lucene-dev mailing list archives

Site index · List index
Message view « Date » · « Thread »
Top « Date » · « Thread »
From Policeman Jenkins Server <jenk...@thetaphi.de>
Subject [JENKINS] Lucene-Solr-6.x-MacOSX (64bit/jdk1.8.0) - Build # 118 - Still Failing!
Date Fri, 06 May 2016 02:11:02 GMT
Build: http://jenkins.thetaphi.de/job/Lucene-Solr-6.x-MacOSX/118/
Java: 64bit/jdk1.8.0 -XX:+UseCompressedOops -XX:+UseG1GC

3 tests failed.
FAILED:  org.apache.solr.MinimalSchemaTest.testAllConfiguredHandlers

Error Message:
exception w/handler: '/graph'

Stack Trace:
java.lang.RuntimeException: exception w/handler: '/graph'
	at __randomizedtesting.SeedInfo.seed([9DA0C6DBE7203F62:70BE7DE16C2D3EE6]:0)
	at org.apache.solr.MinimalSchemaTest.testAllConfiguredHandlers(MinimalSchemaTest.java:130)
	at sun.reflect.NativeMethodAccessorImpl.invoke0(Native Method)
	at sun.reflect.NativeMethodAccessorImpl.invoke(NativeMethodAccessorImpl.java:62)
	at sun.reflect.DelegatingMethodAccessorImpl.invoke(DelegatingMethodAccessorImpl.java:43)
	at java.lang.reflect.Method.invoke(Method.java:498)
	at com.carrotsearch.randomizedtesting.RandomizedRunner.invoke(RandomizedRunner.java:1764)
	at com.carrotsearch.randomizedtesting.RandomizedRunner$8.evaluate(RandomizedRunner.java:871)
	at com.carrotsearch.randomizedtesting.RandomizedRunner$9.evaluate(RandomizedRunner.java:907)
	at com.carrotsearch.randomizedtesting.RandomizedRunner$10.evaluate(RandomizedRunner.java:921)
	at com.carrotsearch.randomizedtesting.rules.SystemPropertiesRestoreRule$1.evaluate(SystemPropertiesRestoreRule.java:57)
	at org.apache.lucene.util.TestRuleSetupTeardownChained$1.evaluate(TestRuleSetupTeardownChained.java:49)
	at org.apache.lucene.util.AbstractBeforeAfterRule$1.evaluate(AbstractBeforeAfterRule.java:45)
	at org.apache.lucene.util.TestRuleThreadAndTestName$1.evaluate(TestRuleThreadAndTestName.java:48)
	at org.apache.lucene.util.TestRuleIgnoreAfterMaxFailures$1.evaluate(TestRuleIgnoreAfterMaxFailures.java:64)
	at org.apache.lucene.util.TestRuleMarkFailure$1.evaluate(TestRuleMarkFailure.java:47)
	at com.carrotsearch.randomizedtesting.rules.StatementAdapter.evaluate(StatementAdapter.java:36)
	at com.carrotsearch.randomizedtesting.ThreadLeakControl$StatementRunner.run(ThreadLeakControl.java:367)
	at com.carrotsearch.randomizedtesting.ThreadLeakControl.forkTimeoutingTask(ThreadLeakControl.java:809)
	at com.carrotsearch.randomizedtesting.ThreadLeakControl$3.evaluate(ThreadLeakControl.java:460)
	at com.carrotsearch.randomizedtesting.RandomizedRunner.runSingleTest(RandomizedRunner.java:880)
	at com.carrotsearch.randomizedtesting.RandomizedRunner$5.evaluate(RandomizedRunner.java:781)
	at com.carrotsearch.randomizedtesting.RandomizedRunner$6.evaluate(RandomizedRunner.java:816)
	at com.carrotsearch.randomizedtesting.RandomizedRunner$7.evaluate(RandomizedRunner.java:827)
	at com.carrotsearch.randomizedtesting.rules.StatementAdapter.evaluate(StatementAdapter.java:36)
	at com.carrotsearch.randomizedtesting.rules.SystemPropertiesRestoreRule$1.evaluate(SystemPropertiesRestoreRule.java:57)
	at org.apache.lucene.util.AbstractBeforeAfterRule$1.evaluate(AbstractBeforeAfterRule.java:45)
	at com.carrotsearch.randomizedtesting.rules.StatementAdapter.evaluate(StatementAdapter.java:36)
	at org.apache.lucene.util.TestRuleStoreClassName$1.evaluate(TestRuleStoreClassName.java:41)
	at com.carrotsearch.randomizedtesting.rules.NoShadowingOrOverridesOnMethodsRule$1.evaluate(NoShadowingOrOverridesOnMethodsRule.java:40)
	at com.carrotsearch.randomizedtesting.rules.NoShadowingOrOverridesOnMethodsRule$1.evaluate(NoShadowingOrOverridesOnMethodsRule.java:40)
	at com.carrotsearch.randomizedtesting.rules.StatementAdapter.evaluate(StatementAdapter.java:36)
	at com.carrotsearch.randomizedtesting.rules.StatementAdapter.evaluate(StatementAdapter.java:36)
	at com.carrotsearch.randomizedtesting.rules.StatementAdapter.evaluate(StatementAdapter.java:36)
	at org.apache.lucene.util.TestRuleAssertionsRequired$1.evaluate(TestRuleAssertionsRequired.java:53)
	at org.apache.lucene.util.TestRuleMarkFailure$1.evaluate(TestRuleMarkFailure.java:47)
	at org.apache.lucene.util.TestRuleIgnoreAfterMaxFailures$1.evaluate(TestRuleIgnoreAfterMaxFailures.java:64)
	at org.apache.lucene.util.TestRuleIgnoreTestSuites$1.evaluate(TestRuleIgnoreTestSuites.java:54)
	at com.carrotsearch.randomizedtesting.rules.StatementAdapter.evaluate(StatementAdapter.java:36)
	at com.carrotsearch.randomizedtesting.ThreadLeakControl$StatementRunner.run(ThreadLeakControl.java:367)
	at java.lang.Thread.run(Thread.java:745)
Caused by: java.lang.RuntimeException: Exception during query
	at org.apache.solr.SolrTestCaseJ4.assertQ(SolrTestCaseJ4.java:786)
	at org.apache.solr.MinimalSchemaTest.testAllConfiguredHandlers(MinimalSchemaTest.java:121)
	... 39 more
Caused by: org.xml.sax.SAXParseException; lineNumber: 1; columnNumber: 1; Content is not allowed in prolog.
	at com.sun.org.apache.xerces.internal.parsers.DOMParser.parse(DOMParser.java:257)
	at com.sun.org.apache.xerces.internal.jaxp.DocumentBuilderImpl.parse(DocumentBuilderImpl.java:339)
	at javax.xml.parsers.DocumentBuilder.parse(DocumentBuilder.java:121)
	at org.apache.solr.util.BaseTestHarness.validateXPath(BaseTestHarness.java:84)
	at org.apache.solr.SolrTestCaseJ4.assertQ(SolrTestCaseJ4.java:771)
	... 40 more


FAILED:  org.apache.solr.core.SolrCoreTest.testImplicitPlugins

Error Message:
wrong number of implicit handlers expected:<21> but was:<22>

Stack Trace:
java.lang.AssertionError: wrong number of implicit handlers expected:<21> but was:<22>
	at __randomizedtesting.SeedInfo.seed([9DA0C6DBE7203F62:5E8DF740B7E8F623]:0)
	at org.junit.Assert.fail(Assert.java:93)
	at org.junit.Assert.failNotEquals(Assert.java:647)
	at org.junit.Assert.assertEquals(Assert.java:128)
	at org.junit.Assert.assertEquals(Assert.java:472)
	at org.apache.solr.core.SolrCoreTest.testImplicitPlugins(SolrCoreTest.java:109)
	at sun.reflect.NativeMethodAccessorImpl.invoke0(Native Method)
	at sun.reflect.NativeMethodAccessorImpl.invoke(NativeMethodAccessorImpl.java:62)
	at sun.reflect.DelegatingMethodAccessorImpl.invoke(DelegatingMethodAccessorImpl.java:43)
	at java.lang.reflect.Method.invoke(Method.java:498)
	at com.carrotsearch.randomizedtesting.RandomizedRunner.invoke(RandomizedRunner.java:1764)
	at com.carrotsearch.randomizedtesting.RandomizedRunner$8.evaluate(RandomizedRunner.java:871)
	at com.carrotsearch.randomizedtesting.RandomizedRunner$9.evaluate(RandomizedRunner.java:907)
	at com.carrotsearch.randomizedtesting.RandomizedRunner$10.evaluate(RandomizedRunner.java:921)
	at com.carrotsearch.randomizedtesting.rules.SystemPropertiesRestoreRule$1.evaluate(SystemPropertiesRestoreRule.java:57)
	at org.apache.lucene.util.TestRuleSetupTeardownChained$1.evaluate(TestRuleSetupTeardownChained.java:49)
	at org.apache.lucene.util.AbstractBeforeAfterRule$1.evaluate(AbstractBeforeAfterRule.java:45)
	at org.apache.lucene.util.TestRuleThreadAndTestName$1.evaluate(TestRuleThreadAndTestName.java:48)
	at org.apache.lucene.util.TestRuleIgnoreAfterMaxFailures$1.evaluate(TestRuleIgnoreAfterMaxFailures.java:64)
	at org.apache.lucene.util.TestRuleMarkFailure$1.evaluate(TestRuleMarkFailure.java:47)
	at com.carrotsearch.randomizedtesting.rules.StatementAdapter.evaluate(StatementAdapter.java:36)
	at com.carrotsearch.randomizedtesting.ThreadLeakControl$StatementRunner.run(ThreadLeakControl.java:367)
	at com.carrotsearch.randomizedtesting.ThreadLeakControl.forkTimeoutingTask(ThreadLeakControl.java:809)
	at com.carrotsearch.randomizedtesting.ThreadLeakControl$3.evaluate(ThreadLeakControl.java:460)
	at com.carrotsearch.randomizedtesting.RandomizedRunner.runSingleTest(RandomizedRunner.java:880)
	at com.carrotsearch.randomizedtesting.RandomizedRunner$5.evaluate(RandomizedRunner.java:781)
	at com.carrotsearch.randomizedtesting.RandomizedRunner$6.evaluate(RandomizedRunner.java:816)
	at com.carrotsearch.randomizedtesting.RandomizedRunner$7.evaluate(RandomizedRunner.java:827)
	at com.carrotsearch.randomizedtesting.rules.StatementAdapter.evaluate(StatementAdapter.java:36)
	at com.carrotsearch.randomizedtesting.rules.SystemPropertiesRestoreRule$1.evaluate(SystemPropertiesRestoreRule.java:57)
	at org.apache.lucene.util.AbstractBeforeAfterRule$1.evaluate(AbstractBeforeAfterRule.java:45)
	at com.carrotsearch.randomizedtesting.rules.StatementAdapter.evaluate(StatementAdapter.java:36)
	at org.apache.lucene.util.TestRuleStoreClassName$1.evaluate(TestRuleStoreClassName.java:41)
	at com.carrotsearch.randomizedtesting.rules.NoShadowingOrOverridesOnMethodsRule$1.evaluate(NoShadowingOrOverridesOnMethodsRule.java:40)
	at com.carrotsearch.randomizedtesting.rules.NoShadowingOrOverridesOnMethodsRule$1.evaluate(NoShadowingOrOverridesOnMethodsRule.java:40)
	at com.carrotsearch.randomizedtesting.rules.StatementAdapter.evaluate(StatementAdapter.java:36)
	at com.carrotsearch.randomizedtesting.rules.StatementAdapter.evaluate(StatementAdapter.java:36)
	at com.carrotsearch.randomizedtesting.rules.StatementAdapter.evaluate(StatementAdapter.java:36)
	at org.apache.lucene.util.TestRuleAssertionsRequired$1.evaluate(TestRuleAssertionsRequired.java:53)
	at org.apache.lucene.util.TestRuleMarkFailure$1.evaluate(TestRuleMarkFailure.java:47)
	at org.apache.lucene.util.TestRuleIgnoreAfterMaxFailures$1.evaluate(TestRuleIgnoreAfterMaxFailures.java:64)
	at org.apache.lucene.util.TestRuleIgnoreTestSuites$1.evaluate(TestRuleIgnoreTestSuites.java:54)
	at com.carrotsearch.randomizedtesting.rules.StatementAdapter.evaluate(StatementAdapter.java:36)
	at com.carrotsearch.randomizedtesting.ThreadLeakControl$StatementRunner.run(ThreadLeakControl.java:367)
	at java.lang.Thread.run(Thread.java:745)


FAILED:  org.apache.solr.handler.TestReqParamsAPI.test

Error Message:
Could not get expected value  'CY val' for path 'response/params/y/c' full output: {   "responseHeader":{     "status":0,     "QTime":0},   "response":{     "znodeVersion":0,     "params":{"x":{         "a":"A val",         "b":"B val",         "":{"v":0}}}}},  from server:  http://127.0.0.1:49247/_vm/o/collection1

Stack Trace:
java.lang.AssertionError: Could not get expected value  'CY val' for path 'response/params/y/c' full output: {
  "responseHeader":{
    "status":0,
    "QTime":0},
  "response":{
    "znodeVersion":0,
    "params":{"x":{
        "a":"A val",
        "b":"B val",
        "":{"v":0}}}}},  from server:  http://127.0.0.1:49247/_vm/o/collection1
	at __randomizedtesting.SeedInfo.seed([9DA0C6DBE7203F62:15F4F90149DC529A]:0)
	at org.junit.Assert.fail(Assert.java:93)
	at org.junit.Assert.assertTrue(Assert.java:43)
	at org.apache.solr.core.TestSolrConfigHandler.testForResponseElement(TestSolrConfigHandler.java:457)
	at org.apache.solr.handler.TestReqParamsAPI.testReqParams(TestReqParamsAPI.java:160)
	at org.apache.solr.handler.TestReqParamsAPI.test(TestReqParamsAPI.java:62)
	at sun.reflect.NativeMethodAccessorImpl.invoke0(Native Method)
	at sun.reflect.NativeMethodAccessorImpl.invoke(NativeMethodAccessorImpl.java:62)
	at sun.reflect.DelegatingMethodAccessorImpl.invoke(DelegatingMethodAccessorImpl.java:43)
	at java.lang.reflect.Method.invoke(Method.java:498)
	at com.carrotsearch.randomizedtesting.RandomizedRunner.invoke(RandomizedRunner.java:1764)
	at com.carrotsearch.randomizedtesting.RandomizedRunner$8.evaluate(RandomizedRunner.java:871)
	at com.carrotsearch.randomizedtesting.RandomizedRunner$9.evaluate(RandomizedRunner.java:907)
	at com.carrotsearch.randomizedtesting.RandomizedRunner$10.evaluate(RandomizedRunner.java:921)
	at org.apache.solr.BaseDistributedSearchTestCase$ShardsRepeatRule$ShardsFixedStatement.callStatement(BaseDistributedSearchTestCase.java:992)
	at org.apache.solr.BaseDistributedSearchTestCase$ShardsRepeatRule$ShardsStatement.evaluate(BaseDistributedSearchTestCase.java:967)
	at com.carrotsearch.randomizedtesting.rules.SystemPropertiesRestoreRule$1.evaluate(SystemPropertiesRestoreRule.java:57)
	at org.apache.lucene.util.TestRuleSetupTeardownChained$1.evaluate(TestRuleSetupTeardownChained.java:49)
	at org.apache.lucene.util.AbstractBeforeAfterRule$1.evaluate(AbstractBeforeAfterRule.java:45)
	at org.apache.lucene.util.TestRuleThreadAndTestName$1.evaluate(TestRuleThreadAndTestName.java:48)
	at org.apache.lucene.util.TestRuleIgnoreAfterMaxFailures$1.evaluate(TestRuleIgnoreAfterMaxFailures.java:64)
	at org.apache.lucene.util.TestRuleMarkFailure$1.evaluate(TestRuleMarkFailure.java:47)
	at com.carrotsearch.randomizedtesting.rules.StatementAdapter.evaluate(StatementAdapter.java:36)
	at com.carrotsearch.randomizedtesting.ThreadLeakControl$StatementRunner.run(ThreadLeakControl.java:367)
	at com.carrotsearch.randomizedtesting.ThreadLeakControl.forkTimeoutingTask(ThreadLeakControl.java:809)
	at com.carrotsearch.randomizedtesting.ThreadLeakControl$3.evaluate(ThreadLeakControl.java:460)
	at com.carrotsearch.randomizedtesting.RandomizedRunner.runSingleTest(RandomizedRunner.java:880)
	at com.carrotsearch.randomizedtesting.RandomizedRunner$5.evaluate(RandomizedRunner.java:781)
	at com.carrotsearch.randomizedtesting.RandomizedRunner$6.evaluate(RandomizedRunner.java:816)
	at com.carrotsearch.randomizedtesting.RandomizedRunner$7.evaluate(RandomizedRunner.java:827)
	at com.carrotsearch.randomizedtesting.rules.StatementAdapter.evaluate(StatementAdapter.java:36)
	at com.carrotsearch.randomizedtesting.rules.SystemPropertiesRestoreRule$1.evaluate(SystemPropertiesRestoreRule.java:57)
	at org.apache.lucene.util.AbstractBeforeAfterRule$1.evaluate(AbstractBeforeAfterRule.java:45)
	at com.carrotsearch.randomizedtesting.rules.StatementAdapter.evaluate(StatementAdapter.java:36)
	at org.apache.lucene.util.TestRuleStoreClassName$1.evaluate(TestRuleStoreClassName.java:41)
	at com.carrotsearch.randomizedtesting.rules.NoShadowingOrOverridesOnMethodsRule$1.evaluate(NoShadowingOrOverridesOnMethodsRule.java:40)
	at com.carrotsearch.randomizedtesting.rules.NoShadowingOrOverridesOnMethodsRule$1.evaluate(NoShadowingOrOverridesOnMethodsRule.java:40)
	at com.carrotsearch.randomizedtesting.rules.StatementAdapter.evaluate(StatementAdapter.java:36)
	at com.carrotsearch.randomizedtesting.rules.StatementAdapter.evaluate(StatementAdapter.java:36)
	at com.carrotsearch.randomizedtesting.rules.StatementAdapter.evaluate(StatementAdapter.java:36)
	at org.apache.lucene.util.TestRuleAssertionsRequired$1.evaluate(TestRuleAssertionsRequired.java:53)
	at org.apache.lucene.util.TestRuleMarkFailure$1.evaluate(TestRuleMarkFailure.java:47)
	at org.apache.lucene.util.TestRuleIgnoreAfterMaxFailures$1.evaluate(TestRuleIgnoreAfterMaxFailures.java:64)
	at org.apache.lucene.util.TestRuleIgnoreTestSuites$1.evaluate(TestRuleIgnoreTestSuites.java:54)
	at com.carrotsearch.randomizedtesting.rules.StatementAdapter.evaluate(StatementAdapter.java:36)
	at com.carrotsearch.randomizedtesting.ThreadLeakControl$StatementRunner.run(ThreadLeakControl.java:367)
	at java.lang.Thread.run(Thread.java:745)




Build Log:
[...truncated 10825 lines...]
   [junit4] Suite: org.apache.solr.MinimalSchemaTest
   [junit4]   2> Creating dataDir: /Users/jenkins/workspace/Lucene-Solr-6.x-MacOSX/solr/build/solr-core/test/J1/temp/solr.MinimalSchemaTest_9DA0C6DBE7203F62-001/init-core-data-001
   [junit4]   2> 498019 INFO  (SUITE-MinimalSchemaTest-seed#[9DA0C6DBE7203F62]-worker) [    ] o.a.s.SolrTestCaseJ4 Randomized ssl (true) and clientAuth (false)
   [junit4]   2> 498020 INFO  (SUITE-MinimalSchemaTest-seed#[9DA0C6DBE7203F62]-worker) [    ] o.a.s.SolrTestCaseJ4 ####initCore
   [junit4]   2> 498021 INFO  (SUITE-MinimalSchemaTest-seed#[9DA0C6DBE7203F62]-worker) [    ] o.a.s.c.SolrResourceLoader new SolrResourceLoader for directory: '/Users/jenkins/workspace/Lucene-Solr-6.x-MacOSX/solr/core/src/test-files/solr/collection1'
   [junit4]   2> 498021 INFO  (SUITE-MinimalSchemaTest-seed#[9DA0C6DBE7203F62]-worker) [    ] o.a.s.c.SolrResourceLoader JNDI not configured for solr (NoInitialContextEx)
   [junit4]   2> 498021 INFO  (SUITE-MinimalSchemaTest-seed#[9DA0C6DBE7203F62]-worker) [    ] o.a.s.c.SolrResourceLoader using system property solr.solr.home: /Users/jenkins/workspace/Lucene-Solr-6.x-MacOSX/solr/core/src/test-files/solr
   [junit4]   2> 498021 INFO  (SUITE-MinimalSchemaTest-seed#[9DA0C6DBE7203F62]-worker) [    ] o.a.s.c.SolrResourceLoader Adding 'file:/Users/jenkins/workspace/Lucene-Solr-6.x-MacOSX/solr/core/src/test-files/solr/collection1/lib/classes/' to classloader
   [junit4]   2> 498021 INFO  (SUITE-MinimalSchemaTest-seed#[9DA0C6DBE7203F62]-worker) [    ] o.a.s.c.SolrResourceLoader Adding 'file:/Users/jenkins/workspace/Lucene-Solr-6.x-MacOSX/solr/core/src/test-files/solr/collection1/lib/README' to classloader
   [junit4]   2> 498063 INFO  (SUITE-MinimalSchemaTest-seed#[9DA0C6DBE7203F62]-worker) [    ] o.a.s.c.SolrConfig current version of requestparams : -1
   [junit4]   2> 498070 INFO  (SUITE-MinimalSchemaTest-seed#[9DA0C6DBE7203F62]-worker) [    ] o.a.s.c.SolrConfig Using Lucene MatchVersion: 6.1.0
   [junit4]   2> 498086 INFO  (SUITE-MinimalSchemaTest-seed#[9DA0C6DBE7203F62]-worker) [    ] o.a.s.c.SolrConfig Loaded SolrConfig: solr/collection1/conf/solrconfig.xml
   [junit4]   2> 498092 INFO  (SUITE-MinimalSchemaTest-seed#[9DA0C6DBE7203F62]-worker) [    ] o.a.s.s.IndexSchema [null] Schema name=minimal
   [junit4]   2> 498095 WARN  (SUITE-MinimalSchemaTest-seed#[9DA0C6DBE7203F62]-worker) [    ] o.a.s.s.IndexSchema no uniqueKey specified in schema.
   [junit4]   2> 498095 INFO  (SUITE-MinimalSchemaTest-seed#[9DA0C6DBE7203F62]-worker) [    ] o.a.s.c.SolrResourceLoader JNDI not configured for solr (NoInitialContextEx)
   [junit4]   2> 498095 INFO  (SUITE-MinimalSchemaTest-seed#[9DA0C6DBE7203F62]-worker) [    ] o.a.s.c.SolrResourceLoader using system property solr.solr.home: /Users/jenkins/workspace/Lucene-Solr-6.x-MacOSX/solr/core/src/test-files/solr
   [junit4]   2> 498095 INFO  (SUITE-MinimalSchemaTest-seed#[9DA0C6DBE7203F62]-worker) [    ] o.a.s.c.SolrResourceLoader new SolrResourceLoader for directory: '/Users/jenkins/workspace/Lucene-Solr-6.x-MacOSX/solr/core/src/test-files/solr'
   [junit4]   2> 498095 INFO  (SUITE-MinimalSchemaTest-seed#[9DA0C6DBE7203F62]-worker) [    ] o.a.s.c.SolrResourceLoader JNDI not configured for solr (NoInitialContextEx)
   [junit4]   2> 498095 INFO  (SUITE-MinimalSchemaTest-seed#[9DA0C6DBE7203F62]-worker) [    ] o.a.s.c.SolrResourceLoader using system property solr.solr.home: /Users/jenkins/workspace/Lucene-Solr-6.x-MacOSX/solr/core/src/test-files/solr
   [junit4]   2> 498096 INFO  (SUITE-MinimalSchemaTest-seed#[9DA0C6DBE7203F62]-worker) [    ] o.a.s.c.CoreContainer New CoreContainer 1175627482
   [junit4]   2> 498096 INFO  (SUITE-MinimalSchemaTest-seed#[9DA0C6DBE7203F62]-worker) [    ] o.a.s.c.CoreContainer Loading cores into CoreContainer [instanceDir=/Users/jenkins/workspace/Lucene-Solr-6.x-MacOSX/solr/core/src/test-files/solr]
   [junit4]   2> 498096 WARN  (SUITE-MinimalSchemaTest-seed#[9DA0C6DBE7203F62]-worker) [    ] o.a.s.c.CoreContainer Couldn't add files from /Users/jenkins/workspace/Lucene-Solr-6.x-MacOSX/solr/core/src/test-files/solr/lib to classpath: /Users/jenkins/workspace/Lucene-Solr-6.x-MacOSX/solr/core/src/test-files/solr/lib
   [junit4]   2> 498096 INFO  (SUITE-MinimalSchemaTest-seed#[9DA0C6DBE7203F62]-worker) [    ] o.a.s.h.c.HttpShardHandlerFactory created with socketTimeout : 600000,connTimeout : 60000,maxConnectionsPerHost : 20,maxConnections : 10000,corePoolSize : 0,maximumPoolSize : 2147483647,maxThreadIdleTime : 5,sizeOfQueue : -1,fairnessPolicy : false,useRetries : false,
   [junit4]   2> 498099 INFO  (SUITE-MinimalSchemaTest-seed#[9DA0C6DBE7203F62]-worker) [    ] o.a.s.u.UpdateShardHandler Creating UpdateShardHandler HTTP client with params: socketTimeout=30000&connTimeout=30000&retry=true
   [junit4]   2> 498100 INFO  (SUITE-MinimalSchemaTest-seed#[9DA0C6DBE7203F62]-worker) [    ] o.a.s.l.LogWatcher SLF4J impl is org.slf4j.impl.Log4jLoggerFactory
   [junit4]   2> 498100 INFO  (SUITE-MinimalSchemaTest-seed#[9DA0C6DBE7203F62]-worker) [    ] o.a.s.l.LogWatcher Registering Log Listener [Log4j (org.slf4j.impl.Log4jLoggerFactory)]
   [junit4]   2> 498100 INFO  (SUITE-MinimalSchemaTest-seed#[9DA0C6DBE7203F62]-worker) [    ] o.a.s.c.CoreContainer Security conf doesn't exist. Skipping setup for authorization module.
   [junit4]   2> 498100 INFO  (SUITE-MinimalSchemaTest-seed#[9DA0C6DBE7203F62]-worker) [    ] o.a.s.c.CoreContainer No authentication plugin used.
   [junit4]   2> 498101 INFO  (SUITE-MinimalSchemaTest-seed#[9DA0C6DBE7203F62]-worker) [    ] o.a.s.c.CoreDescriptor Created CoreDescriptor: {name=collection1, config=solr/collection1/conf/solrconfig.xml, transient=false, schema=solr/collection1/conf/schema-minimal.xml, loadOnStartup=true, configSetProperties=configsetprops.json, collection=collection1, dataDir=/Users/jenkins/workspace/Lucene-Solr-6.x-MacOSX/solr/build/solr-core/test/J1/temp/solr.MinimalSchemaTest_9DA0C6DBE7203F62-001/init-core-data-001, shard=shard1}
   [junit4]   2> 498102 INFO  (coreLoadExecutor-1585-thread-1) [    ] o.a.s.c.SolrResourceLoader new SolrResourceLoader for directory: '/Users/jenkins/workspace/Lucene-Solr-6.x-MacOSX/solr/core/src/test-files/solr/collection1'
   [junit4]   2> 498102 INFO  (coreLoadExecutor-1585-thread-1) [    ] o.a.s.c.SolrResourceLoader JNDI not configured for solr (NoInitialContextEx)
   [junit4]   2> 498102 INFO  (coreLoadExecutor-1585-thread-1) [    ] o.a.s.c.SolrResourceLoader using system property solr.solr.home: /Users/jenkins/workspace/Lucene-Solr-6.x-MacOSX/solr/core/src/test-files/solr
   [junit4]   2> 498102 INFO  (coreLoadExecutor-1585-thread-1) [    ] o.a.s.c.SolrResourceLoader Adding 'file:/Users/jenkins/workspace/Lucene-Solr-6.x-MacOSX/solr/core/src/test-files/solr/collection1/lib/classes/' to classloader
   [junit4]   2> 498102 INFO  (coreLoadExecutor-1585-thread-1) [    ] o.a.s.c.SolrResourceLoader Adding 'file:/Users/jenkins/workspace/Lucene-Solr-6.x-MacOSX/solr/core/src/test-files/solr/collection1/lib/README' to classloader
   [junit4]   2> 498128 INFO  (coreLoadExecutor-1585-thread-1) [    ] o.a.s.c.SolrConfig current version of requestparams : -1
   [junit4]   2> 498145 INFO  (coreLoadExecutor-1585-thread-1) [    ] o.a.s.c.SolrConfig Using Lucene MatchVersion: 6.1.0
   [junit4]   2> 498160 INFO  (coreLoadExecutor-1585-thread-1) [    ] o.a.s.c.SolrConfig Loaded SolrConfig: solr/collection1/conf/solrconfig.xml
   [junit4]   2> 498163 INFO  (coreLoadExecutor-1585-thread-1) [    ] o.a.s.s.IndexSchema [collection1] Schema name=minimal
   [junit4]   2> 498164 WARN  (coreLoadExecutor-1585-thread-1) [    ] o.a.s.s.IndexSchema no uniqueKey specified in schema.
   [junit4]   2> 498168 INFO  (coreLoadExecutor-1585-thread-1) [    ] o.a.s.c.ConfigSetProperties Did not find ConfigSet properties, assuming default properties: Can't find resource 'configsetprops.json' in classpath or '/Users/jenkins/workspace/Lucene-Solr-6.x-MacOSX/solr/core/src/test-files/solr/collection1'
   [junit4]   2> 498168 INFO  (coreLoadExecutor-1585-thread-1) [    ] o.a.s.c.CoreContainer Creating SolrCore 'collection1' using configuration from instancedir /Users/jenkins/workspace/Lucene-Solr-6.x-MacOSX/solr/core/src/test-files/solr/collection1
   [junit4]   2> 498168 INFO  (coreLoadExecutor-1585-thread-1) [    x:collection1] o.a.s.c.SolrCore org.apache.solr.core.MockDirectoryFactory
   [junit4]   2> 498169 INFO  (coreLoadExecutor-1585-thread-1) [    x:collection1] o.a.s.c.SolrCore [[collection1] ] Opening new SolrCore at [/Users/jenkins/workspace/Lucene-Solr-6.x-MacOSX/solr/core/src/test-files/solr/collection1], dataDir=[/Users/jenkins/workspace/Lucene-Solr-6.x-MacOSX/solr/build/solr-core/test/J1/temp/solr.MinimalSchemaTest_9DA0C6DBE7203F62-001/init-core-data-001/]
   [junit4]   2> 498169 INFO  (coreLoadExecutor-1585-thread-1) [    x:collection1] o.a.s.c.JmxMonitoredMap JMX monitoring is enabled. Adding Solr mbeans to JMX Server: com.sun.jmx.mbeanserver.JmxMBeanServer@4195207f
   [junit4]   2> 498169 INFO  (coreLoadExecutor-1585-thread-1) [    x:collection1] o.a.s.c.CachingDirectoryFactory return new directory for /Users/jenkins/workspace/Lucene-Solr-6.x-MacOSX/solr/build/solr-core/test/J1/temp/solr.MinimalSchemaTest_9DA0C6DBE7203F62-001/init-core-data-001
   [junit4]   2> 498169 INFO  (coreLoadExecutor-1585-thread-1) [    x:collection1] o.a.s.c.SolrCore New index directory detected: old=null new=/Users/jenkins/workspace/Lucene-Solr-6.x-MacOSX/solr/build/solr-core/test/J1/temp/solr.MinimalSchemaTest_9DA0C6DBE7203F62-001/init-core-data-001/index/
   [junit4]   2> 498169 WARN  (coreLoadExecutor-1585-thread-1) [    x:collection1] o.a.s.c.SolrCore [collection1] Solr index directory '/Users/jenkins/workspace/Lucene-Solr-6.x-MacOSX/solr/build/solr-core/test/J1/temp/solr.MinimalSchemaTest_9DA0C6DBE7203F62-001/init-core-data-001/index' doesn't exist. Creating new index...
   [junit4]   2> 498169 INFO  (coreLoadExecutor-1585-thread-1) [    x:collection1] o.a.s.c.CachingDirectoryFactory return new directory for /Users/jenkins/workspace/Lucene-Solr-6.x-MacOSX/solr/build/solr-core/test/J1/temp/solr.MinimalSchemaTest_9DA0C6DBE7203F62-001/init-core-data-001/index
   [junit4]   2> 498170 INFO  (coreLoadExecutor-1585-thread-1) [    x:collection1] o.a.s.u.RandomMergePolicy RandomMergePolicy wrapping class org.apache.lucene.index.TieredMergePolicy: [TieredMergePolicy: maxMergeAtOnce=41, maxMergeAtOnceExplicit=29, maxMergedSegmentMB=17.2353515625, floorSegmentMB=1.6103515625, forceMergeDeletesPctAllowed=7.904328868957785, segmentsPerTier=20.0, maxCFSSegmentSizeMB=8.796093022207999E12, noCFSRatio=0.6398038437961362
   [junit4]   2> 498170 INFO  (coreLoadExecutor-1585-thread-1) [    x:collection1] o.a.s.c.SolrDeletionPolicy SolrDeletionPolicy.onCommit: commits: num=1
   [junit4]   2> 	commit{dir=MockDirectoryWrapper(RAMDirectory@4866b711 lockFactory=org.apache.lucene.store.SingleInstanceLockFactory@5db526d5),segFN=segments_1,generation=1}
   [junit4]   2> 498170 INFO  (coreLoadExecutor-1585-thread-1) [    x:collection1] o.a.s.c.SolrDeletionPolicy newest commit generation = 1
   [junit4]   2> 498171 INFO  (OldIndexDirectoryCleanupThreadForCore-collection1) [    x:collection1] o.a.s.c.SolrCore Looking for old index directories to cleanup for core collection1 in /Users/jenkins/workspace/Lucene-Solr-6.x-MacOSX/solr/build/solr-core/test/J1/temp/solr.MinimalSchemaTest_9DA0C6DBE7203F62-001/init-core-data-001/
   [junit4]   2> 498174 INFO  (coreLoadExecutor-1585-thread-1) [    x:collection1] o.a.s.u.p.UpdateRequestProcessorChain creating updateRequestProcessorChain "dedupe"
   [junit4]   2> 498174 INFO  (coreLoadExecutor-1585-thread-1) [    x:collection1] o.a.s.u.p.UpdateRequestProcessorChain inserting DistributedUpdateProcessorFactory into updateRequestProcessorChain "dedupe"
   [junit4]   2> 498174 INFO  (coreLoadExecutor-1585-thread-1) [    x:collection1] o.a.s.u.p.UpdateRequestProcessorChain creating updateRequestProcessorChain "dedupe-allfields"
   [junit4]   2> 498174 INFO  (coreLoadExecutor-1585-thread-1) [    x:collection1] o.a.s.u.p.UpdateRequestProcessorChain inserting DistributedUpdateProcessorFactory into updateRequestProcessorChain "dedupe-allfields"
   [junit4]   2> 498174 INFO  (coreLoadExecutor-1585-thread-1) [    x:collection1] o.a.s.u.p.UpdateRequestProcessorChain creating updateRequestProcessorChain "stored_sig"
   [junit4]   2> 498174 INFO  (coreLoadExecutor-1585-thread-1) [    x:collection1] o.a.s.u.p.UpdateRequestProcessorChain inserting DistributedUpdateProcessorFactory into updateRequestProcessorChain "stored_sig"
   [junit4]   2> 498174 INFO  (coreLoadExecutor-1585-thread-1) [    x:collection1] o.a.s.u.p.UpdateRequestProcessorChain creating updateRequestProcessorChain "uniq-fields"
   [junit4]   2> 498174 INFO  (coreLoadExecutor-1585-thread-1) [    x:collection1] o.a.s.u.p.UpdateRequestProcessorChain inserting DistributedUpdateProcessorFactory into updateRequestProcessorChain "uniq-fields"
   [junit4]   2> 498174 INFO  (coreLoadExecutor-1585-thread-1) [    x:collection1] o.a.s.u.p.UpdateRequestProcessorChain creating updateRequestProcessorChain "distrib-dup-test-chain-explicit"
   [junit4]   2> 498175 INFO  (coreLoadExecutor-1585-thread-1) [    x:collection1] o.a.s.u.p.UpdateRequestProcessorChain creating updateRequestProcessorChain "distrib-dup-test-chain-implicit"
   [junit4]   2> 498175 INFO  (coreLoadExecutor-1585-thread-1) [    x:collection1] o.a.s.u.p.UpdateRequestProcessorChain inserting DistributedUpdateProcessorFactory into updateRequestProcessorChain "distrib-dup-test-chain-implicit"
   [junit4]   2> 498175 INFO  (coreLoadExecutor-1585-thread-1) [    x:collection1] o.a.s.c.SolrCore no updateRequestProcessorChain defined as default, creating implicit default
   [junit4]   2> 498178 INFO  (coreLoadExecutor-1585-thread-1) [    x:collection1] o.a.s.h.l.XMLLoader xsltCacheLifetimeSeconds=60
   [junit4]   2> 498179 INFO  (coreLoadExecutor-1585-thread-1) [    x:collection1] o.a.s.h.l.XMLLoader xsltCacheLifetimeSeconds=60
   [junit4]   2> 498180 INFO  (coreLoadExecutor-1585-thread-1) [    x:collection1] o.a.s.h.l.XMLLoader xsltCacheLifetimeSeconds=60
   [junit4]   2> 498181 INFO  (coreLoadExecutor-1585-thread-1) [    x:collection1] o.a.s.h.l.XMLLoader xsltCacheLifetimeSeconds=60
   [junit4]   2> 498186 INFO  (coreLoadExecutor-1585-thread-1) [    x:collection1] o.a.s.c.PluginBag requestHandler : 'lazy' created with startup=lazy 
   [junit4]   2> 498187 INFO  (coreLoadExecutor-1585-thread-1) [    x:collection1] o.a.s.c.RequestHandlers Registered paths: /admin/mbeans,standard,spellCheckCompRH,lazy,/update/json/docs,/admin/luke,/export,spellCheckWithWordbreak_Direct,tvrh,/get,/admin/properties,/update/json,mltrh,/admin/threads,/search-facet-def,/update/csv,/sql,/graph,/search-facet-invariants,/admin/segments,spellCheckCompRH1,/mlt,/admin/system,/replication,dismax,defaults,/config,/stream,/schema,/admin/plugins,/admin/logging,spellCheckWithWordbreak,mock,/admin/ping,/update,/admin/file,/terms,spellCheckCompRH_Direct,/debug/dump
   [junit4]   2> 498187 INFO  (coreLoadExecutor-1585-thread-1) [    x:collection1] o.a.s.c.SolrCore Using default statsCache cache: org.apache.solr.search.stats.LocalStatsCache
   [junit4]   2> 498188 INFO  (coreLoadExecutor-1585-thread-1) [    x:collection1] o.a.s.u.UpdateHandler Using UpdateLog implementation: org.apache.solr.update.UpdateLog
   [junit4]   2> 498188 INFO  (coreLoadExecutor-1585-thread-1) [    x:collection1] o.a.s.u.UpdateLog Initializing UpdateLog: dataDir= defaultSyncLevel=FLUSH numRecordsToKeep=100 maxNumLogsToKeep=10 numVersionBuckets=65536
   [junit4]   2> 498188 INFO  (coreLoadExecutor-1585-thread-1) [    x:collection1] o.a.s.u.CommitTracker Hard AutoCommit: disabled
   [junit4]   2> 498188 INFO  (coreLoadExecutor-1585-thread-1) [    x:collection1] o.a.s.u.CommitTracker Soft AutoCommit: disabled
   [junit4]   2> 498189 INFO  (coreLoadExecutor-1585-thread-1) [    x:collection1] o.a.s.u.RandomMergePolicy RandomMergePolicy wrapping class org.apache.lucene.index.TieredMergePolicy: [TieredMergePolicy: maxMergeAtOnce=20, maxMergeAtOnceExplicit=30, maxMergedSegmentMB=0.5625, floorSegmentMB=1.1064453125, forceMergeDeletesPctAllowed=14.002179209414114, segmentsPerTier=20.0, maxCFSSegmentSizeMB=8.796093022207999E12, noCFSRatio=0.7170182238701545
   [junit4]   2> 498189 INFO  (coreLoadExecutor-1585-thread-1) [    x:collection1] o.a.s.c.SolrDeletionPolicy SolrDeletionPolicy.onInit: commits: num=1
   [junit4]   2> 	commit{dir=MockDirectoryWrapper(RAMDirectory@4866b711 lockFactory=org.apache.lucene.store.SingleInstanceLockFactory@5db526d5),segFN=segments_1,generation=1}
   [junit4]   2> 498189 INFO  (coreLoadExecutor-1585-thread-1) [    x:collection1] o.a.s.c.SolrDeletionPolicy newest commit generation = 1
   [junit4]   2> 498189 INFO  (coreLoadExecutor-1585-thread-1) [    x:collection1] o.a.s.s.SolrIndexSearcher Opening [Searcher@51bdcdf2[collection1] main]
   [junit4]   2> 498189 INFO  (coreLoadExecutor-1585-thread-1) [    x:collection1] o.a.s.r.RestManager Initializing RestManager with initArgs: {storageIO=org.apache.solr.rest.ManagedResourceStorage$InMemoryStorageIO}
   [junit4]   2> 498189 INFO  (coreLoadExecutor-1585-thread-1) [    x:collection1] o.a.s.r.ManagedResourceStorage Reading _rest_managed.json using InMemoryStorage
   [junit4]   2> 498189 INFO  (coreLoadExecutor-1585-thread-1) [    x:collection1] o.a.s.r.RestManager Initializing 0 registered ManagedResources
   [junit4]   2> 498189 INFO  (coreLoadExecutor-1585-thread-1) [    x:collection1] o.a.s.h.c.SpellCheckComponent Initializing spell checkers
   [junit4]   2> 498198 INFO  (coreLoadExecutor-1585-thread-1) [    x:collection1] o.a.s.s.DirectSolrSpellChecker init: {name=direct,classname=DirectSolrSpellChecker,field=lowerfilt,minQueryLength=3}
   [junit4]   2> 498252 INFO  (coreLoadExecutor-1585-thread-1) [    x:collection1] o.a.s.h.ReplicationHandler Commits will be reserved for  10000
   [junit4]   2> 498252 INFO  (searcherExecutor-1586-thread-1-processing-x:collection1) [    x:collection1] o.a.s.h.c.SpellCheckComponent Loading spell index for spellchecker: default
   [junit4]   2> 498253 INFO  (searcherExecutor-1586-thread-1-processing-x:collection1) [    x:collection1] o.a.s.h.c.SpellCheckComponent Loading spell index for spellchecker: direct
   [junit4]   2> 498253 INFO  (searcherExecutor-1586-thread-1-processing-x:collection1) [    x:collection1] o.a.s.h.c.SpellCheckComponent Loading spell index for spellchecker: wordbreak
   [junit4]   2> 498253 INFO  (searcherExecutor-1586-thread-1-processing-x:collection1) [    x:collection1] o.a.s.h.c.SpellCheckComponent Loading spell index for spellchecker: multipleFields
   [junit4]   2> 498254 INFO  (searcherExecutor-1586-thread-1-processing-x:collection1) [    x:collection1] o.a.s.h.c.SpellCheckComponent Loading spell index for spellchecker: jarowinkler
   [junit4]   2> 498254 INFO  (searcherExecutor-1586-thread-1-processing-x:collection1) [    x:collection1] o.a.s.h.c.SpellCheckComponent Loading spell index for spellchecker: external
   [junit4]   2> 498254 INFO  (searcherExecutor-1586-thread-1-processing-x:collection1) [    x:collection1] o.a.s.h.c.SpellCheckComponent Loading spell index for spellchecker: freq
   [junit4]   2> 498255 INFO  (searcherExecutor-1586-thread-1-processing-x:collection1) [    x:collection1] o.a.s.h.c.SpellCheckComponent Loading spell index for spellchecker: fqcn
   [junit4]   2> 498255 INFO  (searcherExecutor-1586-thread-1-processing-x:collection1) [    x:collection1] o.a.s.h.c.SpellCheckComponent Loading spell index for spellchecker: perDict
   [junit4]   2> 498256 INFO  (searcherExecutor-1586-thread-1-processing-x:collection1) [    x:collection1] o.a.s.c.SolrCore [collection1] Registered new searcher Searcher@51bdcdf2[collection1] main{ExitableDirectoryReader(UninvertingDirectoryReader())}
   [junit4]   2> 498256 INFO  (coreLoadExecutor-1585-thread-1) [    x:collection1] o.a.s.u.UpdateLog Looking up max value of version field to seed version buckets
   [junit4]   2> 498256 INFO  (coreLoadExecutor-1585-thread-1) [    x:collection1] o.a.s.u.VersionInfo Refreshing highest value of _version_ for 65536 version buckets from index
   [junit4]   2> 498256 INFO  (coreLoadExecutor-1585-thread-1) [    x:collection1] o.a.s.u.VersionInfo No terms found for _version_, cannot seed version bucket highest value from index
   [junit4]   2> 498256 INFO  (coreLoadExecutor-1585-thread-1) [    x:collection1] o.a.s.u.UpdateLog Could not find max version in index or recent updates, using new clock 1533539924302626816
   [junit4]   2> 498258 INFO  (coreLoadExecutor-1585-thread-1) [    x:collection1] o.a.s.u.UpdateLog Took 1.0ms to seed version buckets with highest version 1533539924302626816
   [junit4]   2> 498258 INFO  (coreLoadExecutor-1585-thread-1) [    x:collection1] o.a.s.c.CoreContainer registering core: collection1
   [junit4]   2> 498260 INFO  (SUITE-MinimalSchemaTest-seed#[9DA0C6DBE7203F62]-worker) [    ] o.a.s.SolrTestCaseJ4 ####initCore end
   [junit4]   2> 498263 INFO  (SUITE-MinimalSchemaTest-seed#[9DA0C6DBE7203F62]-worker) [    ] o.a.s.u.p.LogUpdateProcessorFactory [collection1]  webapp=null path=null params={}{add=[(null)]} 0 2
   [junit4]   2> 498265 INFO  (SUITE-MinimalSchemaTest-seed#[9DA0C6DBE7203F62]-worker) [    ] o.a.s.u.p.LogUpdateProcessorFactory [collection1]  webapp=null path=null params={}{add=[(null)]} 0 0
   [junit4]   2> 498266 INFO  (SUITE-MinimalSchemaTest-seed#[9DA0C6DBE7203F62]-worker) [    ] o.a.s.u.DirectUpdateHandler2 start commit{,optimize=false,openSearcher=true,waitSearcher=true,expungeDeletes=false,softCommit=false,prepareCommit=false}
   [junit4]   2> 498269 INFO  (SUITE-MinimalSchemaTest-seed#[9DA0C6DBE7203F62]-worker) [    ] o.a.s.c.SolrDeletionPolicy SolrDeletionPolicy.onCommit: commits: num=2
   [junit4]   2> 	commit{dir=MockDirectoryWrapper(RAMDirectory@4866b711 lockFactory=org.apache.lucene.store.SingleInstanceLockFactory@5db526d5),segFN=segments_1,generation=1}
   [junit4]   2> 	commit{dir=MockDirectoryWrapper(RAMDirectory@4866b711 lockFactory=org.apache.lucene.store.SingleInstanceLockFactory@5db526d5),segFN=segments_2,generation=2}
   [junit4]   2> 498270 INFO  (SUITE-MinimalSchemaTest-seed#[9DA0C6DBE7203F62]-worker) [    ] o.a.s.c.SolrDeletionPolicy newest commit generation = 2
   [junit4]   2> 498271 INFO  (SUITE-MinimalSchemaTest-seed#[9DA0C6DBE7203F62]-worker) [    ] o.a.s.s.SolrIndexSearcher Opening [Searcher@674e0200[collection1] main]
   [junit4]   2> 498271 INFO  (SUITE-MinimalSchemaTest-seed#[9DA0C6DBE7203F62]-worker) [    ] o.a.s.u.DirectUpdateHandler2 end_commit_flush
   [junit4]   2> 498272 INFO  (searcherExecutor-1586-thread-1) [    ] o.a.s.c.SolrCore [collection1] Registered new searcher Searcher@674e0200[collection1] main{ExitableDirectoryReader(UninvertingDirectoryReader(Uninverting(_0(6.1.0):c2)))}
   [junit4]   2> 498273 INFO  (SUITE-MinimalSchemaTest-seed#[9DA0C6DBE7203F62]-worker) [    ] o.a.s.u.p.LogUpdateProcessorFactory [collection1]  webapp=null path=null params={}{commit=} 0 7
   [junit4]   2> 498274 INFO  (SUITE-MinimalSchemaTest-seed#[9DA0C6DBE7203F62]-worker) [    ] o.a.s.u.DirectUpdateHandler2 start commit{,optimize=true,openSearcher=true,waitSearcher=true,expungeDeletes=false,softCommit=false,prepareCommit=false}
   [junit4]   2> 498274 WARN  (SUITE-MinimalSchemaTest-seed#[9DA0C6DBE7203F62]-worker) [    ] o.a.s.u.DirectUpdateHandler2 Starting optimize... Reading and rewriting the entire index! Use with care.
   [junit4]   2> 498282 INFO  (SUITE-MinimalSchemaTest-seed#[9DA0C6DBE7203F62]-worker) [    ] o.a.s.c.SolrDeletionPolicy SolrDeletionPolicy.onCommit: commits: num=2
   [junit4]   2> 	commit{dir=MockDirectoryWrapper(RAMDirectory@4866b711 lockFactory=org.apache.lucene.store.SingleInstanceLockFactory@5db526d5),segFN=segments_2,generation=2}
   [junit4]   2> 	commit{dir=MockDirectoryWrapper(RAMDirectory@4866b711 lockFactory=org.apache.lucene.store.SingleInstanceLockFactory@5db526d5),segFN=segments_3,generation=3}
   [junit4]   2> 498282 INFO  (SUITE-MinimalSchemaTest-seed#[9DA0C6DBE7203F62]-worker) [    ] o.a.s.c.SolrDeletionPolicy newest commit generation = 3
   [junit4]   2> 498283 INFO  (SUITE-MinimalSchemaTest-seed#[9DA0C6DBE7203F62]-worker) [    ] o.a.s.s.SolrIndexSearcher Opening [Searcher@59d4b962[collection1] main]
   [junit4]   2> 498283 INFO  (SUITE-MinimalSchemaTest-seed#[9DA0C6DBE7203F62]-worker) [    ] o.a.s.u.DirectUpdateHandler2 end_commit_flush
   [junit4]   2> 498284 INFO  (searcherExecutor-1586-thread-1) [    ] o.a.s.c.SolrCore [collection1] Registered new searcher Searcher@59d4b962[collection1] main{ExitableDirectoryReader(UninvertingDirectoryReader(Uninverting(_1(6.1.0):c2)))}
   [junit4]   2> 498284 INFO  (SUITE-MinimalSchemaTest-seed#[9DA0C6DBE7203F62]-worker) [    ] o.a.s.u.p.LogUpdateProcessorFactory [collection1]  webapp=null path=null params={}{optimize=} 0 10
   [junit4]   2> 498287 INFO  (TEST-MinimalSchemaTest.testSimpleQueries-seed#[9DA0C6DBE7203F62]) [    ] o.a.s.SolrTestCaseJ4 ###Starting testSimpleQueries
   [junit4]   2> 498287 INFO  (TEST-MinimalSchemaTest.testSimpleQueries-seed#[9DA0C6DBE7203F62]) [    ] o.a.s.c.S.Request [collection1]  webapp=null path=null params={q=subject:Hoss&qt=standard&start=0&rows=20&version=2.2} hits=1 status=0 QTime=0
   [junit4]   2> 498288 INFO  (TEST-MinimalSchemaTest.testSimpleQueries-seed#[9DA0C6DBE7203F62]) [    ] o.a.s.c.S.Request [collection1]  webapp=null path=null params={q=subject:Yonik&qt=standard&start=0&rows=20&version=2.2} hits=1 status=0 QTime=0
   [junit4]   2> 498289 INFO  (TEST-MinimalSchemaTest.testSimpleQueries-seed#[9DA0C6DBE7203F62]) [    ] o.a.s.SolrTestCaseJ4 ###Ending testSimpleQueries
   [junit4]   2> 498291 INFO  (TEST-MinimalSchemaTest.testAllConfiguredHandlers-seed#[9DA0C6DBE7203F62]) [    ] o.a.s.SolrTestCaseJ4 ###Starting testAllConfiguredHandlers
   [junit4]   2> 498292 INFO  (TEST-MinimalSchemaTest.testAllConfiguredHandlers-seed#[9DA0C6DBE7203F62]) [    ] o.a.s.c.S.Request [collection1]  webapp=null path=null params={q=foo:bar&qt=standard&omitHeader=false&wt=xml} hits=0 status=0 QTime=0
   [junit4]   2> 498292 INFO  (TEST-MinimalSchemaTest.testAllConfiguredHandlers-seed#[9DA0C6DBE7203F62]) [    ] o.a.s.c.S.Request [collection1]  webapp=null path=null params={q=foo:bar&qt=&omitHeader=false&wt=xml} hits=0 status=0 QTime=0
   [junit4]   2> 498293 INFO  (TEST-MinimalSchemaTest.testAllConfiguredHandlers-seed#[9DA0C6DBE7203F62]) [    ] o.a.s.c.S.Request [collection1]  webapp=null path=null params={q=foo:bar&qt=spellCheckCompRH&omitHeader=false&wt=xml} hits=0 status=0 QTime=0
   [junit4]   2> 498293 INFO  (TEST-MinimalSchemaTest.testAllConfiguredHandlers-seed#[9DA0C6DBE7203F62]) [    ] o.a.s.c.PluginBag Going to create a new requestHandler with {type = requestHandler,name = lazy,class = solr.StandardRequestHandler,args = {defaults={rows=4,hl=true,hl.fl=text,name,subject,title,whitetok}}} 
   [junit4]   2> 498294 INFO  (TEST-MinimalSchemaTest.testAllConfiguredHandlers-seed#[9DA0C6DBE7203F62]) [    ] o.a.s.c.S.Request [collection1]  webapp=null path=null params={q=foo:bar&qt=lazy&omitHeader=false&wt=xml} hits=0 status=0 QTime=0
   [junit4]   2> 498294 INFO  (TEST-MinimalSchemaTest.testAllConfiguredHandlers-seed#[9DA0C6DBE7203F62]) [    ] o.a.s.c.S.Request [collection1]  webapp=null path=null params={q=foo:bar&qt=spellCheckWithWordbreak_Direct&omitHeader=false&wt=xml} hits=0 status=0 QTime=0
   [junit4]   2> 498295 INFO  (TEST-MinimalSchemaTest.testAllConfiguredHandlers-seed#[9DA0C6DBE7203F62]) [    ] o.a.s.c.S.Request [collection1]  webapp=null path=null params={q=foo:bar&qt=tvrh&omitHeader=false&wt=xml} hits=0 status=0 QTime=0
   [junit4]   2> 498295 INFO  (TEST-MinimalSchemaTest.testAllConfiguredHandlers-seed#[9DA0C6DBE7203F62]) [    ] o.a.s.c.S.Request [collection1]  webapp=null path=null params={q=foo:bar&qt=/get&omitHeader=false&wt=xml} status=0 QTime=0
   [junit4]   2> 498295 INFO  (TEST-MinimalSchemaTest.testAllConfiguredHandlers-seed#[9DA0C6DBE7203F62]) [    ] o.a.s.c.S.Request [collection1]  webapp=null path=null params={q=foo:bar&qt=mltrh&omitHeader=false&wt=xml} hits=0 status=0 QTime=0
   [junit4]   2> 498296 INFO  (TEST-MinimalSchemaTest.testAllConfiguredHandlers-seed#[9DA0C6DBE7203F62]) [    ] o.a.s.c.S.Request [collection1]  webapp=null path=null params={q=foo:bar&qt=/search-facet-def&omitHeader=false&wt=xml} hits=0 status=0 QTime=0
   [junit4]   2> 498305 ERROR (TEST-MinimalSchemaTest.testAllConfiguredHandlers-seed#[9DA0C6DBE7203F62]) [    ] o.a.s.h.GraphHandler java.lang.NullPointerException
   [junit4]   2> 	at org.apache.solr.client.solrj.io.stream.expr.StreamExpressionParser.generateStreamExpression(StreamExpressionParser.java:46)
   [junit4]   2> 	at org.apache.solr.client.solrj.io.stream.expr.StreamExpressionParser.parse(StreamExpressionParser.java:37)
   [junit4]   2> 	at org.apache.solr.client.solrj.io.stream.expr.StreamFactory.constructStream(StreamFactory.java:178)
   [junit4]   2> 	at org.apache.solr.handler.GraphHandler.handleRequestBody(GraphHandler.java:159)
   [junit4]   2> 	at org.apache.solr.handler.RequestHandlerBase.handleRequest(RequestHandlerBase.java:155)
   [junit4]   2> 	at org.apache.solr.core.SolrCore.execute(SolrCore.java:2016)
   [junit4]   2> 	at org.apache.solr.util.TestHarness.query(TestHarness.java:310)
   [junit4]   2> 	at org.apache.solr.util.TestHarness.query(TestHarness.java:292)
   [junit4]   2> 	at org.apache.solr.SolrTestCaseJ4.assertQ(SolrTestCaseJ4.java:760)
   [junit4]   2> 	at org.apache.solr.MinimalSchemaTest.testAllConfiguredHandlers(MinimalSchemaTest.java:121)
   [junit4]   2> 	at sun.reflect.NativeMethodAccessorImpl.invoke0(Native Method)
   [junit4]   2> 	at sun.reflect.NativeMethodAccessorImpl.invoke(NativeMethodAccessorImpl.java:62)
   [junit4]   2> 	at sun.reflect.DelegatingMethodAccessorImpl.invoke(DelegatingMethodAccessorImpl.java:43)
   [junit4]   2> 	at java.lang.reflect.Method.invoke(Method.java:498)
   [junit4]   2> 	at com.carrotsearch.randomizedtesting.RandomizedRunner.invoke(RandomizedRunner.java:1764)
   [junit4]   2> 	at com.carrotsearch.randomizedtesting.RandomizedRunner$8.evaluate(RandomizedRunner.java:871)
   [junit4]   2> 	at com.carrotsearch.randomizedtesting.RandomizedRunner$9.evaluate(RandomizedRunner.java:907)
   [junit4]   2> 	at com.carrotsearch.randomizedtesting.RandomizedRunner$10.evaluate(RandomizedRunner.java:921)
   [junit4]   2> 	at com.carrotsearch.randomizedtesting.rules.SystemPropertiesRestoreRule$1.evaluate(SystemPropertiesRestoreRule.java:57)
   [junit4]   2> 	at org.apache.lucene.util.TestRuleSetupTeardownChained$1.evaluate(TestRuleSetupTeardownChained.java:49)
   [junit4]   2> 	at org.apache.lucene.util.AbstractBeforeAfterRule$1.evaluate(AbstractBeforeAfterRule.java:45)
   [junit4]   2> 	at org.apache.lucene.util.TestRuleThreadAndTestName$1.evaluate(TestRuleThreadAndTestName.java:48)
   [junit4]   2> 	at org.apache.lucene.util.TestRuleIgnoreAfterMaxFailures$1.evaluate(TestRuleIgnoreAfterMaxFailures.java:64)
   [junit4]   2> 	at org.apache.lucene.util.TestRuleMarkFailure$1.evaluate(TestRuleMarkFailure.java:47)
   [junit4]   2> 	at com.carrotsearch.randomizedtesting.rules.StatementAdapter.evaluate(StatementAdapter.java:36)
   [junit4]   2> 	at com.carrotsearch.randomizedtesting.ThreadLeakControl$StatementRunner.run(ThreadLeakControl.java:367)
   [junit4]   2> 	at com.carrotsearch.randomizedtesting.ThreadLeakControl.forkTimeoutingTask(ThreadLeakControl.java:809)
   [junit4]   2> 	at com.carrotsearch.randomizedtesting.ThreadLeakControl$3.evaluate(ThreadLeakControl.java:460)
   [junit4]   2> 	at com.carrotsearch.randomizedtesting.RandomizedRunner.runSingleTest(RandomizedRunner.java:880)
   [junit4]   2> 	at com.carrotsearch.randomizedtesting.RandomizedRunner$5.evaluate(RandomizedRunner.java:781)
   [junit4]   2> 	at com.carrotsearch.randomizedtesting.RandomizedRunner$6.evaluate(RandomizedRunner.java:816)
   [junit4]   2> 	at com.carrotsearch.randomizedtesting.RandomizedRunner$7.evaluate(RandomizedRunner.java:827)
   [junit4]   2> 	at com.carrotsearch.randomizedtesting.rules.StatementAdapter.evaluate(StatementAdapter.java:36)
   [junit4]   2> 	at com.carrotsearch.randomizedtesting.rules.SystemPropertiesRestoreRule$1.evaluate(SystemPropertiesRestoreRule.java:57)
   [junit4]   2> 	at org.apache.lucene.util.AbstractBeforeAfterRule$1.evaluate(AbstractBeforeAfterRule.java:45)
   [junit4]   2> 	at com.carrotsearch.randomizedtesting.rules.StatementAdapter.evaluate(StatementAdapter.java:36)
   [junit4]   2> 	at org.apache.lucene.util.TestRuleStoreClassName$1.evaluate(TestRuleStoreClassName.java:41)
   [junit4]   2> 	at com.carrotsearch.randomizedtesting.rules.NoShadowingOrOverridesOnMethodsRule$1.evaluate(NoShadowingOrOverridesOnMethodsRule.java:40)
   [junit4]   2> 	at com.carrotsearch.randomizedtesting.rules.NoShadowingOrOverridesOnMethodsRule$1.evaluate(NoShadowingOrOverridesOnMethodsRule.java:40)
   [junit4]   2> 	at com.carrotsearch.randomizedtesting.rules.StatementAdapter.evaluate(StatementAdapter.java:36)
   [junit4]   2> 	at com.carrotsearch.randomizedtesting.rules.StatementAdapter.evaluate(StatementAdapter.java:36)
   [junit4]   2> 	at com.carrotsearch.randomizedtesting.rules.StatementAdapter.evaluate(StatementAdapter.java:36)
   [junit4]   2> 	at org.apache.lucene.util.TestRuleAssertionsRequired$1.evaluate(TestRuleAssertionsRequired.java:53)
   [junit4]   2> 	at org.apache.lucene.util.TestRuleMarkFailure$1.evaluate(TestRuleMarkFailure.java:47)
   [junit4]   2> 	at org.apache.lucene.util.TestRuleIgnoreAfterMaxFailures$1.evaluate(TestRuleIgnoreAfterMaxFailures.java:64)
   [junit4]   2> 	at org.apache.lucene.util.TestRuleIgnoreTestSuites$1.evaluate(TestRuleIgnoreTestSuites.java:54)
   [junit4]   2> 	at com.carrotsearch.randomizedtesting.rules.StatementAdapter.evaluate(StatementAdapter.java:36)
   [junit4]   2> 	at com.carrotsearch.randomizedtesting.ThreadLeakControl$StatementRunner.run(ThreadLeakControl.java:367)
   [junit4]   2> 	at java.lang.Thread.run(Thread.java:745)
   [junit4]   2> 
   [junit4]   2> 498306 INFO  (TEST-MinimalSchemaTest.testAllConfiguredHandlers-seed#[9DA0C6DBE7203F62]) [    ] o.a.s.c.S.Request [collection1]  webapp=null path=null params={q=foo:bar&qt=/graph&omitHeader=false&wt=xml} status=0 QTime=10
   [junit4]   2> [Fatal Error] :1:1: Content is not allowed in prolog.
   [junit4]   2> 498336 ERROR (TEST-MinimalSchemaTest.testAllConfiguredHandlers-seed#[9DA0C6DBE7203F62]) [    ] o.a.s.SolrTestCaseJ4 REQUEST FAILED: q=foo:bar&qt=/graph&omitHeader=false&wt=xml:org.xml.sax.SAXParseException; lineNumber: 1; columnNumber: 1; Content is not allowed in prolog.
   [junit4]   2> 	at com.sun.org.apache.xerces.internal.parsers.DOMParser.parse(DOMParser.java:257)
   [junit4]   2> 	at com.sun.org.apache.xerces.internal.jaxp.DocumentBuilderImpl.parse(DocumentBuilderImpl.java:339)
   [junit4]   2> 	at javax.xml.parsers.DocumentBuilder.parse(DocumentBuilder.java:121)
   [junit4]   2> 	at org.apache.solr.util.BaseTestHarness.validateXPath(BaseTestHarness.java:84)
   [junit4]   2> 	at org.apache.solr.SolrTestCaseJ4.assertQ(SolrTestCaseJ4.java:771)
   [junit4]   2> 	at org.apache.solr.MinimalSchemaTest.testAllConfiguredHandlers(MinimalSchemaTest.java:121)
   [junit4]   2> 	at sun.reflect.NativeMethodAccessorImpl.invoke0(Native Method)
   [junit4]   2> 	at sun.reflect.NativeMethodAccessorImpl.invoke(NativeMethodAccessorImpl.java:62)
   [junit4]   2> 	at sun.reflect.DelegatingMethodAccessorImpl.invoke(DelegatingMethodAccessorImpl.java:43)
   [junit4]   2> 	at java.lang.reflect.Method.invoke(Method.java:498)
   [junit4]   2> 	at com.carrotsearch.randomizedtesting.RandomizedRunner.invoke(RandomizedRunner.java:1764)
   [junit4]   2> 	at com.carrotsearch.randomizedtesting.RandomizedRunner$8.evaluate(RandomizedRunner.java:871)
   [junit4]   2> 	at com.carrotsearch.randomizedtesting.RandomizedRunner$9.evaluate(RandomizedRunner.java:907)
   [junit4]   2> 	at com.carrotsearch.randomizedtesting.RandomizedRunner$10.evaluate(RandomizedRunner.java:921)
   [junit4]   2> 	at com.carrotsearch.randomizedtesting.rules.SystemPropertiesRestoreRule$1.evaluate(SystemPropertiesRestoreRule.java:57)
   [junit4]   2> 	at org.apache.lucene.util.TestRuleSetupTeardownChained$1.evaluate(TestRuleSetupTeardownChained.java:49)
   [junit4]   2> 	at org.apache.lucene.util.AbstractBeforeAfterRule$1.evaluate(AbstractBeforeAfterRule.java:45)
   [junit4]   2> 	at org.apache.lucene.util.TestRuleThreadAndTestName$1.evaluate(TestRuleThreadAndTestName.java:48)
   [junit4]   2> 	at org.apache.lucene.util.TestRuleIgnoreAfterMaxFailures$1.evaluate(TestRuleIgnoreAfterMaxFailures.java:64)
   [junit4]   2> 	at org.apache.lucene.util.TestRuleMarkFailure$1.evaluate(TestRuleMarkFailure.java:47)
   [junit4]   2> 	at com.carrotsearch.randomizedtesting.rules.StatementAdapter.evaluate(StatementAdapter.java:36)
   [junit4]   2> 	at com.carrotsearch.randomizedtesting.ThreadLeakControl$StatementRunner.run(ThreadLeakControl.java:367)
   [junit4]   2> 	at com.carrotsearch.randomizedtesting.ThreadLeakControl.forkTimeoutingTask(ThreadLeakControl.java:809)
   [junit4]   2> 	at com.carrotsearch.randomizedtesting.ThreadLeakControl$3.evaluate(ThreadLeakControl.java:460)
   [junit4]   2> 	at com.carrotsearch.randomizedtesting.RandomizedRunner.runSingleTest(RandomizedRunner.java:880)
   [junit4]   2> 	at com.carrotsearch.randomizedtesting.RandomizedRunner$5.evaluate(RandomizedRunner.java:781)
   [junit4]   2> 	at com.carrotsearch.randomizedtesting.RandomizedRunner$6.evaluate(RandomizedRunner.java:816)
   [junit4]   2> 	at com.carrotsearch.randomizedtesting.RandomizedRunner$7.evaluate(RandomizedRunner.java:827)
   [junit4]   2> 	at com.carrotsearch.randomizedtesting.rules.StatementAdapter.evaluate(StatementAdapter.java:36)
   [junit4]   2> 	at com.carrotsearch.randomizedtesting.rules.SystemPropertiesRestoreRule$1.evaluate(SystemPropertiesRestoreRule.java:57)
   [junit4]   2> 	at org.apache.lucene.util.AbstractBeforeAfterRule$1.evaluate(AbstractBeforeAfterRule.java:45)
   [junit4]   2> 	at com.carrotsearch.randomizedtesting.rules.StatementAdapter.evaluate(StatementAdapter.java:36)
   [junit4]   2> 	at org.apache.lucene.util.TestRuleStoreClassName$1.evaluate(TestRuleStoreClassName.java:41)
   [junit4]   2> 	at com.carrotsearch.randomizedtesting.rules.NoShadowingOrOverridesOnMethodsRule$1.evaluate(NoShadowingOrOverridesOnMethodsRule.java:40)
   [junit4]   2> 	at com.carrotsearch.randomizedtesting.rules.NoShadowingOrOverridesOnMethodsRule$1.evaluate(NoShadowingOrOverridesOnMethodsRule.java:40)
   [junit4]   2> 	at com.carrotsearch.randomizedtesting.rules.StatementAdapter.evaluate(StatementAdapter.java:36)
   [junit4]   2> 	at com.carrotsearch.randomizedtesting.rules.StatementAdapter.evaluate(StatementAdapter.java:36)
   [junit4]   2> 	at com.carrotsearch.randomizedtesting.rules.StatementAdapter.evaluate(StatementAdapter.java:36)
   [junit4]   2> 	at org.apache.lucene.util.TestRuleAssertionsRequired$1.evaluate(TestRuleAssertionsRequired.java:53)
   [junit4]   2> 	at org.apache.lucene.util.TestRuleMarkFailure$1.evaluate(TestRuleMarkFailure.java:47)
   [junit4]   2> 	at org.apache.lucene.util.TestRuleIgnoreAfterMaxFailures$1.evaluate(TestRuleIgnoreAfterMaxFailures.java:64)
   [junit4]   2> 	at org.apache.lucene.util.TestRuleIgnoreTestSuites$1.evaluate(TestRuleIgnoreTestSuites.java:54)
   [junit4]   2> 	at com.carrotsearch.randomizedtesting.rules.StatementAdapter.evaluate(StatementAdapter.java:36)
   [junit4]   2> 	at com.carrotsearch.randomizedtesting.ThreadLeakControl$StatementRunner.run(ThreadLeakControl.java:367)
   [junit4]   2> 	at java.lang.Thread.run(Thread.java:745)
   [junit4]   2> 
   [junit4]   2> 498337 INFO  (TEST-MinimalSchemaTest.testAllConfiguredHandlers-seed#[9DA0C6DBE7203F62]) [    ] o.a.s.SolrTestCaseJ4 ###Ending testAllConfiguredHandlers
   [junit4]   2> NOTE: reproduce with: ant test  -Dtestcase=MinimalSchemaTest -Dtests.method=testAllConfiguredHandlers -Dtests.seed=9DA0C6DBE7203F62 -Dtests.slow=true -Dtests.locale=ar-LB -Dtests.timezone=Europe/Madrid -Dtests.asserts=true -Dtests.file.encoding=US-ASCII
   [junit4] ERROR   0.05s J1 | MinimalSchemaTest.testAllConfiguredHandlers <<<
   [junit4]    > Throwable #1: java.lang.RuntimeException: exception w/handler: '/graph'
   [junit4]    > 	at __randomizedtesting.SeedInfo.seed([9DA0C6DBE7203F62:70BE7DE16C2D3EE6]:0)
   [junit4]    > 	at org.apache.solr.MinimalSchemaTest.testAllConfiguredHandlers(MinimalSchemaTest.java:130)
   [junit4]    > 	at java.lang.Thread.run(Thread.java:745)
   [junit4]    > Caused by: java.lang.RuntimeException: Exception during query
   [junit4]    > 	at org.apache.solr.SolrTestCaseJ4.assertQ(SolrTestCaseJ4.java:786)
   [junit4]    > 	at org.apache.solr.MinimalSchemaTest.testAllConfiguredHandlers(MinimalSchemaTest.java:121)
   [junit4]    > 	... 39 more
   [junit4]    > Caused by: org.xml.sax.SAXParseException; lineNumber: 1; columnNumber: 1; Content is not allowed in prolog.
   [junit4]    > 	at com.sun.org.apache.xerces.internal.parsers.DOMParser.parse(DOMParser.java:257)
   [junit4]    > 	at com.sun.org.apache.xerces.internal.jaxp.DocumentBuilderImpl.parse(DocumentBuilderImpl.java:339)
   [junit4]    > 	at javax.xml.parsers.DocumentBuilder.parse(DocumentBuilder.java:121)
   [junit4]    > 	at org.apache.solr.util.BaseTestHarness.validateXPath(BaseTestHarness.java:84)
   [junit4]    > 	at org.apache.solr.SolrTestCaseJ4.assertQ(SolrTestCaseJ4.java:771)
   [junit4]    > 	... 40 more
   [junit4]   2> 498342 INFO  (TEST-MinimalSchemaTest.testLuke-seed#[9DA0C6DBE7203F62]) [    ] o.a.s.SolrTestCaseJ4 ###Starting testLuke
   [junit4]   2> 498347 INFO  (TEST-MinimalSchemaTest.testLuke-seed#[9DA0C6DBE7203F62]) [    ] o.a.s.c.S.Request [collection1]  webapp=null path=null params={qt=/admin/luke&wt=xml} status=0 QTime=4
   [junit4]   2> 498349 INFO  (TEST-MinimalSchemaTest.testLuke-seed#[9DA0C6DBE7203F62]) [    ] o.a.s.c.S.Request [collection1]  webapp=null path=null params={qt=/admin/luke&show=schema&wt=xml} status=0 QTime=0
   [junit4]   2> 498350 INFO  (TEST-MinimalSchemaTest.testLuke-seed#[9DA0C6DBE7203F62]) [    ] o.a.s.SolrTestCaseJ4 ###Ending testLuke
   [junit4]   2> 498350 INFO  (SUITE-MinimalSchemaTest-seed#[9DA0C6DBE7203F62]-worker) [    ] o.a.s.SolrTestCaseJ4 ###deleteCore
   [junit4]   2> 498350 INFO  (SUITE-MinimalSchemaTest-seed#[9DA0C6DBE7203F62]-worker) [    ] o.a.s.c.CoreContainer Shutting down CoreContainer instance=1175627482
   [junit4]   2> 498351 INFO  (coreCloseExecutor-1591-thread-1) [    x:collection1] o.a.s.c.SolrCore [collection1]  CLOSING SolrCore org.apache.solr.core.SolrCore@5cf5ad84
   [junit4]   2> 498351 INFO  (coreCloseExecutor-1591-thread-1) [    x:collection1] o.a.s.u.DirectUpdateHandler2 closing DirectUpdateHandler2{commits=1,autocommits=0,soft autocommits=0,optimizes=1,rollbacks=0,expungeDeletes=0,docsPending=0,adds=0,deletesById=0,deletesByQuery=0,errors=0,cumulative_adds=2,cumulative_deletesById=0,cumulative_deletesByQuery=0,cumulative_errors=0,transaction_logs_total_size=132,transaction_logs_total_number=1}
   [junit4]   2> 498352 INFO  (coreCloseExecutor-1591-thread-1) [    x:collection1] o.a.s.u.SolrCoreState Closing SolrCoreState
   [junit4]   2> 498353 INFO  (coreCloseExecutor-1591-thread-1) [    x:collection1] o.a.s.u.DefaultSolrCoreState SolrCoreState ref count has reached 0 - closing IndexWriter
   [junit4]   2> 498353 INFO  (coreCloseExecutor-1591-thread-1) [    x:collection1] o.a.s.u.DefaultSolrCoreState closing IndexWriter with IndexWriterCloser
   [junit4]   2> 498353 INFO  (coreCloseExecutor-1591-thread-1) [    x:collection1] o.a.s.c.SolrCore [collection1] Closing main searcher on request.
   [junit4]   2> 498363 INFO  (coreCloseExecutor-1591-thread-1) [    x:collection1] o.a.s.c.CachingDirectoryFactory Closing MockDirectoryFactory - 2 directories currently being tracked
   [junit4]   2> 498363 INFO  (coreCloseExecutor-1591-thread-1) [    x:collection1] o.a.s.c.CachingDirectoryFactory looking to close /Users/jenkins/workspace/Lucene-Solr-6.x-MacOSX/solr/build/solr-core/test/J1/temp/solr.MinimalSchemaTest_9DA0C6DBE7203F62-001/init-core-data-001 [CachedDir<<refCount=0;path=/Users/jenkins/workspace/Lucene-Solr-6.x-MacOSX/solr/build/solr-core/test/J1/temp/solr.MinimalSchemaTest_9DA0C6DBE7203F62-001/init-core-data-001;done=false>>]
   [junit4]   2> 498363 INFO  (coreCloseExecutor-1591-thread-1) [    x:collection1] o.a.s.c.CachingDirectoryFactory Closing directory, CoreContainer#isShutdown=true
   [junit4]   2> 498363 INFO  (coreCloseExecutor-1591-thread-1) [    x:collection1] o.a.s.c.CachingDirectoryFactory Closing directory: /Users/jenkins/workspace/Lucene-Solr-6.x-MacOSX/solr/build/solr-core/test/J1/temp/solr.MinimalSchemaTest_9DA0C6DBE7203F62-001/init-core-data-001
   [junit4]   2> 498363 INFO  (coreCloseExecutor-1591-thread-1) [    x:collection1] o.a.s.c.CachingDirectoryFactory looking to close /Users/jenkins/workspace/Lucene-Solr-6.x-MacOSX/solr/build/solr-core/test/J1/temp/solr.MinimalSchemaTest_9DA0C6DBE7203F62-001/init-core-data-001/index [CachedDir<<refCount=0;path=/Users/jenkins/workspace/Lucene-Solr-6.x-MacOSX/solr/build/solr-core/test/J1/temp/solr.MinimalSchemaTest_9DA0C6DBE7203F62-001/init-core-data-001/index;done=false>>]
   [junit4]   2> 498363 INFO  (coreCloseExecutor-1591-thread-1) [    x:collection1] o.a.s.c.CachingDirectoryFactory Closing directory, CoreContainer#isShutdown=true
   [junit4]   2> 498363 INFO  (coreCloseExecutor-1591-thread-1) [    x:collection1] o.a.s.c.CachingDirectoryFactory Closing directory: /Users/jenkins/workspace/Lucene-Solr-6.x-MacOSX/solr/build/solr-core/test/J1/temp/solr.MinimalSchemaTest_9DA0C6DBE7203F62-001/init-core-data-001/index
   [junit4]   2> NOTE: leaving temporary files on disk at: /Users/jenkins/workspace/Lucene-Solr-6.x-MacOSX/solr/build/solr-core/test/J1/temp/solr.MinimalSchemaTest_9DA0C6DBE7203F62-001
   [junit4]   2> NOTE: test params are: codec=FastCompressingStoredFields(storedFieldsFormat=CompressingStoredFieldsFormat(compressionMode=FAST, chunkSize=1, maxDocsPerChunk=448, blockSize=6), termVectorsFormat=CompressingTermVectorsFormat(compressionMode=FAST, chunkSize=1, blockSize=6)), sim=ClassicSimilarity, locale=ar-LB, timezone=Europe/Madrid
   [junit4]   2> NOTE: Mac OS X 10.11.4 x86_64/Oracle Corporation 1.8.0_72 (64-bit)/cpus=3,threads=1,free=272554736,total=536870912
   [junit4]   2> NOTE: All tests run in this JVM: [DebugComponentTest, MergeStrategyTest, TestCloudDeleteByQuery, TestSolrQueryResponse, TestCharFilters, TestPHPSerializedResponseWriter, BasicFunctionalityTest, SolrCoreCheckLockOnStartupTest, TestRandomCollapseQParserPlugin, TestSolrIndexConfig, SparseHLLTest, ResourceLoaderTest, TestSolr4Spatial2, AtomicUpdatesTest, NumericFieldsTest, HdfsRecoveryZkTest, ExplicitHLLTest, RemoteQueryErrorTest, BasicZkTest, TestStandardQParsers, TestCSVResponseWriter, LeaderFailoverAfterPartitionTest, TolerantUpdateProcessorTest, OpenExchangeRatesOrgProviderTest, FullSolrCloudDistribCmdsTest, TestPivotHelperCode, TestDistributedGrouping, ShardRoutingCustomTest, SignatureUpdateProcessorFactoryTest, HdfsLockFactoryTest, SolrInfoMBeanTest, TestSuggestSpellingConverter, TestJettySolrRunner, TestCloudSchemaless, FileBasedSpellCheckerTest, BlockCacheTest, CoreAdminHandlerTest, CoreAdminCreateDiscoverTest, SuggesterTSTTest, TestRestoreCore, StatsComponentTest, TestFieldTypeResource, TestLMJelinekMercerSimilarityFactory, TestCrossCoreJoin, TestSchemaVersionResource, TestConfigSets, SuggesterTest, TestBadConfig, DistributedFacetPivotWhiteBoxTest, DistributedQueueTest, HdfsChaosMonkeySafeLeaderTest, GraphQueryTest, TestReplicaProperties, DistributedFacetPivotLargeTest, DistanceFunctionTest, TestGeoJSONResponseWriter, TestFastWriter, ChangedSchemaMergeTest, OutputWriterTest, CSVRequestHandlerTest, MinimalSchemaTest]
   [junit4] Completed [123/595 (1!)] on J1 in 0.38s, 3 tests, 1 error <<< FAILURES!

[...truncated 594 lines...]
   [junit4] Suite: org.apache.solr.core.SolrCoreTest
   [junit4]   2> Creating dataDir: /Users/jenkins/workspace/Lucene-Solr-6.x-MacOSX/solr/build/solr-core/test/J0/temp/solr.core.SolrCoreTest_9DA0C6DBE7203F62-001/init-core-data-001
   [junit4]   2> 1525511 INFO  (SUITE-SolrCoreTest-seed#[9DA0C6DBE7203F62]-worker) [    ] o.a.s.SolrTestCaseJ4 Randomized ssl (false) and clientAuth (false)
   [junit4]   2> 1525513 INFO  (TEST-SolrCoreTest.testRequestHandlerRegistry-seed#[9DA0C6DBE7203F62]) [    ] o.a.s.SolrTestCaseJ4 ###Starting testRequestHandlerRegistry
   [junit4]   2> 1525513 INFO  (TEST-SolrCoreTest.testRequestHandlerRegistry-seed#[9DA0C6DBE7203F62]) [    ] o.a.s.SolrTestCaseJ4 ####initCore
   [junit4]   2> 1525513 INFO  (TEST-SolrCoreTest.testRequestHandlerRegistry-seed#[9DA0C6DBE7203F62]) [    ] o.a.s.c.SolrResourceLoader new SolrResourceLoader for directory: '/Users/jenkins/workspace/Lucene-Solr-6.x-MacOSX/solr/core/src/test-files/solr/collection1'
   [junit4]   2> 1525514 INFO  (TEST-SolrCoreTest.testRequestHandlerRegistry-seed#[9DA0C6DBE7203F62]) [    ] o.a.s.c.SolrResourceLoader JNDI not configured for solr (NoInitialContextEx)
   [junit4]   2> 1525514 INFO  (TEST-SolrCoreTest.testRequestHandlerRegistry-seed#[9DA0C6DBE7203F62]) [    ] o.a.s.c.SolrResourceLoader using system property solr.solr.home: /Users/jenkins/workspace/Lucene-Solr-6.x-MacOSX/solr/core/src/test-files/solr
   [junit4]   2> 1525514 INFO  (TEST-SolrCoreTest.testRequestHandlerRegistry-seed#[9DA0C6DBE7203F62]) [    ] o.a.s.c.SolrResourceLoader Adding 'file:/Users/jenkins/workspace/Lucene-Solr-6.x-MacOSX/solr/core/src/test-files/solr/collection1/lib/classes/' to classloader
   [junit4]   2> 1525514 INFO  (TEST-SolrCoreTest.testRequestHandlerRegistry-seed#[9DA0C6DBE7203F62]) [    ] o.a.s.c.SolrResourceLoader Adding 'file:/Users/jenkins/workspace/Lucene-Solr-6.x-MacOSX/solr/core/src/test-files/solr/collection1/lib/README' to classloader
   [junit4]   2> 1525555 INFO  (TEST-SolrCoreTest.testRequestHandlerRegistry-seed#[9DA0C6DBE7203F62]) [    ] o.a.s.c.SolrConfig current version of requestparams : -1
   [junit4]   2> 1525562 INFO  (TEST-SolrCoreTest.testRequestHandlerRegistry-seed#[9DA0C6DBE7203F62]) [    ] o.a.s.c.SolrConfig Using Lucene MatchVersion: 6.1.0
   [junit4]   2> 1525576 INFO  (TEST-SolrCoreTest.testRequestHandlerRegistry-seed#[9DA0C6DBE7203F62]) [    ] o.a.s.c.SolrConfig Loaded SolrConfig: solrconfig.xml
   [junit4]   2> 1525580 INFO  (TEST-SolrCoreTest.testRequestHandlerRegistry-seed#[9DA0C6DBE7203F62]) [    ] o.a.s.s.IndexSchema [null] Schema name=test
   [junit4]   2> 1525647 INFO  (TEST-SolrCoreTest.testRequestHandlerRegistry-seed#[9DA0C6DBE7203F62]) [    ] o.a.s.s.OpenExchangeRatesOrgProvider Initialized with rates=open-exchange-rates.json, refreshInterval=1440.
   [junit4]   2> 1525653 INFO  (TEST-SolrCoreTest.testRequestHandlerRegistry-seed#[9DA0C6DBE7203F62]) [    ] o.a.s.s.IndexSchema default search field in schema is text
   [junit4]   2> 1525653 INFO  (TEST-SolrCoreTest.testRequestHandlerRegistry-seed#[9DA0C6DBE7203F62]) [    ] o.a.s.s.IndexSchema unique key field: id
   [junit4]   2> 1525657 INFO  (TEST-SolrCoreTest.testRequestHandlerRegistry-seed#[9DA0C6DBE7203F62]) [    ] o.a.s.s.FileExchangeRateProvider Reloading exchange rates from file currency.xml
   [junit4]   2> 1525659 INFO  (TEST-SolrCoreTest.testRequestHandlerRegistry-seed#[9DA0C6DBE7203F62]) [    ] o.a.s.s.FileExchangeRateProvider Reloading exchange rates from file currency.xml
   [junit4]   2> 1525660 INFO  (TEST-SolrCoreTest.testRequestHandlerRegistry-seed#[9DA0C6DBE7203F62]) [    ] o.a.s.s.OpenExchangeRatesOrgProvider Reloading exchange rates from open-exchange-rates.json
   [junit4]   2> 1525660 INFO  (TEST-SolrCoreTest.testRequestHandlerRegistry-seed#[9DA0C6DBE7203F62]) [    ] o.a.s.s.OpenExchangeRatesOrgProvider Reloading exchange rates from open-exchange-rates.json
   [junit4]   2> 1525661 INFO  (TEST-SolrCoreTest.testRequestHandlerRegistry-seed#[9DA0C6DBE7203F62]) [    ] o.a.s.c.SolrResourceLoader JNDI not configured for solr (NoInitialContextEx)
   [junit4]   2> 1525661 INFO  (TEST-SolrCoreTest.testRequestHandlerRegistry-seed#[9DA0C6DBE7203F62]) [    ] o.a.s.c.SolrResourceLoader using system property solr.solr.home: /Users/jenkins/workspace/Lucene-Solr-6.x-MacOSX/solr/core/src/test-files/solr
   [junit4]   2> 1525661 INFO  (TEST-SolrCoreTest.testRequestHandlerRegistry-seed#[9DA0C6DBE7203F62]) [    ] o.a.s.c.SolrResourceLoader new SolrResourceLoader for directory: '/Users/jenkins/workspace/Lucene-Solr-6.x-MacOSX/solr/core/src/test-files/solr'
   [junit4]   2> 1525661 INFO  (TEST-SolrCoreTest.testRequestHandlerRegistry-seed#[9DA0C6DBE7203F62]) [    ] o.a.s.c.SolrResourceLoader JNDI not configured for solr (NoInitialContextEx)
   [junit4]   2> 1525661 INFO  (TEST-SolrCoreTest.testRequestHandlerRegistry-seed#[9DA0C6DBE7203F62]) [    ] o.a.s.c.SolrResourceLoader using system property solr.solr.home: /Users/jenkins/workspace/Lucene-Solr-6.x-MacOSX/solr/core/src/test-files/solr
   [junit4]   2> 1525661 INFO  (TEST-SolrCoreTest.testRequestHandlerRegistry-seed#[9DA0C6DBE7203F62]) [    ] o.a.s.c.CoreContainer New CoreContainer 536077083
   [junit4]   2> 1525661 INFO  (TEST-SolrCoreTest.testRequestHandlerRegistry-seed#[9DA0C6DBE7203F62]) [    ] o.a.s.c.CoreContainer Loading cores into CoreContainer [instanceDir=/Users/jenkins/workspace/Lucene-Solr-6.x-MacOSX/solr/core/src/test-files/solr]
   [junit4]   2> 1525661 WARN  (TEST-SolrCoreTest.testRequestHandlerRegistry-seed#[9DA0C6DBE7203F62]) [    ] o.a.s.c.CoreContainer Couldn't add files from /Users/jenkins/workspace/Lucene-Solr-6.x-MacOSX/solr/core/src/test-files/solr/lib to classpath: /Users/jenkins/workspace/Lucene-Solr-6.x-MacOSX/solr/core/src/test-files/solr/lib
   [junit4]   2> 1525661 INFO  (TEST-SolrCoreTest.testRequestHandlerRegistry-seed#[9DA0C6DBE7203F62]) [    ] o.a.s.h.c.HttpShardHandlerFactory created with socketTimeout : 600000,connTimeout : 60000,maxConnectionsPerHost : 20,maxConnections : 10000,corePoolSize : 0,maximumPoolSize : 2147483647,maxThreadIdleTime : 5,sizeOfQueue : -1,fairnessPolicy : false,useRetries : false,
   [junit4]   2> 1525665 INFO  (TEST-SolrCoreTest.testRequestHandlerRegistry-seed#[9DA0C6DBE7203F62]) [    ] o.a.s.u.UpdateShardHandler Creating UpdateShardHandler HTTP client with params: socketTimeout=30000&connTimeout=30000&retry=true
   [junit4]   2> 1525666 INFO  (TEST-SolrCoreTest.testRequestHandlerRegistry-seed#[9DA0C6DBE7203F62]) [    ] o.a.s.l.LogWatcher SLF4J impl is org.slf4j.impl.Log4jLoggerFactory
   [junit4]   2> 1525666 INFO  (TEST-SolrCoreTest.testRequestHandlerRegistry-seed#[9DA0C6DBE7203F62]) [    ] o.a.s.l.LogWatcher Registering Log Listener [Log4j (org.slf4j.impl.Log4jLoggerFactory)]
   [junit4]   2> 1525666 INFO  (TEST-SolrCoreTest.testRequestHandlerRegistry-seed#[9DA0C6DBE7203F62]) [    ] o.a.s.c.CoreContainer Security conf doesn't exist. Skipping setup for authorization module.
   [junit4]   2> 1525666 INFO  (TEST-SolrCoreTest.testRequestHandlerRegistry-seed#[9DA0C6DBE7203F62]) [    ] o.a.s.c.CoreContainer No authentication plugin used.
   [junit4]   2> 1525668 INFO  (TEST-SolrCoreTest.testRequestHandlerRegistry-seed#[9DA0C6DBE7203F62]) [    ] o.a.s.c.CoreDescriptor Created CoreDescriptor: {name=collection1, config=solrconfig.xml, transient=false, schema=schema.xml, loadOnStartup=true, configSetProperties=configsetprops.json, collection=collection1, dataDir=/Users/jenkins/workspace/Lucene-Solr-6.x-MacOSX/solr/build/solr-core/test/J0/temp/solr.core.SolrCoreTest_9DA0C6DBE7203F62-001/init-core-data-001, shard=shard1}
   [junit4]   2> 1525668 INFO  (coreLoadExecutor-6512-thread-1) [    ] o.a.s.c.SolrResourceLoader new SolrResourceLoader for directory: '/Users/jenkins/workspace/Lucene-Solr-6.x-MacOSX/solr/core/src/test-files/solr/collection1'
   [junit4]   2> 1525668 INFO  (coreLoadExecutor-6512-thread-1) [    ] o.a.s.c.SolrResourceLoader JNDI not configured for solr (NoInitialContextEx)
   [junit4]   2> 1525668 INFO  (coreLoadExecutor-6512-thread-1) [    ] o.a.s.c.SolrResourceLoader using system property solr.solr.home: /Users/jenkins/workspace/Lucene-Solr-6.x-MacOSX/solr/core/src/test-files/solr
   [junit4]   2> 1525669 INFO  (coreLoadExecutor-6512-thread-1) [    ] o.a.s.c.SolrResourceLoader Adding 'file:/Users/jenkins/workspace/Lucene-Solr-6.x-MacOSX/solr/core/src/test-files/solr/collection1/lib/classes/' to classloader
   [junit4]   2> 1525669 INFO  (coreLoadExecutor-6512-thread-1) [    ] o.a.s.c.SolrResourceLoader Adding 'file:/Users/jenkins/workspace/Lucene-Solr-6.x-MacOSX/solr/core/src/test-files/solr/collection1/lib/README' to classloader
   [junit4]   2> 1525689 INFO  (coreLoadExecutor-6512-thread-1) [    ] o.a.s.c.SolrConfig current version of requestparams : -1
   [junit4]   2> 1525695 INFO  (coreLoadExecutor-6512-thread-1) [    ] o.a.s.c.SolrConfig Using Lucene MatchVersion: 6.1.0
   [junit4]   2> 1525708 INFO  (coreLoadExecutor-6512-thread-1) [    ] o.a.s.c.SolrConfig Loaded SolrConfig: solrconfig.xml
   [junit4]   2> 1525712 INFO  (coreLoadExecutor-6512-thread-1) [    ] o.a.s.s.IndexSchema [collection1] Schema name=test
   [junit4]   2> 1525776 INFO  (coreLoadExecutor-6512-thread-1) [    ] o.a.s.s.OpenExchangeRatesOrgProvider Initialized with rates=open-exchange-rates.json, refreshInterval=1440.
   [junit4]   2> 1525780 INFO  (coreLoadExecutor-6512-thread-1) [    ] o.a.s.s.IndexSchema default search field in schema is text
   [junit4]   2> 1525780 INFO  (coreLoadExecutor-6512-thread-1) [    ] o.a.s.s.IndexSchema unique key field: id
   [junit4]   2> 1525783 INFO  (coreLoadExecutor-6512-thread-1) [    ] o.a.s.s.FileExchangeRateProvider Reloading exchange rates from file currency.xml
   [junit4]   2> 1525784 INFO  (coreLoadExecutor-6512-thread-1) [    ] o.a.s.s.FileExchangeRateProvider Reloading exchange rates from file currency.xml
   [junit4]   2> 1525786 INFO  (coreLoadExecutor-6512-thread-1) [    ] o.a.s.s.OpenExchangeRatesOrgProvider Reloading exchange rates from open-exchange-rates.json
   [junit4]   2> 1525786 INFO  (coreLoadExecutor-6512-thread-1) [    ] o.a.s.s.OpenExchangeRatesOrgProvider Reloading exchange rates from open-exchange-rates.json
   [junit4]   2> 1525791 INFO  (coreLoadExecutor-6512-thread-1) [    ] o.a.s.c.ConfigSetProperties Did not find ConfigSet properties, assuming default properties: Can't find resource 'configsetprops.json' in classpath or '/Users/jenkins/workspace/Lucene-Solr-6.x-MacOSX/solr/core/src/test-files/solr/collection1'
   [junit4]   2> 1525791 INFO  (coreLoadExecutor-6512-thread-1) [    ] o.a.s.c.CoreContainer Creating SolrCore 'collection1' using configuration from instancedir /Users/jenkins/workspace/Lucene-Solr-6.x-MacOSX/solr/core/src/test-files/solr/collection1
   [junit4]   2> 1525791 INFO  (coreLoadExecutor-6512-thread-1) [    x:collection1] o.a.s.c.SolrCore org.apache.solr.core.MockDirectoryFactory
   [junit4]   2> 1525791 INFO  (coreLoadExecutor-6512-thread-1) [    x:collection1] o.a.s.c.SolrCore [[collection1] ] Opening new SolrCore at [/Users/jenkins/workspace/Lucene-Solr-6.x-MacOSX/solr/core/src/test-files/solr/collection1], dataDir=[/Users/jenkins/workspace/Lucene-Solr-6.x-MacOSX/solr/build/solr-core/test/J0/temp/solr.core.SolrCoreTest_9DA0C6DBE7203F62-001/init-core-data-001/]
   [junit4]   2> 1525791 INFO  (coreLoadExecutor-6512-thread-1) [    x:collection1] o.a.s.c.JmxMonitoredMap JMX monitoring is enabled. Adding Solr mbeans to JMX Server: com.sun.jmx.mbeanserver.JmxMBeanServer@63f0befc
   [junit4]   2> 1525792 INFO  (coreLoadExecutor-6512-thread-1) [    x:collection1] o.a.s.c.CachingDirectoryFactory return new directory for /Users/jenkins/workspace/Lucene-Solr-6.x-MacOSX/solr/build/solr-core/test/J0/temp/solr.core.SolrCoreTest_9DA0C6DBE7203F62-001/init-core-data-001
   [junit4]   2> 1525792 INFO  (coreLoadExecutor-6512-thread-1) [    x:collection1] o.a.s.c.SolrCore New index directory detected: old=null new=/Users/jenkins/workspace/Lucene-Solr-6.x-MacOSX/solr/build/solr-core/test/J0/temp/solr.core.SolrCoreTest_9DA0C6DBE7203F62-001/init-core-data-001/index/
   [junit4]   2> 1525792 WARN  (coreLoadExecutor-6512-thread-1) [    x:collection1] o.a.s.c.SolrCore [collection1] Solr index directory '/Users/jenkins/workspace/Lucene-Solr-6.x-MacOSX/solr/build/solr-core/test/J0/temp/solr.core.SolrCoreTest_9DA0C6DBE7203F62-001/init-core-data-001/index' doesn't exist. Creating new index...
   [junit4]   2> 1525792 INFO  (coreLoadExecutor-6512-thread-1) [    x:collection1] o.a.s.c.CachingDirectoryFactory return new directory for /Users/jenkins/workspace/Lucene-Solr-6.x-MacOSX/solr/build/solr-core/test/J0/temp/solr.core.SolrCoreTest_9DA0C6DBE7203F62-001/init-core-data-001/index
   [junit4]   2> 1525792 INFO  (coreLoadExecutor-6512-thread-1) [    x:collection1] o.a.s.u.RandomMergePolicy RandomMergePolicy wrapping class org.apache.lucene.index.LogByteSizeMergePolicy: [LogByteSizeMergePolicy: minMergeSize=1677721, mergeFactor=31, maxMergeSize=2147483648, maxMergeSizeForForcedMerge=9223372036854775807, calibrateSizeByDeletes=true, maxMergeDocs=2147483647, maxCFSSegmentSizeMB=8.796093022207999E12, noCFSRatio=1.0]
   [junit4]   2> 1525793 INFO  (coreLoadExecutor-6512-thread-1) [    x:collection1] o.a.s.c.SolrDeletionPolicy SolrDeletionPolicy.onCommit: commits: num=1
   [junit4]   2> 	commit{dir=MockDirectoryWrapper(RAMDirectory@afe7d77 lockFactory=org.apache.lucene.store.SingleInstanceLockFactory@1758304c),segFN=segments_1,generation=1}
   [junit4]   2> 1525793 INFO  (coreLoadExecutor-6512-thread-1) [    x:collection1] o.a.s.c.SolrDeletionPolicy newest commit generation = 1
   [junit4]   2> 1525793 INFO  (OldIndexDirectoryCleanupThreadForCore-collection1) [    x:collection1] o.a.s.c.SolrCore Looking for old index directories to cleanup for core collection1 in /Users/jenkins/workspace/Lucene-Solr-6.x-MacOSX/solr/build/solr-core/test/J0/temp/solr.core.SolrCoreTest_9DA0C6DBE7203F62-001/init-core-data-001/
   [junit4]   2> 1525796 INFO  (coreLoadExecutor-6512-thread-1) [    x:collection1] o.a.s.u.p.UpdateRequestProcessorChain creating updateRequestProcessorChain "dedupe"
   [junit4]   2> 1525796 INFO  (coreLoadExecutor-6512-thread-1) [    x:collection1] o.a.s.u.p.UpdateRequestProcessorChain inserting DistributedUpdateProcessorFactory into updateRequestProcessorChain "dedupe"
   [junit4]   2> 1525796 INFO  (coreLoadExecutor-6512-thread-1) [    x:collection1] o.a.s.u.p.UpdateRequestProcessorChain creating updateRequestProcessorChain "dedupe-allfields"
   [junit4]   2> 1525796 INFO  (coreLoadExecutor-6512-thread-1) [    x:collection1] o.a.s.u.p.UpdateRequestProcessorChain inserting DistributedUpdateProcessorFactory into updateRequestProcessorChain "dedupe-allfields"
   [junit4]   2> 1525796 INFO  (coreLoadExecutor-6512-thread-1) [    x:collection1] o.a.s.u.p.UpdateRequestProcessorChain creating updateRequestProcessorChain "stored_sig"
   [junit4]   2> 1525797 INFO  (coreLoadExecutor-6512-thread-1) [    x:collection1] o.a.s.u.p.UpdateRequestProcessorChain inserting DistributedUpdateProcessorFactory into updateRequestProcessorChain "stored_sig"
   [junit4]   2> 1525797 INFO  (coreLoadExecutor-6512-thread-1) [    x:collection1] o.a.s.u.p.UpdateRequestProcessorChain creating updateRequestProcessorChain "uniq-fields"
   [junit4]   2> 1525797 INFO  (coreLoadExecutor-6512-thread-1) [    x:collection1] o.a.s.u.p.UpdateRequestProcessorChain inserting DistributedUpdateProcessorFactory into updateRequestProcessorChain "uniq-fields"
   [junit4]   2> 1525797 INFO  (coreLoadExecutor-6512-thread-1) [    x:collection1] o.a.s.u.p.UpdateRequestProcessorChain creating updateRequestProcessorChain "distrib-dup-test-chain-explicit"
   [junit4]   2> 1525797 INFO  (coreLoadExecutor-6512-thread-1) [    x:collection1] o.a.s.u.p.UpdateRequestProcessorChain creating updateRequestProcessorChain "distrib-dup-test-chain-implicit"
   [junit4]   2> 1525797 INFO  (coreLoadExecutor-6512-thread-1) [    x:collection1] o.a.s.u.p.UpdateRequestProcessorChain inserting DistributedUpdateProcessorFactory into updateRequestProcessorChain "distrib-dup-test-chain-implicit"
   [junit4]   2> 1525797 INFO  (coreLoadExecutor-6512-thread-1) [    x:collection1] o.a.s.c.SolrCore no updateRequestProcessorChain defined as default, creating implicit default
   [junit4]   2> 1525801 INFO  (coreLoadExecutor-6512-thread-1) [    x:collection1] o.a.s.h.l.XMLLoader xsltCacheLifetimeSeconds=60
   [junit4]   2> 1525803 INFO  (coreLoadExecutor-6512-thread-1) [    x:collection1] o.a.s.h.l.XMLLoader xsltCacheLifetimeSeconds=60
   [junit4]   2> 1525803 INFO  (coreLoadExecutor-6512-thread-1) [    x:collection1] o.a.s.h.l.XMLLoader xsltCacheLifetimeSeconds=60
   [junit4]   2> 1525804 INFO  (coreLoadExecutor-6512-thread-1) [    x:collection1] o.a.s.h.l.XMLLoader xsltCacheLifetimeSeconds=60
   [junit4]   2> 1525808 INFO  (coreLoadExecutor-6512-thread-1) [    x:collection1] o.a.s.c.PluginBag requestHandler : 'lazy' created with startup=lazy 
   [junit4]   2> 1525809 INFO  (coreLoadExecutor-6512-thread-1) [    x:collection1] o.a.s.c.RequestHandlers Registered paths: /admin/mbeans,standard,spellCheckCompRH,lazy,/update/json/docs,/admin/luke,/export,spellCheckWithWordbreak_Direct,tvrh,/get,/admin/properties,/update/json,mltrh,/admin/threads,/search-facet-def,/update/csv,/sql,/graph,/search-facet-invariants,/admin/segments,spellCheckCompRH1,/mlt,/admin/system,/replication,dismax,defaults,/config,/stream,/schema,/admin/plugins,/admin/logging,spellCheckWithWordbreak,mock,/admin/ping,/update,/admin/file,/terms,spellCheckCompRH_Direct,/debug/dump
   [junit4]   2> 1525809 INFO  (coreLoadExecutor-6512-thread-1) [    x:collection1] o.a.s.c.SolrCore Using default statsCache cache: org.apache.solr.search.stats.LocalStatsCache
   [junit4]   2> 1525810 INFO  (coreLoadExecutor-6512-thread-1) [    x:collection1] o.a.s.u.UpdateHandler Using UpdateLog implementation: org.apache.solr.update.UpdateLog
   [junit4]   2> 1525810 INFO  (coreLoadExecutor-6512-thread-1) [    x:collection1] o.a.s.u.UpdateLog Initializing UpdateLog: dataDir= defaultSyncLevel=FLUSH numRecordsToKeep=100 maxNumLogsToKeep=10 numVersionBuckets=65536
   [junit4]   2> 1525811 INFO  (coreLoadExecutor-6512-thread-1) [    x:collection1] o.a.s.u.CommitTracker Hard AutoCommit: disabled
   [junit4]   2> 1525811 INFO  (coreLoadExecutor-6512-thread-1) [    x:collection1] o.a.s.u.CommitTracker Soft AutoCommit: disabled
   [junit4]   2> 1525811 INFO  (coreLoadExecutor-6512-thread-1) [    x:collection1] o.a.s.u.RandomMergePolicy RandomMergePolicy wrapping class org.apache.lucene.index.MockRandomMergePolicy: org.apache.lucene.index.MockRandomMergePolicy@7bf0b12
   [junit4]   2> 1525811 INFO  (coreLoadExecutor-6512-thread-1) [    x:collection1] o.a.s.c.SolrDeletionPolicy SolrDeletionPolicy.onInit: commits: num=1
   [junit4]   2> 	commit{dir=MockDirectoryWrapper(RAMDirectory@afe7d77 lockFactory=org.apache.lucene.store.SingleInstanceLockFactory@1758304c),segFN=segments_1,generation=1}
   [junit4]   2> 1525811 INFO  (coreLoadExecutor-6512-thread-1) [    x:collection1] o.a.s.c.SolrDeletionPolicy newest commit generation = 1
   [junit4]   2> 1525811 INFO  (coreLoadExecutor-6512-thread-1) [    x:collection1] o.a.s.s.SolrIndexSearcher Opening [Searcher@7e5ccc0[collection1] main]
   [junit4]   2> 1525812 INFO  (coreLoadExecutor-6512-thread-1) [    x:collection1] o.a.s.r.RestManager Initializing RestManager with initArgs: {storageIO=org.apache.solr.rest.ManagedResourceStorage$InMemoryStorageIO}
   [junit4]   2> 1525812 INFO  (coreLoadExecutor-6512-thread-1) [    x:collection1] o.a.s.r.ManagedResourceStorage Reading _rest_managed.json using InMemoryStorage
   [junit4]   2> 1525812 INFO  (coreLoadExecutor-6512-thread-1) [    x:collection1] o.a.s.r.RestManager Initializing 0 registered ManagedResources
   [junit4]   2> 1525812 INFO  (coreLoadExecutor-6512-thread-1) [    x:collection1] o.a.s.h.c.SpellCheckComponent Initializing spell checkers
   [junit4]   2> 1525831 INFO  (coreLoadExecutor-6512-thread-1) [    x:collection1] o.a.s.s.DirectSolrSpellChecker init: {name=direct,classname=DirectSolrSpellChecker,field=lowerfilt,minQueryLength=3}
   [junit4]   2> 1525941 INFO  (coreLoadExecutor-6512-thread-1) [    x:collection1] o.a.s.h.ReplicationHandler Commits will be reserved for  10000
   [junit4]   2> 1525941 INFO  (searcherExecutor-6513-thread-1-processing-x:collection1) [    x:collection1] o.a.s.h.c.SpellCheckComponent Loading spell index for spellchecker: default
   [junit4]   2> 1525941 INFO  (coreLoadExecutor-6512-thread-1) [    x:collection1] o.a.s.u.UpdateLog Looking up max value of version field to seed version buckets
   [junit4]   2> 1525942 INFO  (coreLoadExecutor-6512-thread-1) [    x:collection1] o.a.s.u.VersionInfo Refreshing highest value of _version_ for 65536 version buckets from index
   [junit4]   2> 1525942 INFO  (searcherExecutor-6513-thread-1-processing-x:collection1) [    x:collection1] o.a.s.h.c.SpellCheckComponent Loading spell index for spellchecker: direct
   [junit4]   2> 1525942 INFO  (searcherExecutor-6513-thread-1-processing-x:collection1) [    x:collection1] o.a.s.h.c.SpellCheckComponent Loading spell index for spellchecker: wordbreak
   [junit4]   2> 1525942 INFO  (searcherExecutor-6513-thread-1-processing-x:collection1) [    x:collection1] o.a.s.h.c.SpellCheckComponent Loading spell index for spellchecker: multipleFields
   [junit4]   2> 1525942 INFO  (coreLoadExecutor-6512-thread-1) [    x:collection1] o.a.s.u.VersionInfo No terms found for _version_, cannot seed version bucket highest value from index
   [junit4]   2> 1525942 INFO  (coreLoadExecutor-6512-thread-1) [    x:collection1] o.a.s.u.UpdateLog Could not find max version in index or recent updates, using new clock 1533541001914744832
   [junit4]   2> 1525942 INFO  (searcherExecutor-6513-thread-1-processing-x:collection1) [    x:collection1] o.a.s.h.c.SpellCheckComponent Loading spell index for spellchecker: jarowinkler
   [junit4]   2> 1525942 INFO  (searcherExecutor-6513-thread-1-processing-x:collection1) [    x:collection1] o.a.s.h.c.SpellCheckComponent Loading spell index for spellchecker: external
   [junit4]   2> 1525943 INFO  (searcherExecutor-6513-thread-1-processing-x:collection1) [    x:collection1] o.a.s.h.c.SpellCheckComponent Loading spell index for spellchecker: freq
   [junit4]   2> 1525943 INFO  (searcherExecutor-6513-thread-1-processing-x:collection1) [    x:collection1] o.a.s.h.c.SpellCheckComponent Loading spell index for spellchecker: fqcn
   [junit4]   2> 1525944 INFO  (coreLoadExecutor-6512-thread-1) [    x:collection1] o.a.s.u.UpdateLog Took 1.0ms to seed version buckets with highest version 1533541001914744832
   [junit4]   2> 1525944 INFO  (coreLoadExecutor-6512-thread-1) [    x:collection1] o.a.s.c.CoreContainer registering core: collection1
   [junit4]   2> 1525944 INFO  (searcherExecutor-6513-thread-1-processing-x:collection1) [    x:collection1] o.a.s.h.c.SpellCheckComponent Loading spell index for spellchecker: perDict
   [junit4]   2> 1525945 INFO  (searcherExecutor-6513-thread-1-processing-x:collection1) [    x:collection1] o.a.s.c.SolrCore [collection1] Registered new searcher Searcher@7e5ccc0[collection1] main{ExitableDirectoryReader(UninvertingDirectoryReader())}
   [junit4]   2> 1525945 INFO  (TEST-SolrCoreTest.testRequestHandlerRegistry-seed#[9DA0C6DBE7203F62]) [    ] o.a.s.SolrTestCaseJ4 ####initCore end
   [junit4]   2> 1525946 INFO  (TEST-SolrCoreTest.testRequestHandlerRegistry-seed#[9DA0C6DBE7203F62]) [    ] o.a.s.SolrTestCaseJ4 ###deleteCore
   [junit4]   2> 1525946 INFO  (TEST-SolrCoreTest.testRequestHandlerRegistry-seed#[9DA0C6DBE7203F62]) [    ] o.a.s.c.CoreContainer Shutting down CoreContainer instance=536077083
   [junit4]   2> 1525947 INFO  (coreCloseExecutor-6518-thread-1) [    x:collection1] o.a.s.c.SolrCore [collection1]  CLOSING SolrCore org.apache.solr.core.SolrCore@54e3cae0
   [junit4]   2> 1525947 INFO  (coreCloseExecutor-6518-thread-1) [    x:collection1] o.a.s.u.DirectUpdateHandler2 closing DirectUpdateHandler2{commits=0,autocommits=0,soft autocommits=0,optimizes=0,rollbacks=0,expungeDeletes=0,docsPending=0,adds=0,deletesById=0,deletesByQuery=0,errors=0,cumulative_adds=0,cumulative_deletesById=0,cumulative_deletesByQuery=0,cumulative_errors=0,transaction_logs_total_size=0,transaction_logs_total_number=0}
   [junit4]   2> 1525947 INFO  (coreCloseExecutor-6518-thread-1) [    x:collection1] o.a.s.u.SolrCoreState Closing SolrCoreState
   [junit4]   2> 1525947 INFO  (coreCloseExecutor-6518-thread-1) [    x:collection1] o.a.s.u.DefaultSolrCoreState SolrCoreState ref count has reached 0 - closing IndexWriter
   [junit4]   2> 1525947 INFO  (coreCloseExecutor-6518-thread-1) [    x:collection1] o.a.s.u.DefaultSolrCoreState closing IndexWriter with IndexWriterCloser
   [junit4]   2> 1525948 INFO  (coreCloseExecutor-6518-thread-1) [    x:collection1] o.a.s.c.SolrCore [collection1] Closing main searcher on request.
   [junit4]   2> 1525956 INFO  (coreCloseExecutor-6518-thread-1) [    x:collection1] o.a.s.c.CachingDirectoryFactory Closing MockDirectoryFactory - 2 directories currently being tracked
   [junit4]   2> 1525956 INFO  (coreCloseExecutor-6518-thread-1) [    x:collection1] o.a.s.c.CachingDirectoryFactory looking to close /Users/jenkins/workspace/Lucene-Solr-6.x-MacOSX/solr/build/solr-core/test/J0/temp/solr.core.SolrCoreTest_9DA0C6DBE7203F62-001/init-core-data-001/index [CachedDir<<refCount=0;path=/Users/jenkins/workspace/Lucene-Solr-6.x-MacOSX/solr/build/solr-core/test/J0/temp/solr.core.SolrCoreTest_9DA0C6DBE7203F62-001/init-core-data-001/index;done=false>>]
   [junit4]   2> 1525956 INFO  (coreCloseExecutor-6518-thread-1) [    x:collection1] o.a.s.c.CachingDirectoryFactory Closing directory, CoreContainer#isShutdown=true
   [junit4]   2> 1525956 INFO  (coreCloseExecutor-6518-thread-1) [    x:collection1] o.a.s.c.CachingDirectoryFactory Closing directory: /Users/jenkins/workspace/Lucene-Solr-6.x-MacOSX/solr/build/solr-core/test/J0/temp/solr.core.SolrCoreTest_9DA0C6DBE7203F62-001/init-core-data-001/index
   [junit4]   2> 1525956 INFO  (coreCloseExecutor-6518-thread-1) [    x:collection1] o.a.s.c.CachingDirectoryFactory looking to close /Users/jenkins/workspace/Lucene-Solr-6.x-MacOSX/solr/build/solr-core/test/J0/temp/solr.core.SolrCoreTest_9DA0C6DBE7203F62-001/init-core-data-001 [CachedDir<<refCount=0;path=/Users/jenkins/workspace/Lucene-Solr-6.x-MacOSX/solr/build/solr-core/test/J0/temp/solr.core.SolrCoreTest_9DA0C6DBE7203F62-001/init-core-data-001;done=false>>]
   [junit4]   2> 1525956 INFO  (coreCloseExecutor-6518-thread-1) [    x:collection1] o.a.s.c.CachingDirectoryFactory Closing directory, CoreContainer#isShutdown=true
   [junit4]   2> 1525956 INFO  (coreCloseExecutor-6518-thread-1) [    x:collection1] o.a.s.c.CachingDirectoryFactory Closing directory: /Users/jenkins/workspace/Lucene-Solr-6.x-MacOSX/solr/build/solr-core/test/J0/temp/solr.core.SolrCoreTest_9DA0C6DBE7203F62-001/init-core-data-001
   [junit4]   2> 1525956 INFO  (TEST-SolrCoreTest.testRequestHandlerRegistry-seed#[9DA0C6DBE7203F62]) [    ] o.a.s.SolrTestCaseJ4 ###Ending testRequestHandlerRegistry
   [junit4]   2> 1525958 INFO  (TEST-SolrCoreTest.testInfoRegistry-seed#[9DA0C6DBE7203F62]) [    ] o.a.s.SolrTestCaseJ4 ###Starting testInfoRegistry
   [junit4]   2> 1525959 INF

[...truncated too long message...]

 [junit4]   2> 3177033 INFO  (TEST-TestReqParamsAPI.test-seed#[9DA0C6DBE7203F62]) [    ] o.e.j.s.h.ContextHandler Stopped o.e.j.s.ServletContextHandler@10adcaaf{/_vm/o,null,UNAVAILABLE}
   [junit4]   2> 3177036 INFO  (TEST-TestReqParamsAPI.test-seed#[9DA0C6DBE7203F62]) [    ] o.a.s.c.ZkTestServer connecting to 127.0.0.1:49218 49218
   [junit4]   2> 3177053 INFO  (Thread-6193) [    ] o.a.s.c.ZkTestServer connecting to 127.0.0.1:49218 49218
   [junit4]   2> 3178905 WARN  (Thread-6193) [    ] o.a.s.c.ZkTestServer Watch limit violations: 
   [junit4]   2> Maximum concurrent create/delete watches above limit:
   [junit4]   2> 
   [junit4]   2> 	25	/solr/configs/conf1
   [junit4]   2> 	6	/solr/aliases.json
   [junit4]   2> 	5	/solr/security.json
   [junit4]   2> 	4	/solr/collections/collection1/state.json
   [junit4]   2> 
   [junit4]   2> Maximum concurrent data watches above limit:
   [junit4]   2> 
   [junit4]   2> 	6	/solr/clusterstate.json
   [junit4]   2> 
   [junit4]   2> Maximum concurrent children watches above limit:
   [junit4]   2> 
   [junit4]   2> 	6	/solr/live_nodes
   [junit4]   2> 	6	/solr/collections
   [junit4]   2> 	2	/solr/overseer/queue
   [junit4]   2> 	2	/solr/overseer/collection-queue-work
   [junit4]   2> 
   [junit4]   2> NOTE: reproduce with: ant test  -Dtestcase=TestReqParamsAPI -Dtests.method=test -Dtests.seed=9DA0C6DBE7203F62 -Dtests.slow=true -Dtests.locale=de-CH -Dtests.timezone=Etc/GMT-11 -Dtests.asserts=true -Dtests.file.encoding=US-ASCII
   [junit4] FAILURE 32.2s J1 | TestReqParamsAPI.test <<<
   [junit4]    > Throwable #1: java.lang.AssertionError: Could not get expected value  'CY val' for path 'response/params/y/c' full output: {
   [junit4]    >   "responseHeader":{
   [junit4]    >     "status":0,
   [junit4]    >     "QTime":0},
   [junit4]    >   "response":{
   [junit4]    >     "znodeVersion":0,
   [junit4]    >     "params":{"x":{
   [junit4]    >         "a":"A val",
   [junit4]    >         "b":"B val",
   [junit4]    >         "":{"v":0}}}}},  from server:  http://127.0.0.1:49247/_vm/o/collection1
   [junit4]    > 	at __randomizedtesting.SeedInfo.seed([9DA0C6DBE7203F62:15F4F90149DC529A]:0)
   [junit4]    > 	at org.apache.solr.core.TestSolrConfigHandler.testForResponseElement(TestSolrConfigHandler.java:457)
   [junit4]    > 	at org.apache.solr.handler.TestReqParamsAPI.testReqParams(TestReqParamsAPI.java:160)
   [junit4]    > 	at org.apache.solr.handler.TestReqParamsAPI.test(TestReqParamsAPI.java:62)
   [junit4]    > 	at org.apache.solr.BaseDistributedSearchTestCase$ShardsRepeatRule$ShardsFixedStatement.callStatement(BaseDistributedSearchTestCase.java:992)
   [junit4]    > 	at org.apache.solr.BaseDistributedSearchTestCase$ShardsRepeatRule$ShardsStatement.evaluate(BaseDistributedSearchTestCase.java:967)
   [junit4]    > 	at java.lang.Thread.run(Thread.java:745)
   [junit4]   2> 3178907 INFO  (SUITE-TestReqParamsAPI-seed#[9DA0C6DBE7203F62]-worker) [    ] o.a.s.SolrTestCaseJ4 ###deleteCore
   [junit4]   2> NOTE: leaving temporary files on disk at: /Users/jenkins/workspace/Lucene-Solr-6.x-MacOSX/solr/build/solr-core/test/J1/temp/solr.handler.TestReqParamsAPI_9DA0C6DBE7203F62-001
   [junit4]   2> NOTE: test params are: codec=CheapBastard, sim=ClassicSimilarity, locale=de-CH, timezone=Etc/GMT-11
   [junit4]   2> NOTE: Mac OS X 10.11.4 x86_64/Oracle Corporation 1.8.0_72 (64-bit)/cpus=3,threads=1,free=155285144,total=536870912
   [junit4]   2> NOTE: All tests run in this JVM: [DebugComponentTest, MergeStrategyTest, TestCloudDeleteByQuery, TestSolrQueryResponse, TestCharFilters, TestPHPSerializedResponseWriter, BasicFunctionalityTest, SolrCoreCheckLockOnStartupTest, TestRandomCollapseQParserPlugin, TestSolrIndexConfig, SparseHLLTest, ResourceLoaderTest, TestSolr4Spatial2, AtomicUpdatesTest, NumericFieldsTest, HdfsRecoveryZkTest, ExplicitHLLTest, RemoteQueryErrorTest, BasicZkTest, TestStandardQParsers, TestCSVResponseWriter, LeaderFailoverAfterPartitionTest, TolerantUpdateProcessorTest, OpenExchangeRatesOrgProviderTest, FullSolrCloudDistribCmdsTest, TestPivotHelperCode, TestDistributedGrouping, ShardRoutingCustomTest, SignatureUpdateProcessorFactoryTest, HdfsLockFactoryTest, SolrInfoMBeanTest, TestSuggestSpellingConverter, TestJettySolrRunner, TestCloudSchemaless, FileBasedSpellCheckerTest, BlockCacheTest, CoreAdminHandlerTest, CoreAdminCreateDiscoverTest, SuggesterTSTTest, TestRestoreCore, StatsComponentTest, TestFieldTypeResource, TestLMJelinekMercerSimilarityFactory, TestCrossCoreJoin, TestSchemaVersionResource, TestConfigSets, SuggesterTest, TestBadConfig, DistributedFacetPivotWhiteBoxTest, DistributedQueueTest, HdfsChaosMonkeySafeLeaderTest, GraphQueryTest, TestReplicaProperties, DistributedFacetPivotLargeTest, DistanceFunctionTest, TestGeoJSONResponseWriter, TestFastWriter, ChangedSchemaMergeTest, OutputWriterTest, CSVRequestHandlerTest, MinimalSchemaTest, TestFuzzyAnalyzedSuggestions, TestReversedWildcardFilterFactory, HdfsWriteToMultipleCollectionsTest, WordBreakSolrSpellCheckerTest, BlobRepositoryCloudTest, TestTrie, TestSystemIdResolver, SecurityConfHandlerTest, TestJsonFacets, TestReloadDeadlock, DateFieldTest, TestTrieFacet, SynonymTokenizerTest, TestUniqueKeyFieldResource, CleanupOldIndexTest, TestScoreJoinQPScore, TestFiltering, TestFastOutputStream, TestManagedSynonymFilterFactory, TestSolrCoreProperties, EchoParamsTest, SpellPossibilityIteratorTest, TestSha256AuthenticationProvider, TestShortCircuitedRequests, ExitableDirectoryReaderTest, TestSimpleQParserPlugin, TestImplicitCoreProperties, ConvertedLegacyTest, QueryResultKeyTest, SSLMigrationTest, ConnectionReuseTest, BJQParserTest, DirectSolrConnectionTest, OverseerRolesTest, TestGraphTermsQParserPlugin, DistribDocExpirationUpdateProcessorTest, TestSolrJ, TestRequestStatusCollectionAPI, ZkStateWriterTest, TestBlendedInfixSuggestions, CdcrReplicationHandlerTest, RuleEngineTest, SolrCmdDistributorTest, PKIAuthenticationIntegrationTest, ZkSolrClientTest, HdfsNNFailoverTest, LeaderElectionIntegrationTest, AliasIntegrationTest, CollectionsAPIDistributedZkTest, TestMiniSolrCloudClusterSSL, TestComplexPhraseQParserPlugin, TestInitParams, SuggestComponentContextFilterQueryTest, TestManagedSchema, AnalyticsQueryTest, RAMDirectoryFactoryTest, ConfigSetsAPITest, TestTestInjection, TestUseDocValuesAsStored2, PreAnalyzedUpdateProcessorTest, LeaderInitiatedRecoveryOnShardRestartTest, TestManagedResource, NotRequiredUniqueKeyTest, FileUtilsTest, OverseerTaskQueueTest, TermVectorComponentDistributedTest, TestDistribDocBasedVersion, ShowFileRequestHandlerTest, ZkNodePropsTest, TestChildDocTransformer, TestJoin, TestIndexingPerformance, TestDistributedMissingSort, TlogReplayBufferedWhileIndexingTest, TestSolr4Spatial, DeleteStatusTest, TestRandomRequestDistribution, QueryParsingTest, TestSolrCloudWithKerberosAlt, DocValuesMissingTest, CollectionReloadTest, TestSchemaManager, TestSolrXml, TestCoreDiscovery, ChaosMonkeySafeLeaderTest, SyncSliceTest, ShardRoutingTest, RecoveryZkTest, TestRandomDVFaceting, TestDistributedSearch, TestBinaryResponseWriter, HighlighterConfigTest, SOLR749Test, TestQuerySenderListener, UpdateParamsTest, AlternateDirectoryTest, CopyFieldTest, ResponseLogComponentTest, BadComponentTest, TestStressRecovery, TestSolrDeletionPolicy2, MultiTermTest, SampleTest, TestDocSet, TestSearchPerf, TestConfig, ExternalFileFieldSortTest, TestCodecSupport, TestDFRSimilarityFactory, TestIBSimilarityFactory, TestJmxMonitoredMap, URLClassifyProcessorTest, DateMathParserTest, PrimUtilsTest, SpellingQueryConverterTest, ClusterStateTest, TestLRUCache, TestUtils, TestDocumentBuilder, SliceStateTest, UUIDFieldTest, DistributedMLTComponentTest, TestRTGBase, DistributedIntervalFacetingTest, TestCursorMarkWithoutUniqueKey, TestHighlightDedupGrouping, TestSimpleTrackingShardHandler, TestEmbeddedSolrServerConstructors, AsyncCallRequestStatusResponseTest, CollectionTooManyReplicasTest, CreateCollectionCleanupTest, DeleteInactiveReplicaTest, DeleteReplicaTest, DistribJoinFromCollectionTest, HttpPartitionTest, MultiThreadedOCPTest, ReplicationFactorTest, RestartWhileUpdatingTest, RollingRestartTest, ShardSplitTest, TestCloudBackupRestore, TestCloudInspectUtil, TestCloudPivotFacet, TestCollectionAPI, TestConfigSetsAPI, TestConfigSetsAPIExclusivity, TestConfigSetsAPIZkFailure, TestCryptoKeys, TestExclusionRuleCollectionAccess, TestMiniSolrCloudCluster, CachingDirectoryFactoryTest, DirectoryFactoryTest, HdfsDirectoryFactoryTest, TestConfigSetImmutable, TestReloadAndDeleteDocs, TestShardHandlerFactory, TestSolrConfigHandler, TestSolrDynamicMBean, TestBlobHandler, TestReplicationHandlerBackup, TestReqParamsAPI]
   [junit4] Completed [500/595 (3!)] on J1 in 32.22s, 1 test, 1 failure <<< FAILURES!

[...truncated 318 lines...]
BUILD FAILED
/Users/jenkins/workspace/Lucene-Solr-6.x-MacOSX/build.xml:740: The following error occurred while executing this line:
/Users/jenkins/workspace/Lucene-Solr-6.x-MacOSX/build.xml:684: The following error occurred while executing this line:
/Users/jenkins/workspace/Lucene-Solr-6.x-MacOSX/build.xml:59: The following error occurred while executing this line:
/Users/jenkins/workspace/Lucene-Solr-6.x-MacOSX/solr/build.xml:233: The following error occurred while executing this line:
/Users/jenkins/workspace/Lucene-Solr-6.x-MacOSX/solr/common-build.xml:529: The following error occurred while executing this line:
/Users/jenkins/workspace/Lucene-Solr-6.x-MacOSX/lucene/common-build.xml:1457: The following error occurred while executing this line:
/Users/jenkins/workspace/Lucene-Solr-6.x-MacOSX/lucene/common-build.xml:1014: There were test failures: 595 suites (10 ignored), 2404 tests, 1 error, 2 failures, 121 ignored (71 assumptions) [seed: 9DA0C6DBE7203F62]

Total time: 101 minutes 44 seconds
Build step 'Invoke Ant' marked build as failure
Archiving artifacts
[WARNINGS] Skipping publisher since build result is FAILURE
Recording test results
Email was triggered for: Failure - Any
Sending email for trigger: Failure - Any



Mime
View raw message