lucene-dev mailing list archives

Site index · List index
Message view « Date » · « Thread »
Top « Date » · « Thread »
From Policeman Jenkins Server <jenk...@thetaphi.de>
Subject [JENKINS] Lucene-Solr-6.x-Linux (32bit/jdk1.8.0_92) - Build # 575 - Still Failing!
Date Thu, 05 May 2016 22:20:54 GMT
Build: http://jenkins.thetaphi.de/job/Lucene-Solr-6.x-Linux/575/
Java: 32bit/jdk1.8.0_92 -client -XX:+UseParallelGC

2 tests failed.
FAILED:  org.apache.solr.MinimalSchemaTest.testAllConfiguredHandlers

Error Message:
exception w/handler: '/graph'

Stack Trace:
java.lang.RuntimeException: exception w/handler: '/graph'
	at __randomizedtesting.SeedInfo.seed([474E911E2550F381:AA502A24AE5DF205]:0)
	at org.apache.solr.MinimalSchemaTest.testAllConfiguredHandlers(MinimalSchemaTest.java:130)
	at sun.reflect.NativeMethodAccessorImpl.invoke0(Native Method)
	at sun.reflect.NativeMethodAccessorImpl.invoke(NativeMethodAccessorImpl.java:62)
	at sun.reflect.DelegatingMethodAccessorImpl.invoke(DelegatingMethodAccessorImpl.java:43)
	at java.lang.reflect.Method.invoke(Method.java:498)
	at com.carrotsearch.randomizedtesting.RandomizedRunner.invoke(RandomizedRunner.java:1764)
	at com.carrotsearch.randomizedtesting.RandomizedRunner$8.evaluate(RandomizedRunner.java:871)
	at com.carrotsearch.randomizedtesting.RandomizedRunner$9.evaluate(RandomizedRunner.java:907)
	at com.carrotsearch.randomizedtesting.RandomizedRunner$10.evaluate(RandomizedRunner.java:921)
	at com.carrotsearch.randomizedtesting.rules.SystemPropertiesRestoreRule$1.evaluate(SystemPropertiesRestoreRule.java:57)
	at org.apache.lucene.util.TestRuleSetupTeardownChained$1.evaluate(TestRuleSetupTeardownChained.java:49)
	at org.apache.lucene.util.AbstractBeforeAfterRule$1.evaluate(AbstractBeforeAfterRule.java:45)
	at org.apache.lucene.util.TestRuleThreadAndTestName$1.evaluate(TestRuleThreadAndTestName.java:48)
	at org.apache.lucene.util.TestRuleIgnoreAfterMaxFailures$1.evaluate(TestRuleIgnoreAfterMaxFailures.java:64)
	at org.apache.lucene.util.TestRuleMarkFailure$1.evaluate(TestRuleMarkFailure.java:47)
	at com.carrotsearch.randomizedtesting.rules.StatementAdapter.evaluate(StatementAdapter.java:36)
	at com.carrotsearch.randomizedtesting.ThreadLeakControl$StatementRunner.run(ThreadLeakControl.java:367)
	at com.carrotsearch.randomizedtesting.ThreadLeakControl.forkTimeoutingTask(ThreadLeakControl.java:809)
	at com.carrotsearch.randomizedtesting.ThreadLeakControl$3.evaluate(ThreadLeakControl.java:460)
	at com.carrotsearch.randomizedtesting.RandomizedRunner.runSingleTest(RandomizedRunner.java:880)
	at com.carrotsearch.randomizedtesting.RandomizedRunner$5.evaluate(RandomizedRunner.java:781)
	at com.carrotsearch.randomizedtesting.RandomizedRunner$6.evaluate(RandomizedRunner.java:816)
	at com.carrotsearch.randomizedtesting.RandomizedRunner$7.evaluate(RandomizedRunner.java:827)
	at com.carrotsearch.randomizedtesting.rules.StatementAdapter.evaluate(StatementAdapter.java:36)
	at com.carrotsearch.randomizedtesting.rules.SystemPropertiesRestoreRule$1.evaluate(SystemPropertiesRestoreRule.java:57)
	at org.apache.lucene.util.AbstractBeforeAfterRule$1.evaluate(AbstractBeforeAfterRule.java:45)
	at com.carrotsearch.randomizedtesting.rules.StatementAdapter.evaluate(StatementAdapter.java:36)
	at org.apache.lucene.util.TestRuleStoreClassName$1.evaluate(TestRuleStoreClassName.java:41)
	at com.carrotsearch.randomizedtesting.rules.NoShadowingOrOverridesOnMethodsRule$1.evaluate(NoShadowingOrOverridesOnMethodsRule.java:40)
	at com.carrotsearch.randomizedtesting.rules.NoShadowingOrOverridesOnMethodsRule$1.evaluate(NoShadowingOrOverridesOnMethodsRule.java:40)
	at com.carrotsearch.randomizedtesting.rules.StatementAdapter.evaluate(StatementAdapter.java:36)
	at com.carrotsearch.randomizedtesting.rules.StatementAdapter.evaluate(StatementAdapter.java:36)
	at com.carrotsearch.randomizedtesting.rules.StatementAdapter.evaluate(StatementAdapter.java:36)
	at org.apache.lucene.util.TestRuleAssertionsRequired$1.evaluate(TestRuleAssertionsRequired.java:53)
	at org.apache.lucene.util.TestRuleMarkFailure$1.evaluate(TestRuleMarkFailure.java:47)
	at org.apache.lucene.util.TestRuleIgnoreAfterMaxFailures$1.evaluate(TestRuleIgnoreAfterMaxFailures.java:64)
	at org.apache.lucene.util.TestRuleIgnoreTestSuites$1.evaluate(TestRuleIgnoreTestSuites.java:54)
	at com.carrotsearch.randomizedtesting.rules.StatementAdapter.evaluate(StatementAdapter.java:36)
	at com.carrotsearch.randomizedtesting.ThreadLeakControl$StatementRunner.run(ThreadLeakControl.java:367)
	at java.lang.Thread.run(Thread.java:745)
Caused by: java.lang.RuntimeException: Exception during query
	at org.apache.solr.SolrTestCaseJ4.assertQ(SolrTestCaseJ4.java:786)
	at org.apache.solr.MinimalSchemaTest.testAllConfiguredHandlers(MinimalSchemaTest.java:121)
	... 39 more
Caused by: org.xml.sax.SAXParseException; lineNumber: 1; columnNumber: 1; Content is not allowed in prolog.
	at com.sun.org.apache.xerces.internal.parsers.DOMParser.parse(DOMParser.java:257)
	at com.sun.org.apache.xerces.internal.jaxp.DocumentBuilderImpl.parse(DocumentBuilderImpl.java:339)
	at javax.xml.parsers.DocumentBuilder.parse(DocumentBuilder.java:121)
	at org.apache.solr.util.BaseTestHarness.validateXPath(BaseTestHarness.java:84)
	at org.apache.solr.SolrTestCaseJ4.assertQ(SolrTestCaseJ4.java:771)
	... 40 more


FAILED:  org.apache.solr.core.SolrCoreTest.testImplicitPlugins

Error Message:
wrong number of implicit handlers expected:<21> but was:<22>

Stack Trace:
java.lang.AssertionError: wrong number of implicit handlers expected:<21> but was:<22>
	at __randomizedtesting.SeedInfo.seed([474E911E2550F381:8463A08575983AC0]:0)
	at org.junit.Assert.fail(Assert.java:93)
	at org.junit.Assert.failNotEquals(Assert.java:647)
	at org.junit.Assert.assertEquals(Assert.java:128)
	at org.junit.Assert.assertEquals(Assert.java:472)
	at org.apache.solr.core.SolrCoreTest.testImplicitPlugins(SolrCoreTest.java:109)
	at sun.reflect.NativeMethodAccessorImpl.invoke0(Native Method)
	at sun.reflect.NativeMethodAccessorImpl.invoke(NativeMethodAccessorImpl.java:62)
	at sun.reflect.DelegatingMethodAccessorImpl.invoke(DelegatingMethodAccessorImpl.java:43)
	at java.lang.reflect.Method.invoke(Method.java:498)
	at com.carrotsearch.randomizedtesting.RandomizedRunner.invoke(RandomizedRunner.java:1764)
	at com.carrotsearch.randomizedtesting.RandomizedRunner$8.evaluate(RandomizedRunner.java:871)
	at com.carrotsearch.randomizedtesting.RandomizedRunner$9.evaluate(RandomizedRunner.java:907)
	at com.carrotsearch.randomizedtesting.RandomizedRunner$10.evaluate(RandomizedRunner.java:921)
	at com.carrotsearch.randomizedtesting.rules.SystemPropertiesRestoreRule$1.evaluate(SystemPropertiesRestoreRule.java:57)
	at org.apache.lucene.util.TestRuleSetupTeardownChained$1.evaluate(TestRuleSetupTeardownChained.java:49)
	at org.apache.lucene.util.AbstractBeforeAfterRule$1.evaluate(AbstractBeforeAfterRule.java:45)
	at org.apache.lucene.util.TestRuleThreadAndTestName$1.evaluate(TestRuleThreadAndTestName.java:48)
	at org.apache.lucene.util.TestRuleIgnoreAfterMaxFailures$1.evaluate(TestRuleIgnoreAfterMaxFailures.java:64)
	at org.apache.lucene.util.TestRuleMarkFailure$1.evaluate(TestRuleMarkFailure.java:47)
	at com.carrotsearch.randomizedtesting.rules.StatementAdapter.evaluate(StatementAdapter.java:36)
	at com.carrotsearch.randomizedtesting.ThreadLeakControl$StatementRunner.run(ThreadLeakControl.java:367)
	at com.carrotsearch.randomizedtesting.ThreadLeakControl.forkTimeoutingTask(ThreadLeakControl.java:809)
	at com.carrotsearch.randomizedtesting.ThreadLeakControl$3.evaluate(ThreadLeakControl.java:460)
	at com.carrotsearch.randomizedtesting.RandomizedRunner.runSingleTest(RandomizedRunner.java:880)
	at com.carrotsearch.randomizedtesting.RandomizedRunner$5.evaluate(RandomizedRunner.java:781)
	at com.carrotsearch.randomizedtesting.RandomizedRunner$6.evaluate(RandomizedRunner.java:816)
	at com.carrotsearch.randomizedtesting.RandomizedRunner$7.evaluate(RandomizedRunner.java:827)
	at com.carrotsearch.randomizedtesting.rules.StatementAdapter.evaluate(StatementAdapter.java:36)
	at com.carrotsearch.randomizedtesting.rules.SystemPropertiesRestoreRule$1.evaluate(SystemPropertiesRestoreRule.java:57)
	at org.apache.lucene.util.AbstractBeforeAfterRule$1.evaluate(AbstractBeforeAfterRule.java:45)
	at com.carrotsearch.randomizedtesting.rules.StatementAdapter.evaluate(StatementAdapter.java:36)
	at org.apache.lucene.util.TestRuleStoreClassName$1.evaluate(TestRuleStoreClassName.java:41)
	at com.carrotsearch.randomizedtesting.rules.NoShadowingOrOverridesOnMethodsRule$1.evaluate(NoShadowingOrOverridesOnMethodsRule.java:40)
	at com.carrotsearch.randomizedtesting.rules.NoShadowingOrOverridesOnMethodsRule$1.evaluate(NoShadowingOrOverridesOnMethodsRule.java:40)
	at com.carrotsearch.randomizedtesting.rules.StatementAdapter.evaluate(StatementAdapter.java:36)
	at com.carrotsearch.randomizedtesting.rules.StatementAdapter.evaluate(StatementAdapter.java:36)
	at com.carrotsearch.randomizedtesting.rules.StatementAdapter.evaluate(StatementAdapter.java:36)
	at org.apache.lucene.util.TestRuleAssertionsRequired$1.evaluate(TestRuleAssertionsRequired.java:53)
	at org.apache.lucene.util.TestRuleMarkFailure$1.evaluate(TestRuleMarkFailure.java:47)
	at org.apache.lucene.util.TestRuleIgnoreAfterMaxFailures$1.evaluate(TestRuleIgnoreAfterMaxFailures.java:64)
	at org.apache.lucene.util.TestRuleIgnoreTestSuites$1.evaluate(TestRuleIgnoreTestSuites.java:54)
	at com.carrotsearch.randomizedtesting.rules.StatementAdapter.evaluate(StatementAdapter.java:36)
	at com.carrotsearch.randomizedtesting.ThreadLeakControl$StatementRunner.run(ThreadLeakControl.java:367)
	at java.lang.Thread.run(Thread.java:745)




Build Log:
[...truncated 10935 lines...]
   [junit4] Suite: org.apache.solr.MinimalSchemaTest
   [junit4]   2> Creating dataDir: /home/jenkins/workspace/Lucene-Solr-6.x-Linux/solr/build/solr-core/test/J1/temp/solr.MinimalSchemaTest_474E911E2550F381-001/init-core-data-001
   [junit4]   2> 408720 INFO  (SUITE-MinimalSchemaTest-seed#[474E911E2550F381]-worker) [    ] o.a.s.SolrTestCaseJ4 Randomized ssl (false) and clientAuth (false)
   [junit4]   2> 408720 INFO  (SUITE-MinimalSchemaTest-seed#[474E911E2550F381]-worker) [    ] o.a.s.SolrTestCaseJ4 ####initCore
   [junit4]   2> 408721 INFO  (SUITE-MinimalSchemaTest-seed#[474E911E2550F381]-worker) [    ] o.a.s.c.SolrResourceLoader new SolrResourceLoader for directory: '/home/jenkins/workspace/Lucene-Solr-6.x-Linux/solr/core/src/test-files/solr/collection1'
   [junit4]   2> 408721 INFO  (SUITE-MinimalSchemaTest-seed#[474E911E2550F381]-worker) [    ] o.a.s.c.SolrResourceLoader JNDI not configured for solr (NoInitialContextEx)
   [junit4]   2> 408721 INFO  (SUITE-MinimalSchemaTest-seed#[474E911E2550F381]-worker) [    ] o.a.s.c.SolrResourceLoader using system property solr.solr.home: /home/jenkins/workspace/Lucene-Solr-6.x-Linux/solr/core/src/test-files/solr
   [junit4]   2> 408722 INFO  (SUITE-MinimalSchemaTest-seed#[474E911E2550F381]-worker) [    ] o.a.s.c.SolrResourceLoader Adding 'file:/home/jenkins/workspace/Lucene-Solr-6.x-Linux/solr/core/src/test-files/solr/collection1/lib/classes/' to classloader
   [junit4]   2> 408722 INFO  (SUITE-MinimalSchemaTest-seed#[474E911E2550F381]-worker) [    ] o.a.s.c.SolrResourceLoader Adding 'file:/home/jenkins/workspace/Lucene-Solr-6.x-Linux/solr/core/src/test-files/solr/collection1/lib/README' to classloader
   [junit4]   2> 408760 INFO  (SUITE-MinimalSchemaTest-seed#[474E911E2550F381]-worker) [    ] o.a.s.c.SolrConfig current version of requestparams : -1
   [junit4]   2> 408775 INFO  (SUITE-MinimalSchemaTest-seed#[474E911E2550F381]-worker) [    ] o.a.s.c.SolrConfig Using Lucene MatchVersion: 6.1.0
   [junit4]   2> 408811 INFO  (SUITE-MinimalSchemaTest-seed#[474E911E2550F381]-worker) [    ] o.a.s.c.SolrConfig Loaded SolrConfig: solr/collection1/conf/solrconfig.xml
   [junit4]   2> 408815 INFO  (SUITE-MinimalSchemaTest-seed#[474E911E2550F381]-worker) [    ] o.a.s.s.IndexSchema [null] Schema name=minimal
   [junit4]   2> 408818 WARN  (SUITE-MinimalSchemaTest-seed#[474E911E2550F381]-worker) [    ] o.a.s.s.IndexSchema no uniqueKey specified in schema.
   [junit4]   2> 408818 INFO  (SUITE-MinimalSchemaTest-seed#[474E911E2550F381]-worker) [    ] o.a.s.c.SolrResourceLoader JNDI not configured for solr (NoInitialContextEx)
   [junit4]   2> 408819 INFO  (SUITE-MinimalSchemaTest-seed#[474E911E2550F381]-worker) [    ] o.a.s.c.SolrResourceLoader using system property solr.solr.home: /home/jenkins/workspace/Lucene-Solr-6.x-Linux/solr/core/src/test-files/solr
   [junit4]   2> 408819 INFO  (SUITE-MinimalSchemaTest-seed#[474E911E2550F381]-worker) [    ] o.a.s.c.SolrResourceLoader new SolrResourceLoader for directory: '/home/jenkins/workspace/Lucene-Solr-6.x-Linux/solr/core/src/test-files/solr'
   [junit4]   2> 408819 INFO  (SUITE-MinimalSchemaTest-seed#[474E911E2550F381]-worker) [    ] o.a.s.c.SolrResourceLoader JNDI not configured for solr (NoInitialContextEx)
   [junit4]   2> 408819 INFO  (SUITE-MinimalSchemaTest-seed#[474E911E2550F381]-worker) [    ] o.a.s.c.SolrResourceLoader using system property solr.solr.home: /home/jenkins/workspace/Lucene-Solr-6.x-Linux/solr/core/src/test-files/solr
   [junit4]   2> 408819 INFO  (SUITE-MinimalSchemaTest-seed#[474E911E2550F381]-worker) [    ] o.a.s.c.CoreContainer New CoreContainer 26951563
   [junit4]   2> 408819 INFO  (SUITE-MinimalSchemaTest-seed#[474E911E2550F381]-worker) [    ] o.a.s.c.CoreContainer Loading cores into CoreContainer [instanceDir=/home/jenkins/workspace/Lucene-Solr-6.x-Linux/solr/core/src/test-files/solr]
   [junit4]   2> 408819 WARN  (SUITE-MinimalSchemaTest-seed#[474E911E2550F381]-worker) [    ] o.a.s.c.CoreContainer Couldn't add files from /home/jenkins/workspace/Lucene-Solr-6.x-Linux/solr/core/src/test-files/solr/lib to classpath: /home/jenkins/workspace/Lucene-Solr-6.x-Linux/solr/core/src/test-files/solr/lib
   [junit4]   2> 408819 INFO  (SUITE-MinimalSchemaTest-seed#[474E911E2550F381]-worker) [    ] o.a.s.h.c.HttpShardHandlerFactory created with socketTimeout : 600000,connTimeout : 60000,maxConnectionsPerHost : 20,maxConnections : 10000,corePoolSize : 0,maximumPoolSize : 2147483647,maxThreadIdleTime : 5,sizeOfQueue : -1,fairnessPolicy : false,useRetries : false,
   [junit4]   2> 408822 INFO  (SUITE-MinimalSchemaTest-seed#[474E911E2550F381]-worker) [    ] o.a.s.u.UpdateShardHandler Creating UpdateShardHandler HTTP client with params: socketTimeout=30000&connTimeout=30000&retry=true
   [junit4]   2> 408822 INFO  (SUITE-MinimalSchemaTest-seed#[474E911E2550F381]-worker) [    ] o.a.s.l.LogWatcher SLF4J impl is org.slf4j.impl.Log4jLoggerFactory
   [junit4]   2> 408823 INFO  (SUITE-MinimalSchemaTest-seed#[474E911E2550F381]-worker) [    ] o.a.s.l.LogWatcher Registering Log Listener [Log4j (org.slf4j.impl.Log4jLoggerFactory)]
   [junit4]   2> 408823 INFO  (SUITE-MinimalSchemaTest-seed#[474E911E2550F381]-worker) [    ] o.a.s.c.CoreContainer Security conf doesn't exist. Skipping setup for authorization module.
   [junit4]   2> 408823 INFO  (SUITE-MinimalSchemaTest-seed#[474E911E2550F381]-worker) [    ] o.a.s.c.CoreContainer No authentication plugin used.
   [junit4]   2> 408824 INFO  (SUITE-MinimalSchemaTest-seed#[474E911E2550F381]-worker) [    ] o.a.s.c.CoreDescriptor Created CoreDescriptor: {name=collection1, config=solr/collection1/conf/solrconfig.xml, transient=false, schema=solr/collection1/conf/schema-minimal.xml, loadOnStartup=true, configSetProperties=configsetprops.json, collection=collection1, dataDir=/home/jenkins/workspace/Lucene-Solr-6.x-Linux/solr/build/solr-core/test/J1/temp/solr.MinimalSchemaTest_474E911E2550F381-001/init-core-data-001, shard=shard1}
   [junit4]   2> 408824 INFO  (coreLoadExecutor-1436-thread-1) [    ] o.a.s.c.SolrResourceLoader new SolrResourceLoader for directory: '/home/jenkins/workspace/Lucene-Solr-6.x-Linux/solr/core/src/test-files/solr/collection1'
   [junit4]   2> 408824 INFO  (coreLoadExecutor-1436-thread-1) [    ] o.a.s.c.SolrResourceLoader JNDI not configured for solr (NoInitialContextEx)
   [junit4]   2> 408824 INFO  (coreLoadExecutor-1436-thread-1) [    ] o.a.s.c.SolrResourceLoader using system property solr.solr.home: /home/jenkins/workspace/Lucene-Solr-6.x-Linux/solr/core/src/test-files/solr
   [junit4]   2> 408825 INFO  (coreLoadExecutor-1436-thread-1) [    ] o.a.s.c.SolrResourceLoader Adding 'file:/home/jenkins/workspace/Lucene-Solr-6.x-Linux/solr/core/src/test-files/solr/collection1/lib/classes/' to classloader
   [junit4]   2> 408825 INFO  (coreLoadExecutor-1436-thread-1) [    ] o.a.s.c.SolrResourceLoader Adding 'file:/home/jenkins/workspace/Lucene-Solr-6.x-Linux/solr/core/src/test-files/solr/collection1/lib/README' to classloader
   [junit4]   2> 408857 INFO  (coreLoadExecutor-1436-thread-1) [    ] o.a.s.c.SolrConfig current version of requestparams : -1
   [junit4]   2> 408866 INFO  (coreLoadExecutor-1436-thread-1) [    ] o.a.s.c.SolrConfig Using Lucene MatchVersion: 6.1.0
   [junit4]   2> 408892 INFO  (coreLoadExecutor-1436-thread-1) [    ] o.a.s.c.SolrConfig Loaded SolrConfig: solr/collection1/conf/solrconfig.xml
   [junit4]   2> 408895 INFO  (coreLoadExecutor-1436-thread-1) [    ] o.a.s.s.IndexSchema [collection1] Schema name=minimal
   [junit4]   2> 408896 WARN  (coreLoadExecutor-1436-thread-1) [    ] o.a.s.s.IndexSchema no uniqueKey specified in schema.
   [junit4]   2> 408897 INFO  (coreLoadExecutor-1436-thread-1) [    ] o.a.s.c.ConfigSetProperties Did not find ConfigSet properties, assuming default properties: Can't find resource 'configsetprops.json' in classpath or '/home/jenkins/workspace/Lucene-Solr-6.x-Linux/solr/core/src/test-files/solr/collection1'
   [junit4]   2> 408897 INFO  (coreLoadExecutor-1436-thread-1) [    ] o.a.s.c.CoreContainer Creating SolrCore 'collection1' using configuration from instancedir /home/jenkins/workspace/Lucene-Solr-6.x-Linux/solr/core/src/test-files/solr/collection1
   [junit4]   2> 408898 INFO  (coreLoadExecutor-1436-thread-1) [    x:collection1] o.a.s.c.SolrCore org.apache.solr.core.MockDirectoryFactory
   [junit4]   2> 408898 INFO  (coreLoadExecutor-1436-thread-1) [    x:collection1] o.a.s.c.SolrCore [[collection1] ] Opening new SolrCore at [/home/jenkins/workspace/Lucene-Solr-6.x-Linux/solr/core/src/test-files/solr/collection1], dataDir=[/home/jenkins/workspace/Lucene-Solr-6.x-Linux/solr/build/solr-core/test/J1/temp/solr.MinimalSchemaTest_474E911E2550F381-001/init-core-data-001/]
   [junit4]   2> 408898 INFO  (coreLoadExecutor-1436-thread-1) [    x:collection1] o.a.s.c.JmxMonitoredMap JMX monitoring is enabled. Adding Solr mbeans to JMX Server: com.sun.jmx.mbeanserver.JmxMBeanServer@1c7f76f
   [junit4]   2> 408898 INFO  (coreLoadExecutor-1436-thread-1) [    x:collection1] o.a.s.c.CachingDirectoryFactory return new directory for /home/jenkins/workspace/Lucene-Solr-6.x-Linux/solr/build/solr-core/test/J1/temp/solr.MinimalSchemaTest_474E911E2550F381-001/init-core-data-001
   [junit4]   2> 408899 INFO  (coreLoadExecutor-1436-thread-1) [    x:collection1] o.a.s.c.SolrCore New index directory detected: old=null new=/home/jenkins/workspace/Lucene-Solr-6.x-Linux/solr/build/solr-core/test/J1/temp/solr.MinimalSchemaTest_474E911E2550F381-001/init-core-data-001/index/
   [junit4]   2> 408899 WARN  (coreLoadExecutor-1436-thread-1) [    x:collection1] o.a.s.c.SolrCore [collection1] Solr index directory '/home/jenkins/workspace/Lucene-Solr-6.x-Linux/solr/build/solr-core/test/J1/temp/solr.MinimalSchemaTest_474E911E2550F381-001/init-core-data-001/index' doesn't exist. Creating new index...
   [junit4]   2> 408899 INFO  (coreLoadExecutor-1436-thread-1) [    x:collection1] o.a.s.c.CachingDirectoryFactory return new directory for /home/jenkins/workspace/Lucene-Solr-6.x-Linux/solr/build/solr-core/test/J1/temp/solr.MinimalSchemaTest_474E911E2550F381-001/init-core-data-001/index
   [junit4]   2> 408899 INFO  (coreLoadExecutor-1436-thread-1) [    x:collection1] o.a.s.u.RandomMergePolicy RandomMergePolicy wrapping class org.apache.lucene.index.LogByteSizeMergePolicy: [LogByteSizeMergePolicy: minMergeSize=1677721, mergeFactor=27, maxMergeSize=2147483648, maxMergeSizeForForcedMerge=9223372036854775807, calibrateSizeByDeletes=true, maxMergeDocs=2147483647, maxCFSSegmentSizeMB=8.796093022207999E12, noCFSRatio=0.3754526865512482]
   [junit4]   2> 408899 INFO  (coreLoadExecutor-1436-thread-1) [    x:collection1] o.a.s.c.SolrDeletionPolicy SolrDeletionPolicy.onCommit: commits: num=1
   [junit4]   2> 	commit{dir=MockDirectoryWrapper(RAMDirectory@37848c lockFactory=org.apache.lucene.store.SingleInstanceLockFactory@1fc2868),segFN=segments_1,generation=1}
   [junit4]   2> 408899 INFO  (coreLoadExecutor-1436-thread-1) [    x:collection1] o.a.s.c.SolrDeletionPolicy newest commit generation = 1
   [junit4]   2> 408900 INFO  (OldIndexDirectoryCleanupThreadForCore-collection1) [    x:collection1] o.a.s.c.SolrCore Looking for old index directories to cleanup for core collection1 in /home/jenkins/workspace/Lucene-Solr-6.x-Linux/solr/build/solr-core/test/J1/temp/solr.MinimalSchemaTest_474E911E2550F381-001/init-core-data-001/
   [junit4]   2> 408903 INFO  (coreLoadExecutor-1436-thread-1) [    x:collection1] o.a.s.u.p.UpdateRequestProcessorChain creating updateRequestProcessorChain "dedupe"
   [junit4]   2> 408904 INFO  (coreLoadExecutor-1436-thread-1) [    x:collection1] o.a.s.u.p.UpdateRequestProcessorChain inserting DistributedUpdateProcessorFactory into updateRequestProcessorChain "dedupe"
   [junit4]   2> 408904 INFO  (coreLoadExecutor-1436-thread-1) [    x:collection1] o.a.s.u.p.UpdateRequestProcessorChain creating updateRequestProcessorChain "dedupe-allfields"
   [junit4]   2> 408904 INFO  (coreLoadExecutor-1436-thread-1) [    x:collection1] o.a.s.u.p.UpdateRequestProcessorChain inserting DistributedUpdateProcessorFactory into updateRequestProcessorChain "dedupe-allfields"
   [junit4]   2> 408904 INFO  (coreLoadExecutor-1436-thread-1) [    x:collection1] o.a.s.u.p.UpdateRequestProcessorChain creating updateRequestProcessorChain "stored_sig"
   [junit4]   2> 408904 INFO  (coreLoadExecutor-1436-thread-1) [    x:collection1] o.a.s.u.p.UpdateRequestProcessorChain inserting DistributedUpdateProcessorFactory into updateRequestProcessorChain "stored_sig"
   [junit4]   2> 408904 INFO  (coreLoadExecutor-1436-thread-1) [    x:collection1] o.a.s.u.p.UpdateRequestProcessorChain creating updateRequestProcessorChain "uniq-fields"
   [junit4]   2> 408904 INFO  (coreLoadExecutor-1436-thread-1) [    x:collection1] o.a.s.u.p.UpdateRequestProcessorChain inserting DistributedUpdateProcessorFactory into updateRequestProcessorChain "uniq-fields"
   [junit4]   2> 408904 INFO  (coreLoadExecutor-1436-thread-1) [    x:collection1] o.a.s.u.p.UpdateRequestProcessorChain creating updateRequestProcessorChain "distrib-dup-test-chain-explicit"
   [junit4]   2> 408904 INFO  (coreLoadExecutor-1436-thread-1) [    x:collection1] o.a.s.u.p.UpdateRequestProcessorChain creating updateRequestProcessorChain "distrib-dup-test-chain-implicit"
   [junit4]   2> 408904 INFO  (coreLoadExecutor-1436-thread-1) [    x:collection1] o.a.s.u.p.UpdateRequestProcessorChain inserting DistributedUpdateProcessorFactory into updateRequestProcessorChain "distrib-dup-test-chain-implicit"
   [junit4]   2> 408904 INFO  (coreLoadExecutor-1436-thread-1) [    x:collection1] o.a.s.c.SolrCore no updateRequestProcessorChain defined as default, creating implicit default
   [junit4]   2> 408906 INFO  (coreLoadExecutor-1436-thread-1) [    x:collection1] o.a.s.h.l.XMLLoader xsltCacheLifetimeSeconds=60
   [junit4]   2> 408907 INFO  (coreLoadExecutor-1436-thread-1) [    x:collection1] o.a.s.h.l.XMLLoader xsltCacheLifetimeSeconds=60
   [junit4]   2> 408908 INFO  (coreLoadExecutor-1436-thread-1) [    x:collection1] o.a.s.h.l.XMLLoader xsltCacheLifetimeSeconds=60
   [junit4]   2> 408908 INFO  (coreLoadExecutor-1436-thread-1) [    x:collection1] o.a.s.h.l.XMLLoader xsltCacheLifetimeSeconds=60
   [junit4]   2> 408914 INFO  (coreLoadExecutor-1436-thread-1) [    x:collection1] o.a.s.c.PluginBag requestHandler : 'lazy' created with startup=lazy 
   [junit4]   2> 408916 INFO  (coreLoadExecutor-1436-thread-1) [    x:collection1] o.a.s.c.RequestHandlers Registered paths: /admin/mbeans,standard,spellCheckCompRH,lazy,/update/json/docs,/admin/luke,/export,spellCheckWithWordbreak_Direct,tvrh,/get,/admin/properties,/update/json,mltrh,/admin/threads,/search-facet-def,/update/csv,/sql,/graph,/search-facet-invariants,/admin/segments,spellCheckCompRH1,/mlt,/admin/system,/replication,dismax,defaults,/config,/stream,/schema,/admin/plugins,/admin/logging,spellCheckWithWordbreak,mock,/admin/ping,/update,/admin/file,/terms,spellCheckCompRH_Direct,/debug/dump
   [junit4]   2> 408916 INFO  (coreLoadExecutor-1436-thread-1) [    x:collection1] o.a.s.c.SolrCore Using default statsCache cache: org.apache.solr.search.stats.LocalStatsCache
   [junit4]   2> 408917 INFO  (coreLoadExecutor-1436-thread-1) [    x:collection1] o.a.s.u.UpdateHandler Using UpdateLog implementation: org.apache.solr.update.UpdateLog
   [junit4]   2> 408917 INFO  (coreLoadExecutor-1436-thread-1) [    x:collection1] o.a.s.u.UpdateLog Initializing UpdateLog: dataDir= defaultSyncLevel=FLUSH numRecordsToKeep=100 maxNumLogsToKeep=10 numVersionBuckets=65536
   [junit4]   2> 408918 INFO  (coreLoadExecutor-1436-thread-1) [    x:collection1] o.a.s.u.CommitTracker Hard AutoCommit: disabled
   [junit4]   2> 408918 INFO  (coreLoadExecutor-1436-thread-1) [    x:collection1] o.a.s.u.CommitTracker Soft AutoCommit: disabled
   [junit4]   2> 408918 INFO  (coreLoadExecutor-1436-thread-1) [    x:collection1] o.a.s.u.RandomMergePolicy RandomMergePolicy wrapping class org.apache.lucene.index.TieredMergePolicy: [TieredMergePolicy: maxMergeAtOnce=26, maxMergeAtOnceExplicit=28, maxMergedSegmentMB=95.1328125, floorSegmentMB=0.8583984375, forceMergeDeletesPctAllowed=25.57572870172395, segmentsPerTier=23.0, maxCFSSegmentSizeMB=8.796093022207999E12, noCFSRatio=1.0
   [junit4]   2> 408918 INFO  (coreLoadExecutor-1436-thread-1) [    x:collection1] o.a.s.c.SolrDeletionPolicy SolrDeletionPolicy.onInit: commits: num=1
   [junit4]   2> 	commit{dir=MockDirectoryWrapper(RAMDirectory@37848c lockFactory=org.apache.lucene.store.SingleInstanceLockFactory@1fc2868),segFN=segments_1,generation=1}
   [junit4]   2> 408918 INFO  (coreLoadExecutor-1436-thread-1) [    x:collection1] o.a.s.c.SolrDeletionPolicy newest commit generation = 1
   [junit4]   2> 408918 INFO  (coreLoadExecutor-1436-thread-1) [    x:collection1] o.a.s.s.SolrIndexSearcher Opening [Searcher@62504b[collection1] main]
   [junit4]   2> 408919 INFO  (coreLoadExecutor-1436-thread-1) [    x:collection1] o.a.s.r.RestManager Initializing RestManager with initArgs: {storageIO=org.apache.solr.rest.ManagedResourceStorage$InMemoryStorageIO}
   [junit4]   2> 408919 INFO  (coreLoadExecutor-1436-thread-1) [    x:collection1] o.a.s.r.ManagedResourceStorage Reading _rest_managed.json using InMemoryStorage
   [junit4]   2> 408919 INFO  (coreLoadExecutor-1436-thread-1) [    x:collection1] o.a.s.r.RestManager Initializing 0 registered ManagedResources
   [junit4]   2> 408919 INFO  (coreLoadExecutor-1436-thread-1) [    x:collection1] o.a.s.h.c.SpellCheckComponent Initializing spell checkers
   [junit4]   2> 408955 INFO  (coreLoadExecutor-1436-thread-1) [    x:collection1] o.a.s.s.DirectSolrSpellChecker init: {name=direct,classname=DirectSolrSpellChecker,field=lowerfilt,minQueryLength=3}
   [junit4]   2> 411087 INFO  (coreLoadExecutor-1436-thread-1) [    x:collection1] o.a.s.h.ReplicationHandler Commits will be reserved for  10000
   [junit4]   2> 411088 INFO  (searcherExecutor-1437-thread-1-processing-x:collection1) [    x:collection1] o.a.s.h.c.SpellCheckComponent Loading spell index for spellchecker: default
   [junit4]   2> 411088 INFO  (searcherExecutor-1437-thread-1-processing-x:collection1) [    x:collection1] o.a.s.h.c.SpellCheckComponent Loading spell index for spellchecker: direct
   [junit4]   2> 411088 INFO  (searcherExecutor-1437-thread-1-processing-x:collection1) [    x:collection1] o.a.s.h.c.SpellCheckComponent Loading spell index for spellchecker: wordbreak
   [junit4]   2> 411088 INFO  (searcherExecutor-1437-thread-1-processing-x:collection1) [    x:collection1] o.a.s.h.c.SpellCheckComponent Loading spell index for spellchecker: multipleFields
   [junit4]   2> 411088 INFO  (searcherExecutor-1437-thread-1-processing-x:collection1) [    x:collection1] o.a.s.h.c.SpellCheckComponent Loading spell index for spellchecker: jarowinkler
   [junit4]   2> 411089 INFO  (searcherExecutor-1437-thread-1-processing-x:collection1) [    x:collection1] o.a.s.h.c.SpellCheckComponent Loading spell index for spellchecker: external
   [junit4]   2> 411089 INFO  (searcherExecutor-1437-thread-1-processing-x:collection1) [    x:collection1] o.a.s.h.c.SpellCheckComponent Loading spell index for spellchecker: freq
   [junit4]   2> 411089 INFO  (coreLoadExecutor-1436-thread-1) [    x:collection1] o.a.s.u.UpdateLog Looking up max value of version field to seed version buckets
   [junit4]   2> 411089 INFO  (coreLoadExecutor-1436-thread-1) [    x:collection1] o.a.s.u.VersionInfo Refreshing highest value of _version_ for 65536 version buckets from index
   [junit4]   2> 411089 INFO  (searcherExecutor-1437-thread-1-processing-x:collection1) [    x:collection1] o.a.s.h.c.SpellCheckComponent Loading spell index for spellchecker: fqcn
   [junit4]   2> 411089 INFO  (coreLoadExecutor-1436-thread-1) [    x:collection1] o.a.s.u.VersionInfo No terms found for _version_, cannot seed version bucket highest value from index
   [junit4]   2> 411089 INFO  (coreLoadExecutor-1436-thread-1) [    x:collection1] o.a.s.u.UpdateLog Could not find max version in index or recent updates, using new clock 1533526728041824256
   [junit4]   2> 411089 INFO  (searcherExecutor-1437-thread-1-processing-x:collection1) [    x:collection1] o.a.s.h.c.SpellCheckComponent Loading spell index for spellchecker: perDict
   [junit4]   2> 411091 INFO  (searcherExecutor-1437-thread-1-processing-x:collection1) [    x:collection1] o.a.s.c.SolrCore [collection1] Registered new searcher Searcher@62504b[collection1] main{ExitableDirectoryReader(UninvertingDirectoryReader())}
   [junit4]   2> 411091 INFO  (coreLoadExecutor-1436-thread-1) [    x:collection1] o.a.s.u.UpdateLog Took 1.0ms to seed version buckets with highest version 1533526728041824256
   [junit4]   2> 411091 INFO  (coreLoadExecutor-1436-thread-1) [    x:collection1] o.a.s.c.CoreContainer registering core: collection1
   [junit4]   2> 411092 INFO  (SUITE-MinimalSchemaTest-seed#[474E911E2550F381]-worker) [    ] o.a.s.SolrTestCaseJ4 ####initCore end
   [junit4]   2> 411095 INFO  (SUITE-MinimalSchemaTest-seed#[474E911E2550F381]-worker) [    ] o.a.s.u.p.LogUpdateProcessorFactory [collection1]  webapp=null path=null params={}{add=[(null)]} 0 2
   [junit4]   2> 411099 INFO  (SUITE-MinimalSchemaTest-seed#[474E911E2550F381]-worker) [    ] o.a.s.u.p.LogUpdateProcessorFactory [collection1]  webapp=null path=null params={}{add=[(null)]} 0 0
   [junit4]   2> 411100 INFO  (SUITE-MinimalSchemaTest-seed#[474E911E2550F381]-worker) [    ] o.a.s.u.DirectUpdateHandler2 start commit{,optimize=false,openSearcher=true,waitSearcher=true,expungeDeletes=false,softCommit=false,prepareCommit=false}
   [junit4]   2> 411103 INFO  (SUITE-MinimalSchemaTest-seed#[474E911E2550F381]-worker) [    ] o.a.s.c.SolrDeletionPolicy SolrDeletionPolicy.onCommit: commits: num=2
   [junit4]   2> 	commit{dir=MockDirectoryWrapper(RAMDirectory@37848c lockFactory=org.apache.lucene.store.SingleInstanceLockFactory@1fc2868),segFN=segments_1,generation=1}
   [junit4]   2> 	commit{dir=MockDirectoryWrapper(RAMDirectory@37848c lockFactory=org.apache.lucene.store.SingleInstanceLockFactory@1fc2868),segFN=segments_2,generation=2}
   [junit4]   2> 411103 INFO  (SUITE-MinimalSchemaTest-seed#[474E911E2550F381]-worker) [    ] o.a.s.c.SolrDeletionPolicy newest commit generation = 2
   [junit4]   2> 411105 INFO  (SUITE-MinimalSchemaTest-seed#[474E911E2550F381]-worker) [    ] o.a.s.s.SolrIndexSearcher Opening [Searcher@1365e21[collection1] main]
   [junit4]   2> 411106 INFO  (SUITE-MinimalSchemaTest-seed#[474E911E2550F381]-worker) [    ] o.a.s.u.DirectUpdateHandler2 end_commit_flush
   [junit4]   2> 411109 INFO  (searcherExecutor-1437-thread-1) [    ] o.a.s.c.SolrCore [collection1] Registered new searcher Searcher@1365e21[collection1] main{ExitableDirectoryReader(UninvertingDirectoryReader(Uninverting(_0(6.1.0):C2)))}
   [junit4]   2> 411110 INFO  (SUITE-MinimalSchemaTest-seed#[474E911E2550F381]-worker) [    ] o.a.s.u.p.LogUpdateProcessorFactory [collection1]  webapp=null path=null params={}{commit=} 0 10
   [junit4]   2> 411111 INFO  (SUITE-MinimalSchemaTest-seed#[474E911E2550F381]-worker) [    ] o.a.s.u.DirectUpdateHandler2 start commit{,optimize=true,openSearcher=true,waitSearcher=true,expungeDeletes=false,softCommit=false,prepareCommit=false}
   [junit4]   2> 411111 WARN  (SUITE-MinimalSchemaTest-seed#[474E911E2550F381]-worker) [    ] o.a.s.u.DirectUpdateHandler2 Starting optimize... Reading and rewriting the entire index! Use with care.
   [junit4]   2> 411119 INFO  (SUITE-MinimalSchemaTest-seed#[474E911E2550F381]-worker) [    ] o.a.s.c.SolrDeletionPolicy SolrDeletionPolicy.onCommit: commits: num=2
   [junit4]   2> 	commit{dir=MockDirectoryWrapper(RAMDirectory@37848c lockFactory=org.apache.lucene.store.SingleInstanceLockFactory@1fc2868),segFN=segments_2,generation=2}
   [junit4]   2> 	commit{dir=MockDirectoryWrapper(RAMDirectory@37848c lockFactory=org.apache.lucene.store.SingleInstanceLockFactory@1fc2868),segFN=segments_3,generation=3}
   [junit4]   2> 411119 INFO  (SUITE-MinimalSchemaTest-seed#[474E911E2550F381]-worker) [    ] o.a.s.c.SolrDeletionPolicy newest commit generation = 3
   [junit4]   2> 411120 INFO  (SUITE-MinimalSchemaTest-seed#[474E911E2550F381]-worker) [    ] o.a.s.s.SolrIndexSearcher Opening [Searcher@1e6329c[collection1] main]
   [junit4]   2> 411124 INFO  (SUITE-MinimalSchemaTest-seed#[474E911E2550F381]-worker) [    ] o.a.s.u.DirectUpdateHandler2 end_commit_flush
   [junit4]   2> 411124 INFO  (searcherExecutor-1437-thread-1) [    ] o.a.s.c.SolrCore [collection1] Registered new searcher Searcher@1e6329c[collection1] main{ExitableDirectoryReader(UninvertingDirectoryReader(Uninverting(_1(6.1.0):c2)))}
   [junit4]   2> 411124 INFO  (SUITE-MinimalSchemaTest-seed#[474E911E2550F381]-worker) [    ] o.a.s.u.p.LogUpdateProcessorFactory [collection1]  webapp=null path=null params={}{optimize=} 0 13
   [junit4]   2> 411128 INFO  (TEST-MinimalSchemaTest.testLuke-seed#[474E911E2550F381]) [    ] o.a.s.SolrTestCaseJ4 ###Starting testLuke
   [junit4]   2> 411132 INFO  (TEST-MinimalSchemaTest.testLuke-seed#[474E911E2550F381]) [    ] o.a.s.c.S.Request [collection1]  webapp=null path=null params={qt=/admin/luke&wt=xml} status=0 QTime=3
   [junit4]   2> 411134 INFO  (TEST-MinimalSchemaTest.testLuke-seed#[474E911E2550F381]) [    ] o.a.s.c.S.Request [collection1]  webapp=null path=null params={qt=/admin/luke&show=schema&wt=xml} status=0 QTime=0
   [junit4]   2> 411135 INFO  (TEST-MinimalSchemaTest.testLuke-seed#[474E911E2550F381]) [    ] o.a.s.SolrTestCaseJ4 ###Ending testLuke
   [junit4]   2> 411138 INFO  (TEST-MinimalSchemaTest.testAllConfiguredHandlers-seed#[474E911E2550F381]) [    ] o.a.s.SolrTestCaseJ4 ###Starting testAllConfiguredHandlers
   [junit4]   2> 411139 INFO  (TEST-MinimalSchemaTest.testAllConfiguredHandlers-seed#[474E911E2550F381]) [    ] o.a.s.c.S.Request [collection1]  webapp=null path=null params={q=foo:bar&qt=standard&omitHeader=false&wt=xml} hits=0 status=0 QTime=0
   [junit4]   2> 411140 INFO  (TEST-MinimalSchemaTest.testAllConfiguredHandlers-seed#[474E911E2550F381]) [    ] o.a.s.c.S.Request [collection1]  webapp=null path=null params={q=foo:bar&qt=&omitHeader=false&wt=xml} hits=0 status=0 QTime=0
   [junit4]   2> 411140 INFO  (TEST-MinimalSchemaTest.testAllConfiguredHandlers-seed#[474E911E2550F381]) [    ] o.a.s.c.S.Request [collection1]  webapp=null path=null params={q=foo:bar&qt=spellCheckCompRH&omitHeader=false&wt=xml} hits=0 status=0 QTime=0
   [junit4]   2> 411141 INFO  (TEST-MinimalSchemaTest.testAllConfiguredHandlers-seed#[474E911E2550F381]) [    ] o.a.s.c.PluginBag Going to create a new requestHandler with {type = requestHandler,name = lazy,class = solr.StandardRequestHandler,args = {defaults={rows=4,hl=true,hl.fl=text,name,subject,title,whitetok}}} 
   [junit4]   2> 411142 INFO  (TEST-MinimalSchemaTest.testAllConfiguredHandlers-seed#[474E911E2550F381]) [    ] o.a.s.c.S.Request [collection1]  webapp=null path=null params={q=foo:bar&qt=lazy&omitHeader=false&wt=xml} hits=0 status=0 QTime=0
   [junit4]   2> 411142 INFO  (TEST-MinimalSchemaTest.testAllConfiguredHandlers-seed#[474E911E2550F381]) [    ] o.a.s.c.S.Request [collection1]  webapp=null path=null params={q=foo:bar&qt=spellCheckWithWordbreak_Direct&omitHeader=false&wt=xml} hits=0 status=0 QTime=0
   [junit4]   2> 411143 INFO  (TEST-MinimalSchemaTest.testAllConfiguredHandlers-seed#[474E911E2550F381]) [    ] o.a.s.c.S.Request [collection1]  webapp=null path=null params={q=foo:bar&qt=tvrh&omitHeader=false&wt=xml} hits=0 status=0 QTime=0
   [junit4]   2> 411144 INFO  (TEST-MinimalSchemaTest.testAllConfiguredHandlers-seed#[474E911E2550F381]) [    ] o.a.s.c.S.Request [collection1]  webapp=null path=null params={q=foo:bar&qt=/get&omitHeader=false&wt=xml} status=0 QTime=0
   [junit4]   2> 411145 INFO  (TEST-MinimalSchemaTest.testAllConfiguredHandlers-seed#[474E911E2550F381]) [    ] o.a.s.c.S.Request [collection1]  webapp=null path=null params={q=foo:bar&qt=mltrh&omitHeader=false&wt=xml} hits=0 status=0 QTime=0
   [junit4]   2> 411146 INFO  (TEST-MinimalSchemaTest.testAllConfiguredHandlers-seed#[474E911E2550F381]) [    ] o.a.s.c.S.Request [collection1]  webapp=null path=null params={q=foo:bar&qt=/search-facet-def&omitHeader=false&wt=xml} hits=0 status=0 QTime=0
   [junit4]   2> 411150 ERROR (TEST-MinimalSchemaTest.testAllConfiguredHandlers-seed#[474E911E2550F381]) [    ] o.a.s.h.GraphHandler java.lang.NullPointerException
   [junit4]   2> 	at org.apache.solr.client.solrj.io.stream.expr.StreamExpressionParser.generateStreamExpression(StreamExpressionParser.java:46)
   [junit4]   2> 	at org.apache.solr.client.solrj.io.stream.expr.StreamExpressionParser.parse(StreamExpressionParser.java:37)
   [junit4]   2> 	at org.apache.solr.client.solrj.io.stream.expr.StreamFactory.constructStream(StreamFactory.java:178)
   [junit4]   2> 	at org.apache.solr.handler.GraphHandler.handleRequestBody(GraphHandler.java:159)
   [junit4]   2> 	at org.apache.solr.handler.RequestHandlerBase.handleRequest(RequestHandlerBase.java:155)
   [junit4]   2> 	at org.apache.solr.core.SolrCore.execute(SolrCore.java:2016)
   [junit4]   2> 	at org.apache.solr.util.TestHarness.query(TestHarness.java:310)
   [junit4]   2> 	at org.apache.solr.util.TestHarness.query(TestHarness.java:292)
   [junit4]   2> 	at org.apache.solr.SolrTestCaseJ4.assertQ(SolrTestCaseJ4.java:760)
   [junit4]   2> 	at org.apache.solr.MinimalSchemaTest.testAllConfiguredHandlers(MinimalSchemaTest.java:121)
   [junit4]   2> 	at sun.reflect.NativeMethodAccessorImpl.invoke0(Native Method)
   [junit4]   2> 	at sun.reflect.NativeMethodAccessorImpl.invoke(NativeMethodAccessorImpl.java:62)
   [junit4]   2> 	at sun.reflect.DelegatingMethodAccessorImpl.invoke(DelegatingMethodAccessorImpl.java:43)
   [junit4]   2> 	at java.lang.reflect.Method.invoke(Method.java:498)
   [junit4]   2> 	at com.carrotsearch.randomizedtesting.RandomizedRunner.invoke(RandomizedRunner.java:1764)
   [junit4]   2> 	at com.carrotsearch.randomizedtesting.RandomizedRunner$8.evaluate(RandomizedRunner.java:871)
   [junit4]   2> 	at com.carrotsearch.randomizedtesting.RandomizedRunner$9.evaluate(RandomizedRunner.java:907)
   [junit4]   2> 	at com.carrotsearch.randomizedtesting.RandomizedRunner$10.evaluate(RandomizedRunner.java:921)
   [junit4]   2> 	at com.carrotsearch.randomizedtesting.rules.SystemPropertiesRestoreRule$1.evaluate(SystemPropertiesRestoreRule.java:57)
   [junit4]   2> 	at org.apache.lucene.util.TestRuleSetupTeardownChained$1.evaluate(TestRuleSetupTeardownChained.java:49)
   [junit4]   2> 	at org.apache.lucene.util.AbstractBeforeAfterRule$1.evaluate(AbstractBeforeAfterRule.java:45)
   [junit4]   2> 	at org.apache.lucene.util.TestRuleThreadAndTestName$1.evaluate(TestRuleThreadAndTestName.java:48)
   [junit4]   2> 	at org.apache.lucene.util.TestRuleIgnoreAfterMaxFailures$1.evaluate(TestRuleIgnoreAfterMaxFailures.java:64)
   [junit4]   2> 	at org.apache.lucene.util.TestRuleMarkFailure$1.evaluate(TestRuleMarkFailure.java:47)
   [junit4]   2> 	at com.carrotsearch.randomizedtesting.rules.StatementAdapter.evaluate(StatementAdapter.java:36)
   [junit4]   2> 	at com.carrotsearch.randomizedtesting.ThreadLeakControl$StatementRunner.run(ThreadLeakControl.java:367)
   [junit4]   2> 	at com.carrotsearch.randomizedtesting.ThreadLeakControl.forkTimeoutingTask(ThreadLeakControl.java:809)
   [junit4]   2> 	at com.carrotsearch.randomizedtesting.ThreadLeakControl$3.evaluate(ThreadLeakControl.java:460)
   [junit4]   2> 	at com.carrotsearch.randomizedtesting.RandomizedRunner.runSingleTest(RandomizedRunner.java:880)
   [junit4]   2> 	at com.carrotsearch.randomizedtesting.RandomizedRunner$5.evaluate(RandomizedRunner.java:781)
   [junit4]   2> 	at com.carrotsearch.randomizedtesting.RandomizedRunner$6.evaluate(RandomizedRunner.java:816)
   [junit4]   2> 	at com.carrotsearch.randomizedtesting.RandomizedRunner$7.evaluate(RandomizedRunner.java:827)
   [junit4]   2> 	at com.carrotsearch.randomizedtesting.rules.StatementAdapter.evaluate(StatementAdapter.java:36)
   [junit4]   2> 	at com.carrotsearch.randomizedtesting.rules.SystemPropertiesRestoreRule$1.evaluate(SystemPropertiesRestoreRule.java:57)
   [junit4]   2> 	at org.apache.lucene.util.AbstractBeforeAfterRule$1.evaluate(AbstractBeforeAfterRule.java:45)
   [junit4]   2> 	at com.carrotsearch.randomizedtesting.rules.StatementAdapter.evaluate(StatementAdapter.java:36)
   [junit4]   2> 	at org.apache.lucene.util.TestRuleStoreClassName$1.evaluate(TestRuleStoreClassName.java:41)
   [junit4]   2> 	at com.carrotsearch.randomizedtesting.rules.NoShadowingOrOverridesOnMethodsRule$1.evaluate(NoShadowingOrOverridesOnMethodsRule.java:40)
   [junit4]   2> 	at com.carrotsearch.randomizedtesting.rules.NoShadowingOrOverridesOnMethodsRule$1.evaluate(NoShadowingOrOverridesOnMethodsRule.java:40)
   [junit4]   2> 	at com.carrotsearch.randomizedtesting.rules.StatementAdapter.evaluate(StatementAdapter.java:36)
   [junit4]   2> 	at com.carrotsearch.randomizedtesting.rules.StatementAdapter.evaluate(StatementAdapter.java:36)
   [junit4]   2> 	at com.carrotsearch.randomizedtesting.rules.StatementAdapter.evaluate(StatementAdapter.java:36)
   [junit4]   2> 	at org.apache.lucene.util.TestRuleAssertionsRequired$1.evaluate(TestRuleAssertionsRequired.java:53)
   [junit4]   2> 	at org.apache.lucene.util.TestRuleMarkFailure$1.evaluate(TestRuleMarkFailure.java:47)
   [junit4]   2> 	at org.apache.lucene.util.TestRuleIgnoreAfterMaxFailures$1.evaluate(TestRuleIgnoreAfterMaxFailures.java:64)
   [junit4]   2> 	at org.apache.lucene.util.TestRuleIgnoreTestSuites$1.evaluate(TestRuleIgnoreTestSuites.java:54)
   [junit4]   2> 	at com.carrotsearch.randomizedtesting.rules.StatementAdapter.evaluate(StatementAdapter.java:36)
   [junit4]   2> 	at com.carrotsearch.randomizedtesting.ThreadLeakControl$StatementRunner.run(ThreadLeakControl.java:367)
   [junit4]   2> 	at java.lang.Thread.run(Thread.java:745)
   [junit4]   2> 
   [junit4]   2> 411152 INFO  (TEST-MinimalSchemaTest.testAllConfiguredHandlers-seed#[474E911E2550F381]) [    ] o.a.s.c.S.Request [collection1]  webapp=null path=null params={q=foo:bar&qt=/graph&omitHeader=false&wt=xml} status=0 QTime=5
   [junit4]   2> [Fatal Error] :1:1: Content is not allowed in prolog.
   [junit4]   2> 411163 ERROR (TEST-MinimalSchemaTest.testAllConfiguredHandlers-seed#[474E911E2550F381]) [    ] o.a.s.SolrTestCaseJ4 REQUEST FAILED: q=foo:bar&qt=/graph&omitHeader=false&wt=xml:org.xml.sax.SAXParseException; lineNumber: 1; columnNumber: 1; Content is not allowed in prolog.
   [junit4]   2> 	at com.sun.org.apache.xerces.internal.parsers.DOMParser.parse(DOMParser.java:257)
   [junit4]   2> 	at com.sun.org.apache.xerces.internal.jaxp.DocumentBuilderImpl.parse(DocumentBuilderImpl.java:339)
   [junit4]   2> 	at javax.xml.parsers.DocumentBuilder.parse(DocumentBuilder.java:121)
   [junit4]   2> 	at org.apache.solr.util.BaseTestHarness.validateXPath(BaseTestHarness.java:84)
   [junit4]   2> 	at org.apache.solr.SolrTestCaseJ4.assertQ(SolrTestCaseJ4.java:771)
   [junit4]   2> 	at org.apache.solr.MinimalSchemaTest.testAllConfiguredHandlers(MinimalSchemaTest.java:121)
   [junit4]   2> 	at sun.reflect.NativeMethodAccessorImpl.invoke0(Native Method)
   [junit4]   2> 	at sun.reflect.NativeMethodAccessorImpl.invoke(NativeMethodAccessorImpl.java:62)
   [junit4]   2> 	at sun.reflect.DelegatingMethodAccessorImpl.invoke(DelegatingMethodAccessorImpl.java:43)
   [junit4]   2> 	at java.lang.reflect.Method.invoke(Method.java:498)
   [junit4]   2> 	at com.carrotsearch.randomizedtesting.RandomizedRunner.invoke(RandomizedRunner.java:1764)
   [junit4]   2> 	at com.carrotsearch.randomizedtesting.RandomizedRunner$8.evaluate(RandomizedRunner.java:871)
   [junit4]   2> 	at com.carrotsearch.randomizedtesting.RandomizedRunner$9.evaluate(RandomizedRunner.java:907)
   [junit4]   2> 	at com.carrotsearch.randomizedtesting.RandomizedRunner$10.evaluate(RandomizedRunner.java:921)
   [junit4]   2> 	at com.carrotsearch.randomizedtesting.rules.SystemPropertiesRestoreRule$1.evaluate(SystemPropertiesRestoreRule.java:57)
   [junit4]   2> 	at org.apache.lucene.util.TestRuleSetupTeardownChained$1.evaluate(TestRuleSetupTeardownChained.java:49)
   [junit4]   2> 	at org.apache.lucene.util.AbstractBeforeAfterRule$1.evaluate(AbstractBeforeAfterRule.java:45)
   [junit4]   2> 	at org.apache.lucene.util.TestRuleThreadAndTestName$1.evaluate(TestRuleThreadAndTestName.java:48)
   [junit4]   2> 	at org.apache.lucene.util.TestRuleIgnoreAfterMaxFailures$1.evaluate(TestRuleIgnoreAfterMaxFailures.java:64)
   [junit4]   2> 	at org.apache.lucene.util.TestRuleMarkFailure$1.evaluate(TestRuleMarkFailure.java:47)
   [junit4]   2> 	at com.carrotsearch.randomizedtesting.rules.StatementAdapter.evaluate(StatementAdapter.java:36)
   [junit4]   2> 	at com.carrotsearch.randomizedtesting.ThreadLeakControl$StatementRunner.run(ThreadLeakControl.java:367)
   [junit4]   2> 	at com.carrotsearch.randomizedtesting.ThreadLeakControl.forkTimeoutingTask(ThreadLeakControl.java:809)
   [junit4]   2> 	at com.carrotsearch.randomizedtesting.ThreadLeakControl$3.evaluate(ThreadLeakControl.java:460)
   [junit4]   2> 	at com.carrotsearch.randomizedtesting.RandomizedRunner.runSingleTest(RandomizedRunner.java:880)
   [junit4]   2> 	at com.carrotsearch.randomizedtesting.RandomizedRunner$5.evaluate(RandomizedRunner.java:781)
   [junit4]   2> 	at com.carrotsearch.randomizedtesting.RandomizedRunner$6.evaluate(RandomizedRunner.java:816)
   [junit4]   2> 	at com.carrotsearch.randomizedtesting.RandomizedRunner$7.evaluate(RandomizedRunner.java:827)
   [junit4]   2> 	at com.carrotsearch.randomizedtesting.rules.StatementAdapter.evaluate(StatementAdapter.java:36)
   [junit4]   2> 	at com.carrotsearch.randomizedtesting.rules.SystemPropertiesRestoreRule$1.evaluate(SystemPropertiesRestoreRule.java:57)
   [junit4]   2> 	at org.apache.lucene.util.AbstractBeforeAfterRule$1.evaluate(AbstractBeforeAfterRule.java:45)
   [junit4]   2> 	at com.carrotsearch.randomizedtesting.rules.StatementAdapter.evaluate(StatementAdapter.java:36)
   [junit4]   2> 	at org.apache.lucene.util.TestRuleStoreClassName$1.evaluate(TestRuleStoreClassName.java:41)
   [junit4]   2> 	at com.carrotsearch.randomizedtesting.rules.NoShadowingOrOverridesOnMethodsRule$1.evaluate(NoShadowingOrOverridesOnMethodsRule.java:40)
   [junit4]   2> 	at com.carrotsearch.randomizedtesting.rules.NoShadowingOrOverridesOnMethodsRule$1.evaluate(NoShadowingOrOverridesOnMethodsRule.java:40)
   [junit4]   2> 	at com.carrotsearch.randomizedtesting.rules.StatementAdapter.evaluate(StatementAdapter.java:36)
   [junit4]   2> 	at com.carrotsearch.randomizedtesting.rules.StatementAdapter.evaluate(StatementAdapter.java:36)
   [junit4]   2> 	at com.carrotsearch.randomizedtesting.rules.StatementAdapter.evaluate(StatementAdapter.java:36)
   [junit4]   2> 	at org.apache.lucene.util.TestRuleAssertionsRequired$1.evaluate(TestRuleAssertionsRequired.java:53)
   [junit4]   2> 	at org.apache.lucene.util.TestRuleMarkFailure$1.evaluate(TestRuleMarkFailure.java:47)
   [junit4]   2> 	at org.apache.lucene.util.TestRuleIgnoreAfterMaxFailures$1.evaluate(TestRuleIgnoreAfterMaxFailures.java:64)
   [junit4]   2> 	at org.apache.lucene.util.TestRuleIgnoreTestSuites$1.evaluate(TestRuleIgnoreTestSuites.java:54)
   [junit4]   2> 	at com.carrotsearch.randomizedtesting.rules.StatementAdapter.evaluate(StatementAdapter.java:36)
   [junit4]   2> 	at com.carrotsearch.randomizedtesting.ThreadLeakControl$StatementRunner.run(ThreadLeakControl.java:367)
   [junit4]   2> 	at java.lang.Thread.run(Thread.java:745)
   [junit4]   2> 
   [junit4]   2> 411164 INFO  (TEST-MinimalSchemaTest.testAllConfiguredHandlers-seed#[474E911E2550F381]) [    ] o.a.s.SolrTestCaseJ4 ###Ending testAllConfiguredHandlers
   [junit4]   2> NOTE: reproduce with: ant test  -Dtestcase=MinimalSchemaTest -Dtests.method=testAllConfiguredHandlers -Dtests.seed=474E911E2550F381 -Dtests.multiplier=3 -Dtests.slow=true -Dtests.locale=ar-SY -Dtests.timezone=America/Port-au-Prince -Dtests.asserts=true -Dtests.file.encoding=ISO-8859-1
   [junit4] ERROR   0.03s J1 | MinimalSchemaTest.testAllConfiguredHandlers <<<
   [junit4]    > Throwable #1: java.lang.RuntimeException: exception w/handler: '/graph'
   [junit4]    > 	at __randomizedtesting.SeedInfo.seed([474E911E2550F381:AA502A24AE5DF205]:0)
   [junit4]    > 	at org.apache.solr.MinimalSchemaTest.testAllConfiguredHandlers(MinimalSchemaTest.java:130)
   [junit4]    > 	at java.lang.Thread.run(Thread.java:745)
   [junit4]    > Caused by: java.lang.RuntimeException: Exception during query
   [junit4]    > 	at org.apache.solr.SolrTestCaseJ4.assertQ(SolrTestCaseJ4.java:786)
   [junit4]    > 	at org.apache.solr.MinimalSchemaTest.testAllConfiguredHandlers(MinimalSchemaTest.java:121)
   [junit4]    > 	... 39 more
   [junit4]    > Caused by: org.xml.sax.SAXParseException; lineNumber: 1; columnNumber: 1; Content is not allowed in prolog.
   [junit4]    > 	at com.sun.org.apache.xerces.internal.parsers.DOMParser.parse(DOMParser.java:257)
   [junit4]    > 	at com.sun.org.apache.xerces.internal.jaxp.DocumentBuilderImpl.parse(DocumentBuilderImpl.java:339)
   [junit4]    > 	at javax.xml.parsers.DocumentBuilder.parse(DocumentBuilder.java:121)
   [junit4]    > 	at org.apache.solr.util.BaseTestHarness.validateXPath(BaseTestHarness.java:84)
   [junit4]    > 	at org.apache.solr.SolrTestCaseJ4.assertQ(SolrTestCaseJ4.java:771)
   [junit4]    > 	... 40 more
   [junit4]   2> 411169 INFO  (TEST-MinimalSchemaTest.testSimpleQueries-seed#[474E911E2550F381]) [    ] o.a.s.SolrTestCaseJ4 ###Starting testSimpleQueries
   [junit4]   2> 411170 INFO  (TEST-MinimalSchemaTest.testSimpleQueries-seed#[474E911E2550F381]) [    ] o.a.s.c.S.Request [collection1]  webapp=null path=null params={q=subject:Hoss&qt=standard&start=0&rows=20&version=2.2} hits=1 status=0 QTime=0
   [junit4]   2> 411171 INFO  (TEST-MinimalSchemaTest.testSimpleQueries-seed#[474E911E2550F381]) [    ] o.a.s.c.S.Request [collection1]  webapp=null path=null params={q=subject:Yonik&qt=standard&start=0&rows=20&version=2.2} hits=1 status=0 QTime=0
   [junit4]   2> 411172 INFO  (TEST-MinimalSchemaTest.testSimpleQueries-seed#[474E911E2550F381]) [    ] o.a.s.SolrTestCaseJ4 ###Ending testSimpleQueries
   [junit4]   2> 411172 INFO  (SUITE-MinimalSchemaTest-seed#[474E911E2550F381]-worker) [    ] o.a.s.SolrTestCaseJ4 ###deleteCore
   [junit4]   2> 411173 INFO  (SUITE-MinimalSchemaTest-seed#[474E911E2550F381]-worker) [    ] o.a.s.c.CoreContainer Shutting down CoreContainer instance=26951563
   [junit4]   2> 411173 INFO  (coreCloseExecutor-1442-thread-1) [    x:collection1] o.a.s.c.SolrCore [collection1]  CLOSING SolrCore org.apache.solr.core.SolrCore@bd267b
   [junit4]   2> 411173 INFO  (coreCloseExecutor-1442-thread-1) [    x:collection1] o.a.s.u.DirectUpdateHandler2 closing DirectUpdateHandler2{commits=1,autocommits=0,soft autocommits=0,optimizes=1,rollbacks=0,expungeDeletes=0,docsPending=0,adds=0,deletesById=0,deletesByQuery=0,errors=0,cumulative_adds=2,cumulative_deletesById=0,cumulative_deletesByQuery=0,cumulative_errors=0,transaction_logs_total_size=132,transaction_logs_total_number=1}
   [junit4]   2> 411174 INFO  (coreCloseExecutor-1442-thread-1) [    x:collection1] o.a.s.u.SolrCoreState Closing SolrCoreState
   [junit4]   2> 411174 INFO  (coreCloseExecutor-1442-thread-1) [    x:collection1] o.a.s.u.DefaultSolrCoreState SolrCoreState ref count has reached 0 - closing IndexWriter
   [junit4]   2> 411174 INFO  (coreCloseExecutor-1442-thread-1) [    x:collection1] o.a.s.u.DefaultSolrCoreState closing IndexWriter with IndexWriterCloser
   [junit4]   2> 411175 INFO  (coreCloseExecutor-1442-thread-1) [    x:collection1] o.a.s.c.SolrCore [collection1] Closing main searcher on request.
   [junit4]   2> 411197 INFO  (coreCloseExecutor-1442-thread-1) [    x:collection1] o.a.s.c.CachingDirectoryFactory Closing MockDirectoryFactory - 2 directories currently being tracked
   [junit4]   2> 411197 INFO  (coreCloseExecutor-1442-thread-1) [    x:collection1] o.a.s.c.CachingDirectoryFactory looking to close /home/jenkins/workspace/Lucene-Solr-6.x-Linux/solr/build/solr-core/test/J1/temp/solr.MinimalSchemaTest_474E911E2550F381-001/init-core-data-001 [CachedDir<<refCount=0;path=/home/jenkins/workspace/Lucene-Solr-6.x-Linux/solr/build/solr-core/test/J1/temp/solr.MinimalSchemaTest_474E911E2550F381-001/init-core-data-001;done=false>>]
   [junit4]   2> 411197 INFO  (coreCloseExecutor-1442-thread-1) [    x:collection1] o.a.s.c.CachingDirectoryFactory Closing directory, CoreContainer#isShutdown=true
   [junit4]   2> 411197 INFO  (coreCloseExecutor-1442-thread-1) [    x:collection1] o.a.s.c.CachingDirectoryFactory Closing directory: /home/jenkins/workspace/Lucene-Solr-6.x-Linux/solr/build/solr-core/test/J1/temp/solr.MinimalSchemaTest_474E911E2550F381-001/init-core-data-001
   [junit4]   2> 411197 INFO  (coreCloseExecutor-1442-thread-1) [    x:collection1] o.a.s.c.CachingDirectoryFactory looking to close /home/jenkins/workspace/Lucene-Solr-6.x-Linux/solr/build/solr-core/test/J1/temp/solr.MinimalSchemaTest_474E911E2550F381-001/init-core-data-001/index [CachedDir<<refCount=0;path=/home/jenkins/workspace/Lucene-Solr-6.x-Linux/solr/build/solr-core/test/J1/temp/solr.MinimalSchemaTest_474E911E2550F381-001/init-core-data-001/index;done=false>>]
   [junit4]   2> 411197 INFO  (coreCloseExecutor-1442-thread-1) [    x:collection1] o.a.s.c.CachingDirectoryFactory Closing directory, CoreContainer#isShutdown=true
   [junit4]   2> 411197 INFO  (coreCloseExecutor-1442-thread-1) [    x:collection1] o.a.s.c.CachingDirectoryFactory Closing directory: /home/jenkins/workspace/Lucene-Solr-6.x-Linux/solr/build/solr-core/test/J1/temp/solr.MinimalSchemaTest_474E911E2550F381-001/init-core-data-001/index
   [junit4]   2> NOTE: leaving temporary files on disk at: /home/jenkins/workspace/Lucene-Solr-6.x-Linux/solr/build/solr-core/test/J1/temp/solr.MinimalSchemaTest_474E911E2550F381-001
   [junit4]   2> NOTE: test params are: codec=Asserting(Lucene60): {subject=TestBloomFilteredLucenePostings(BloomFilteringPostingsFormat(Lucene50(blocksize=128))), project=PostingsFormat(name=Direct), id=PostingsFormat(name=Direct)}, docValues:{}, maxPointsInLeafNode=968, maxMBSortInHeap=6.932708524693425, sim=RandomSimilarity(queryNorm=false,coord=yes): {}, locale=ar-SY, timezone=America/Port-au-Prince
   [junit4]   2> NOTE: Linux 4.4.0-21-generic i386/Oracle Corporation 1.8.0_92 (32-bit)/cpus=12,threads=1,free=98635224,total=277348352
   [junit4]   2> NOTE: All tests run in this JVM: [TestUseDocValuesAsStored2, IndexBasedSpellCheckerTest, DirectoryFactoryTest, DistanceFunctionTest, TestWordDelimiterFilterFactory, AliasIntegrationTest, CoreAdminCreateDiscoverTest, SaslZkACLProviderTest, TestCollapseQParserPlugin, OutOfBoxZkACLAndCredentialsProvidersTest, TestSolrConfigHandler, DirectSolrSpellCheckerTest, SpellCheckCollatorTest, TestDownShardTolerantSearch, BlockJoinFacetRandomTest, ZkCLITest, TestBulkSchemaConcurrent, HdfsSyncSliceTest, TestCoreContainer, TestRestManager, CursorMarkTest, DistributedQueueTest, NotRequiredUniqueKeyTest, RecoveryAfterSoftCommitTest, ParsingFieldUpdateProcessorsTest, RestartWhileUpdatingTest, TestRawResponseWriter, TestMissingGroups, CollectionsAPIAsyncDistributedZkTest, ChaosMonkeyNothingIsSafeTest, TestAnalyzeInfixSuggestions, TestDynamicFieldResource, DocumentBuilderTest, TestRequestForwarding, TestHashPartitioner, TestDFRSimilarityFactory, RequestLoggingTest, TestCloudDeleteByQuery, SpellingQueryConverterTest, TestReplicationHandlerBackup, CdcrUpdateLogTest, SolrPluginUtilsTest, SpellCheckComponentTest, TestQueryUtils, TestDFISimilarityFactory, AsyncMigrateRouteKeyTest, TestSha256AuthenticationProvider, DocValuesMissingTest, TestTestInjection, TestPartialUpdateDeduplication, TermsComponentTest, LeaderInitiatedRecoveryOnShardRestartTest, TestEmbeddedSolrServerConstructors, JavabinLoaderTest, BitVectorTest, TestFieldSortValues, SoftAutoCommitTest, TestSolr4Spatial2, MinimalSchemaTest]
   [junit4] Completed [122/595 (1!)] on J1 in 2.51s, 3 tests, 1 error <<< FAILURES!

[...truncated 459 lines...]
   [junit4] Suite: org.apache.solr.core.SolrCoreTest
   [junit4]   2> Creating dataDir: /home/jenkins/workspace/Lucene-Solr-6.x-Linux/solr/build/solr-core/test/J0/temp/solr.core.SolrCoreTest_474E911E2550F381-001/init-core-data-001
   [junit4]   2> 992763 INFO  (SUITE-SolrCoreTest-seed#[474E911E2550F381]-worker) [    ] o.a.s.SolrTestCaseJ4 Randomized ssl (false) and clientAuth (false)
   [junit4]   2> 992765 INFO  (TEST-SolrCoreTest.testInfoRegistry-seed#[474E911E2550F381]) [    ] o.a.s.SolrTestCaseJ4 ###Starting testInfoRegistry
   [junit4]   2> 992765 INFO  (TEST-SolrCoreTest.testInfoRegistry-seed#[474E911E2550F381]) [    ] o.a.s.SolrTestCaseJ4 ####initCore
   [junit4]   2> 992765 INFO  (TEST-SolrCoreTest.testInfoRegistry-seed#[474E911E2550F381]) [    ] o.a.s.c.SolrResourceLoader new SolrResourceLoader for directory: '/home/jenkins/workspace/Lucene-Solr-6.x-Linux/solr/core/src/test-files/solr/collection1'
   [junit4]   2> 992765 INFO  (TEST-SolrCoreTest.testInfoRegistry-seed#[474E911E2550F381]) [    ] o.a.s.c.SolrResourceLoader JNDI not configured for solr (NoInitialContextEx)
   [junit4]   2> 992765 INFO  (TEST-SolrCoreTest.testInfoRegistry-seed#[474E911E2550F381]) [    ] o.a.s.c.SolrResourceLoader using system property solr.solr.home: /home/jenkins/workspace/Lucene-Solr-6.x-Linux/solr/core/src/test-files/solr
   [junit4]   2> 992766 INFO  (TEST-SolrCoreTest.testInfoRegistry-seed#[474E911E2550F381]) [    ] o.a.s.c.SolrResourceLoader Adding 'file:/home/jenkins/workspace/Lucene-Solr-6.x-Linux/solr/core/src/test-files/solr/collection1/lib/classes/' to classloader
   [junit4]   2> 992766 INFO  (TEST-SolrCoreTest.testInfoRegistry-seed#[474E911E2550F381]) [    ] o.a.s.c.SolrResourceLoader Adding 'file:/home/jenkins/workspace/Lucene-Solr-6.x-Linux/solr/core/src/test-files/solr/collection1/lib/README' to classloader
   [junit4]   2> 992801 INFO  (TEST-SolrCoreTest.testInfoRegistry-seed#[474E911E2550F381]) [    ] o.a.s.c.SolrConfig current version of requestparams : -1
   [junit4]   2> 992809 WARN  (TEST-SolrCoreTest.testInfoRegistry-seed#[474E911E2550F381]) [    ] o.a.s.c.Config Beginning with Solr 5.5, <mergePolicy> is deprecated, use <mergePolicyFactory> instead.
   [junit4]   2> 992811 INFO  (TEST-SolrCoreTest.testInfoRegistry-seed#[474E911E2550F381]) [    ] o.a.s.c.SolrConfig Using Lucene MatchVersion: 6.1.0
   [junit4]   2> 992831 INFO  (TEST-SolrCoreTest.testInfoRegistry-seed#[474E911E2550F381]) [    ] o.a.s.c.SolrConfig Loaded SolrConfig: solrconfig.xml
   [junit4]   2> 992838 INFO  (TEST-SolrCoreTest.testInfoRegistry-seed#[474E911E2550F381]) [    ] o.a.s.s.IndexSchema [null] Schema name=test
   [junit4]   2> 992933 INFO  (TEST-SolrCoreTest.testInfoRegistry-seed#[474E911E2550F381]) [    ] o.a.s.s.OpenExchangeRatesOrgProvider Initialized with rates=open-exchange-rates.json, refreshInterval=1440.
   [junit4]   2> 992938 INFO  (TEST-SolrCoreTest.testInfoRegistry-seed#[474E911E2550F381]) [    ] o.a.s.s.IndexSchema default search field in schema is text
   [junit4]   2> 992939 INFO  (TEST-SolrCoreTest.testInfoRegistry-seed#[474E911E2550F381]) [    ] o.a.s.s.IndexSchema unique key field: id
   [junit4]   2> 992944 INFO  (TEST-SolrCoreTest.testInfoRegistry-seed#[474E911E2550F381]) [    ] o.a.s.s.FileExchangeRateProvider Reloading exchange rates from file currency.xml
   [junit4]   2> 992945 INFO  (TEST-SolrCoreTest.testInfoRegistry-seed#[474E911E2550F381]) [    ] o.a.s.s.FileExchangeRateProvider Reloading exchange rates from file currency.xml
   [junit4]   2> 992947 INFO  (TEST-SolrCoreTest.testInfoRegistry-seed#[474E911E2550F381]) [    ] o.a.s.s.OpenExchangeRatesOrgProvider Reloading exchange rates from open-exchange-rates.json
   [junit4]   2> 992947 INFO  (TEST-SolrCoreTest.testInfoRegistry-seed#[474E911E2550F381]) [    ] o.a.s.s.OpenExchangeRatesOrgProvider Reloading exchange rates from open-exchange-rates.json
   [junit4]   2> 992948 INFO  (TEST-SolrCoreTest.testInfoRegistry-seed#[474E911E2550F381]) [    ] o.a.s.c.SolrResourceLoader JNDI not configured for solr (NoInitialContextEx)
   [junit4]   2> 992948 INFO  (TEST-SolrCoreTest.testInfoRegistry-seed#[474E911E2550F381]) [    ] o.a.s.c.SolrResourceLoader using system property solr.solr.home: /home/jenkins/workspace/Lucene-Solr-6.x-Linux/solr/core/src/test-files/solr
   [junit4]   2> 992948 INFO  (TEST-SolrCoreTest.testInfoRegistry-seed#[474E911E2550F381]) [    ] o.a.s.c.SolrResourceLoader new SolrResourceLoader for directory: '/home/jenkins/workspace/Lucene-Solr-6.x-Linux/solr/core/src/test-files/solr'
   [junit4]   2> 992948 INFO  (TEST-SolrCoreTest.testInfoRegistry-seed#[474E911E2550F381]) [    ] o.a.s.c.SolrResourceLoader JNDI not configured for solr (NoInitialContextEx)
   [junit4]   2> 992948 INFO  (TEST-SolrCoreTest.testInfoRegistry-seed#[474E911E2550F381]) [    ] o.a.s.c.SolrResourceLoader using system property solr.solr.home: /home/jenkins/workspace/Lucene-Solr-6.x-Linux/solr/core/src/test-files/solr
   [junit4]   2> 992948 INFO  (TEST-SolrCoreTest.testInfoRegistry-seed#[474E911E2550F381]) [    ] o.a.s.c.CoreContainer New CoreContainer 3678155
   [junit4]   2> 992948 INFO  (TEST-SolrCoreTest.testInfoRegistry-seed#[474E911E2550F381]) [    ] o.a.s.c.CoreContainer Loading cores into CoreContainer [instanceDir=/home/jenkins/workspace/Lucene-Solr-6.x-Linux/solr/core/src/test-files/solr]
   [junit4]   2> 992948 WARN  (TEST-SolrCoreTest.testInfoRegistry-seed#[474E911E2550F381]) [    ] o.a.s.c.CoreContainer Couldn't add files from /home/jenkins/workspace/Lucene-Solr-6.x-Linux/solr/core/src/test-files/solr/lib to classpath: /home/jenkins/workspace/Lucene-Solr-6.x-Linux/solr/core/src/test-files/solr/lib
   [junit4]   2> 992948 INFO  (TEST-SolrCoreTest.testInfoRegistry-seed#[474E911E2550F381]) [    ] o.a.s.h.c.HttpShardHandlerFactory created with socketTimeout : 600000,connTimeout : 60000,maxConnectionsPerHost : 20,maxConnections : 10000,corePoolSize : 0,maximumPoolSize : 2147483647,maxThreadIdleTime : 5,sizeOfQueue : -1,fairnessPolicy : false,useRetries : false,
   [junit4]   2> 992949 INFO  (TEST-SolrCoreTest.testInfoRegistry-seed#[474E911E2550F381]) [    ] o.a.s.u.UpdateShardHandler Creating UpdateShardHandler HTTP client with params: socketTimeout=30000&connTimeout=30000&retry=true
   [junit4]   2> 992950 INFO  (TEST-SolrCoreTest.testInfoRegistry-seed#[474E911E2550F381]) [    ] o.a.s.l.LogWatcher SLF4J impl is org.slf4j.impl.Log4jLoggerFactory
   [junit4]   2> 992950 INFO  (TEST-SolrCoreTest.testInfoRegistry-seed#[474E911E2550F381]) [    ] o.a.s.l.LogWatcher Registering Log Listener [Log4j (org.slf4j.impl.Log4jLoggerFactory)]
   [junit4]   2> 992950 INFO  (TEST-SolrCoreTest.testInfoRegistry-seed#[474E911E2550F381]) [    ] o.a.s.c.CoreContainer Security conf doesn't exist. Skipping setup for authorization module.
   [junit4]   2> 992950 INFO  (TEST-SolrCoreTest.testInfoRegistry-seed#[474E911E2550F381]) [    ] o.a.s.c.CoreContainer No authentication plugin used.
   [junit4]   2> 992950 INFO  (TEST-SolrCoreTest.testInfoRegistry-seed#[474E911E2550F381]) [    ] o.a.s.c.CoreDescriptor Created CoreDescriptor: {name=collection1, config=solrconfig.xml, transient=false, schema=schema.xml, loadOnStartup=true, configSetProperties=configsetprops.json, collection=collection1, dataDir=/home/jenkins/workspace/Lucene-Solr-6.x-Linux/solr/build/solr-core/test/J0/temp/solr.core.SolrCoreTest_474E911E2550F381-001/init-core-data-001, shard=shard1}
   [junit4]   2> 992951 INFO  (coreLoadExecutor-4414-thread-1) [    ] o.a.s.c.SolrResourceLoader new SolrResourceLoader for directory: '/home/jenkins/workspace/Lucene-Solr-6.x-Linux/solr/core/src/test-files/solr/collection1'
   [junit4]   2> 992951 INFO  (coreLoadExecutor-4414-thread-1) [    ] o.a.s.c.SolrResourceLoader JNDI not configured for solr (NoInitialContextEx)
   [junit4]   2> 992951 INFO  (coreLoadExecutor-4414-thread-1) [    ] o.a.s.c.SolrResourceLoader using system property solr.solr.home: /home/jenkins/workspace/Lucene-Solr-6.x-Linux/solr/core/src/test-files/solr
   [junit4]   2> 992951 INFO  (coreLoadExecutor-4414-thread-1) [    ] o.a.s.c.SolrResourceLoader Adding 'file:/home/jenkins/workspace/Lucene-Solr-6.x-Linux/solr/core/src/test-files/solr/collection1/lib/classes/' to classloader
   [junit4]   2> 992951 INFO  (coreLoadExecutor-4414-thread-1) [    ] o.a.s.c.SolrResourceLoader Adding 'file:/home/jenkins/workspace/Lucene-Solr-6.x-Linux/solr/core/src/test-files/solr/collection1/lib/README' to classloader
   [junit4]   2> 992970 INFO  (coreLoadExecutor-4414-thread-1) [    ] o.a.s.c.SolrConfig current version of requestparams : -1
   [junit4]   2> 992977 WARN  (coreLoadExecutor-4414-thread-1) [    ] o.a.s.c.Config Beginning with Solr 5.5, <mergePolicy> is deprecated, use <mergePolicyFactory> instead.
   [junit4]   2> 992979 INFO  (coreLoadExecutor-4414-thread-1) [    ] o.a.s.c.SolrConfig Using Lucene MatchVersion: 6.1.0
   [junit4]   2> 993009 INFO  (coreLoadExecutor-4414-thread-1) [    ] o.a.s.c.SolrConfig Loaded SolrConfig: solrconfig.xml
   [junit4]   2> 993015 INFO  (coreLoadExecutor-4414-thread-1) [    ] o.a.s.s.IndexSchema [collection1] Schema name=test
   [junit4]   2> 993103 INFO  (coreLoadExecutor-4414-thread-1) [    ] o.a.s.s.OpenExchangeRatesOrgProvider Initialized with rates=open-exchange-rates.json, refreshInterval=1440.
   [junit4]   2> 993108 INFO  (coreLoadExecutor-4414-thread-1) [    ] o.a.s.s.IndexSchema default search field in schema is text
   [junit4]   2> 993109 INFO  (coreLoadExecutor-4414-thread-1) [    ] o.a.s.s.IndexSchema unique key field: id
   [junit4]   2> 993113 INFO  (coreLoadExecutor-4414-thread-1) [    ] o.a.s.s.FileExchangeRateProvider Reloading exchange rates from file currency.xml
   [junit4]   2> 993115 INFO  (coreLoadExecutor-4414-thread-1) [    ] o.a.s.s.FileExchangeRateProvider Reloading exchange rates from file currency.xml
   [junit4]   2> 993116 INFO  (coreLoadExecutor-4414-thread-1) [    ] o.a.s.s.OpenExchangeRatesOrgProvider Reloading exchange rates from open-exchange-rates.json
   [junit4]   2> 993116 INFO  (coreLoadExecutor-4414-thread-1) [    ] o.a.s.s.OpenExchangeRatesOrgProvider Reloading exchange rates from open-exchange-rates.json
   [junit4]   2> 993117 INFO  (coreLoadExecutor-4414-thread-1) [    ] o.a.s.c.ConfigSetProperties Did not find ConfigSet properties, assuming default properties: Can't find resource 'configsetprops.json' in classpath or '/home/jenkins/workspace/Lucene-Solr-6.x-Linux/solr/core/src/test-files/solr/collection1'
   [junit4]   2> 993117 INFO  (coreLoadExecutor-4414-thread-1) [    ] o.a.s.c.CoreContainer Creating SolrCore 'collection1' using configuration from instancedir /home/jenkins/workspace/Lucene-Solr-6.x-Linux/solr/core/src/test-files/solr/collection1
   [junit4]   2> 993118 INFO  (coreLoadExecutor-4414-thread-1) [    x:collection1] o.a.s.c.SolrCore org.apache.solr.core.MockDirectoryFactory
   [junit4]   2> 993118 INFO  (coreLoadExecutor-4414-thread-1) [    x:collection1] o.a.s.c.SolrCore [[collection1] ] Opening new SolrCore at [/home/jenkins/workspace/Lucene-Solr-6.x-Linux/solr/core/src/test-files/solr/collection1], dataDir=[/home/jenkins/workspace/Lucene-Solr-6.x-Linux/solr/build/solr-core/test/J0/temp/solr.core.SolrCoreTest_474E911E2550F381-001/init-core-data-001/]
   [junit4]   2> 993118 INFO  (coreLoadExecutor-4414-thread-1) [    x:collection1] o.a.s.c.JmxMonitoredMap JMX monitoring is enabled. Adding Solr mbeans to JMX Server: com.sun.jmx.mbeanserver.JmxMBeanServer@18742f2
   [junit4]   2> 993119 INFO  (coreLoadExecutor-4414-thread-1) [    x:collection1] o.a.s.c.CachingDirectoryFactory return new directory for /home/jenkins/workspace/Lucene-Solr-6.x-Linux/solr/build/solr-core/test/J0/temp/solr.core.SolrCoreTest_474E911E2550F381-001/init-core-data-001
   [junit4]   2> 993119 INFO  (coreLoadExecutor-4414-thread-1) [    x:collection1] o.a.s.c.SolrCore New index directory detected: old=null new=/home/jenkins/workspace/Lucene-Solr-6.x-Linux/solr/build/solr-core/test/J0/temp/solr.core.SolrCoreTest_474E911E2550F381-001/init-core-data-001/index/
   [junit4]   2> 993119 WARN  (coreLoadExecutor-4414-thread-1) [    x:collection1] o.a.s.c.SolrCore [collection1] Solr index directory '/home/jenkins/workspace/Lucene-Solr-6.x-Linux/solr/build/solr-core/test/J0/temp/solr.core.SolrCoreTest_474E911E2550F381-001/init-core-data-001/index' doesn't exist. Creating new index...
   [junit4]   2> 993119 INFO  (coreLoadExecutor-4414-thread-1) [    x:collection1] o.a.s.c.CachingDirectoryFactory return new directory for /home/jenkins/workspace/Lucene-Solr-6.x-Linux/solr/build/solr-core/test/J0/temp/solr.core.SolrCoreTest_474E911E2550F381-001/init-core-data-001/index
   [junit4]   2> 993120 INFO  (coreLoadExecutor-4414-thread-1) [    x:collection1] o.a.s.u.RandomMergePolicy RandomMergePolicy wrapping class org.apache.lucene.index.LogDocMergePolicy: [LogDocMergePolicy: minMergeSize=1000, mergeFactor=43, maxMergeSize=9223372036854775807, maxMergeSizeForForcedMerge=9223372036854775807, calibrateSizeByDeletes=true, maxMergeDocs=2147483647, maxCFSSegmentSizeMB=8.796093022207999E12, noCFSRatio=0.0]
   [junit4]   2> 993122 INFO  (coreLoadExecutor-4414-thread-1) [    x:collection1] o.a.s.c.SolrDeletionPolicy SolrDeletionPolicy.onCommit: commits: num=1
   [junit4]   2> 	commit{dir=MockDirectoryWrapper(NIOFSDirectory@/home/jenkins/workspace/Lucene-Solr-6.x-Linux/solr/build/solr-core/test/J0/temp/solr.core.SolrCoreTest_474E911E2550F381-001/index-NIOFSDirectory-001 lockFactory=org.apache.lucene.store.NativeFSLockFactory@18130b8),segFN=segments_1,generation=1}
   [junit4]   2> 993122 INFO  (coreLoadExecutor-4414-thread-1) [    x:collection1] o.a.s.c.SolrDeletionPolicy newest commit generation = 1
   [junit4]   2> 993122 INFO  (OldIndexDirectoryCleanupThreadForCore-collection1) [    x:collection1] o.a.s.c.SolrCore Looking for old index directories to cleanup for core collection1 in /home/jenkins/workspace/Lucene-Solr-6.x-Linux/solr/build/solr-core/test/J0/temp/solr.core.SolrCoreTest_474E911E2550F381-001/init-core-data-001/
   [junit4]   2> 993126 INFO  (coreLoadExecutor-4414-thread-1) [    x:collection1] o.a.s.u.p.UpdateRequestProcessorChain creating updateRequestProcessorChain "dedupe"
   [junit4]   2> 993126 INFO  (coreLoadExecutor-4414-thread-1) [    x:collection1] o.a.s.u.p.UpdateRequestProcessorChain inserting DistributedUpdateProcessorFactory into updateRequestProcessorChain "dedupe"
   [junit4]   2> 993127 INFO  (coreLoadExecutor-4414-thread-1) [    x:collection1] o.a.s.u.p.UpdateRequestProcessorChain creating updateRequestProcessorChain "dedupe-allfields"
   [junit4]   2> 993127 INFO  (coreLoadExecutor-4414-thread-1) [    x:collection1] o.a.s.u.p.UpdateRequestProcessorChain inserting DistributedUpdateProcessorFactory into updateRequestProcessorChain "dedupe-allfields"
   [junit4]   2> 993127 INFO  (coreLoadExecutor-4414-thread-1) [    x:collection1] o.a.s.u.p.UpdateRequestProcessorChain creating updateRequestProcessorChain "stored_sig"
   [junit4]   2> 993127 INFO  (coreLoadExecutor-4414-thread-1) [    x:collection1] o.a.s.u.p.UpdateRequestProcessorChain inserting DistributedUpdateProcessorFactory into updateRequestProcessorChain "stored_sig"
   [junit4]   2> 993127 INFO  (coreLoadExecutor-4414-thread-1) [    x:collection1] o.a.s.u.p.UpdateRequestProcessorChain creating updateRequestProcessorChain "uniq-fields"
   [junit4]   2> 993127 INFO  (coreLoadExecutor-4414-thread-1) [    x:collection1] o.a.s.u.p.UpdateRequestProcessorChain inserting DistributedUpdateProcessorFactory into updateRequestProcessorChain "uniq-fields"
   [junit4]   2> 993127 INFO  (coreLoadExecutor-4414-thread-1) [    x:collection1] o.a.s.u.p.UpdateRequestProcessorChain creating updateRequestProcessorChain "distrib-dup-test-chain-explicit"
   [junit4]   2> 993127 INFO  (coreLoadExecutor-4414-thread-1) [    x:collection1] o.a.s.u.p.UpdateRequestProcessorChain creating updateRequestProcessorChain "distrib-dup-test-chain-implicit"
   [junit4]   2> 993127 INFO  (coreLoadExecutor-4414-thread-1) [    x:collection1] o.a.s.u.p.UpdateRequestProcessorChain inserting DistributedUpdateProcessorFactory into updateRequestProcessorChain "distrib-dup-test-chain-implicit"
   [junit4]   2> 993128 INFO  (coreLoadExecutor-4414-thread-1) [    x:collection1] o.a.s.c.SolrCore no updateRequestProcessorChain defined as default, creating implicit default
   [junit4]   2> 993129 INFO  (coreLoadExecutor-4414-thread-1) [    x:collection1] o.a.s.h.l.XMLLoader xsltCacheLifetimeSeconds=60
   [junit4]   2> 993130 INFO  (coreLoadExecutor-4414-thread-1) [    x:collection1] o.a.s.h.l.XMLLoader xsltCacheLifetimeSeconds=60
   [junit4]   2> 993130 INFO  (coreLoadExecutor-4414-thread-1) [    x:collection1] o.a.s.h.l.XMLLoader xsltCacheLifetimeSeconds=60
   [junit4]   2> 993131 INFO  (coreLoadExecutor-4414-thread-1) [    x:collection1] o.a.s.h.l.XMLLoader xsltCacheLifetimeSeconds=60
   [junit4]   2> 993137 INFO  (coreLoadExecutor-4414-thread-1) [    x:collection1] o.a.s.c.PluginBag requestHandler : 'lazy' created with startup=lazy 
   [junit4]   2> 993140 INFO  (coreLoadExecutor-4414-thread-1) [    x:collection1] o.a.s.c.RequestHandlers Registered paths: /admin/mbeans,standard,spellCheckCompRH,lazy,/update/json/docs,/admin/luke,/export,spellCheckWithWordbreak_Direct,tvrh,/get,/admin/properties,/update/json,mltrh,/admin/threads,/search-facet-def,/update/csv,/sql,/graph,/search-facet-invariants,/admin/segments,spellCheckCompRH1,/mlt,/admin/system,/replication,dismax,defaults,/config,/stream,/schema,/admin/plugins,/admin/logging,spellCheckWithWordbreak,mock,/admin/ping,/update,/admin/file,/terms,spellCheckCompRH_Direct,/debug/dump
   [junit4]   2> 993140 INFO  (coreLoadExecutor-4414-thread-1) [    x:collection1] o.a.s.c.SolrCore Using default statsCache cache: org.apache.solr.search.stats.LocalStatsCache
   [junit4]   2> 993140 INFO  (coreLoadExecutor-4414-thread-1) [    x:collection1] o.a.s.u.UpdateHandler Using UpdateLog implementation: org.apache.solr.update.UpdateLog
   [junit4]   2> 993140 INFO  (coreLoadExecutor-4414-thread-1) [    x:collection1] o.a.s.u.UpdateLog Initializing UpdateLog: dataDir= defaultSyncLevel=FLUSH numRecordsToKeep=100 maxNumLogsToKeep=10 numVersionBuckets=65536
   [junit4]   2> 993141 INFO  (coreLoadExecutor-4414-thread-1) [    x:collection1] o.a.s.u.CommitTracker Hard AutoCommit: disabled
   [junit4]   2> 993141 INFO  (coreLoadExecutor-4414-thread-1) [    x:collection1] o.a.s.u.CommitTracker Soft AutoCommit: disabled
   [junit4]   2> 993141 INFO  (coreLoadExecutor-4414-thread-1) [    x:collection1] o.a.s.u.RandomMergePolicy RandomMergePolicy wrapping class org.apache.lucene.index.TieredMergePolicy: [TieredMergePolicy: maxMergeAtOnce=47, maxMergeAtOnceExplicit=36, maxMergedSegmentMB=58.51953125, floorSegmentMB=0.951171875, forceMergeDeletesPctAllowed=29.173100713750646, segmentsPerTier=23.0, maxCFSSegmentSizeMB=8.796093022207999E12, noCFSRatio=1.0
   [junit4]   2> 993142 INFO  (coreLoadExecutor-4414-thread-1) [    x:collection1] o.a.s.c.SolrDeletionPolicy SolrDeletionPolicy.onInit: commits: num=1
   [junit4]   2> 	commit{dir=MockDirectoryWrapper(NIOFSDirectory@/home/jenkins/workspace/Lucene-Solr-6.x-Linux/solr/build/solr-core/test/J0/temp/solr.core.SolrCoreTest_474E911E2550F381-001/index-NIOFSDirectory-001 lockFactory=org.apache.lucene.store.NativeFSLockFactory@18130b8),segFN=segments_1,generation=1}
   [junit4]   2> 993142 INFO  (coreLoadExecutor-4414-thread-1) [    x:collection1] o.a.s.c.SolrDeletionPolicy newest commit generation = 1
   [junit4]   2> 993142 INFO  (coreLoadExecutor-4414-thread-1) [    x:collection1] o.a.s.s.SolrIndexSearcher Opening [Searcher@152be85[collection1] main]
   [junit4]   2> 993143 INFO  (coreLoadExecutor-4414-thread-1) [    x:collection1] o.a.s.r.RestManager Initializing RestManager with initArgs: {storageIO=org.apache.solr.rest.ManagedResourceStorage$InMemoryStorageIO}
   [junit4]   2> 993143 INFO  (coreLoadExecutor-4414-thread-1) [    x:collection1] o.a.s.r.ManagedResourceStorage Reading _rest_managed.json using InMemoryStorage
   [junit4]   2> 993143 INFO  (coreLoadExecutor-4414-thread-1) [    x:collection1] o.a.s.r.RestManager Initializing 0 registered ManagedResources
   [junit4]   2> 993143 INFO  (coreLoadExecutor-4414-thread-1) [    x:collection1] o.a.s.h.c.SpellCheckComponent Initializing spell checkers
   [junit4]   2> 993168 INFO  (coreLoadExecutor-4414-thread-1) [    x:collection1] o.a.s.s.DirectSolrSpellChecker init: {name=direct,classname=DirectSolrSpellChecker,field=lowerfilt,minQueryLength=3}
   [junit4]   2> 993243 INFO  (coreLoadExecutor-4414-thread-1) [    x:collection1] o.a.s.h.ReplicationHandler Commits will be reserved for  10000
   [junit4]   2> 993244 INFO  (searcherExecutor-4415-thread-1-processing-x:collection1) [    x:collection1] o.a.s.h.c.SpellCheckComponent Loading spell index for spellchecker: default
   [junit4]   2> 993244 INFO  (searcherExecutor-4415-thread-1-processing-x:collection1) [    x:collection1] o.a.s.h.c.SpellCheckComponent Loading spell index for spellchecker: direct
   [junit4]   2> 993244 INFO  (searcherExecutor-4415-thread-1-processing-x:collection1) [    x:collection1] o.a.s.h.c.SpellCheckComponent Loading spell index for spellchecker: wordbreak
   [junit4]   2> 993244 INFO  (searcherExecutor-4415-thread-1-processing-x:collection1) [    x:collection1] o.a.s.h.c.SpellCheckComponent Loading spell index for spellchecker: multipleFields
   [junit4]   2> 993244 INFO  (coreLoadExecutor-4414-thread-1) [    x:collection1] o.a.s.u.UpdateLog Looking up max value of version field to seed version buckets
   [junit4]   2> 993245 INFO  (coreLoadExecutor-4414-thread-1) [    x:collection1] o.a.s.u.VersionInfo Refreshing highest value of _version_ for 65536 version buckets from index
   [junit4]   2> 993245 INFO  (searcherExecutor-4415-thread-1-processing-x:collection1) [    x:collection1] o.a.s.h.c.SpellCheckComponent Loading spell index for spellchecker: jarowinkler
   [junit4]   2> 993245 INFO  (coreLoadExecutor-4414-thread-1) [    x:collection1] o.a.s.u.VersionInfo No terms found for _version_, cannot seed version bucket highest value from index
   [junit4]   2> 993245 INFO  (coreLoadExecutor-4414-thread-1) [    x:collection1] o.a.s.u.UpdateLog Could not find max version in index or recent updates, using new clock 1533527338575200256
   [junit4]   2> 993245 INFO  (searcherExecutor-4415-thread-1-processing-x:collection1) [    x:collection1] o.a.s.h.c.SpellCheckComponent Loading spell index for spellchecker: external
   [junit4]   2> 993245 INFO  (searcherExecutor-4415-thread-1-processing-x:collection1) [    x:collection1] o.a.s.h.c.SpellCheckComponent Loading spell index for spellchecker: freq
   [junit4]   2> 993246 INFO  (searcherExecutor-4415-thread-1-processing-x:collection1) [    x:collection1] o.a.s.h.c.SpellCheckComponent Loading spell index for spellchecker: fqcn
   [junit4]   2> 993246 INFO  (searcherExecutor-4415-thread-1-processing-x:collection1) [    x:collection1] o.a.s.h.c.SpellCheckComponent Loading spell index for spellchecker: perDict
   [junit4]   2> 993246 INFO  (coreLoadExecutor-4414-thread-1) [    x:collection1] o.a.s.u.UpdateLog Took 1.0ms to seed version buckets with highest version 1533527338575200256
   [junit4]   2> 993246 INFO  (coreLoadExecutor-4414-thread-1) [    x:collection1] o.a.s.c.CoreContainer registering core: collection1
   [junit4]   2> 993248 INFO  (TEST-SolrCoreTest.testInfoRegistry-seed#[474E911E2550F381]) [    ] o.a.s.SolrTestCaseJ4 ####initCore end
   [junit4]   2> 993248 INFO  (TEST-SolrCoreTest.testInfoRegistry-seed#[474E911E2550F381]) [    ] o.a.s.SolrTestCaseJ4 ###deleteCore
   [junit4]   2> 993248 INFO  (TEST-SolrCoreTest.testInfoRegistry-seed#[474E911E2550F381]) [    ] o.a.s.c.CoreContainer Shutting down CoreContainer instance=3678155
   [junit4]   2> 993248 INFO  (coreCloseExecutor-4420-thread-1) [    x:collection1] o.a.s.c.SolrCore [collection1]  CLOSING SolrCore org.apache.solr.core.SolrCore@1ce1d88
   [junit4]   2> 993249 INFO  (coreCloseExecutor-4420-thread-1) [    x:collection1] o.a.s.u.DirectUpdateHandler2 closing DirectUpdateHandler2{commits=0,autocommits=0,soft autocommits=0,optimizes=0,rollbacks=0,expungeDeletes=0,docsPending=0,adds=0,deletesById=0,deletesByQuery=0,errors=0,cumulative_adds=0,cumulative_deletesById=0,cumulative_deletesByQuery=0,cumulative_errors=0,transaction_logs_total_size=0,transaction_logs_total_number=0}
   [junit4]   2> 993249 INFO  (searcherExecutor-4415-thread-1-processing-x:collection1) [    x:collection1] o.a.s.c.SolrCore [collection1] Registered new searcher Searcher@152be85[collection1] main{ExitableDirectoryReader(UninvertingDirectoryReader())}
   [junit4]   2> 993249 INFO  (coreCloseExecutor-4420-thread-1) [    x:collection1] o.a.s.u.SolrCoreState Closing SolrCoreState
   [junit4]   2> 993249 INFO  (coreCloseExecutor-4420-thread-1) [    x:collection1] o.a.s.u.DefaultSolrCoreState SolrCoreState ref count has reached 0 - closing IndexWriter
   [junit4]   2> 993249 INFO  (coreCloseExecutor-4420-thread-1) [    x:collection1] o.a.s.u.DefaultSolrCoreState closing IndexWriter with IndexWriterCloser
   [junit4]   2> 993250 INFO  (coreCloseExecutor-4420-thread-1) [    x:collection1] o.a.s.c.SolrCore [collection1] Closing main searcher on request.
   [junit4]   2> 993272 INFO  (coreCloseExecutor-4420-thread-1) [    x:collection1] o.a.s.c.CachingDirectoryFactory Closing MockDirectoryFactory - 2 directories currently being tracked
   [junit4]   2> 993272 INFO  (coreCloseExecutor-4420-thread-1) [    x:collection1] o.a.s.c.CachingDirectoryFactory looking to close /home/jenkins/workspace/Lucene-Solr-6.x-Linux/solr/build/solr-core/test/J0/temp/solr.core.SolrCoreTest_474E911E2550F381-001/init-core-data-001 [CachedDir<<refCount=0;path=/home/jenkins/workspace/Lucene-Solr-6.x-Linux/solr/build/solr-core/test/J0/temp/solr.core.SolrCoreTest_474E911E2550F381-001/init-core-data-001;done=false>>]
   [junit4]   2> 993272 INFO  (coreCloseExecutor-4420-thread-1) [    x:collection1] o.a.s.c.CachingDirectoryFactory Closing directory, CoreContainer#isShutdown=true
   [junit4]   2> 993273 INFO  (coreCloseExecutor-4420-thread-1) [    x:collection1] o.a.s.c.CachingDirectoryFactory Closing directory: /home/jenkins/workspace/Lucene-Solr-6.x-Linux/solr/build/solr-core/test/J0/temp/solr.core.SolrCoreTest_474E911E2550F381-001/init-core-data-001
   [junit4]   2> 993273 INFO  (coreCloseExecutor-4420-thread-1) [    x:collection1] o.a.s.c.CachingDirectoryFactory looking to close /home/jenkins/workspace/Lucene-Solr-6.x-Linux/solr/build/solr-core/test/J0/temp/solr.core.SolrCoreTest_474E911E2550F381-001/init-core-data-001/index [CachedDir<<refCount=0;path=/home/jenkins/workspace/Lucene-Solr-6.x-Linux/solr/build/solr-core/test/J0/temp/solr.core.SolrCoreTest_474E911E2550F381-001/init-core-data-001/index;done=false>>]
   [junit4]   2> 993273 INFO  (coreCloseExecutor-4420-thread-1) [    x:collection1] o.a.s.c.CachingDirectoryFactory Closing directory, CoreContainer#isShutdown=true
   [junit4]   2> 993273 INFO  (coreCloseExecutor-4420-thread-1) [    x:collection1] o.a.s.c.CachingDirectoryFactory Closing directory: /home/jenkins/workspace/Lucene-Solr-6.x-Linux/solr/build/solr-core/test/J0/temp/solr.core.SolrCoreTest_474E911E2550F381-001/init-core-data-001/index
   [junit4]   2> 993273 INFO  (TEST-SolrCoreTest.testInfoRegistry-seed#[474E911E2550F381]) [    ] o.a.s.SolrTestCaseJ4 ###Ending testInfoRegistry
   [junit4]   2> 993277 INFO  (TEST-SolrCoreTest.testRefCount-seed#[474E911E2550F381]) [    ] o.a.s.SolrTestCaseJ4 ###Starting testRefCount
   [junit4]   2> 993277 INFO  (TEST-SolrCoreTest.testRefCount-seed#[474E911E2550F381]) [    ] o.a.s.SolrTestCaseJ4 ####initCore
   [junit4]   2> 993277 INFO  (TEST-SolrCoreTest.testRefCount-seed#[474E911E2550F381]) [    ] o.a.s.c.SolrResourceLoader new SolrResourceLoader for directory: '/home/jenkins/workspace/Lucene-Solr-6.x-Linux/solr/core/src/test-files/solr/collection1'
   [junit4]   2> 993278 INFO  (TEST-SolrCoreTest.testRefCount-seed#[474E911E2550F381]) [    ] o.a.s.c.SolrResourceLoader JNDI not configured for solr (NoInitialContextEx)
   [junit4]   2> 993278 INFO  (TEST-SolrCoreTest.testRefCount-seed#[474E911E2550F381]) [    ] o.a.s.c.SolrResourceLoader using system property solr.solr.home: /home/jenkins/workspace/Lucene-Solr-6.x-Linux/solr/core/src/test-files/solr
   [junit4]   2> 993278 INFO  (TEST-SolrCoreTest.testRefCount-seed#[474E911E2550F381]) [    ] o.a.s.c.SolrResourceLoader Adding 'file:/home/jenkins/workspace/Lucene-Solr-6.x-Linux/solr/core/src/test-files/solr/collection1/lib/classes/' to classloader
   [junit4]   2> 993278 INFO  (TEST-SolrCoreTest.testRefCount-seed#[474E911E2550F381]) [    ] o.a.s.c.SolrResourceLoader Adding 'file:/home/jenkins/workspace/Lucene-Solr-6.x-Linux/solr/core/src/test-files/solr/collection1/lib/README' to classloader
   [junit4]   2> 993308 INFO  (TEST-SolrCoreTest.testRefCount-seed#[474E911E2550F381]) [    ] o.a.s.c.SolrConfig current version of requestparams : -1
   [junit4]   2> 993321 WARN  (TEST-SolrCoreTest.testRefCount-seed#[474E911E2550F381]) [    ] o.a.s.c.Config Beginning with Solr 5.5, <mergePolicy> is deprecated, use <mergePolicyFactory> instead.
   [junit4]   2> 993322 INFO  (TEST-SolrCoreTest.testRefCount-seed#[474E911E2550F381]) [    ] o.a.s.c.SolrConfig Using Lucene MatchVersion: 6.1.0
   [junit4]   2> 993352 INFO  (TEST-SolrCoreTest.testRefCount-seed#[474E911E2550F381]) [    ] o.a.s.c.SolrConfig Loaded SolrConfig: solrconfig.xml
   [junit4]   2> 993358 INFO  (TEST-SolrCoreTest.testRefCount-seed#[474E911E2550F381]) [    ] o.a.s.s.IndexSchema [null] Schema name=test
   [junit4]   2> 993457 INFO  (TEST-SolrCoreTest.testRefCount-seed#[474E911E2550F381]) [    ] o.a.s.s.OpenExchangeRatesOrgProvider Initialized with rates=open-exchange-rates.json, refreshInterval=1440.
   [junit4]   2> 993463 INFO  (TEST-SolrCoreTest.testRefCount-seed#[474E911E2550F381]) [    ] o.a.s.s.IndexSchema default search field in schema is text
   [junit4]   2> 993464 INFO  (TEST-SolrCoreTest.testRefCount-seed#[474E911E2550F381]) [    ] o.a.s.s.IndexSchema unique key field: id
   [junit4]   2> 993469 INFO  (TEST-SolrCoreTest.testRefCount-seed#[474E911E2550F381]) [    ] o.a.s.s.FileExchangeRateProvider Reloading exchange rates from file currency.xml
   [junit4]   2> 993471 INFO  (TEST-SolrCoreTest.testRefCount-seed#[474E911E2550F381]) [    ] o.a.s.s.FileExchangeRateProvider Reloading exchange rates from file currency.xml
   [junit4]   2> 993472 INFO  (TEST-SolrCoreTest.testRefCount-seed#[474E911E2550F381]) [    ] o.a.s.s.OpenExchangeRatesOrgProvider Reloading exchange rates from open-exchange-rates.json
   [junit4]   2> 993473 INFO  (TEST-SolrCoreTest.testRefCount-seed#[474E911E2550F381]) [    ] o.a.s.s.OpenExchangeRatesOrgProvider Reloading exchange rates from open-exchange-rates.json
   [junit4]   2> 993473 INFO  (TEST-SolrCoreTest.testRefCount-seed#[474E911E2550F381]) [    ] o.a.s.c.SolrResourceLoader JNDI not configured for solr (NoInitialContextEx)
   [junit4]   2> 993473 INFO  (TEST-SolrCoreTest.testRefCount-seed#[474E911E2550F381]) [    ] o.a.s.c.SolrResourceLoader using system property solr.solr.home: /home/jenkins/workspace/Lucene-Solr-6.x-Linux/solr/core/src/test-files/solr
   [junit4]   2> 993473 INFO  (TEST-SolrCoreTest.testRefCount-seed#[474E911E2550F381]) [    ] o.a.s.c.SolrResourceLoader new SolrResourceLoader for directory: '/home/jenkins/workspace/Lucene-Solr-6.x-Linux/solr/core/src/test-files/solr'
   [junit4]   2> 993473 INFO  (TEST-SolrCoreTest.testRefCount-seed#[474E911E2550F381]) [    ] o.a.s.c.SolrResourceLoader JNDI not configured for solr (NoInitialContextEx)
   [junit4]   2> 993473 INFO  (TEST-SolrCoreTest.testRefCount-seed#[474E911E2550F381]) [    ] o.a.s.c.SolrResourceLoader using system property solr.solr.home: /home/jenkins/workspace/Lucene-Solr-6.x-Linux/solr/core/src/test-files/solr
   [junit4]   2> 993473 INFO  (TEST-SolrCoreTest.testRefCount-seed#[474E911E2550F381]) [    ] o.a.s.c.CoreContainer New CoreContainer 21172089
   [junit4]   2> 993473 INFO  (TEST-SolrCoreTest.testRefCount-seed#[474E911E2550F381]) [    ] o.a.s.c.CoreContainer Loading cores into CoreContainer [instanceDir=/home/jenkins/workspace/Lucene-Solr-6.x-Linux/solr/core/src/test-files/solr]
   [junit4]   2> 993473 WARN  (TEST-SolrCoreTest.testRefCount-seed#[474E911E2550F381]) [    ] o.a.s.c.CoreContainer Couldn't add files from /home/jenkins/workspace/Lucene-Solr-6.x-Linux/solr/core/src/test-files/solr/lib to classpath: /home/jenkins/workspace/Lucene-Solr-6.x-Li

[...truncated too long message...]

llection1) [    x:collection1] o.a.s.h.c.SpellCheckComponent Loading spell index for spellchecker: wordbreak
   [junit4]   2> 996270 INFO  (searcherExecutor-4496-thread-1-processing-x:collection1) [    x:collection1] o.a.s.h.c.SpellCheckComponent Loading spell index for spellchecker: multipleFields
   [junit4]   2> 996270 INFO  (searcherExecutor-4496-thread-1-processing-x:collection1) [    x:collection1] o.a.s.h.c.SpellCheckComponent Loading spell index for spellchecker: jarowinkler
   [junit4]   2> 996271 INFO  (searcherExecutor-4496-thread-1-processing-x:collection1) [    x:collection1] o.a.s.h.c.SpellCheckComponent Loading spell index for spellchecker: external
   [junit4]   2> 996271 INFO  (searcherExecutor-4496-thread-1-processing-x:collection1) [    x:collection1] o.a.s.h.c.SpellCheckComponent Loading spell index for spellchecker: freq
   [junit4]   2> 996271 INFO  (coreLoadExecutor-4495-thread-1) [    x:collection1] o.a.s.u.UpdateLog Took 2.0ms to seed version buckets with highest version 1533527341746094080
   [junit4]   2> 996272 INFO  (searcherExecutor-4496-thread-1-processing-x:collection1) [    x:collection1] o.a.s.h.c.SpellCheckComponent Loading spell index for spellchecker: fqcn
   [junit4]   2> 996272 INFO  (coreLoadExecutor-4495-thread-1) [    x:collection1] o.a.s.c.CoreContainer registering core: collection1
   [junit4]   2> 996272 INFO  (searcherExecutor-4496-thread-1-processing-x:collection1) [    x:collection1] o.a.s.h.c.SpellCheckComponent Loading spell index for spellchecker: perDict
   [junit4]   2> 996273 INFO  (TEST-SolrCoreTest.testClose-seed#[474E911E2550F381]) [    ] o.a.s.SolrTestCaseJ4 ####initCore end
   [junit4]   2> 996273 INFO  (searcherExecutor-4496-thread-1-processing-x:collection1) [    x:collection1] o.a.s.c.SolrCore [collection1] Registered new searcher Searcher@d8c757[collection1] main{ExitableDirectoryReader(UninvertingDirectoryReader())}
   [junit4]   2> 996273 INFO  (TEST-SolrCoreTest.testClose-seed#[474E911E2550F381]) [    ] o.a.s.c.CoreContainer Shutting down CoreContainer instance=16780157
   [junit4]   2> 996274 INFO  (coreCloseExecutor-4501-thread-1) [    x:collection1] o.a.s.c.SolrCore [collection1]  CLOSING SolrCore org.apache.solr.core.SolrCore@118bea4
   [junit4]   2> 996274 INFO  (coreCloseExecutor-4501-thread-1) [    x:collection1] o.a.s.u.DirectUpdateHandler2 closing DirectUpdateHandler2{commits=0,autocommits=0,soft autocommits=0,optimizes=0,rollbacks=0,expungeDeletes=0,docsPending=0,adds=0,deletesById=0,deletesByQuery=0,errors=0,cumulative_adds=0,cumulative_deletesById=0,cumulative_deletesByQuery=0,cumulative_errors=0,transaction_logs_total_size=0,transaction_logs_total_number=0}
   [junit4]   2> 996274 INFO  (coreCloseExecutor-4501-thread-1) [    x:collection1] o.a.s.u.SolrCoreState Closing SolrCoreState
   [junit4]   2> 996274 INFO  (coreCloseExecutor-4501-thread-1) [    x:collection1] o.a.s.u.DefaultSolrCoreState SolrCoreState ref count has reached 0 - closing IndexWriter
   [junit4]   2> 996274 INFO  (coreCloseExecutor-4501-thread-1) [    x:collection1] o.a.s.u.DefaultSolrCoreState closing IndexWriter with IndexWriterCloser
   [junit4]   2> 996275 INFO  (coreCloseExecutor-4501-thread-1) [    x:collection1] o.a.s.c.SolrCore [collection1] Closing main searcher on request.
   [junit4]   2> 996306 INFO  (coreCloseExecutor-4501-thread-1) [    x:collection1] o.a.s.c.CachingDirectoryFactory Closing MockDirectoryFactory - 2 directories currently being tracked
   [junit4]   2> 996306 INFO  (coreCloseExecutor-4501-thread-1) [    x:collection1] o.a.s.c.CachingDirectoryFactory looking to close /home/jenkins/workspace/Lucene-Solr-6.x-Linux/solr/build/solr-core/test/J0/temp/solr.core.SolrCoreTest_474E911E2550F381-001/init-core-data-001/index [CachedDir<<refCount=0;path=/home/jenkins/workspace/Lucene-Solr-6.x-Linux/solr/build/solr-core/test/J0/temp/solr.core.SolrCoreTest_474E911E2550F381-001/init-core-data-001/index;done=false>>]
   [junit4]   2> 996306 INFO  (coreCloseExecutor-4501-thread-1) [    x:collection1] o.a.s.c.CachingDirectoryFactory Closing directory, CoreContainer#isShutdown=true
   [junit4]   2> 996306 INFO  (coreCloseExecutor-4501-thread-1) [    x:collection1] o.a.s.c.CachingDirectoryFactory Closing directory: /home/jenkins/workspace/Lucene-Solr-6.x-Linux/solr/build/solr-core/test/J0/temp/solr.core.SolrCoreTest_474E911E2550F381-001/init-core-data-001/index
   [junit4]   2> 996306 INFO  (coreCloseExecutor-4501-thread-1) [    x:collection1] o.a.s.c.CachingDirectoryFactory looking to close /home/jenkins/workspace/Lucene-Solr-6.x-Linux/solr/build/solr-core/test/J0/temp/solr.core.SolrCoreTest_474E911E2550F381-001/init-core-data-001 [CachedDir<<refCount=0;path=/home/jenkins/workspace/Lucene-Solr-6.x-Linux/solr/build/solr-core/test/J0/temp/solr.core.SolrCoreTest_474E911E2550F381-001/init-core-data-001;done=false>>]
   [junit4]   2> 996306 INFO  (coreCloseExecutor-4501-thread-1) [    x:collection1] o.a.s.c.CachingDirectoryFactory Closing directory, CoreContainer#isShutdown=true
   [junit4]   2> 996306 INFO  (coreCloseExecutor-4501-thread-1) [    x:collection1] o.a.s.c.CachingDirectoryFactory Closing directory: /home/jenkins/workspace/Lucene-Solr-6.x-Linux/solr/build/solr-core/test/J0/temp/solr.core.SolrCoreTest_474E911E2550F381-001/init-core-data-001
   [junit4]   2> 996306 INFO  (TEST-SolrCoreTest.testClose-seed#[474E911E2550F381]) [    ] o.a.s.SolrTestCaseJ4 ###deleteCore
   [junit4]   2> 996306 INFO  (TEST-SolrCoreTest.testClose-seed#[474E911E2550F381]) [    ] o.a.s.c.CoreContainer Shutting down CoreContainer instance=16780157
   [junit4]   2> 996307 INFO  (TEST-SolrCoreTest.testClose-seed#[474E911E2550F381]) [    ] o.a.s.SolrTestCaseJ4 ###Ending testClose
   [junit4]   2> 996319 INFO  (SUITE-SolrCoreTest-seed#[474E911E2550F381]-worker) [    ] o.a.s.SolrTestCaseJ4 ###deleteCore
   [junit4]   2> NOTE: leaving temporary files on disk at: /home/jenkins/workspace/Lucene-Solr-6.x-Linux/solr/build/solr-core/test/J0/temp/solr.core.SolrCoreTest_474E911E2550F381-001
   [junit4]   2> NOTE: test params are: codec=Asserting(Lucene60): {}, docValues:{}, maxPointsInLeafNode=33, maxMBSortInHeap=7.108231009891144, sim=ClassicSimilarity, locale=ga, timezone=Africa/Libreville
   [junit4]   2> NOTE: Linux 4.4.0-21-generic i386/Oracle Corporation 1.8.0_92 (32-bit)/cpus=12,threads=1,free=198869040,total=394002432
   [junit4]   2> NOTE: All tests run in this JVM: [PathHierarchyTokenizerFactoryTest, TestChildDocTransformer, TestDynamicFieldCollectionResource, TestCrossCoreJoin, DisMaxRequestHandlerTest, SpatialHeatmapFacetsTest, TestPhraseSuggestions, ResponseLogComponentTest, SolrRequestParserTest, TestSmileRequest, TestGraphMLResponseWriter, CurrencyFieldOpenExchangeTest, TestJsonRequest, UUIDFieldTest, TestRTGBase, TestDefaultStatsCache, CursorPagingTest, TestConfigSetImmutable, CreateCollectionCleanupTest, TestLazyCores, ReturnFieldsTest, CloudExitableDirectoryReaderTest, SegmentsInfoRequestHandlerTest, TestConfigReload, TestFieldResource, VMParamsZkACLAndCredentialsProvidersTest, TestRealTimeGet, TestDynamicLoading, PingRequestHandlerTest, TestReplicationHandler, TestRandomFaceting, TestShardHandlerFactory, TestManagedResourceStorage, TestBadConfig, TestJoin, ConjunctionSolrSpellCheckerTest, TestSolrConfigHandlerConcurrent, ZkNodePropsTest, TestNamedUpdateProcessors, OverseerCollectionConfigSetProcessorTest, SSLMigrationTest, TestFileDictionaryLookup, JsonLoaderTest, TestDistribDocBasedVersion, TestUseDocValuesAsStored, SparseHLLTest, VersionInfoTest, AsyncCallRequestStatusResponseTest, SystemInfoHandlerTest, PKIAuthenticationIntegrationTest, TestLMDirichletSimilarityFactory, TestCloudBackupRestore, LeaderInitiatedRecoveryOnCommitTest, HdfsNNFailoverTest, TestBinaryField, HdfsChaosMonkeyNothingIsSafeTest, TestOrdValues, ConnectionReuseTest, TestReloadDeadlock, DistributedFacetPivotLargeTest, TestHighlightDedupGrouping, TestRangeQuery, SharedFSAutoReplicaFailoverTest, ReplicationFactorTest, HdfsDirectoryTest, TestConfig, TestSchemaVersionResource, TestDistributedSearch, TestManagedSchema, AnalyticsQueryTest, TestStandardQParsers, TestSolrCloudWithKerberosAlt, TestMergePolicyConfig, WrapperMergePolicyFactoryTest, TestFoldingMultitermQuery, ResourceLoaderTest, RankQueryTest, TestCustomSort, TestManagedSynonymFilterFactory, SyncSliceTest, TestTolerantUpdateProcessorRandomCloud, TestPerFieldSimilarityClassic, XsltUpdateRequestHandlerTest, CdcrVersionReplicationTest, HdfsRestartWhileUpdatingTest, TestSSLRandomization, HdfsTlogReplayBufferedWhileIndexingTest, BlockCacheTest, SynonymTokenizerTest, TestCloudPivotFacet, CoreMergeIndexesAdminHandlerTest, SolrCoreTest]
   [junit4] Completed [261/595 (2!)] on J0 in 3.58s, 7 tests, 1 failure <<< FAILURES!

[...truncated 1059 lines...]
BUILD FAILED
/home/jenkins/workspace/Lucene-Solr-6.x-Linux/build.xml:740: The following error occurred while executing this line:
/home/jenkins/workspace/Lucene-Solr-6.x-Linux/build.xml:684: The following error occurred while executing this line:
/home/jenkins/workspace/Lucene-Solr-6.x-Linux/build.xml:59: The following error occurred while executing this line:
/home/jenkins/workspace/Lucene-Solr-6.x-Linux/solr/build.xml:233: The following error occurred while executing this line:
/home/jenkins/workspace/Lucene-Solr-6.x-Linux/solr/common-build.xml:529: The following error occurred while executing this line:
/home/jenkins/workspace/Lucene-Solr-6.x-Linux/lucene/common-build.xml:1457: The following error occurred while executing this line:
/home/jenkins/workspace/Lucene-Solr-6.x-Linux/lucene/common-build.xml:1014: There were test failures: 595 suites (10 ignored), 2404 tests, 1 error, 1 failure, 115 ignored (71 assumptions) [seed: 474E911E2550F381]

Total time: 67 minutes 10 seconds
Build step 'Invoke Ant' marked build as failure
Archiving artifacts
[WARNINGS] Skipping publisher since build result is FAILURE
Recording test results
Email was triggered for: Failure - Any
Sending email for trigger: Failure - Any



Mime
View raw message