lucene-dev mailing list archives

Site index · List index
Message view « Date » · « Thread »
Top « Date » · « Thread »
From Policeman Jenkins Server <jenk...@thetaphi.de>
Subject [JENKINS] Lucene-Solr-6.x-Linux (32bit/jdk1.8.0_92) - Build # 644 - Failure!
Date Fri, 13 May 2016 20:45:53 GMT
Build: http://jenkins.thetaphi.de/job/Lucene-Solr-6.x-Linux/644/
Java: 32bit/jdk1.8.0_92 -client -XX:+UseG1GC

1 tests failed.
FAILED:  org.apache.lucene.index.TestExitableDirectoryReader.testExitableFilterIndexReader

Error Message:
The request took too long to iterate over terms. Timeout: timeoutAt: 630063179252163 (System.nanoTime():
630063780028938), TermsEnum=org.apache.lucene.codecs.blocktree.SegmentTermsEnum@1cc8ad4

Stack Trace:
org.apache.lucene.index.ExitableDirectoryReader$ExitingReaderException: The request took too
long to iterate over terms. Timeout: timeoutAt: 630063179252163 (System.nanoTime(): 630063780028938),
TermsEnum=org.apache.lucene.codecs.blocktree.SegmentTermsEnum@1cc8ad4
	at __randomizedtesting.SeedInfo.seed([D6EF1155738BC28C:6E8ABC1418514B75]:0)
	at org.apache.lucene.index.ExitableDirectoryReader$ExitableTermsEnum.checkAndThrow(ExitableDirectoryReader.java:173)
	at org.apache.lucene.index.ExitableDirectoryReader$ExitableTermsEnum.<init>(ExitableDirectoryReader.java:163)
	at org.apache.lucene.index.ExitableDirectoryReader$ExitableTerms.iterator(ExitableDirectoryReader.java:147)
	at org.apache.lucene.index.FilterLeafReader$FilterTerms.iterator(FilterLeafReader.java:113)
	at org.apache.lucene.index.TestExitableDirectoryReader$TestReader$TestTerms.iterator(TestExitableDirectoryReader.java:58)
	at org.apache.lucene.index.Terms.intersect(Terms.java:72)
	at org.apache.lucene.util.automaton.CompiledAutomaton.getTermsEnum(CompiledAutomaton.java:336)
	at org.apache.lucene.search.AutomatonQuery.getTermsEnum(AutomatonQuery.java:107)
	at org.apache.lucene.search.MultiTermQuery.getTermsEnum(MultiTermQuery.java:304)
	at org.apache.lucene.search.MultiTermQueryConstantScoreWrapper$1.rewrite(MultiTermQueryConstantScoreWrapper.java:148)
	at org.apache.lucene.search.MultiTermQueryConstantScoreWrapper$1.bulkScorer(MultiTermQueryConstantScoreWrapper.java:201)
	at org.apache.lucene.search.IndexSearcher.search(IndexSearcher.java:666)
	at org.apache.lucene.search.IndexSearcher.search(IndexSearcher.java:473)
	at org.apache.lucene.search.IndexSearcher.search(IndexSearcher.java:592)
	at org.apache.lucene.search.IndexSearcher.searchAfter(IndexSearcher.java:450)
	at org.apache.lucene.search.IndexSearcher.search(IndexSearcher.java:461)
	at org.apache.lucene.index.TestExitableDirectoryReader.testExitableFilterIndexReader(TestExitableDirectoryReader.java:128)
	at sun.reflect.NativeMethodAccessorImpl.invoke0(Native Method)
	at sun.reflect.NativeMethodAccessorImpl.invoke(NativeMethodAccessorImpl.java:62)
	at sun.reflect.DelegatingMethodAccessorImpl.invoke(DelegatingMethodAccessorImpl.java:43)
	at java.lang.reflect.Method.invoke(Method.java:498)
	at com.carrotsearch.randomizedtesting.RandomizedRunner.invoke(RandomizedRunner.java:1764)
	at com.carrotsearch.randomizedtesting.RandomizedRunner$8.evaluate(RandomizedRunner.java:871)
	at com.carrotsearch.randomizedtesting.RandomizedRunner$9.evaluate(RandomizedRunner.java:907)
	at com.carrotsearch.randomizedtesting.RandomizedRunner$10.evaluate(RandomizedRunner.java:921)
	at org.apache.lucene.util.TestRuleSetupTeardownChained$1.evaluate(TestRuleSetupTeardownChained.java:49)
	at org.apache.lucene.util.AbstractBeforeAfterRule$1.evaluate(AbstractBeforeAfterRule.java:45)
	at org.apache.lucene.util.TestRuleThreadAndTestName$1.evaluate(TestRuleThreadAndTestName.java:48)
	at org.apache.lucene.util.TestRuleIgnoreAfterMaxFailures$1.evaluate(TestRuleIgnoreAfterMaxFailures.java:64)
	at org.apache.lucene.util.TestRuleMarkFailure$1.evaluate(TestRuleMarkFailure.java:47)
	at com.carrotsearch.randomizedtesting.rules.StatementAdapter.evaluate(StatementAdapter.java:36)
	at com.carrotsearch.randomizedtesting.ThreadLeakControl$StatementRunner.run(ThreadLeakControl.java:367)
	at com.carrotsearch.randomizedtesting.ThreadLeakControl.forkTimeoutingTask(ThreadLeakControl.java:809)
	at com.carrotsearch.randomizedtesting.ThreadLeakControl$3.evaluate(ThreadLeakControl.java:460)
	at com.carrotsearch.randomizedtesting.RandomizedRunner.runSingleTest(RandomizedRunner.java:880)
	at com.carrotsearch.randomizedtesting.RandomizedRunner$5.evaluate(RandomizedRunner.java:781)
	at com.carrotsearch.randomizedtesting.RandomizedRunner$6.evaluate(RandomizedRunner.java:816)
	at com.carrotsearch.randomizedtesting.RandomizedRunner$7.evaluate(RandomizedRunner.java:827)
	at org.apache.lucene.util.AbstractBeforeAfterRule$1.evaluate(AbstractBeforeAfterRule.java:45)
	at com.carrotsearch.randomizedtesting.rules.StatementAdapter.evaluate(StatementAdapter.java:36)
	at org.apache.lucene.util.TestRuleStoreClassName$1.evaluate(TestRuleStoreClassName.java:41)
	at com.carrotsearch.randomizedtesting.rules.NoShadowingOrOverridesOnMethodsRule$1.evaluate(NoShadowingOrOverridesOnMethodsRule.java:40)
	at com.carrotsearch.randomizedtesting.rules.NoShadowingOrOverridesOnMethodsRule$1.evaluate(NoShadowingOrOverridesOnMethodsRule.java:40)
	at com.carrotsearch.randomizedtesting.rules.StatementAdapter.evaluate(StatementAdapter.java:36)
	at com.carrotsearch.randomizedtesting.rules.StatementAdapter.evaluate(StatementAdapter.java:36)
	at com.carrotsearch.randomizedtesting.rules.StatementAdapter.evaluate(StatementAdapter.java:36)
	at org.apache.lucene.util.TestRuleAssertionsRequired$1.evaluate(TestRuleAssertionsRequired.java:53)
	at org.apache.lucene.util.TestRuleMarkFailure$1.evaluate(TestRuleMarkFailure.java:47)
	at org.apache.lucene.util.TestRuleIgnoreAfterMaxFailures$1.evaluate(TestRuleIgnoreAfterMaxFailures.java:64)
	at org.apache.lucene.util.TestRuleIgnoreTestSuites$1.evaluate(TestRuleIgnoreTestSuites.java:54)
	at com.carrotsearch.randomizedtesting.rules.StatementAdapter.evaluate(StatementAdapter.java:36)
	at com.carrotsearch.randomizedtesting.ThreadLeakControl$StatementRunner.run(ThreadLeakControl.java:367)
	at java.lang.Thread.run(Thread.java:745)




Build Log:
[...truncated 510 lines...]
   [junit4] Suite: org.apache.lucene.index.TestExitableDirectoryReader
   [junit4]   2> NOTE: reproduce with: ant test  -Dtestcase=TestExitableDirectoryReader
-Dtests.method=testExitableFilterIndexReader -Dtests.seed=D6EF1155738BC28C -Dtests.multiplier=3
-Dtests.slow=true -Dtests.locale=es-CR -Dtests.timezone=MST -Dtests.asserts=true -Dtests.file.encoding=UTF-8
   [junit4] ERROR   1.62s J0 | TestExitableDirectoryReader.testExitableFilterIndexReader <<<
   [junit4]    > Throwable #1: org.apache.lucene.index.ExitableDirectoryReader$ExitingReaderException:
The request took too long to iterate over terms. Timeout: timeoutAt: 630063179252163 (System.nanoTime():
630063780028938), TermsEnum=org.apache.lucene.codecs.blocktree.SegmentTermsEnum@1cc8ad4
   [junit4]    > 	at __randomizedtesting.SeedInfo.seed([D6EF1155738BC28C:6E8ABC1418514B75]:0)
   [junit4]    > 	at org.apache.lucene.index.ExitableDirectoryReader$ExitableTermsEnum.checkAndThrow(ExitableDirectoryReader.java:173)
   [junit4]    > 	at org.apache.lucene.index.ExitableDirectoryReader$ExitableTermsEnum.<init>(ExitableDirectoryReader.java:163)
   [junit4]    > 	at org.apache.lucene.index.ExitableDirectoryReader$ExitableTerms.iterator(ExitableDirectoryReader.java:147)
   [junit4]    > 	at org.apache.lucene.index.FilterLeafReader$FilterTerms.iterator(FilterLeafReader.java:113)
   [junit4]    > 	at org.apache.lucene.index.TestExitableDirectoryReader$TestReader$TestTerms.iterator(TestExitableDirectoryReader.java:58)
   [junit4]    > 	at org.apache.lucene.index.Terms.intersect(Terms.java:72)
   [junit4]    > 	at org.apache.lucene.util.automaton.CompiledAutomaton.getTermsEnum(CompiledAutomaton.java:336)
   [junit4]    > 	at org.apache.lucene.search.AutomatonQuery.getTermsEnum(AutomatonQuery.java:107)
   [junit4]    > 	at org.apache.lucene.search.MultiTermQuery.getTermsEnum(MultiTermQuery.java:304)
   [junit4]    > 	at org.apache.lucene.search.MultiTermQueryConstantScoreWrapper$1.rewrite(MultiTermQueryConstantScoreWrapper.java:148)
   [junit4]    > 	at org.apache.lucene.search.MultiTermQueryConstantScoreWrapper$1.bulkScorer(MultiTermQueryConstantScoreWrapper.java:201)
   [junit4]    > 	at org.apache.lucene.search.IndexSearcher.search(IndexSearcher.java:666)
   [junit4]    > 	at org.apache.lucene.search.IndexSearcher.search(IndexSearcher.java:473)
   [junit4]    > 	at org.apache.lucene.search.IndexSearcher.search(IndexSearcher.java:592)
   [junit4]    > 	at org.apache.lucene.search.IndexSearcher.searchAfter(IndexSearcher.java:450)
   [junit4]    > 	at org.apache.lucene.search.IndexSearcher.search(IndexSearcher.java:461)
   [junit4]    > 	at org.apache.lucene.index.TestExitableDirectoryReader.testExitableFilterIndexReader(TestExitableDirectoryReader.java:128)
   [junit4]    > 	at java.lang.Thread.run(Thread.java:745)
   [junit4]   2> NOTE: test params are: codec=HighCompressionCompressingStoredFields(storedFieldsFormat=CompressingStoredFieldsFormat(compressionMode=HIGH_COMPRESSION,
chunkSize=6, maxDocsPerChunk=527, blockSize=1), termVectorsFormat=CompressingTermVectorsFormat(compressionMode=HIGH_COMPRESSION,
chunkSize=6, blockSize=1)), sim=RandomSimilarity(queryNorm=true,coord=no): {default=DFR I(ne)1},
locale=es-CR, timezone=MST
   [junit4]   2> NOTE: Linux 4.4.0-21-generic i386/Oracle Corporation 1.8.0_92 (32-bit)/cpus=12,threads=1,free=270212296,total=339738624
   [junit4]   2> NOTE: All tests run in this JVM: [TestMultiTermQueryRewrites, TestLucene53NormsFormat,
TestSubScorerFreqs, TestNoDeletionPolicy, TestIndexWriterOutOfFileDescriptors, TestTerm, TestNGramPhraseQuery,
TestQueryRescorer, TestAutomaton, Test2BTerms, TestPersistentSnapshotDeletionPolicy, Test2BBKDPoints,
TestHighCompressionMode, TestIndexWriterUnicode, TestSizeBoundedForceMerge, TestDeterminizeLexicon,
TestIndexWriterCommit, TestCodecUtil, TestNoMergePolicy, TestVirtualMethod, TestLucene50CompoundFormat,
TestMmapDirectory, TestExitableDirectoryReader]
   [junit4] Completed [87/419 (1!)] on J0 in 1.63s, 1 test, 1 error <<< FAILURES!

[...truncated 1107 lines...]
BUILD FAILED
/home/jenkins/workspace/Lucene-Solr-6.x-Linux/build.xml:740: The following error occurred
while executing this line:
/home/jenkins/workspace/Lucene-Solr-6.x-Linux/build.xml:684: The following error occurred
while executing this line:
/home/jenkins/workspace/Lucene-Solr-6.x-Linux/build.xml:59: The following error occurred while
executing this line:
/home/jenkins/workspace/Lucene-Solr-6.x-Linux/lucene/build.xml:50: The following error occurred
while executing this line:
/home/jenkins/workspace/Lucene-Solr-6.x-Linux/lucene/common-build.xml:1457: The following
error occurred while executing this line:
/home/jenkins/workspace/Lucene-Solr-6.x-Linux/lucene/common-build.xml:1014: There were test
failures: 419 suites (1 ignored), 3506 tests, 1 error, 67 ignored (63 assumptions) [seed:
D6EF1155738BC28C]

Total time: 8 minutes 38 seconds
Build step 'Invoke Ant' marked build as failure
Archiving artifacts
[WARNINGS] Skipping publisher since build result is FAILURE
Recording test results
Email was triggered for: Failure - Any
Sending email for trigger: Failure - Any



Mime
View raw message