lucene-dev mailing list archives

Site index · List index
Message view « Date » · « Thread »
Top « Date » · « Thread »
From Policeman Jenkins Server <jenk...@thetaphi.de>
Subject [JENKINS] Lucene-Solr-5.5-Linux (64bit/jdk1.7.0_80) - Build # 266 - Still Failing!
Date Thu, 05 May 2016 21:13:12 GMT
Build: http://jenkins.thetaphi.de/job/Lucene-Solr-5.5-Linux/266/
Java: 64bit/jdk1.7.0_80 -XX:+UseCompressedOops -XX:+UseSerialGC

1 tests failed.
FAILED:  org.apache.solr.schema.TestManagedSchemaAPI.test

Error Message:
Error from server at http://127.0.0.1:36313/solr/testschemaapi_shard1_replica1: ERROR: [doc=2] unknown field 'myNewField1'

Stack Trace:
org.apache.solr.client.solrj.impl.CloudSolrClient$RouteException: Error from server at http://127.0.0.1:36313/solr/testschemaapi_shard1_replica1: ERROR: [doc=2] unknown field 'myNewField1'
	at __randomizedtesting.SeedInfo.seed([91AE8EA7EC777680:19FAB17D428B1B78]:0)
	at org.apache.solr.client.solrj.impl.CloudSolrClient.directUpdate(CloudSolrClient.java:632)
	at org.apache.solr.client.solrj.impl.CloudSolrClient.sendRequest(CloudSolrClient.java:981)
	at org.apache.solr.client.solrj.impl.CloudSolrClient.requestWithRetryOnStaleState(CloudSolrClient.java:870)
	at org.apache.solr.client.solrj.impl.CloudSolrClient.request(CloudSolrClient.java:806)
	at org.apache.solr.schema.TestManagedSchemaAPI.testAddFieldAndDocument(TestManagedSchemaAPI.java:101)
	at org.apache.solr.schema.TestManagedSchemaAPI.test(TestManagedSchemaAPI.java:69)
	at sun.reflect.NativeMethodAccessorImpl.invoke0(Native Method)
	at sun.reflect.NativeMethodAccessorImpl.invoke(NativeMethodAccessorImpl.java:57)
	at sun.reflect.DelegatingMethodAccessorImpl.invoke(DelegatingMethodAccessorImpl.java:43)
	at java.lang.reflect.Method.invoke(Method.java:606)
	at com.carrotsearch.randomizedtesting.RandomizedRunner.invoke(RandomizedRunner.java:1764)
	at com.carrotsearch.randomizedtesting.RandomizedRunner$8.evaluate(RandomizedRunner.java:871)
	at com.carrotsearch.randomizedtesting.RandomizedRunner$9.evaluate(RandomizedRunner.java:907)
	at com.carrotsearch.randomizedtesting.RandomizedRunner$10.evaluate(RandomizedRunner.java:921)
	at com.carrotsearch.randomizedtesting.rules.SystemPropertiesRestoreRule$1.evaluate(SystemPropertiesRestoreRule.java:57)
	at org.apache.lucene.util.TestRuleSetupTeardownChained$1.evaluate(TestRuleSetupTeardownChained.java:49)
	at org.apache.lucene.util.AbstractBeforeAfterRule$1.evaluate(AbstractBeforeAfterRule.java:45)
	at org.apache.lucene.util.TestRuleThreadAndTestName$1.evaluate(TestRuleThreadAndTestName.java:48)
	at org.apache.lucene.util.TestRuleIgnoreAfterMaxFailures$1.evaluate(TestRuleIgnoreAfterMaxFailures.java:64)
	at org.apache.lucene.util.TestRuleMarkFailure$1.evaluate(TestRuleMarkFailure.java:47)
	at com.carrotsearch.randomizedtesting.rules.StatementAdapter.evaluate(StatementAdapter.java:36)
	at com.carrotsearch.randomizedtesting.ThreadLeakControl$StatementRunner.run(ThreadLeakControl.java:367)
	at com.carrotsearch.randomizedtesting.ThreadLeakControl.forkTimeoutingTask(ThreadLeakControl.java:809)
	at com.carrotsearch.randomizedtesting.ThreadLeakControl$3.evaluate(ThreadLeakControl.java:460)
	at com.carrotsearch.randomizedtesting.RandomizedRunner.runSingleTest(RandomizedRunner.java:880)
	at com.carrotsearch.randomizedtesting.RandomizedRunner$5.evaluate(RandomizedRunner.java:781)
	at com.carrotsearch.randomizedtesting.RandomizedRunner$6.evaluate(RandomizedRunner.java:816)
	at com.carrotsearch.randomizedtesting.RandomizedRunner$7.evaluate(RandomizedRunner.java:827)
	at com.carrotsearch.randomizedtesting.rules.StatementAdapter.evaluate(StatementAdapter.java:36)
	at com.carrotsearch.randomizedtesting.rules.SystemPropertiesRestoreRule$1.evaluate(SystemPropertiesRestoreRule.java:57)
	at org.apache.lucene.util.AbstractBeforeAfterRule$1.evaluate(AbstractBeforeAfterRule.java:45)
	at com.carrotsearch.randomizedtesting.rules.StatementAdapter.evaluate(StatementAdapter.java:36)
	at org.apache.lucene.util.TestRuleStoreClassName$1.evaluate(TestRuleStoreClassName.java:41)
	at com.carrotsearch.randomizedtesting.rules.NoShadowingOrOverridesOnMethodsRule$1.evaluate(NoShadowingOrOverridesOnMethodsRule.java:40)
	at com.carrotsearch.randomizedtesting.rules.NoShadowingOrOverridesOnMethodsRule$1.evaluate(NoShadowingOrOverridesOnMethodsRule.java:40)
	at com.carrotsearch.randomizedtesting.rules.StatementAdapter.evaluate(StatementAdapter.java:36)
	at com.carrotsearch.randomizedtesting.rules.StatementAdapter.evaluate(StatementAdapter.java:36)
	at com.carrotsearch.randomizedtesting.rules.StatementAdapter.evaluate(StatementAdapter.java:36)
	at org.apache.lucene.util.TestRuleAssertionsRequired$1.evaluate(TestRuleAssertionsRequired.java:53)
	at org.apache.lucene.util.TestRuleMarkFailure$1.evaluate(TestRuleMarkFailure.java:47)
	at org.apache.lucene.util.TestRuleIgnoreAfterMaxFailures$1.evaluate(TestRuleIgnoreAfterMaxFailures.java:64)
	at org.apache.lucene.util.TestRuleIgnoreTestSuites$1.evaluate(TestRuleIgnoreTestSuites.java:54)
	at com.carrotsearch.randomizedtesting.rules.StatementAdapter.evaluate(StatementAdapter.java:36)
	at com.carrotsearch.randomizedtesting.ThreadLeakControl$StatementRunner.run(ThreadLeakControl.java:367)
	at java.lang.Thread.run(Thread.java:745)
Caused by: org.apache.solr.client.solrj.impl.HttpSolrClient$RemoteSolrException: Error from server at http://127.0.0.1:36313/solr/testschemaapi_shard1_replica1: ERROR: [doc=2] unknown field 'myNewField1'
	at org.apache.solr.client.solrj.impl.HttpSolrClient.executeMethod(HttpSolrClient.java:577)
	at org.apache.solr.client.solrj.impl.HttpSolrClient.request(HttpSolrClient.java:241)
	at org.apache.solr.client.solrj.impl.HttpSolrClient.request(HttpSolrClient.java:230)
	at org.apache.solr.client.solrj.impl.LBHttpSolrClient.doRequest(LBHttpSolrClient.java:372)
	at org.apache.solr.client.solrj.impl.LBHttpSolrClient.request(LBHttpSolrClient.java:325)
	at org.apache.solr.client.solrj.impl.CloudSolrClient$2.call(CloudSolrClient.java:607)
	at org.apache.solr.client.solrj.impl.CloudSolrClient$2.call(CloudSolrClient.java:604)
	at java.util.concurrent.FutureTask.run(FutureTask.java:262)
	at org.apache.solr.common.util.ExecutorUtil$MDCAwareThreadPoolExecutor$1.run(ExecutorUtil.java:231)
	at java.util.concurrent.ThreadPoolExecutor.runWorker(ThreadPoolExecutor.java:1145)
	at java.util.concurrent.ThreadPoolExecutor$Worker.run(ThreadPoolExecutor.java:615)
	... 1 more




Build Log:
[...truncated 11249 lines...]
   [junit4] Suite: org.apache.solr.schema.TestManagedSchemaAPI
   [junit4]   2> Creating dataDir: /home/jenkins/workspace/Lucene-Solr-5.5-Linux/solr/build/solr-core/test/J2/temp/solr.schema.TestManagedSchemaAPI_91AE8EA7EC777680-001/init-core-data-001
   [junit4]   2> 950183 INFO  (SUITE-TestManagedSchemaAPI-seed#[91AE8EA7EC777680]-worker) [    ] o.a.s.SolrTestCaseJ4 Randomized ssl (false) and clientAuth (false)
   [junit4]   2> 950185 INFO  (TEST-TestManagedSchemaAPI.test-seed#[91AE8EA7EC777680]) [    ] o.a.s.SolrTestCaseJ4 ###Starting test
   [junit4]   2> 950186 INFO  (TEST-TestManagedSchemaAPI.test-seed#[91AE8EA7EC777680]) [    ] o.a.s.c.ZkTestServer STARTING ZK TEST SERVER
   [junit4]   2> 950186 INFO  (Thread-2631) [    ] o.a.s.c.ZkTestServer client port:0.0.0.0/0.0.0.0:0
   [junit4]   2> 950186 INFO  (Thread-2631) [    ] o.a.s.c.ZkTestServer Starting server
   [junit4]   2> 950286 INFO  (TEST-TestManagedSchemaAPI.test-seed#[91AE8EA7EC777680]) [    ] o.a.s.c.ZkTestServer start zk server on port:32973
   [junit4]   2> 950286 INFO  (TEST-TestManagedSchemaAPI.test-seed#[91AE8EA7EC777680]) [    ] o.a.s.c.c.SolrZkClient Using default ZkCredentialsProvider
   [junit4]   2> 950287 INFO  (TEST-TestManagedSchemaAPI.test-seed#[91AE8EA7EC777680]) [    ] o.a.s.c.c.ConnectionManager Waiting for client to connect to ZooKeeper
   [junit4]   2> 950288 INFO  (zkCallback-1239-thread-1) [    ] o.a.s.c.c.ConnectionManager Watcher org.apache.solr.common.cloud.ConnectionManager@49374fa9 name:ZooKeeperConnection Watcher:127.0.0.1:32973 got event WatchedEvent state:SyncConnected type:None path:null path:null type:None
   [junit4]   2> 950288 INFO  (TEST-TestManagedSchemaAPI.test-seed#[91AE8EA7EC777680]) [    ] o.a.s.c.c.ConnectionManager Client is connected to ZooKeeper
   [junit4]   2> 950288 INFO  (TEST-TestManagedSchemaAPI.test-seed#[91AE8EA7EC777680]) [    ] o.a.s.c.c.SolrZkClient Using default ZkACLProvider
   [junit4]   2> 950288 INFO  (TEST-TestManagedSchemaAPI.test-seed#[91AE8EA7EC777680]) [    ] o.a.s.c.c.SolrZkClient makePath: /solr/solr.xml
   [junit4]   2> 950290 INFO  (jetty-launcher-1238-thread-1) [    ] o.e.j.s.Server jetty-9.2.13.v20150730
   [junit4]   2> 950291 INFO  (jetty-launcher-1238-thread-2) [    ] o.e.j.s.Server jetty-9.2.13.v20150730
   [junit4]   2> 950291 INFO  (jetty-launcher-1238-thread-1) [    ] o.e.j.s.h.ContextHandler Started o.e.j.s.ServletContextHandler@25502d30{/solr,null,AVAILABLE}
   [junit4]   2> 950292 INFO  (jetty-launcher-1238-thread-2) [    ] o.e.j.s.h.ContextHandler Started o.e.j.s.ServletContextHandler@5f72b16d{/solr,null,AVAILABLE}
   [junit4]   2> 950292 INFO  (jetty-launcher-1238-thread-1) [    ] o.e.j.s.ServerConnector Started ServerConnector@1a3065e9{HTTP/1.1}{127.0.0.1:36313}
   [junit4]   2> 950292 INFO  (jetty-launcher-1238-thread-1) [    ] o.e.j.s.Server Started @952366ms
   [junit4]   2> 950292 INFO  (jetty-launcher-1238-thread-1) [    ] o.a.s.c.s.e.JettySolrRunner Jetty properties: {hostPort=36313, hostContext=/solr}
   [junit4]   2> 950292 INFO  (jetty-launcher-1238-thread-2) [    ] o.e.j.s.ServerConnector Started ServerConnector@58fa3188{HTTP/1.1}{127.0.0.1:41096}
   [junit4]   2> 950292 INFO  (jetty-launcher-1238-thread-2) [    ] o.e.j.s.Server Started @952366ms
   [junit4]   2> 950292 INFO  (jetty-launcher-1238-thread-1) [    ] o.a.s.s.SolrDispatchFilter SolrDispatchFilter.init(): sun.misc.Launcher$AppClassLoader@321ea24
   [junit4]   2> 950292 INFO  (jetty-launcher-1238-thread-2) [    ] o.a.s.c.s.e.JettySolrRunner Jetty properties: {hostContext=/solr, hostPort=41096}
   [junit4]   2> 950292 INFO  (jetty-launcher-1238-thread-1) [    ] o.a.s.c.SolrResourceLoader new SolrResourceLoader for directory: '/home/jenkins/workspace/Lucene-Solr-5.5-Linux/solr/build/solr-core/test/J2/temp/solr.schema.TestManagedSchemaAPI_91AE8EA7EC777680-001/tempDir-001/node1'
   [junit4]   2> 950292 INFO  (jetty-launcher-1238-thread-1) [    ] o.a.s.c.SolrResourceLoader JNDI not configured for solr (NoInitialContextEx)
   [junit4]   2> 950292 INFO  (jetty-launcher-1238-thread-1) [    ] o.a.s.c.SolrResourceLoader solr home defaulted to 'solr/' (could not find system property or JNDI)
   [junit4]   2> 950292 INFO  (jetty-launcher-1238-thread-2) [    ] o.a.s.s.SolrDispatchFilter SolrDispatchFilter.init(): sun.misc.Launcher$AppClassLoader@321ea24
   [junit4]   2> 950292 INFO  (jetty-launcher-1238-thread-2) [    ] o.a.s.c.SolrResourceLoader new SolrResourceLoader for directory: '/home/jenkins/workspace/Lucene-Solr-5.5-Linux/solr/build/solr-core/test/J2/temp/solr.schema.TestManagedSchemaAPI_91AE8EA7EC777680-001/tempDir-001/node2'
   [junit4]   2> 950292 INFO  (jetty-launcher-1238-thread-1) [    ] o.a.s.c.c.SolrZkClient Using default ZkCredentialsProvider
   [junit4]   2> 950292 INFO  (jetty-launcher-1238-thread-2) [    ] o.a.s.c.SolrResourceLoader JNDI not configured for solr (NoInitialContextEx)
   [junit4]   2> 950292 INFO  (jetty-launcher-1238-thread-2) [    ] o.a.s.c.SolrResourceLoader solr home defaulted to 'solr/' (could not find system property or JNDI)
   [junit4]   2> 950293 INFO  (jetty-launcher-1238-thread-2) [    ] o.a.s.c.c.SolrZkClient Using default ZkCredentialsProvider
   [junit4]   2> 950293 INFO  (jetty-launcher-1238-thread-1) [    ] o.a.s.c.c.ConnectionManager Waiting for client to connect to ZooKeeper
   [junit4]   2> 950293 INFO  (jetty-launcher-1238-thread-2) [    ] o.a.s.c.c.ConnectionManager Waiting for client to connect to ZooKeeper
   [junit4]   2> 950294 INFO  (zkCallback-1240-thread-1) [    ] o.a.s.c.c.ConnectionManager Watcher org.apache.solr.common.cloud.ConnectionManager@474a931c name:ZooKeeperConnection Watcher:127.0.0.1:32973/solr got event WatchedEvent state:SyncConnected type:None path:null path:null type:None
   [junit4]   2> 950294 INFO  (jetty-launcher-1238-thread-1) [    ] o.a.s.c.c.ConnectionManager Client is connected to ZooKeeper
   [junit4]   2> 950294 INFO  (jetty-launcher-1238-thread-1) [    ] o.a.s.c.c.SolrZkClient Using default ZkACLProvider
   [junit4]   2> 950294 INFO  (zkCallback-1241-thread-1) [    ] o.a.s.c.c.ConnectionManager Watcher org.apache.solr.common.cloud.ConnectionManager@45cce767 name:ZooKeeperConnection Watcher:127.0.0.1:32973/solr got event WatchedEvent state:SyncConnected type:None path:null path:null type:None
   [junit4]   2> 950294 INFO  (jetty-launcher-1238-thread-2) [    ] o.a.s.c.c.ConnectionManager Client is connected to ZooKeeper
   [junit4]   2> 950294 INFO  (jetty-launcher-1238-thread-1) [    ] o.a.s.s.SolrDispatchFilter solr.xml found in ZooKeeper. Loading...
   [junit4]   2> 950294 INFO  (jetty-launcher-1238-thread-2) [    ] o.a.s.c.c.SolrZkClient Using default ZkACLProvider
   [junit4]   2> 950294 INFO  (jetty-launcher-1238-thread-2) [    ] o.a.s.s.SolrDispatchFilter solr.xml found in ZooKeeper. Loading...
   [junit4]   2> 950302 INFO  (jetty-launcher-1238-thread-1) [    ] o.a.s.c.CorePropertiesLocator Config-defined core root directory: /home/jenkins/workspace/Lucene-Solr-5.5-Linux/solr/build/solr-core/test/J2/temp/solr.schema.TestManagedSchemaAPI_91AE8EA7EC777680-001/tempDir-001/node1/.
   [junit4]   2> 950302 INFO  (jetty-launcher-1238-thread-2) [    ] o.a.s.c.CorePropertiesLocator Config-defined core root directory: /home/jenkins/workspace/Lucene-Solr-5.5-Linux/solr/build/solr-core/test/J2/temp/solr.schema.TestManagedSchemaAPI_91AE8EA7EC777680-001/tempDir-001/node2/.
   [junit4]   2> 950302 INFO  (jetty-launcher-1238-thread-1) [    ] o.a.s.c.CoreContainer New CoreContainer 1332150835
   [junit4]   2> 950303 INFO  (jetty-launcher-1238-thread-2) [    ] o.a.s.c.CoreContainer New CoreContainer 1942063870
   [junit4]   2> 950303 INFO  (jetty-launcher-1238-thread-1) [    ] o.a.s.c.CoreContainer Loading cores into CoreContainer [instanceDir=/home/jenkins/workspace/Lucene-Solr-5.5-Linux/solr/build/solr-core/test/J2/temp/solr.schema.TestManagedSchemaAPI_91AE8EA7EC777680-001/tempDir-001/node1]
   [junit4]   2> 950303 INFO  (jetty-launcher-1238-thread-2) [    ] o.a.s.c.CoreContainer Loading cores into CoreContainer [instanceDir=/home/jenkins/workspace/Lucene-Solr-5.5-Linux/solr/build/solr-core/test/J2/temp/solr.schema.TestManagedSchemaAPI_91AE8EA7EC777680-001/tempDir-001/node2]
   [junit4]   2> 950302 WARN  (NIOServerCxn.Factory:0.0.0.0/0.0.0.0:0) [    ] o.a.z.s.NIOServerCnxn caught end of stream exception
   [junit4]   2> EndOfStreamException: Unable to read additional data from client sessionid 0x15482b444620002, likely client has closed socket
   [junit4]   2> 	at org.apache.zookeeper.server.NIOServerCnxn.doIO(NIOServerCnxn.java:228)
   [junit4]   2> 	at org.apache.zookeeper.server.NIOServerCnxnFactory.run(NIOServerCnxnFactory.java:208)
   [junit4]   2> 	at java.lang.Thread.run(Thread.java:745)
   [junit4]   2> 950303 WARN  (jetty-launcher-1238-thread-2) [    ] o.a.s.c.CoreContainer Couldn't add files from /home/jenkins/workspace/Lucene-Solr-5.5-Linux/solr/build/solr-core/test/J2/temp/solr.schema.TestManagedSchemaAPI_91AE8EA7EC777680-001/tempDir-001/node2/lib to classpath: /home/jenkins/workspace/Lucene-Solr-5.5-Linux/solr/build/solr-core/test/J2/temp/solr.schema.TestManagedSchemaAPI_91AE8EA7EC777680-001/tempDir-001/node2/lib
   [junit4]   2> 950303 WARN  (jetty-launcher-1238-thread-1) [    ] o.a.s.c.CoreContainer Couldn't add files from /home/jenkins/workspace/Lucene-Solr-5.5-Linux/solr/build/solr-core/test/J2/temp/solr.schema.TestManagedSchemaAPI_91AE8EA7EC777680-001/tempDir-001/node1/lib to classpath: /home/jenkins/workspace/Lucene-Solr-5.5-Linux/solr/build/solr-core/test/J2/temp/solr.schema.TestManagedSchemaAPI_91AE8EA7EC777680-001/tempDir-001/node1/lib
   [junit4]   2> 950303 INFO  (jetty-launcher-1238-thread-2) [    ] o.a.s.h.c.HttpShardHandlerFactory created with socketTimeout : 90000,urlScheme : ,connTimeout : 15000,maxConnectionsPerHost : 20,maxConnections : 10000,corePoolSize : 0,maximumPoolSize : 2147483647,maxThreadIdleTime : 5,sizeOfQueue : -1,fairnessPolicy : false,useRetries : false,
   [junit4]   2> 950303 INFO  (jetty-launcher-1238-thread-1) [    ] o.a.s.h.c.HttpShardHandlerFactory created with socketTimeout : 90000,urlScheme : ,connTimeout : 15000,maxConnectionsPerHost : 20,maxConnections : 10000,corePoolSize : 0,maximumPoolSize : 2147483647,maxThreadIdleTime : 5,sizeOfQueue : -1,fairnessPolicy : false,useRetries : false,
   [junit4]   2> 950304 INFO  (jetty-launcher-1238-thread-1) [    ] o.a.s.u.UpdateShardHandler Creating UpdateShardHandler HTTP client with params: socketTimeout=340000&connTimeout=45000&retry=true
   [junit4]   2> 950304 INFO  (jetty-launcher-1238-thread-2) [    ] o.a.s.u.UpdateShardHandler Creating UpdateShardHandler HTTP client with params: socketTimeout=340000&connTimeout=45000&retry=true
   [junit4]   2> 950304 INFO  (jetty-launcher-1238-thread-1) [    ] o.a.s.l.LogWatcher SLF4J impl is org.slf4j.impl.Log4jLoggerFactory
   [junit4]   2> 950304 INFO  (jetty-launcher-1238-thread-2) [    ] o.a.s.l.LogWatcher SLF4J impl is org.slf4j.impl.Log4jLoggerFactory
   [junit4]   2> 950304 INFO  (jetty-launcher-1238-thread-1) [    ] o.a.s.l.LogWatcher Registering Log Listener [Log4j (org.slf4j.impl.Log4jLoggerFactory)]
   [junit4]   2> 950304 INFO  (jetty-launcher-1238-thread-2) [    ] o.a.s.l.LogWatcher Registering Log Listener [Log4j (org.slf4j.impl.Log4jLoggerFactory)]
   [junit4]   2> 950304 INFO  (jetty-launcher-1238-thread-1) [    ] o.a.s.c.ZkContainer Zookeeper client=127.0.0.1:32973/solr
   [junit4]   2> 950304 INFO  (jetty-launcher-1238-thread-2) [    ] o.a.s.c.ZkContainer Zookeeper client=127.0.0.1:32973/solr
   [junit4]   2> 950304 INFO  (jetty-launcher-1238-thread-1) [    ] o.a.s.c.ZkController zkHost includes chroot
   [junit4]   2> 950304 INFO  (jetty-launcher-1238-thread-2) [    ] o.a.s.c.ZkController zkHost includes chroot
   [junit4]   2> 950304 INFO  (jetty-launcher-1238-thread-1) [    ] o.a.s.c.c.SolrZkClient Using default ZkCredentialsProvider
   [junit4]   2> 950304 INFO  (jetty-launcher-1238-thread-2) [    ] o.a.s.c.c.SolrZkClient Using default ZkCredentialsProvider
   [junit4]   2> 950306 INFO  (jetty-launcher-1238-thread-1) [    ] o.a.s.c.c.ConnectionManager Waiting for client to connect to ZooKeeper
   [junit4]   2> 950306 INFO  (jetty-launcher-1238-thread-2) [    ] o.a.s.c.c.ConnectionManager Waiting for client to connect to ZooKeeper
   [junit4]   2> 950307 INFO  (zkCallback-1246-thread-1) [    ] o.a.s.c.c.ConnectionManager Watcher org.apache.solr.common.cloud.ConnectionManager@3a3355e9 name:ZooKeeperConnection Watcher:127.0.0.1:32973 got event WatchedEvent state:SyncConnected type:None path:null path:null type:None
   [junit4]   2> 950307 INFO  (jetty-launcher-1238-thread-1) [    ] o.a.s.c.c.ConnectionManager Client is connected to ZooKeeper
   [junit4]   2> 950307 INFO  (zkCallback-1247-thread-1) [    ] o.a.s.c.c.ConnectionManager Watcher org.apache.solr.common.cloud.ConnectionManager@16e19947 name:ZooKeeperConnection Watcher:127.0.0.1:32973 got event WatchedEvent state:SyncConnected type:None path:null path:null type:None
   [junit4]   2> 950307 INFO  (jetty-launcher-1238-thread-1) [    ] o.a.s.c.c.SolrZkClient Using default ZkACLProvider
   [junit4]   2> 950307 INFO  (jetty-launcher-1238-thread-2) [    ] o.a.s.c.c.ConnectionManager Client is connected to ZooKeeper
   [junit4]   2> 950307 INFO  (jetty-launcher-1238-thread-2) [    ] o.a.s.c.c.SolrZkClient Using default ZkACLProvider
   [junit4]   2> 950307 INFO  (jetty-launcher-1238-thread-1) [n:127.0.0.1:36313_solr    ] o.a.s.c.ZkController Added new OnReconnect listener org.apache.solr.cloud.ZkController$6@53e41049
   [junit4]   2> 950307 INFO  (jetty-launcher-1238-thread-2) [n:127.0.0.1:41096_solr    ] o.a.s.c.ZkController Added new OnReconnect listener org.apache.solr.cloud.ZkController$6@1ad54770
   [junit4]   2> 950307 INFO  (jetty-launcher-1238-thread-1) [n:127.0.0.1:36313_solr    ] o.a.s.c.c.ConnectionManager Waiting for client to connect to ZooKeeper
   [junit4]   2> 950308 INFO  (jetty-launcher-1238-thread-2) [n:127.0.0.1:41096_solr    ] o.a.s.c.c.ConnectionManager Waiting for client to connect to ZooKeeper
   [junit4]   2> 950308 INFO  (zkCallback-1248-thread-1-processing-n:127.0.0.1:36313_solr) [n:127.0.0.1:36313_solr    ] o.a.s.c.c.ConnectionManager Watcher org.apache.solr.common.cloud.ConnectionManager@6593ab09 name:ZooKeeperConnection Watcher:127.0.0.1:32973/solr got event WatchedEvent state:SyncConnected type:None path:null path:null type:None
   [junit4]   2> 950308 INFO  (jetty-launcher-1238-thread-1) [n:127.0.0.1:36313_solr    ] o.a.s.c.c.ConnectionManager Client is connected to ZooKeeper
   [junit4]   2> 950308 INFO  (zkCallback-1249-thread-1-processing-n:127.0.0.1:41096_solr) [n:127.0.0.1:41096_solr    ] o.a.s.c.c.ConnectionManager Watcher org.apache.solr.common.cloud.ConnectionManager@7b173096 name:ZooKeeperConnection Watcher:127.0.0.1:32973/solr got event WatchedEvent state:SyncConnected type:None path:null path:null type:None
   [junit4]   2> 950308 INFO  (jetty-launcher-1238-thread-2) [n:127.0.0.1:41096_solr    ] o.a.s.c.c.ConnectionManager Client is connected to ZooKeeper
   [junit4]   2> 950309 INFO  (jetty-launcher-1238-thread-1) [n:127.0.0.1:36313_solr    ] o.a.s.c.c.SolrZkClient makePath: /overseer/queue
   [junit4]   2> 950309 INFO  (jetty-launcher-1238-thread-2) [n:127.0.0.1:41096_solr    ] o.a.s.c.c.SolrZkClient makePath: /overseer/queue
   [junit4]   2> 950309 INFO  (jetty-launcher-1238-thread-2) [n:127.0.0.1:41096_solr    ] o.a.s.c.c.SolrZkClient makePath: /overseer/collection-queue-work
   [junit4]   2> 950309 INFO  (jetty-launcher-1238-thread-1) [n:127.0.0.1:36313_solr    ] o.a.s.c.c.SolrZkClient makePath: /overseer/collection-queue-work
   [junit4]   2> 950310 INFO  (jetty-launcher-1238-thread-1) [n:127.0.0.1:36313_solr    ] o.a.s.c.c.SolrZkClient makePath: /overseer/collection-map-running
   [junit4]   2> 950310 INFO  (jetty-launcher-1238-thread-2) [n:127.0.0.1:41096_solr    ] o.a.s.c.c.SolrZkClient makePath: /overseer/collection-map-running
   [junit4]   2> 950311 INFO  (jetty-launcher-1238-thread-2) [n:127.0.0.1:41096_solr    ] o.a.s.c.c.SolrZkClient makePath: /overseer/collection-map-completed
   [junit4]   2> 950311 INFO  (jetty-launcher-1238-thread-1) [n:127.0.0.1:36313_solr    ] o.a.s.c.c.SolrZkClient makePath: /overseer/collection-map-completed
   [junit4]   2> 950311 INFO  (jetty-launcher-1238-thread-1) [n:127.0.0.1:36313_solr    ] o.a.s.c.c.SolrZkClient makePath: /overseer/collection-map-failure
   [junit4]   2> 950311 INFO  (jetty-launcher-1238-thread-2) [n:127.0.0.1:41096_solr    ] o.a.s.c.c.SolrZkClient makePath: /overseer/collection-map-failure
   [junit4]   2> 950312 INFO  (jetty-launcher-1238-thread-2) [n:127.0.0.1:41096_solr    ] o.a.s.c.c.SolrZkClient makePath: /live_nodes
   [junit4]   2> 950312 INFO  (jetty-launcher-1238-thread-1) [n:127.0.0.1:36313_solr    ] o.a.s.c.c.SolrZkClient makePath: /live_nodes
   [junit4]   2> 950312 INFO  (jetty-launcher-1238-thread-1) [n:127.0.0.1:36313_solr    ] o.a.s.c.c.SolrZkClient makePath: /collections
   [junit4]   2> 950312 INFO  (jetty-launcher-1238-thread-2) [n:127.0.0.1:41096_solr    ] o.a.s.c.c.SolrZkClient makePath: /collections
   [junit4]   2> 950312 INFO  (jetty-launcher-1238-thread-2) [n:127.0.0.1:41096_solr    ] o.a.s.c.c.SolrZkClient makePath: /aliases.json
   [junit4]   2> 950312 INFO  (jetty-launcher-1238-thread-1) [n:127.0.0.1:36313_solr    ] o.a.s.c.c.SolrZkClient makePath: /aliases.json
   [junit4]   2> 950313 INFO  (jetty-launcher-1238-thread-1) [n:127.0.0.1:36313_solr    ] o.a.s.c.c.SolrZkClient makePath: /clusterstate.json
   [junit4]   2> 950313 INFO  (jetty-launcher-1238-thread-2) [n:127.0.0.1:41096_solr    ] o.a.s.c.c.SolrZkClient makePath: /clusterstate.json
   [junit4]   2> 950313 INFO  (jetty-launcher-1238-thread-2) [n:127.0.0.1:41096_solr    ] o.a.s.c.c.SolrZkClient makePath: /security.json
   [junit4]   2> 950313 INFO  (jetty-launcher-1238-thread-1) [n:127.0.0.1:36313_solr    ] o.a.s.c.c.SolrZkClient makePath: /security.json
   [junit4]   2> 950313 INFO  (jetty-launcher-1238-thread-1) [n:127.0.0.1:36313_solr    ] o.a.s.c.ZkController Register node as live in ZooKeeper:/live_nodes/127.0.0.1:36313_solr
   [junit4]   2> 950313 INFO  (jetty-launcher-1238-thread-2) [n:127.0.0.1:41096_solr    ] o.a.s.c.ZkController Register node as live in ZooKeeper:/live_nodes/127.0.0.1:41096_solr
   [junit4]   2> 950314 INFO  (jetty-launcher-1238-thread-1) [n:127.0.0.1:36313_solr    ] o.a.s.c.c.SolrZkClient makePath: /live_nodes/127.0.0.1:36313_solr
   [junit4]   2> 950314 INFO  (jetty-launcher-1238-thread-2) [n:127.0.0.1:41096_solr    ] o.a.s.c.c.SolrZkClient makePath: /live_nodes/127.0.0.1:41096_solr
   [junit4]   2> 950314 INFO  (jetty-launcher-1238-thread-1) [n:127.0.0.1:36313_solr    ] o.a.s.c.c.SolrZkClient makePath: /overseer_elect
   [junit4]   2> 950314 INFO  (jetty-launcher-1238-thread-2) [n:127.0.0.1:41096_solr    ] o.a.s.c.c.SolrZkClient makePath: /overseer_elect
   [junit4]   2> 950314 INFO  (jetty-launcher-1238-thread-2) [n:127.0.0.1:41096_solr    ] o.a.s.c.c.SolrZkClient makePath: /overseer_elect/election
   [junit4]   2> 950314 INFO  (jetty-launcher-1238-thread-1) [n:127.0.0.1:36313_solr    ] o.a.s.c.c.SolrZkClient makePath: /overseer_elect/election
   [junit4]   2> 950315 INFO  (jetty-launcher-1238-thread-2) [n:127.0.0.1:41096_solr    ] o.a.s.c.Overseer Overseer (id=null) closing
   [junit4]   2> 950315 INFO  (jetty-launcher-1238-thread-1) [n:127.0.0.1:36313_solr    ] o.a.s.c.Overseer Overseer (id=null) closing
   [junit4]   2> 950315 INFO  (jetty-launcher-1238-thread-2) [n:127.0.0.1:41096_solr    ] o.a.s.c.LeaderElector Joined leadership election with path: /overseer_elect/election/95845202834620422-127.0.0.1:41096_solr-n_0000000000
   [junit4]   2> 950315 INFO  (jetty-launcher-1238-thread-1) [n:127.0.0.1:36313_solr    ] o.a.s.c.LeaderElector Joined leadership election with path: /overseer_elect/election/95845202834620421-127.0.0.1:36313_solr-n_0000000001
   [junit4]   2> 950315 INFO  (jetty-launcher-1238-thread-2) [n:127.0.0.1:41096_solr    ] o.a.s.c.OverseerElectionContext I am going to be the leader 127.0.0.1:41096_solr
   [junit4]   2> 950315 INFO  (jetty-launcher-1238-thread-2) [n:127.0.0.1:41096_solr    ] o.a.s.c.c.SolrZkClient makePath: /overseer_elect/leader
   [junit4]   2> 950315 INFO  (jetty-launcher-1238-thread-1) [n:127.0.0.1:36313_solr    ] o.a.s.c.LeaderElector Watching path /overseer_elect/election/95845202834620422-127.0.0.1:41096_solr-n_0000000000 to know if I could be the leader
   [junit4]   2> 950315 INFO  (jetty-launcher-1238-thread-1) [n:127.0.0.1:36313_solr    ] o.a.s.c.c.ZkStateReader Updating cluster state from ZooKeeper... 
   [junit4]   2> 950315 INFO  (jetty-launcher-1238-thread-2) [n:127.0.0.1:41096_solr    ] o.a.s.c.Overseer Overseer (id=95845202834620422-127.0.0.1:41096_solr-n_0000000000) starting
   [junit4]   2> 950316 INFO  (jetty-launcher-1238-thread-2) [n:127.0.0.1:41096_solr    ] o.a.s.c.c.SolrZkClient makePath: /overseer/queue-work
   [junit4]   2> 950319 INFO  (jetty-launcher-1238-thread-2) [n:127.0.0.1:41096_solr    ] o.a.s.c.OverseerAutoReplicaFailoverThread Starting OverseerAutoReplicaFailoverThread autoReplicaFailoverWorkLoopDelay=10000 autoReplicaFailoverWaitAfterExpiration=30000 autoReplicaFailoverBadNodeExpiration=60000
   [junit4]   2> 950319 INFO  (OverseerCollectionConfigSetProcessor-95845202834620422-127.0.0.1:41096_solr-n_0000000000) [n:127.0.0.1:41096_solr    ] o.a.s.c.OverseerTaskProcessor Process current queue of overseer operations
   [junit4]   2> 950319 INFO  (jetty-launcher-1238-thread-2) [n:127.0.0.1:41096_solr    ] o.a.s.c.c.ZkStateReader Updating cluster state from ZooKeeper... 
   [junit4]   2> 950319 INFO  (OverseerStateUpdate-95845202834620422-127.0.0.1:41096_solr-n_0000000000) [n:127.0.0.1:41096_solr    ] o.a.s.c.Overseer Starting to work on the main queue
   [junit4]   2> 950327 INFO  (jetty-launcher-1238-thread-1) [n:127.0.0.1:36313_solr    ] o.a.s.c.CoreContainer Security conf doesn't exist. Skipping setup for authorization module.
   [junit4]   2> 950327 INFO  (jetty-launcher-1238-thread-1) [n:127.0.0.1:36313_solr    ] o.a.s.c.CoreContainer No authentication plugin used.
   [junit4]   2> 950327 INFO  (jetty-launcher-1238-thread-1) [n:127.0.0.1:36313_solr    ] o.a.s.c.CorePropertiesLocator Looking for core definitions underneath /home/jenkins/workspace/Lucene-Solr-5.5-Linux/solr/build/solr-core/test/J2/temp/solr.schema.TestManagedSchemaAPI_91AE8EA7EC777680-001/tempDir-001/node1/.
   [junit4]   2> 950327 INFO  (jetty-launcher-1238-thread-1) [n:127.0.0.1:36313_solr    ] o.a.s.c.CorePropertiesLocator Found 0 core definitions
   [junit4]   2> 950328 INFO  (jetty-launcher-1238-thread-1) [n:127.0.0.1:36313_solr    ] o.a.s.s.SolrDispatchFilter user.dir=/home/jenkins/workspace/Lucene-Solr-5.5-Linux/solr/build/solr-core/test/J2
   [junit4]   2> 950328 INFO  (jetty-launcher-1238-thread-1) [n:127.0.0.1:36313_solr    ] o.a.s.s.SolrDispatchFilter SolrDispatchFilter.init() done
   [junit4]   2> 950342 INFO  (jetty-launcher-1238-thread-2) [n:127.0.0.1:41096_solr    ] o.a.s.c.CoreContainer Security conf doesn't exist. Skipping setup for authorization module.
   [junit4]   2> 950342 INFO  (jetty-launcher-1238-thread-2) [n:127.0.0.1:41096_solr    ] o.a.s.c.CoreContainer No authentication plugin used.
   [junit4]   2> 950343 INFO  (jetty-launcher-1238-thread-2) [n:127.0.0.1:41096_solr    ] o.a.s.c.CorePropertiesLocator Looking for core definitions underneath /home/jenkins/workspace/Lucene-Solr-5.5-Linux/solr/build/solr-core/test/J2/temp/solr.schema.TestManagedSchemaAPI_91AE8EA7EC777680-001/tempDir-001/node2/.
   [junit4]   2> 950343 INFO  (jetty-launcher-1238-thread-2) [n:127.0.0.1:41096_solr    ] o.a.s.c.CorePropertiesLocator Found 0 core definitions
   [junit4]   2> 950343 INFO  (jetty-launcher-1238-thread-2) [n:127.0.0.1:41096_solr    ] o.a.s.s.SolrDispatchFilter user.dir=/home/jenkins/workspace/Lucene-Solr-5.5-Linux/solr/build/solr-core/test/J2
   [junit4]   2> 950343 INFO  (jetty-launcher-1238-thread-2) [n:127.0.0.1:41096_solr    ] o.a.s.s.SolrDispatchFilter SolrDispatchFilter.init() done
   [junit4]   2> 950343 INFO  (TEST-TestManagedSchemaAPI.test-seed#[91AE8EA7EC777680]) [    ] o.a.s.c.c.SolrZkClient Using default ZkCredentialsProvider
   [junit4]   2> 950344 INFO  (TEST-TestManagedSchemaAPI.test-seed#[91AE8EA7EC777680]) [    ] o.a.s.c.c.ConnectionManager Waiting for client to connect to ZooKeeper
   [junit4]   2> 950344 INFO  (zkCallback-1250-thread-1) [    ] o.a.s.c.c.ConnectionManager Watcher org.apache.solr.common.cloud.ConnectionManager@7f231b23 name:ZooKeeperConnection Watcher:127.0.0.1:32973 got event WatchedEvent state:SyncConnected type:None path:null path:null type:None
   [junit4]   2> 950344 INFO  (TEST-TestManagedSchemaAPI.test-seed#[91AE8EA7EC777680]) [    ] o.a.s.c.c.ConnectionManager Client is connected to ZooKeeper
   [junit4]   2> 950345 INFO  (TEST-TestManagedSchemaAPI.test-seed#[91AE8EA7EC777680]) [    ] o.a.s.c.c.SolrZkClient Using default ZkACLProvider
   [junit4]   2> 950346 INFO  (TEST-TestManagedSchemaAPI.test-seed#[91AE8EA7EC777680]) [    ] o.a.s.c.c.SolrZkClient Using default ZkCredentialsProvider
   [junit4]   2> 950346 INFO  (TEST-TestManagedSchemaAPI.test-seed#[91AE8EA7EC777680]) [    ] o.a.s.c.c.ConnectionManager Waiting for client to connect to ZooKeeper
   [junit4]   2> 950347 INFO  (zkCallback-1252-thread-1) [    ] o.a.s.c.c.ConnectionManager Watcher org.apache.solr.common.cloud.ConnectionManager@4277d18b name:ZooKeeperConnection Watcher:127.0.0.1:32973/solr got event WatchedEvent state:SyncConnected type:None path:null path:null type:None
   [junit4]   2> 950347 INFO  (TEST-TestManagedSchemaAPI.test-seed#[91AE8EA7EC777680]) [    ] o.a.s.c.c.ConnectionManager Client is connected to ZooKeeper
   [junit4]   2> 950347 INFO  (TEST-TestManagedSchemaAPI.test-seed#[91AE8EA7EC777680]) [    ] o.a.s.c.c.SolrZkClient Using default ZkACLProvider
   [junit4]   2> 950347 INFO  (TEST-TestManagedSchemaAPI.test-seed#[91AE8EA7EC777680]) [    ] o.a.s.c.c.SolrZkClient makePath: /configs/conf1/solrconfig.xml
   [junit4]   2> 950348 INFO  (TEST-TestManagedSchemaAPI.test-seed#[91AE8EA7EC777680]) [    ] o.a.s.c.c.SolrZkClient makePath: /configs/conf1/managed-schema
   [junit4]   2> 950349 INFO  (TEST-TestManagedSchemaAPI.test-seed#[91AE8EA7EC777680]) [    ] o.a.s.c.c.SolrZkClient Using default ZkCredentialsProvider
   [junit4]   2> 950349 INFO  (TEST-TestManagedSchemaAPI.test-seed#[91AE8EA7EC777680]) [    ] o.a.s.c.c.ConnectionManager Waiting for client to connect to ZooKeeper
   [junit4]   2> 950350 INFO  (zkCallback-1253-thread-1) [    ] o.a.s.c.c.ConnectionManager Watcher org.apache.solr.common.cloud.ConnectionManager@2afcec3b name:ZooKeeperConnection Watcher:127.0.0.1:32973/solr got event WatchedEvent state:SyncConnected type:None path:null path:null type:None
   [junit4]   2> 950350 INFO  (TEST-TestManagedSchemaAPI.test-seed#[91AE8EA7EC777680]) [    ] o.a.s.c.c.ConnectionManager Client is connected to ZooKeeper
   [junit4]   2> 950350 INFO  (TEST-TestManagedSchemaAPI.test-seed#[91AE8EA7EC777680]) [    ] o.a.s.c.c.SolrZkClient Using default ZkACLProvider
   [junit4]   2> 950350 INFO  (TEST-TestManagedSchemaAPI.test-seed#[91AE8EA7EC777680]) [    ] o.a.s.c.c.ZkStateReader Updating cluster state from ZooKeeper... 
   [junit4]   2> 950352 INFO  (qtp1553054917-7744) [n:127.0.0.1:41096_solr    ] o.a.s.h.a.CollectionsHandler Invoked Collection Action :create with params numShards=1&collection.configName=conf1&name=testschemaapi&replicationFactor=2&action=CREATE&version=2&wt=javabin and sendToOCPQueue=true
   [junit4]   2> 950354 INFO  (OverseerCollectionConfigSetProcessor-95845202834620422-127.0.0.1:41096_solr-n_0000000000) [n:127.0.0.1:41096_solr    ] o.a.s.c.OverseerTaskProcessor Overseer Collection Message Handler: Get the message id:/overseer/collection-queue-work/qn-0000000000 message:{
   [junit4]   2>   "name":"testschemaapi",
   [junit4]   2>   "fromApi":"true",
   [junit4]   2>   "replicationFactor":"2",
   [junit4]   2>   "collection.configName":"conf1",
   [junit4]   2>   "numShards":"1",
   [junit4]   2>   "stateFormat":"2",
   [junit4]   2>   "operation":"create"}
   [junit4]   2> 950354 INFO  (OverseerThreadFactory-3224-thread-1-processing-n:127.0.0.1:41096_solr) [n:127.0.0.1:41096_solr    ] o.a.s.c.OverseerCollectionMessageHandler OverseerCollectionMessageHandler.processMessage : create , {
   [junit4]   2>   "name":"testschemaapi",
   [junit4]   2>   "fromApi":"true",
   [junit4]   2>   "replicationFactor":"2",
   [junit4]   2>   "collection.configName":"conf1",
   [junit4]   2>   "numShards":"1",
   [junit4]   2>   "stateFormat":"2",
   [junit4]   2>   "operation":"create"}
   [junit4]   2> 950355 INFO  (OverseerThreadFactory-3224-thread-1-processing-n:127.0.0.1:41096_solr) [n:127.0.0.1:41096_solr    ] o.a.s.c.OverseerCollectionMessageHandler Create collection testschemaapi
   [junit4]   2> 950355 INFO  (OverseerThreadFactory-3224-thread-1-processing-n:127.0.0.1:41096_solr) [n:127.0.0.1:41096_solr    ] o.a.s.c.OverseerCollectionMessageHandler creating collections conf node /collections/testschemaapi 
   [junit4]   2> 950355 INFO  (OverseerThreadFactory-3224-thread-1-processing-n:127.0.0.1:41096_solr) [n:127.0.0.1:41096_solr    ] o.a.s.c.c.SolrZkClient makePath: /collections/testschemaapi
   [junit4]   2> 950356 INFO  (zkCallback-1249-thread-1-processing-n:127.0.0.1:41096_solr) [n:127.0.0.1:41096_solr    ] o.a.s.c.c.ZkStateReader A collections change: [WatchedEvent state:SyncConnected type:NodeChildrenChanged path:/collections], has occurred - updating...
   [junit4]   2> 950356 INFO  (zkCallback-1248-thread-1-processing-n:127.0.0.1:36313_solr) [n:127.0.0.1:36313_solr    ] o.a.s.c.c.ZkStateReader A collections change: [WatchedEvent state:SyncConnected type:NodeChildrenChanged path:/collections], has occurred - updating...
   [junit4]   2> 950356 INFO  (zkCallback-1253-thread-1) [    ] o.a.s.c.c.ZkStateReader A collections change: [WatchedEvent state:SyncConnected type:NodeChildrenChanged path:/collections], has occurred - updating...
   [junit4]   2> 950356 INFO  (OverseerStateUpdate-95845202834620422-127.0.0.1:41096_solr-n_0000000000) [n:127.0.0.1:41096_solr    ] o.a.s.c.Overseer processMessage: queueSize: 1, message = {
   [junit4]   2>   "name":"testschemaapi",
   [junit4]   2>   "fromApi":"true",
   [junit4]   2>   "replicationFactor":"2",
   [junit4]   2>   "collection.configName":"conf1",
   [junit4]   2>   "numShards":"1",
   [junit4]   2>   "stateFormat":"2",
   [junit4]   2>   "operation":"create"} current state version: 0
   [junit4]   2> 950356 INFO  (OverseerStateUpdate-95845202834620422-127.0.0.1:41096_solr-n_0000000000) [n:127.0.0.1:41096_solr    ] o.a.s.c.o.ClusterStateMutator building a new cName: testschemaapi
   [junit4]   2> 950357 INFO  (OverseerStateUpdate-95845202834620422-127.0.0.1:41096_solr-n_0000000000) [n:127.0.0.1:41096_solr    ] o.a.s.c.o.ZkStateWriter going to create_collection /collections/testschemaapi/state.json
   [junit4]   2> 950456 INFO  (OverseerThreadFactory-3224-thread-1-processing-n:127.0.0.1:41096_solr) [n:127.0.0.1:41096_solr    ] o.a.s.c.OverseerCollectionMessageHandler Creating SolrCores for new collection testschemaapi, shardNames [shard1] , replicationFactor : 2
   [junit4]   2> 950457 INFO  (OverseerThreadFactory-3224-thread-1-processing-n:127.0.0.1:41096_solr) [n:127.0.0.1:41096_solr    ] o.a.s.c.OverseerCollectionMessageHandler Creating core testschemaapi_shard1_replica1 as part of shard shard1 of collection testschemaapi on 127.0.0.1:36313_solr
   [junit4]   2> 950457 INFO  (OverseerThreadFactory-3224-thread-1-processing-n:127.0.0.1:41096_solr) [n:127.0.0.1:41096_solr    ] o.a.s.c.OverseerCollectionMessageHandler Creating core testschemaapi_shard1_replica2 as part of shard shard1 of collection testschemaapi on 127.0.0.1:41096_solr
   [junit4]   2> 950459 INFO  (qtp1553054917-7745) [n:127.0.0.1:41096_solr    ] o.a.s.h.a.CoreAdminOperation core create command shard=shard1&numShards=1&qt=/admin/cores&collection.configName=conf1&name=testschemaapi_shard1_replica2&action=CREATE&version=2&wt=javabin&collection=testschemaapi
   [junit4]   2> 950459 INFO  (qtp1049941816-7733) [n:127.0.0.1:36313_solr    ] o.a.s.h.a.CoreAdminOperation core create command shard=shard1&numShards=1&qt=/admin/cores&collection.configName=conf1&name=testschemaapi_shard1_replica1&action=CREATE&version=2&wt=javabin&collection=testschemaapi
   [junit4]   2> 950459 INFO  (qtp1049941816-7733) [n:127.0.0.1:36313_solr    ] o.a.s.c.CoreDescriptor Created CoreDescriptor: {collection=testschemaapi, shard=shard1, name=testschemaapi_shard1_replica1, transient=false, schema=schema.xml, numShards=1, configSetProperties=configsetprops.json, dataDir=data/, loadOnStartup=true, config=solrconfig.xml, collection.configName=conf1}
   [junit4]   2> 950459 INFO  (qtp1553054917-7745) [n:127.0.0.1:41096_solr    ] o.a.s.c.CoreDescriptor Created CoreDescriptor: {config=solrconfig.xml, dataDir=data/, collection=testschemaapi, collection.configName=conf1, configSetProperties=configsetprops.json, shard=shard1, schema=schema.xml, transient=false, loadOnStartup=true, numShards=1, name=testschemaapi_shard1_replica2}
   [junit4]   2> 950460 INFO  (qtp1049941816-7733) [n:127.0.0.1:36313_solr c:testschemaapi s:shard1  x:testschemaapi_shard1_replica1] o.a.s.c.ZkController publishing state=down
   [junit4]   2> 950460 INFO  (qtp1553054917-7745) [n:127.0.0.1:41096_solr c:testschemaapi s:shard1  x:testschemaapi_shard1_replica2] o.a.s.c.ZkController publishing state=down
   [junit4]   2> 950460 INFO  (qtp1049941816-7733) [n:127.0.0.1:36313_solr c:testschemaapi s:shard1  x:testschemaapi_shard1_replica1] o.a.s.c.ZkController Registering watch for collection testschemaapi
   [junit4]   2> 950460 INFO  (qtp1049941816-7733) [n:127.0.0.1:36313_solr c:testschemaapi s:shard1  x:testschemaapi_shard1_replica1] o.a.s.c.c.ZkStateReader addZkWatch [testschemaapi]
   [junit4]   2> 950460 INFO  (qtp1553054917-7745) [n:127.0.0.1:41096_solr c:testschemaapi s:shard1  x:testschemaapi_shard1_replica2] o.a.s.c.ZkController Registering watch for collection testschemaapi
   [junit4]   2> 950460 INFO  (qtp1049941816-7733) [n:127.0.0.1:36313_solr c:testschemaapi s:shard1  x:testschemaapi_shard1_replica1] o.a.s.c.c.ZkStateReader Add data for [testschemaapi] ver [0]
   [junit4]   2> 950460 INFO  (qtp1553054917-7745) [n:127.0.0.1:41096_solr c:testschemaapi s:shard1  x:testschemaapi_shard1_replica2] o.a.s.c.c.ZkStateReader addZkWatch [testschemaapi]
   [junit4]   2> 950460 INFO  (OverseerStateUpdate-95845202834620422-127.0.0.1:41096_solr-n_0000000000) [n:127.0.0.1:41096_solr    ] o.a.s.c.Overseer processMessage: queueSize: 2, message = {
   [junit4]   2>   "state":"down",
   [junit4]   2>   "shard":"shard1",
   [junit4]   2>   "core":"testschemaapi_shard1_replica1",
   [junit4]   2>   "numShards":"1",
   [junit4]   2>   "operation":"state",
   [junit4]   2>   "node_name":"127.0.0.1:36313_solr",
   [junit4]   2>   "roles":null,
   [junit4]   2>   "base_url":"http://127.0.0.1:36313/solr",
   [junit4]   2>   "collection":"testschemaapi"} current state version: 0
   [junit4]   2> 950461 INFO  (qtp1049941816-7733) [n:127.0.0.1:36313_solr c:testschemaapi s:shard1  x:testschemaapi_shard1_replica1] o.a.s.c.ZkController look for our core node name
   [junit4]   2> 950461 INFO  (qtp1553054917-7745) [n:127.0.0.1:41096_solr c:testschemaapi s:shard1  x:testschemaapi_shard1_replica2] o.a.s.c.c.ZkStateReader Add data for [testschemaapi] ver [0]
   [junit4]   2> 950461 INFO  (qtp1553054917-7745) [n:127.0.0.1:41096_solr c:testschemaapi s:shard1  x:testschemaapi_shard1_replica2] o.a.s.c.ZkController look for our core node name
   [junit4]   2> 950461 INFO  (OverseerStateUpdate-95845202834620422-127.0.0.1:41096_solr-n_0000000000) [n:127.0.0.1:41096_solr    ] o.a.s.c.o.ReplicaMutator Update state numShards=1 message={
   [junit4]   2>   "state":"down",
   [junit4]   2>   "shard":"shard1",
   [junit4]   2>   "core":"testschemaapi_shard1_replica1",
   [junit4]   2>   "numShards":"1",
   [junit4]   2>   "operation":"state",
   [junit4]   2>   "node_name":"127.0.0.1:36313_solr",
   [junit4]   2>   "roles":null,
   [junit4]   2>   "base_url":"http://127.0.0.1:36313/solr",
   [junit4]   2>   "collection":"testschemaapi"}
   [junit4]   2> 950462 INFO  (OverseerStateUpdate-95845202834620422-127.0.0.1:41096_solr-n_0000000000) [n:127.0.0.1:41096_solr    ] o.a.s.c.Overseer processMessage: queueSize: 2, message = {
   [junit4]   2>   "state":"down",
   [junit4]   2>   "shard":"shard1",
   [junit4]   2>   "core":"testschemaapi_shard1_replica2",
   [junit4]   2>   "numShards":"1",
   [junit4]   2>   "operation":"state",
   [junit4]   2>   "node_name":"127.0.0.1:41096_solr",
   [junit4]   2>   "roles":null,
   [junit4]   2>   "base_url":"http://127.0.0.1:41096/solr",
   [junit4]   2>   "collection":"testschemaapi"} current state version: 0
   [junit4]   2> 950462 INFO  (OverseerStateUpdate-95845202834620422-127.0.0.1:41096_solr-n_0000000000) [n:127.0.0.1:41096_solr    ] o.a.s.c.o.ReplicaMutator Update state numShards=1 message={
   [junit4]   2>   "state":"down",
   [junit4]   2>   "shard":"shard1",
   [junit4]   2>   "core":"testschemaapi_shard1_replica2",
   [junit4]   2>   "numShards":"1",
   [junit4]   2>   "operation":"state",
   [junit4]   2>   "node_name":"127.0.0.1:41096_solr",
   [junit4]   2>   "roles":null,
   [junit4]   2>   "base_url":"http://127.0.0.1:41096/solr",
   [junit4]   2>   "collection":"testschemaapi"}
   [junit4]   2> 950563 INFO  (OverseerStateUpdate-95845202834620422-127.0.0.1:41096_solr-n_0000000000) [n:127.0.0.1:41096_solr    ] o.a.s.c.o.ZkStateWriter going to update_collection /collections/testschemaapi/state.json version: 0
   [junit4]   2> 950564 INFO  (zkCallback-1248-thread-1-processing-n:127.0.0.1:36313_solr) [n:127.0.0.1:36313_solr    ] o.a.s.c.c.ZkStateReader A cluster state change: [WatchedEvent state:SyncConnected type:NodeDataChanged path:/collections/testschemaapi/state.json] for collection [testschemaapi] has occurred - updating... (live nodes size: [2])
   [junit4]   2> 950564 INFO  (zkCallback-1249-thread-1-processing-n:127.0.0.1:41096_solr) [n:127.0.0.1:41096_solr    ] o.a.s.c.c.ZkStateReader A cluster state change: [WatchedEvent state:SyncConnected type:NodeDataChanged path:/collections/testschemaapi/state.json] for collection [testschemaapi] has occurred - updating... (live nodes size: [2])
   [junit4]   2> 950564 INFO  (zkCallback-1248-thread-1-processing-n:127.0.0.1:36313_solr) [n:127.0.0.1:36313_solr    ] o.a.s.c.c.ZkStateReader Updating data for [testschemaapi] from [0] to [1]
   [junit4]   2> 950564 INFO  (zkCallback-1249-thread-1-processing-n:127.0.0.1:41096_solr) [n:127.0.0.1:41096_solr    ] o.a.s.c.c.ZkStateReader Updating data for [testschemaapi] from [0] to [1]
   [junit4]   2> 951461 INFO  (qtp1049941816-7733) [n:127.0.0.1:36313_solr c:testschemaapi s:shard1  x:testschemaapi_shard1_replica1] o.a.s.c.ZkController waiting to find shard id in clusterstate for testschemaapi_shard1_replica1
   [junit4]   2> 951461 INFO  (qtp1049941816-7733) [n:127.0.0.1:36313_solr c:testschemaapi s:shard1  x:testschemaapi_shard1_replica1] o.a.s.c.ZkController Check for collection zkNode:testschemaapi
   [junit4]   2> 951462 INFO  (qtp1553054917-7745) [n:127.0.0.1:41096_solr c:testschemaapi s:shard1  x:testschemaapi_shard1_replica2] o.a.s.c.ZkController waiting to find shard id in clusterstate for testschemaapi_shard1_replica2
   [junit4]   2> 951462 INFO  (qtp1553054917-7745) [n:127.0.0.1:41096_solr c:testschemaapi s:shard1  x:testschemaapi_shard1_replica2] o.a.s.c.ZkController Check for collection zkNode:testschemaapi
   [junit4]   2> 951462 INFO  (qtp1049941816-7733) [n:127.0.0.1:36313_solr c:testschemaapi s:shard1  x:testschemaapi_shard1_replica1] o.a.s.c.ZkController Collection zkNode exists
   [junit4]   2> 951462 INFO  (qtp1049941816-7733) [n:127.0.0.1:36313_solr c:testschemaapi s:shard1  x:testschemaapi_shard1_replica1] o.a.s.c.c.ZkStateReader Load collection config from: [/collections/testschemaapi]
   [junit4]   2> 951462 INFO  (qtp1553054917-7745) [n:127.0.0.1:41096_solr c:testschemaapi s:shard1  x:testschemaapi_shard1_replica2] o.a.s.c.ZkController Collection zkNode exists
   [junit4]   2> 951462 INFO  (qtp1553054917-7745) [n:127.0.0.1:41096_solr c:testschemaapi s:shard1  x:testschemaapi_shard1_replica2] o.a.s.c.c.ZkStateReader Load collection config from: [/collections/testschemaapi]
   [junit4]   2> 951462 INFO  (qtp1049941816-7733) [n:127.0.0.1:36313_solr c:testschemaapi s:shard1  x:testschemaapi_shard1_replica1] o.a.s.c.c.ZkStateReader path=[/collections/testschemaapi] [configName]=[conf1] specified config exists in ZooKeeper
   [junit4]   2> 951462 INFO  (qtp1049941816-7733) [n:127.0.0.1:36313_solr c:testschemaapi s:shard1  x:testschemaapi_shard1_replica1] o.a.s.c.SolrResourceLoader new SolrResourceLoader for directory: '/home/jenkins/workspace/Lucene-Solr-5.5-Linux/solr/build/solr-core/test/J2/temp/solr.schema.TestManagedSchemaAPI_91AE8EA7EC777680-001/tempDir-001/node1/testschemaapi_shard1_replica1'
   [junit4]   2> 951462 INFO  (qtp1553054917-7745) [n:127.0.0.1:41096_solr c:testschemaapi s:shard1  x:testschemaapi_shard1_replica2] o.a.s.c.c.ZkStateReader path=[/collections/testschemaapi] [configName]=[conf1] specified config exists in ZooKeeper
   [junit4]   2> 951462 INFO  (qtp1049941816-7733) [n:127.0.0.1:36313_solr c:testschemaapi s:shard1  x:testschemaapi_shard1_replica1] o.a.s.c.SolrResourceLoader JNDI not configured for solr (NoInitialContextEx)
   [junit4]   2> 951462 INFO  (qtp1553054917-7745) [n:127.0.0.1:41096_solr c:testschemaapi s:shard1  x:testschemaapi_shard1_replica2] o.a.s.c.SolrResourceLoader new SolrResourceLoader for directory: '/home/jenkins/workspace/Lucene-Solr-5.5-Linux/solr/build/solr-core/test/J2/temp/solr.schema.TestManagedSchemaAPI_91AE8EA7EC777680-001/tempDir-001/node2/testschemaapi_shard1_replica2'
   [junit4]   2> 951462 INFO  (qtp1049941816-7733) [n:127.0.0.1:36313_solr c:testschemaapi s:shard1  x:testschemaapi_shard1_replica1] o.a.s.c.SolrResourceLoader solr home defaulted to 'solr/' (could not find system property or JNDI)
   [junit4]   2> 951462 INFO  (qtp1553054917-7745) [n:127.0.0.1:41096_solr c:testschemaapi s:shard1  x:testschemaapi_shard1_replica2] o.a.s.c.SolrResourceLoader JNDI not configured for solr (NoInitialContextEx)
   [junit4]   2> 951462 INFO  (qtp1553054917-7745) [n:127.0.0.1:41096_solr c:testschemaapi s:shard1  x:testschemaapi_shard1_replica2] o.a.s.c.SolrResourceLoader solr home defaulted to 'solr/' (could not find system property or JNDI)
   [junit4]   2> 951463 INFO  (qtp1049941816-7733) [n:127.0.0.1:36313_solr c:testschemaapi s:shard1  x:testschemaapi_shard1_replica1] o.a.s.c.Config loaded config solrconfig.xml with version 0 
   [junit4]   2> 951463 INFO  (qtp1553054917-7745) [n:127.0.0.1:41096_solr c:testschemaapi s:shard1  x:testschemaapi_shard1_replica2] o.a.s.c.Config loaded config solrconfig.xml with version 0 
   [junit4]   2> 951466 INFO  (qtp1049941816-7733) [n:127.0.0.1:36313_solr c:testschemaapi s:shard1  x:testschemaapi_shard1_replica1] o.a.s.c.SolrConfig current version of requestparams : -1
   [junit4]   2> 951466 INFO  (qtp1553054917-7745) [n:127.0.0.1:41096_solr c:testschemaapi s:shard1  x:testschemaapi_shard1_replica2] o.a.s.c.SolrConfig current version of requestparams : -1
   [junit4]   2> 951472 INFO  (qtp1049941816-7733) [n:127.0.0.1:36313_solr c:testschemaapi s:shard1  x:testschemaapi_shard1_replica1] o.a.s.c.SolrConfig Using Lucene MatchVersion: 5.5.1
   [junit4]   2> 951477 INFO  (qtp1553054917-7745) [n:127.0.0.1:41096_solr c:testschemaapi s:shard1  x:testschemaapi_shard1_replica2] o.a.s.c.SolrConfig Using Lucene MatchVersion: 5.5.1
   [junit4]   2> 951486 INFO  (qtp1049941816-7733) [n:127.0.0.1:36313_solr c:testschemaapi s:shard1  x:testschemaapi_shard1_replica1] o.a.s.c.SolrConfig Loaded SolrConfig: solrconfig.xml
   [junit4]   2> 951489 INFO  (qtp1049941816-7733) [n:127.0.0.1:36313_solr c:testschemaapi s:shard1  x:testschemaapi_shard1_replica1] o.a.s.s.IndexSchema [testschemaapi_shard1_replica1] Schema name=minimal
   [junit4]   2> 951495 INFO  (qtp1049941816-7733) [n:127.0.0.1:36313_solr c:testschemaapi s:shard1  x:testschemaapi_shard1_replica1] o.a.s.s.IndexSchema unique key field: id
   [junit4]   2> 951496 INFO  (qtp1049941816-7733) [n:127.0.0.1:36313_solr c:testschemaapi s:shard1  x:testschemaapi_shard1_replica1] o.a.s.c.ConfigSetProperties Did not find ConfigSet properties, assuming default properties: Can't find resource 'configsetprops.json' in classpath or '/configs/conf1', cwd=/home/jenkins/workspace/Lucene-Solr-5.5-Linux/solr/build/solr-core/test/J2
   [junit4]   2> 951496 INFO  (qtp1049941816-7733) [n:127.0.0.1:36313_solr c:testschemaapi s:shard1  x:testschemaapi_shard1_replica1] o.a.s.c.CoreContainer Creating SolrCore 'testschemaapi_shard1_replica1' using configuration from collection testschemaapi
   [junit4]   2> 951496 INFO  (qtp1553054917-7745) [n:127.0.0.1:41096_solr c:testschemaapi s:shard1  x:testschemaapi_shard1_replica2] o.a.s.c.SolrConfig Loaded SolrConfig: solrconfig.xml
   [junit4]   2> 951496 INFO  (qtp1049941816-7733) [n:127.0.0.1:36313_solr c:testschemaapi s:shard1 r:core_node1 x:testschemaapi_shard1_replica1] o.a.s.c.SolrCore org.apache.solr.core.MockDirectoryFactory
   [junit4]   2> 951497 INFO  (qtp1049941816-7733) [n:127.0.0.1:36313_solr c:testschemaapi s:shard1 r:core_node1 x:testschemaapi_shard1_replica1] o.a.s.c.SolrCore [[testschemaapi_shard1_replica1] ] Opening new SolrCore at [/home/jenkins/workspace/Lucene-Solr-5.5-Linux/solr/build/solr-core/test/J2/temp/solr.schema.TestManagedSchemaAPI_91AE8EA7EC777680-001/tempDir-001/node1/testschemaapi_shard1_replica1], dataDir=[/home/jenkins/workspace/Lucene-Solr-5.5-Linux/solr/build/solr-core/test/J2/temp/solr.schema.TestManagedSchemaAPI_91AE8EA7EC777680-001/tempDir-001/node1/./testschemaapi_shard1_replica1/data/]
   [junit4]   2> 951497 INFO  (qtp1049941816-7733) [n:127.0.0.1:36313_solr c:testschemaapi s:shard1 r:core_node1 x:testschemaapi_shard1_replica1] o.a.s.c.SolrCore JMX monitoring not detected for core: testschemaapi_shard1_replica1
   [junit4]   2> 951497 INFO  (qtp1049941816-7733) [n:127.0.0.1:36313_solr c:testschemaapi s:shard1 r:core_node1 x:testschemaapi_shard1_replica1] o.a.s.c.CachingDirectoryFactory return new directory for /home/jenkins/workspace/Lucene-Solr-5.5-Linux/solr/build/solr-core/test/J2/temp/solr.schema.TestManagedSchemaAPI_91AE8EA7EC777680-001/tempDir-001/node1/./testschemaapi_shard1_replica1/data
   [junit4]   2> 951497 INFO  (qtp1049941816-7733) [n:127.0.0.1:36313_solr c:testschemaapi s:shard1 r:core_node1 x:testschemaapi_shard1_replica1] o.a.s.c.SolrCore New index directory detected: old=null new=/home/jenkins/workspace/Lucene-Solr-5.5-Linux/solr/build/solr-core/test/J2/temp/solr.schema.TestManagedSchemaAPI_91AE8EA7EC777680-001/tempDir-001/node1/./testschemaapi_shard1_replica1/data/index/
   [junit4]   2> 951497 WARN  (qtp1049941816-7733) [n:127.0.0.1:36313_solr c:testschemaapi s:shard1 r:core_node1 x:testschemaapi_shard1_replica1] o.a.s.c.SolrCore [testschemaapi_shard1_replica1] Solr index directory '/home/jenkins/workspace/Lucene-Solr-5.5-Linux/solr/build/solr-core/test/J2/temp/solr.schema.TestManagedSchemaAPI_91AE8EA7EC777680-001/tempDir-001/node1/./testschemaapi_shard1_replica1/data/index' doesn't exist. Creating new index...
   [junit4]   2> 951498 INFO  (qtp1049941816-7733) [n:127.0.0.1:36313_solr c:testschemaapi s:shard1 r:core_node1 x:testschemaapi_shard1_replica1] o.a.s.c.CachingDirectoryFactory return new directory for /home/jenkins/workspace/Lucene-Solr-5.5-Linux/solr/build/solr-core/test/J2/temp/solr.schema.TestManagedSchemaAPI_91AE8EA7EC777680-001/tempDir-001/node1/./testschemaapi_shard1_replica1/data/index
   [junit4]   2> 951498 INFO  (qtp1049941816-7733) [n:127.0.0.1:36313_solr c:testschemaapi s:shard1 r:core_node1 x:testschemaapi_shard1_replica1] o.a.s.c.SolrDeletionPolicy SolrDeletionPolicy.onCommit: commits: num=1
   [junit4]   2> 	commit{dir=MockDirectoryWrapper(RAMDirectory@36d87efd lockFactory=org.apache.lucene.store.SingleInstanceLockFactory@3f79302c),segFN=segments_1,generation=1}
   [junit4]   2> 951498 INFO  (qtp1049941816-7733) [n:127.0.0.1:36313_solr c:testschemaapi s:shard1 r:core_node1 x:testschemaapi_shard1_replica1] o.a.s.c.SolrDeletionPolicy newest commit generation = 1
   [junit4]   2> 951499 INFO  (OldIndexDirectoryCleanupThreadForCore-testschemaapi_shard1_replica1) [n:127.0.0.1:36313_solr c:testschemaapi s:shard1 r:core_node1 x:testschemaapi_shard1_replica1] o.a.s.c.SolrCore Looking for old index directories to cleanup for core testschemaapi_shard1_replica1 in /home/jenkins/workspace/Lucene-Solr-5.5-Linux/solr/build/solr-core/test/J2/temp/solr.schema.TestManagedSchemaAPI_91AE8EA7EC777680-001/tempDir-001/node1/./testschemaapi_shard1_replica1/data/
   [junit4]   2> 951499 WARN  (OldIndexDirectoryCleanupThreadForCore-testschemaapi_shard1_replica1) [n:127.0.0.1:36313_solr c:testschemaapi s:shard1 r:core_node1 x:testschemaapi_shard1_replica1] o.a.s.c.DirectoryFactory /home/jenkins/workspace/Lucene-Solr-5.5-Linux/solr/build/solr-core/test/J2/temp/solr.schema.TestManagedSchemaAPI_91AE8EA7EC777680-001/tempDir-001/node1/./testschemaapi_shard1_replica1/data/ does not point to a valid data directory; skipping clean-up of old index directories.
   [junit4]   2> 951499 INFO  (qtp1553054917-7745) [n:127.0.0.1:41096_solr c:testschemaapi s:shard1  x:testschemaapi_shard1_replica2] o.a.s.s.IndexSchema [testschemaapi_shard1_replica2] Schema name=minimal
   [junit4]   2> 951500 INFO  (qtp1049941816-7733) [n:127.0.0.1:36313_solr c:testschemaapi s:shard1 r:core_node1 x:testschemaapi_shard1_replica1] o.a.s.c.SolrCore no updateRequestProcessorChain defined as default, creating implicit default
   [junit4]   2> 951503 INFO  (qtp1049941816-7733) [n:127.0.0.1:36313_solr c:testschemaapi s:shard1 r:core_node1 x:testschemaapi_shard1_replica1] o.a.s.h.l.XMLLoader xsltCacheLifetimeSeconds=60
   [junit4]   2> 951504 INFO  (qtp1049941816-7733) [n:127.0.0.1:36313_solr c:testschemaapi s:shard1 r:core_node1 x:testschemaapi_shard1_replica1] o.a.s.h.l.XMLLoader xsltCacheLifetimeSeconds=60
   [junit4]   2> 951504 INFO  (qtp1553054917-7745) [n:127.0.0.1:41096_solr c:testschemaapi s:shard1  x:testschemaapi_shard1_replica2] o.a.s.s.IndexSchema unique key field: id
   [junit4]   2> 951506 INFO  (qtp1553054917-7745) [n:127.0.0.1:41096_solr c:testschemaapi s:shard1  x:testschemaapi_shard1_replica2] o.a.s.c.ConfigSetProperties Did not find ConfigSet properties, assuming default properties: Can't find resource 'configsetprops.json' in classpath or '/configs/conf1', cwd=/home/jenkins/workspace/Lucene-Solr-5.5-Linux/solr/build/solr-core/test/J2
   [junit4]   2> 951506 INFO  (qtp1553054917-7745) [n:127.0.0.1:41096_solr c:testschemaapi s:shard1  x:testschemaapi_shard1_replica2] o.a.s.c.CoreContainer Creating SolrCore 'testschemaapi_shard1_replica2' using configuration from collection testschemaapi
   [junit4]   2> 951506 INFO  (qtp1049941816-7733) [n:127.0.0.1:36313_solr c:testschemaapi s:shard1 r:core_node1 x:testschemaapi_shard1_replica1] o.a.s.h.l.XMLLoader xsltCacheLifetimeSeconds=60
   [junit4]   2> 951506 INFO  (qtp1553054917-7745) [n:127.0.0.1:41096_solr c:testschemaapi s:shard1 r:core_node2 x:testschemaapi_shard1_replica2] o.a.s.c.SolrCore org.apache.solr.core.MockDirectoryFactory
   [junit4]   2> 951506 INFO  (qtp1553054917-7745) [n:127.0.0.1:41096_solr c:testschemaapi s:shard1 r:core_node2 x:testschemaapi_shard1_replica2] o.a.s.c.SolrCore [[testschemaapi_shard1_replica2] ] Opening new SolrCore at [/home/jenkins/workspace/Lucene-Solr-5.5-Linux/solr/build/solr-core/test/J2/temp/solr.schema.TestManagedSchemaAPI_91AE8EA7EC777680-001/tempDir-001/node2/testschemaapi_shard1_replica2], dataDir=[/home/jenkins/workspace/Lucene-Solr-5.5-Linux/solr/build/solr-core/test/J2/temp/solr.schema.TestManagedSchemaAPI_91AE8EA7EC777680-001/tempDir-001/node2/./testschemaapi_shard1_replica2/data/]
   [junit4]   2> 951506 INFO  (qtp1553054917-7745) [n:127.0.0.1:41096_solr c:testschemaapi s:shard1 r:core_node2 x:testschemaapi_shard1_replica2] o.a.s.c.SolrCore JMX monitoring not detected for core: testschemaapi_shard1_replica2
   [junit4]   2> 951507 INFO  (qtp1553054917-7745) [n:127.0.0.1:41096_solr c:testschemaapi s:shard1 r:core_node2 x:testschemaapi_shard1_replica2] o.a.s.c.CachingDirectoryFactory return new directory for /home/jenkins/workspace/Lucene-Solr-5.5-Linux/solr/build/solr-core/test/J2/temp/solr.schema.TestManagedSchemaAPI_91AE8EA7EC777680-001/tempDir-001/node2/./testschemaapi_shard1_replica2/data
   [junit4]   2> 951507 INFO  (qtp1553054917-7745) [n:127.0.0.1:41096_solr c:testschemaapi s:shard1 r:core_node2 x:testschemaapi_shard1_replica2] o.a.s.c.SolrCore New index directory detected: old=null new=/home/jenkins/workspace/Lucene-Solr-5.5-Linux/solr/build/solr-core/test/J2/temp/solr.schema.TestManagedSchemaAPI_91AE8EA7EC777680-001/tempDir-001/node2/./testschemaapi_shard1_replica2/data/index/
   [junit4]   2> 951507 WARN  (qtp1553054917-7745) [n:127.0.0.1:41096_solr c:testschemaapi s:shard1 r:core_node2 x:testschemaapi_shard1_replica2] o.a.s.c.SolrCore [testschemaapi_shard1_replica2] Solr index directory '/home/jenkins/workspace/Lucene-Solr-5.5-Linux/solr/build/solr-core/test/J2/temp/solr.schema.TestManagedSchemaAPI_91AE8EA7EC777680-001/tempDir-001/node2/./testschemaapi_shard1_replica2/data/index' doesn't exist. Creating new index...
   [junit4]   2> 951507 INFO  (qtp1049941816-7733) [n:127.0.0.1:36313_solr c:testschemaapi s:shard1 r:core_node1 x:testschemaapi_shard1_replica1] o.a.s.h.l.XMLLoader xsltCacheLifetimeSeconds=60
   [junit4]   2> 951507 INFO  (qtp1553054917-7745) [n:127.0.0.1:41096_solr c:testschemaapi s:shard1 r:core_node2 x:testschemaapi_shard1_replica2] o.a.s.c.CachingDirectoryFactory return new directory for /home/jenkins/workspace/Lucene-Solr-5.5-Linux/solr/build/solr-core/test/J2/temp/solr.schema.TestManagedSchemaAPI_91AE8EA7EC777680-001/tempDir-001/node2/./testschemaapi_shard1_replica2/data/index
   [junit4]   2> 951508 INFO  (qtp1553054917-7745) [n:127.0.0.1:41096_solr c:testschemaapi s:shard1 r:core_node2 x:testschemaapi_shard1_replica2] o.a.s.c.SolrDeletionPolicy SolrDeletionPolicy.onCommit: commits: num=1
   [junit4]   2> 	commit{dir=MockDirectoryWrapper(RAMDirectory@2136cc50 lockFactory=org.apache.lucene.store.SingleInstanceLockFactory@149fa939),segFN=segments_1,generation=1}
   [junit4]   2> 951508 INFO  (qtp1553054917-7745) [n:127.0.0.1:41096_solr c:testschemaapi s:shard1 r:core_node2 x:testschemaapi_shard1_replica2] o.a.s.c.SolrDeletionPolicy newest commit generation = 1
   [junit4]   2> 951508 INFO  (OldIndexDirectoryCleanupThreadForCore-testschemaapi_shard1_replica2) [n:127.0.0.1:41096_solr c:testschemaapi s:shard1 r:core_node2 x:testschemaapi_shard1_replica2] o.a.s.c.SolrCore Looking for old index directories to cleanup for core testschemaapi_shard1_replica2 in /home/jenkins/workspace/Lucene-Solr-5.5-Linux/solr/build/solr-core/test/J2/temp/solr.schema.TestManagedSchemaAPI_91AE8EA7EC777680-001/tempDir-001/node2/./testschemaapi_shard1_replica2/data/
   [junit4]   2> 951508 WARN  (OldIndexDirectoryCleanupThreadForCore-testschemaapi_shard1_replica2) [n:127.0.0.1:41096_solr c:testschemaapi s:shard1 r:core_node2 x:testschemaapi_shard1_replica2] o.a.s.c.DirectoryFactory /home/jenkins/workspace/Lucene-Solr-5.5-Linux/solr/build/solr-core/test/J2/temp/solr.schema.TestManagedSchemaAPI_91AE8EA7EC777680-001/tempDir-001/node2/./testschemaapi_shard1_replica2/data/ does not point to a valid data directory; skipping clean-up of old index directories.
   [junit4]   2> 951508 INFO  (qtp1049941816-7733) [n:127.0.0.1:36313_solr c:testschemaapi s:shard1 r:core_node1 x:testschemaapi_shard1_replica1] o.a.s.c.RequestHandlers Registered paths: /admin/threads,/replication,/admin/ping,/admin/luke,/admin/logging,/update,/update/json/docs,/admin/plugins,/config,/get,/admin/mbeans,/update/csv,/schema,/admin/file,/update/json,/admin/segments,/admin/system,/select,/admin/properties
   [junit4]   2> 951509 INFO  (qtp1553054917-7745) [n:127.0.0.1:41096_solr c:testschemaapi s:shard1 r:core_node2 x:testschemaapi_shard1_replica2] o.a.s.c.SolrCore no updateRequestProcessorChain defined as default, creating implicit default
   [junit4]   2> 951509 INFO  (qtp1049941816-7733) [n:127.0.0.1:36313_solr c:testschemaapi s:shard1 r:core_node1 x:testschemaapi_shard1_replica1] o.a.s.c.SolrCore Using default statsCache cache: org.apache.solr.search.stats.LocalStatsCache
   [junit4]   2> 951509 INFO  (qtp1049941816-7733) [n:127.0.0.1:36313_solr c:testschemaapi s:shard1 r:core_node1 x:testschemaapi_shard1_replica1] o.a.s.u.UpdateHandler Using UpdateLog implementation: org.apache.solr.update.UpdateLog
   [junit4]   2> 951509 INFO  (qtp1049941816-7733) [n:127.0.0.1:36313_solr c:testschemaapi s:shard1 r:core_node1 x:testschemaapi_shard1_replica1] o.a.s.u.UpdateLog Initializing UpdateLog: dataDir=null defaultSyncLevel=FLUSH numRecordsToKeep=100 maxNumLogsToKeep=10 numVersionBuckets=65536
   [junit4]   2> 951510 INFO  (qtp1553054917-7745) [n:127.0.0.1:41096_solr c:testschemaapi s:shard1 r:core_node2 x:testschemaapi_shard1_replica2] o.a.s.h.l.XMLLoader xsltCacheLifetimeSeconds=60
   [junit4]   2> 951510 INFO  (qtp1049941816-7733) [n:127.0.0.1:36313_solr c:testschemaapi s:shard1 r:core_node1 x:testschemaapi_shard1_replica1] o.a.s.u.CommitTracker Hard AutoCommit: disabled
   [junit4]   2> 951510 INFO  (qtp1049941816-7733) [n:127.0.0.1:36313_solr c:testschemaapi s:shard1 r:core_node1 x:testschemaapi_shard1_replica1] o.a.s.u.CommitTracker Soft AutoCommit: disabled
   [junit4]   2> 951511 INFO  (qtp1553054917-7745) [n:127.0.0.1:41096_solr c:testschemaapi s:shard1 r:core_node2 x:testschemaapi_shard1_replica2] o.a.s.h.l.XMLLoader xsltCacheLifetimeSeconds=60
   [junit4]   2> 951511 INFO  (qtp1049941816-7733) [n:127.0.0.1:36313_solr c:testschemaapi s:shard1 r:core_node1 x:testschemaapi_shard1_replica1] o.a.s.c.SolrDeletionPolicy SolrDeletionPolicy.onInit: commits: num=1
   [junit4]   2> 	commit{dir=MockDirectoryWrapper(RAMDirectory@36d87efd lockFactory=org.apache.lucene.store.SingleInstanceLockFactory@3f79302c),segFN=segments_1,generation=1}
   [junit4]   2> 951511 INFO  (qtp1049941816-7733) [n:127.0.0.1:36313_solr c:testschemaapi s:shard1 r:core_node1 x:testschemaapi_shard1_replica1] o.a.s.c.SolrDeletionPolicy newest commit generation = 1
   [junit4]   2> 951511 INFO  (qtp1049941816-7733) [n:127.0.0.1:36313_solr c:testschemaapi s:shard1 r:core_node1 x:testschemaapi_shard1_replica1] o.a.s.s.SolrIndexSearcher Opening Searcher@7e34d0ff[testschemaapi_shard1_replica1] main
   [junit4]   2> 951511 INFO  (qtp1049941816-7733) [n:127.0.0.1:36313_solr c:testschemaapi s:shard1 r:core_node1 x:testschemaapi_shard1_replica1] o.a.s.c.c.ZkStateReader Load collection config from: [/collections/testschemaapi]
   [junit4]   2> 951511 INFO  (qtp1553054917-7745) [n:127.0.0.1:41096_solr c:testschemaapi s:shard1 r:core_node2 x:testschemaapi_shard1_replica2] o.a.s.h.l.XMLLoader xsltCacheLifetimeSeconds=60
   [junit4]   2> 951511 INFO  (qtp1049941816-7733) [n:127.0.0.1:36313_solr c:testschemaapi s:shard1 r:core_node1 x:testschemaapi_shard1_replica1] o.a.s.c.c.ZkStateReader path=[/collections/testschemaapi] [configName]=[conf1] specified config exists in ZooKeeper
   [junit4]   2> 951511 INFO  (qtp1049941816-7733) [n:127.0.0.1:36313_solr c:testschemaapi s:shard1 r:core_node1 x:testschemaapi_shard1_replica1] o.a.s.r.ManagedResourceStorage Setting up ZooKeeper-based storage for the RestManager with znodeBase: /configs/conf1
   [junit4]   2> 951512 INFO  (qtp1049941816-7733) [n:127.0.0.1:36313_solr c:testschemaapi s:shard1 r:core_node1 x:testschemaapi_shard1_replica1] o.a.s.r.ManagedResourceStorage Configured ZooKeeperStorageIO with znodeBase: /configs/conf1
   [junit4]   2> 951512 INFO  (qtp1049941816-7733) [n:127.0.0.1:36313_solr c:testschemaapi s:shard1 r:core_node1 x:testschemaapi_shard1_replica1] o.a.s.r.RestManager Initializing RestManager with initArgs: {}
   [junit4]   2> 951512 INFO  (qtp1049941816-7733) [n:127.0.0.1:36313_solr c:testschemaapi s:shard1 r:core_node1 x:testschemaapi_shard1_replica1] o.a.s.r.ManagedResourceStorage Reading _rest_managed.json using ZooKeeperStorageIO:path=/configs/conf1
   [junit4]   2> 951512 INFO  (qtp1553054917-7745) [n:127.0.0.1:41096_solr c:testschemaapi s:shard1 r:core_node2 x:testschemaapi_shard1_replica2] o.a.s.h.l.XMLLoader xsltCacheLifetimeSeconds=60
   [junit4]   2> 951512 INFO  (qtp1049941816-7733) [n:127.0.0.1:36313_solr c:testschemaapi s:shard1 r:core_node1 x:testschemaapi_shard1_replica1] o.a.s.r.ManagedResourceStorage No data found for znode /configs/conf1/_rest_managed.json
   [junit4]   2> 951512 INFO  (qtp1049941816-7733) [n:127.0.0.1:36313_solr c:testschemaapi s:shard1 r:core_node1 x:testschemaapi_shard1_replica1] o.a.s.r.ManagedResourceStorage Loaded null at path _rest_managed.json using ZooKeeperStorageIO:path=/configs/conf1
   [junit4]   2> 951512 INFO  (qtp1049941816-7733) [n:127.0.0.1:36313_solr c:testschemaapi s:shard1 r:core_node1 x:testschemaapi_shard1_replica1] o.a.s.r.RestManager Initializing 0 registered ManagedResources
   [junit4]   2> 951512 INFO  (qtp1049941816-7733) [n:127.0.0.1:36313_solr c:testschemaapi s:shard1 r:core_node1 x:testschemaapi_shard1_replica1] o.a.s.s.ZkIndexSchemaReader Creating ZooKeeper watch for the managed schema at /configs/conf1/managed-schema
   [junit4]   2> 951512 INFO  (qtp1049941816-7733) [n:127.0.0.1:36313_solr c:testschemaapi s:shard1 r:core_node1 x:testschemaapi_shard1_replica1] o.a.s.c.ZkController Added new OnReconnect listener ZkIndexSchemaReader: /configs/conf1/managed-schema, uniqueCoreId: testschemaapi_shard1_replica1:6528907573534
   [junit4]   2> 951512 INFO  (qtp1049941816-7733) [n:127.0.0.1:36313_solr c:testschemaapi s:shard1 r:core_node1 x:testschemaapi_shard1_replica1] o.a.s.h.ReplicationHandler Commits will be reserved for  10000
   [junit4]   2> 951513 INFO  (searcherExecutor-3229-thread-1-processing-r:core_node1 s:shard1 x:testschemaapi_shard1_replica1 n:127.0.0.1:36313_solr c:testschemaapi) [n:127.0.0.1:36313_solr c:testschemaapi s:shard1 r:core_node1 x:testschemaapi_shard1_replica1] o.a.s.c.SolrCore [testschemaapi_shard1_replica1] Registered new searcher Searcher@7e34d0ff[testschemaapi_shard1_replica1] main{ExitableDirectoryReader(UninvertingDirectoryReader())}
   [junit4]   2> 951513 INFO  (qtp1049941816-7733) [n:127.0.0.1:36313_solr c:testschemaapi s:shard1 r:core_node1 x:testschemaapi_shard1_replica1] o.a.s.u.UpdateLog Looking up max value of version field to seed version buckets
   [junit4]   2> 951513 INFO  (qtp1049941816-7733) [n:127.0.0.1:36313_solr c:testschemaapi s:shard1 r:core_node1 x:testschemaapi_shard1_replica1] o.a.s.u.VersionInfo Refreshing highest value of _version_ for 65536 version buckets from index
   [junit4]   2> 951513 INFO  (qtp1049941816-7733) [n:127.0.0.1:36313_solr c:testschemaapi s:shard1 r:core_node1 x:testschemaapi_shard1_replica1] o.a.s.u.VersionInfo No terms found for _version_, cannot seed version bucket highest value from index
   [junit4]   2> 951513 INFO  (qtp1049941816-7733) [n:127.0.0.1:36313_solr c:testschemaapi s:shard1 r:core_node1 x:testschemaapi_shard1_replica1] o.a.s.u.UpdateLog Could not find max version in index or recent updates, using new clock 1533523246744338432
   [junit4]   2> 951513 INFO  (qtp1553054917-7745) [n:127.0.0.1:41096_solr c:testschemaapi s:shard1 r:core_node2 x:testschemaapi_shard1_replica2] o.a.s.c.RequestHandlers Registered paths: /admin/threads,/replication,/admin/ping,/admin/luke,/admin/logging,/update,/update/json/docs,/admin/plugins,/config,/get,/admin/mbeans,/update/csv,/schema,/admin/file,/update/json,/admin/segments,/admin/system,/select,/admin/properties
   [junit4]   2> 951514 INFO  (qtp1553054917-7745) [n:127.0.0.1:41096_solr c:testschemaapi s:shard1 r:core_node2 x:testschemaapi_shard1_replica2] o.a.s.c.SolrCore Using default statsCache cache: org.apache.solr.search.stats.LocalStatsCache
   [junit4]   2> 951514 INFO  (qtp1553054917-7745) [n:127.0.0.1:41096_solr c:testschemaapi s:shard1 r:core_node2 x:testschemaapi_shard1_replica2] o.a.s.u.UpdateHandler Using UpdateLog implementation: org.apache.solr.update.UpdateLog
   [junit4]   2> 951514 INFO  (qtp1553054917-7745) [n:127.0.0.1:41096_solr c:testschemaapi s:shard1 r:core_node2 x:testschemaapi_shard1_replica2] o.a.s.u.UpdateLog Initializing UpdateLog: dataDir=null defaultSyncLevel=FLUSH numRecordsToKeep=100 maxNumLogsToKeep=10 numVersionBuckets=65536
   [junit4]   2> 951515 INFO  (qtp1553054917-7745) [n:127.0.0.1:41096_solr c:testschemaapi s:shard1 r:core_node2 x:testschemaapi_shard1_replica2] o.a.s.u.CommitTracker Hard AutoCommit: disabled
   [junit4]   2> 951515 INFO  (qtp1553054917-7745) [n:127.0.0.1:41096_solr c:testschemaapi s:shard1 r:core_node2 x:testschemaapi_shard1_replica2] o.a.s.u.CommitTracker Soft AutoCommit: disabled
   [junit4]   2> 951515 INFO  (qtp1049941816-7733) [n:127.0.0.1:36313_solr c:testschemaapi s:shard1 r:core_node1 x:testschemaapi_shard1_replica1] o.a.s.u.UpdateLog Took 1.0ms to seed version buckets with highest version 1533523246744338432
   [junit4]   2> 951516 INFO  (qtp1049941816-7733) [n:127.0.0.1:36313_solr c:testschemaapi s:shard1 r:core_node1 x:testschemaapi_shard1_replica1] o.a.s.c.ZkController watch zkdir /configs/conf1
   [junit4]   2> 951516 INFO  (qtp1553054917-7745) [n:127.0.0.1:41096_solr c:testschemaapi s:shard1 r:core_node2 x:testschemaapi_shard1_replica2] o.a.s.c.SolrDeletionPolicy SolrDeletionPolicy.onInit: commits: num=1
   [junit4]   2> 	commit{dir=MockDirectoryWrapper(RAMDirectory@2136cc50 lockFactory=org.apache.lucene.store.SingleInstanceLockFactory@149fa939),segFN=segments_1,generation=1}
   [junit4]   2> 951516 INFO  (qtp1553054917-7745) [n:127.0.0.1:41096_solr c:testschemaapi s:shard1 r:core_node2 x:testschemaapi_shard1_replica2] o.a.s.c.SolrDeletionPolicy newest commit generation = 1
   [junit4]   2> 951516 INFO  (qtp1553054917-7745) [n:127.0.0.1:41096_solr c:testschemaapi s:shard1 r:core_node2 x:testschemaapi_shard1_replica2] o.a.s.s.SolrIndexSearcher Opening Searcher@3599bc36[testschemaapi_shard1_replica2] main
   [junit4]   2> 951516 INFO  (qtp1553054917-7745) [n:127.0.0.1:41096_solr c:testschemaapi s:shard1 r:core_node2 x:testschemaapi_shard1_replica2] o.a.s.c.c.ZkStateReader Load collection config from: [/collections/testschemaapi]
   [junit4]   2> 951516 INFO  (qtp1049941816-7733) [n:127.0.0.1:36313_solr c:testschemaapi s:shard1 r:core_node1 x:testschemaapi_shard1_replica1] o.a.s.c.CoreContainer registering core: testschemaapi_shard1_replica1
   [junit4]   2> 951516 INFO  (qtp1049941816-7733) [n:127.0.0.1:36313_solr c:testschemaapi s:shard1 r:core_node1 x:testschemaapi_shard1_replica1] o.a.s.c.ZkController Register replica - core:testschemaapi_shard1_replica1 address:http://127.0.0.1:36313/solr collection:testschemaapi shard:shard1
   [junit4]   2> 951516 INFO  (qtp1553054917-7745) [n:127.0.0.1:41096_solr c:testschemaapi s:shard1 r:core_node2 x:testschemaapi_shard1_replica2] o.a.s.c.c.ZkStateReader path=[/collections/testschemaapi] [configName]=[conf1] specified config exists in ZooKeeper
   [junit4]   2> 951516 INFO  (qtp1553054917-7745) [n:127.0.0.1:41096_solr c:testschemaapi s:shard1 r:core_node2 x:testschemaapi_shard1_replica2] o.a.s.r.ManagedResourceStorage Setting up ZooKeeper-based storage for the RestManager with znodeBase: /configs/conf1
   [junit4]   2> 951516 INFO  (qtp1553054917-7745) [n:127.0.0.1:41096_solr c:testschemaapi s:shard1 r:core_node2 x:testschemaapi_shard1_replica2] o.a.s.r.ManagedResourceStorage Configured ZooKeeperStorageIO with znodeBase: /configs/conf1
   [junit4]   2> 951516 INFO  (qtp1553054917-7745) [n:127.0.0.1:41096_solr c:testschemaapi s:shard1 r:core_node2 x:testschemaapi_shard1_replica2] o.a.s.r.RestManager Initializing RestManager with initArgs: {}
   [junit4]   2> 951516 INFO  (qtp1049941816-7733) [n:127.0.0.1:36313_solr c:testschemaapi s:shard1 r:core_node1 x:testschemaapi_shard1_replica1] o.a.s.c.c.SolrZkClient makePath: /collections/testschemaapi/leader_elect/shard1/election
   [junit4]   2> 951516 INFO  (qtp1553054917-7745) [n:127.0.0.1:41096_solr c:testschemaapi s:shard1 r:core_node2 x:testschemaapi_shard1_replica2] o.a.s.r.ManagedResourceStorage Reading _rest_managed.json using ZooKeeperStorageIO:path=/configs/conf1
   [junit4]   2> 951518 INFO  (qtp1553054917-7745) [n:127.0.0.1:41096_solr c:testschemaapi s:shard1 r:core_node2 x:testschemaapi_shard1_replica2] o.a.s.r.ManagedResourceStorage No data found for znode /configs/conf1/_rest_managed.json
   [junit4]   2> 951518 INFO  (qtp1553054917-7745) [n:127.0.0.1:41096_solr c:testschemaapi s:shard1 r:core_node2 x:testschemaapi_shard1_replica2] o.a.s.r.ManagedResourceStorage Loaded null at path _rest_managed.json using ZooKeeperStorageIO:path=/configs/conf1
   [junit4]   2> 951518 INFO  (qtp1553054917-7745) [n:127.0.0.1:41096_solr c:testschemaapi s:shard1 r:core_node2 x:testschemaapi_shard1_replica2] o.a.s.r.RestManager Initializing 0 registered ManagedResources
   [junit4]   2> 951518 INFO  (qtp1553054917-7745) [n:127.0.0.1:41096_solr c:testschemaapi s:shard1 r:core_node2 x:testschemaapi_shard1_replica2] o.a.s.s.ZkIndexSchemaReader Creating ZooKeeper watch for the managed schema at /configs/conf1/managed-schema
   [junit4]   2> 951518 INFO  (qtp1553054917-7745) [n:127.0.0.1:41096_solr c:testschemaapi s:shard1 r:core_node2 x:testschemaapi_shard1_replica2] o.a.s.c.ZkController Added new OnReconnect listener ZkIndexSchemaReader: /configs/conf1/managed-schema, uniqueCoreId: testschemaapi_shard1_replica2:6528917372361
   [junit4]   2> 951519 INFO  (qtp1553054917-7745) [n:127.0.0.1:41096_solr c:testschemaapi s:shard1 r:core_node2 x:testschemaapi_shard1_replica2] o.a.s.h.ReplicationHandler Commits will be reserved for  10000
   [junit4]   2> 951519 INFO  (qtp1553054917-7745) [n:127.0.0.1:41096_solr c:testschemaapi s:shard1 r:core_node2 x:testschemaapi_shard1_replica2] o.a.s.u.UpdateLog Looking up max value of version field to seed version buckets
   [junit4]   2> 951519 INFO  (searcherExecutor-3230-thread-1-processing-r:core_node2 s:shard1 x:testschemaapi_shard1_replica2 n:127.0.0.1:41096_solr c:testschemaapi) [n:127.0.0.1:41096_solr c:testschemaapi s:shard1 r:core_node2 x:testschemaapi_shard1_replica2] o.a.s.c.SolrCore [testschemaapi_shard1_replica2] Registered new searcher Searcher@3599bc36[testschemaapi_shard1_replica2] main{ExitableDirectoryReader(UninvertingDirectoryReader())}
   [junit4]   2> 951519 INFO  (qtp1553054917-7745) [n:127.0.0.1:41096_solr c:testschemaapi s:shard1 r:core_node2 x:testschemaapi_shard1_replica2] o.a.s.u.VersionInfo Refreshing highest value of _version_ for 65536 version buckets from index
   [junit4]   2> 951519 INFO  (qtp1553054917-7745) [n:127.0.0.1:41096_solr c:testschemaapi s:shard1 r:core_node2 x:testschemaapi_shard1_replica2] o.a.s.u.VersionInfo No terms found for _version_, cannot seed version bucket highest value from index
   [junit4]   2> 951519 INFO  (qtp1553054917-7745) [n:127.0.0.1:41096_solr c:testschemaapi s:shard1 r:core_node2 x:testschemaapi_shard1_replica2] o.a.s.u.UpdateLog Could not find max version in index or recent updates, using new clock 1533523246750629888
   [junit4]   2> 951519 INFO  (qtp1049941816-7733) [n:127.0.0.1:36313_solr c:testschemaapi s:shard1 r:core_node1 x:testschemaapi_shard1_replica1] o.a.s.c.LeaderElector Joined leadership election with path: /collections/testschemaapi/leader_elect/shard1/election/95845202834620421-core_node1-n_0000000000
   [junit4]   2> 951519 INFO  (qtp1049941816-7733) [n:127.0.0.1:36313_solr c:testschemaapi s:shard1 r:core_node1 x:testschemaapi_shard1_replica1] o.a.s.c.ShardLeaderElectionContext Running the leader process for shard=shard1 and weAreReplacement=false and leaderVoteWait=10000
   [junit4]   2> 951520 INFO  (qtp1049941816-7733) [n:127.0.0.1:36313_solr c:testschemaapi s:shard1 r:core_node1 x:testschemaapi_shard1_replica1] o.a.s.c.ShardLeaderElectionContext Waiting until we see more replicas up for shard shard1: total=2 found=1 timeoutin=9999ms
   [junit4]   2> 951520 INFO  (OverseerStateUpdate-95845202834620422-127.0.0.1:41096_solr-n_0000000000) [n:127.0.0.1:41096_solr    ] o.a.s.c.Overseer processMessage: queueSize: 1, message = {
   [junit4]   2>   "operation":"leader",
   [junit4]   2>   "shard":"shard1",
   [junit4]   2>   "collection":"testschemaapi"} current state version: 0
   [junit4]   2> 951520 INFO  (qtp1553054917-7745) [n:127.0.0.1:41096_solr c:testschemaapi s:shard1 r:core_node2 x:testschemaapi_shard1_replica2] o.a.s.u.UpdateLog Took 1.0ms to seed version buckets with highest version 1533523246750629888
   [junit4]   2> 951521 INFO  (qtp1553054917-7745) [n:127.0.0.1:41096_solr c:testschemaapi s:shard1 r:core_node2 x:testschemaapi_shard1_replica2] o.a.s.c.ZkController watch zkdir /configs/conf1
   [junit4]   2> 951521 INFO  (qtp1553054917-7745) [n:127.0.0.1:41096_solr c:testschemaapi s:shard1 r:core_node2 x:testschemaapi_shard1_replica2] o.a.s.c.CoreContainer registering core: testschemaapi_shard1_replica2
   [junit4]   2> 951521 INFO  (qtp1553054917-7745) [n:127.0.0.1:41096_solr c:testschemaapi s:shard1 r:core_node2 x:testschemaapi_shard1_replica2] o.a.s.c.ZkController Register replica - core:testschemaapi_shard1_replica2 address:http://127.0.0.1:41096/solr collection:testschemaapi shard:shard1
   [junit4]   2> 951522 INFO  (qtp1553054917-7745) [n:127.0.0.1:41096_solr c:testschemaapi s:shard1 r:core_node2 x:testschemaapi_shard1_replica2] o.a.s.c.LeaderElector Joined leadership election with path: /collections/testschemaapi/leader_elect/shard1/election/95845202834620422-core_node2-n_0000000001
   [junit4]   2> 951522 INFO  (qtp1553054917-7745) [n:127.0.0.1:41096_solr c:testschemaapi s:shard1 r:core_node2 x:testschemaapi_shard1_replica2] o.a.s.c.LeaderElector Watching path /collections/testschemaapi/leader_elect/shard1/election/95845202834620421-core_node1-n_0000000000 to know if I could be the leader
   [junit4]   2> 951621 INFO  (OverseerStateUpdate-95845202834620422-127.0.0.1:41096_solr-n_0000000000) [n:127.0.0.1:41096_solr    ] o.a.s.c.o.ZkStateWriter going to update_collection /collections/testschemaapi/state.json version: 1
   [junit4]   2> 951622 INFO  (zkCallback-1249-thread-1-processing-n:127.0.0.1:41096_solr) [n:127.0.0.1:41096_solr    ] o.a.s.c.c.ZkStateReader A cluster state change: [WatchedEvent state:SyncConnected type:NodeDataChanged path:/collections/testschemaapi/state.json] for collection [testschemaapi] has occurred - updating... (live nodes size: [2])
   [junit4]   2> 951622 INFO  (zkCallback-1248-thread-1-processing-n:127.0.0.1:36313_solr) [n:127.0.0.1:36313_solr    ] o.a.s.c.c.ZkStateReader A cluster state change: [WatchedEvent state:SyncConnected type:NodeDataChanged path:/collections/testschemaapi/state.json] for collection [testschemaapi] has occurred - updating... (live nodes size: [2])
   [junit4]   2> 951622 INFO  (zkCallback-1249-thread-1-processing-n:127.0.0.1:41096_solr) [n:127.0.0.1:41096_solr    ] o.a.s.c.c.ZkStateReader Updating data for [testschemaapi] from [1] to [2]
   [junit4]   2> 951622 INFO  (zkCallback-1248-thread-1-processing-n:127.0.0.1:36313_solr) [n:127.0.0.1:36313_solr    ] o.a.s.c.c.ZkStateReader Updating data for [testschemaapi] from [1] to [2]
   [junit4]   2> 952021 INFO  (qtp1049941816-7733) [n:127.0.0.1:36313_solr c:testschemaapi s:shard1 r:core_node1 x:testschemaapi_shard1_replica1] o.a.s.c.ShardLeaderElectionContext Enough replicas found to continue.
   [junit4]   2> 952021 INFO  (qtp1049941816-7733) [n:127.0.0.1:36313_solr c:testschemaapi s:shard1 r:core_node1 x:testschemaapi_shard1_replica1] o.a.s.c.ShardLeaderElectionContext I may be the new leader - try and sync
   [junit4]   2> 952021 INFO  (qtp1049941816-7733) [n:127.0.0.1:36313_solr c:testschemaapi s:shard1 r:core_node1 x:testschemaapi_shard1_replica1] o.a.s.c.SyncStrategy Sync replicas to http://127.0.0.1:36313/solr/testschemaapi_shard1_replica1/
   [junit4]   2> 952021 INFO  (qtp1049941816-7733) [n:127.0.0.1:36313_solr c:testschemaapi s:shard1 r:core_node1 x:testschemaapi_shard1_replica1] o.a.s.u.PeerSync PeerSync: core=testschemaapi_shard1_replica1 url=http://127.0.0.1:36313/solr START replicas=[http://127.0.0.1:41096/solr/testschemaapi_shard1_replica2/] nUpdates=100
   [junit4]   2> 952021 INFO  (qtp1049941816-7733) [n:127.0.0.1:36313_solr c:testschemaapi s:shard1 r:core_node1 x:testschemaapi_shard1_replica1] o.a.s.u.PeerSync PeerSync: core=testschemaapi_shard1_replica1 url=http://127.0.0.1:36313/solr DONE.  We have no versions.  sync failed.
   [junit4]   2> 952021 INFO  (qtp1049941816-7733) [n:127.0.0.1:36313_solr c:testschemaapi s:shard1 r:core_node1 x:testschemaapi_shard1_replica1] o.a.s.c.SyncStrategy Leader's attempt to sync with shard failed, moving to the next candidate
   [junit4]   2> 952021 INFO  (qtp1049941816-7733) [n:127.0.0.1:36313_solr c:testschemaapi s:shard1 r:core_node1 x:testschemaapi_shard1_replica1] o.a.s.c.ShardLeaderElectionContext We failed sync, but we have no versions - we can't sync in that case - we were active before, so become leader anyway
   [junit4]   2> 952022 INFO  (qtp1049941816-7733) [n:127.0.0.1:36313_solr c:testschemaapi s:shard1 r:core_node1 x:testschemaapi_shard1_replica1] o.a.s.c.c.SolrZkClient makePath: /collections/testschemaapi/leaders/shard1
   [junit4]   2> 952024 INFO  (qtp1553054917-7746) [n:127.0.0.1:41096_solr c:testschemaapi s:shard1 r:core_node2 x:testschemaapi_shard1_replica2] o.a.s.c.S.Request [testschemaapi_shard1_replica2]  webapp=/solr path=/get params={fingerprint=false&qt=/get&getVersions=100&distrib=false&version=2&wt=javabin} status=0 QTime=0
   [junit4]   2> 952024 INFO  (qtp1049941816-7733) [n:127.0.0.1:36313_solr c:testschemaapi s:shard1 r:core_node1 x:testschemaapi_shard1_replica1] o.a.s.c.ShardLeaderElectionContextBase Creating leader registration node /collections/testschemaapi/leaders/shard1/leader after winning as /collections/testschemaapi/leader_elect/shard1/election/95845202834620421-core_node1-n_0000000000
   [junit4]   2> 952025 INFO  (qtp1049941816-7733) [n:127.0.0.1:36313_solr c:testschemaapi s:shard1 r:core_node1 x:testschemaapi_shard1_replica1] o.a.s.c.ShardLeaderElectionContext I am the new leader: http://127.0.0.1:36313/solr/testschemaapi_shard1_replica1/ shard1
   [junit4]   2> 952026 INFO  (OverseerStateUpdate-95845202834620422-127.0.0.1:41096_solr-n_0000000000) [n:127.0.0.1:41096_solr    ] o.a.s.c.Overseer processMessage: queueSize: 1, message = {
   [junit4]   2>   "operation":"leader",
   [junit4]   2>   "shard":"shard1",
   [junit4]   2>   "collection":"testschemaapi",
   [junit4]   2>   "base_url":"http://127.0.0.1:36313/solr",
   [junit4]   2>   "core":"testschemaapi_shard1_replica1",
   [junit4]   2>   "state":"active"} current state version: 0
   [junit4]   2> 952126 INFO  (OverseerStateUpdate-95845202834620422-127.0.0.1:41096_solr-n_0000000000) [n:127.0.0.1:41096_solr    ] o.a.s.c.o.ZkStateWriter going to update_collection /collections/testschemaapi/state.json version: 2
   [junit4]   2> 952127 INFO  (zkCallback-1249-thread-1-processing-n:127.0.0.1:41096_solr) [n:127.0.0.1:41096_solr    ] o.a.s.c.c.ZkStateReader A cluster state change: [WatchedEvent state:SyncConnected type:NodeDataChanged path:/collections/testschemaapi/state.json] for collection [testschemaapi] has occurred - updating... (live nodes size: [2])
   [junit4]   2> 952127 INFO  (zkCallback-1248-thread-1-processing-n:127.0.0.1:36313_solr) [n:127.0.0.1:36313_solr    ] o.a.s.c.c.ZkStateReader A cluster state change: [WatchedEvent state:SyncConnected type:NodeDataChanged path:/collections/testschemaapi/state.json] for collection [testschemaapi] has occurred - updating... (live nodes size: [2])
   [junit4]   2> 952127 INFO  (zkCallback-1249-thread-1-processing-n:127.0.0.1:41096_solr) [n:127.0.0.1:41096_solr    ] o.a.s.c.c.ZkStateReader Updating data for [testschemaapi] from [2] to [3]
   [junit4]   2> 952127 INFO  (zkCallback-1248-thread-1-processing-n:127.0.0.1:36313_solr) [n:127.0.0.1:36313_solr    ] o.a.s.c.c.ZkStateReader Updating data for [testschemaapi] from [2] to [3]
   [junit4]   2> 952176 INFO  (qtp1049941816-7733) [n:127.0.0.1:36313_solr c:testschemaapi s:shard1 r:core_node1 x:testschemaapi_shard1_replica1] o.a.s.c.ZkController We are http://127.0.0.1:36313/solr/testschemaapi_shard1_replica1/ and leader is http://127.0.0.1:36313/solr/testschemaapi_shard1_replica1/
   [junit4]   2> 952176 INFO  (qtp1049941816-7733) [n:127.0.0.1:36313_solr c:testschemaapi s:shard1 r:core_node1 x:testschemaapi_shard1_replica1] o.a.s.c.ZkController No LogReplay needed for core=testschemaapi_shard1_replica1 baseURL=http://127.0.0.1:36313/solr
   [junit4]   2> 952176 INFO  (qtp1049941816-7733) [n:127.0.0.1:36313_solr c:testschemaapi s:shard1 r:core_node1 x:testschemaapi_shard1_replica1] o.a.s.c.ZkController I am the leader, no recovery necessary
   [junit4]   2> 952176 INFO  (qtp1049941816-7733) [n:127.0.0.1:36313_solr c:testschemaapi s:shard1 r:core_node1 x:testschemaapi_shard1_replica1] o.a.s.c.ZkController publishing state=active
   [junit4]   2> 952177 INFO  (OverseerStateUpdate-95845202834620422-127.0.0.1:41096_solr-n_0000000000) [n:127.0.0.1:41096_solr    ] o.a.s.c.Overseer processMessage: queueSize: 1, message = {
   [junit4]   2>   "core_node_name":"core_node1",
   [junit4]   2>   "state":"active",
   [junit4]   2>   "shard":"shard1",
   [junit4]   2>   "core":"testschemaapi_shard1_replica1",
   [junit4]   2>   "numShards":"1",
   [junit4]   2>   "operation":"state",
   [junit4]   2>   "node_name":"127.0.0.1:36313_solr",
   [junit4]   2>   "roles":null,
   [junit4]   2>   "base_url":"http://127.0.0.1:36313/solr",
   [junit4]   2>   "collection":"testschemaapi"} current state version: 0
   [junit4]   2> 952177 INFO  (OverseerStateUpdate-95845202834620422-127.0.0.1:41096_solr-n_0000000000) [n:127.0.0.1:41096_solr    ] o.a.s.c.o.ReplicaMutator Update state numShards=1 message={
   [junit4]   2>   "core_node_name":"core_node1",
   [junit4]   2>   "state":"active",
   [junit4]   2>   "shard":"shard1",
   [junit4]   2>   "core":"testschemaapi_shard1_replica1",
   [junit4]   2>   "numShards":"1",
   [junit4]   2>   "operation":"state",
   [junit4]   2>   "node_name":"127.0.0.1:36313_solr",
   [junit4]   2>   "roles":null,
   [junit4]   2>   "base_url":"http://127.0.0.1:36313/solr",
   [junit4]   2>   "collection":"testschemaapi"}
   [junit4]   2> 952179 INFO  (qtp1049941816-7733) [n:127.0.0.1:36313_solr c:testschemaapi s:shard1 r:core_node1 x:testschemaapi_shard1_replica1] o.a.s.s.HttpSolrCall [admin] webapp=null path=/admin/cores params={shard=shard1&qt=/admin/cores&numShards=1&collection.configName=conf1&name=testschemaapi_shard1_replica1&action=CREATE&version=2&wt=javabin&collection=testschemaapi} status=0 QTime=1720
   [junit4]   2> 952280 INFO  (OverseerStateUpdate-95845202834620422-127.0.0.1:41096_solr-n_0000000000) [n:127.0.0.1:41096_solr    ] o.a.s.c.o.ZkStateWriter going to update_collection /collections/testschemaapi/state.json version: 3
   [junit4]   2> 952280 INFO  (zkCallback-1248-thread-1-processing-n:127.0.0.1:36313_solr) [n:127.0.0.1:36313_solr    ] o.a.s.c.c.ZkStateReader A cluster state change: [WatchedEvent state:SyncConnected type:NodeDataChanged path:/collections/testschemaapi/state.json] for collection [testschemaapi] has occurred - updating... (live nodes size: [2])
   [junit4]   2> 952280 INFO  (zkCallback-1249-thread-1-processing-n:127.0.0.1:41096_solr) [n:127.0.0.1:41096_solr    ] o.a.s.c.c.ZkStateReader A cluster state change: [WatchedEvent state:SyncConnect

[...truncated too long message...]

s/conf1/managed-schema
   [junit4]   2> 	at org.apache.solr.schema.ManagedIndexSchemaFactory.create(ManagedIndexSchemaFactory.java:143)
   [junit4]   2> 	at org.apache.solr.schema.ManagedIndexSchemaFactory.create(ManagedIndexSchemaFactory.java:47)
   [junit4]   2> 	at org.apache.solr.schema.IndexSchemaFactory.buildIndexSchema(IndexSchemaFactory.java:70)
   [junit4]   2> 	at org.apache.solr.core.ConfigSetService.createIndexSchema(ConfigSetService.java:108)
   [junit4]   2> 	at org.apache.solr.core.ConfigSetService.getConfig(ConfigSetService.java:79)
   [junit4]   2> 	... 3 more
   [junit4]   2> Caused by: org.apache.zookeeper.KeeperException$SessionExpiredException: KeeperErrorCode = Session expired for /configs/conf1/managed-schema
   [junit4]   2> 	at org.apache.zookeeper.KeeperException.create(KeeperException.java:127)
   [junit4]   2> 	at org.apache.zookeeper.KeeperException.create(KeeperException.java:51)
   [junit4]   2> 	at org.apache.zookeeper.ZooKeeper.getData(ZooKeeper.java:1155)
   [junit4]   2> 	at org.apache.solr.common.cloud.SolrZkClient$7.execute(SolrZkClient.java:345)
   [junit4]   2> 	at org.apache.solr.common.cloud.SolrZkClient$7.execute(SolrZkClient.java:342)
   [junit4]   2> 	at org.apache.solr.common.cloud.ZkCmdExecutor.retryOperation(ZkCmdExecutor.java:60)
   [junit4]   2> 	at org.apache.solr.common.cloud.SolrZkClient.getData(SolrZkClient.java:342)
   [junit4]   2> 	at org.apache.solr.schema.ManagedIndexSchemaFactory.create(ManagedIndexSchemaFactory.java:128)
   [junit4]   2> 	... 7 more
   [junit4]   2> 963282 WARN  (zkCallback-1249-thread-3-processing-n:127.0.0.1:41096_solr) [n:127.0.0.1:41096_solr    ] o.a.s.c.c.ZkStateReader ZooKeeper watch triggered, but Solr cannot talk to ZK: [KeeperErrorCode = Session expired for /live_nodes]
   [junit4]   2> 963284 INFO  (jetty-launcher-1238-thread-1) [    ] o.e.j.s.h.ContextHandler Stopped o.e.j.s.ServletContextHandler@5f72b16d{/solr,null,UNAVAILABLE}
   [junit4]   2> 963285 INFO  (TEST-TestManagedSchemaAPI.test-seed#[91AE8EA7EC777680]) [    ] o.a.s.c.ZkTestServer connecting to 127.0.0.1:32973 32973
   [junit4]   2> 963316 INFO  (Thread-2631) [    ] o.a.s.c.ZkTestServer connecting to 127.0.0.1:32973 32973
   [junit4]   2> 963317 WARN  (Thread-2631) [    ] o.a.s.c.ZkTestServer Watch limit violations: 
   [junit4]   2> Maximum concurrent create/delete watches above limit:
   [junit4]   2> 
   [junit4]   2> 	6	/solr/configs/conf1/managed-schema
   [junit4]   2> 	6	/solr/configs/conf1
   [junit4]   2> 	3	/solr/aliases.json
   [junit4]   2> 	2	/solr/security.json
   [junit4]   2> 
   [junit4]   2> Maximum concurrent data watches above limit:
   [junit4]   2> 
   [junit4]   2> 	3	/solr/clusterstate.json
   [junit4]   2> 	2	/solr/collections/testschemaapi/state.json
   [junit4]   2> 
   [junit4]   2> Maximum concurrent children watches above limit:
   [junit4]   2> 
   [junit4]   2> 	3	/solr/collections
   [junit4]   2> 	3	/solr/live_nodes
   [junit4]   2> 
   [junit4]   2> 963317 INFO  (TEST-TestManagedSchemaAPI.test-seed#[91AE8EA7EC777680]) [    ] o.a.s.SolrTestCaseJ4 ###Ending test
   [junit4]   2> NOTE: reproduce with: ant test  -Dtestcase=TestManagedSchemaAPI -Dtests.method=test -Dtests.seed=91AE8EA7EC777680 -Dtests.multiplier=3 -Dtests.slow=true -Dtests.locale=ar -Dtests.timezone=America/Curacao -Dtests.asserts=true -Dtests.file.encoding=ISO-8859-1
   [junit4] ERROR   13.1s J2 | TestManagedSchemaAPI.test <<<
   [junit4]    > Throwable #1: org.apache.solr.client.solrj.impl.CloudSolrClient$RouteException: Error from server at http://127.0.0.1:36313/solr/testschemaapi_shard1_replica1: ERROR: [doc=2] unknown field 'myNewField1'
   [junit4]    > 	at __randomizedtesting.SeedInfo.seed([91AE8EA7EC777680:19FAB17D428B1B78]:0)
   [junit4]    > 	at org.apache.solr.client.solrj.impl.CloudSolrClient.directUpdate(CloudSolrClient.java:632)
   [junit4]    > 	at org.apache.solr.client.solrj.impl.CloudSolrClient.sendRequest(CloudSolrClient.java:981)
   [junit4]    > 	at org.apache.solr.client.solrj.impl.CloudSolrClient.requestWithRetryOnStaleState(CloudSolrClient.java:870)
   [junit4]    > 	at org.apache.solr.client.solrj.impl.CloudSolrClient.request(CloudSolrClient.java:806)
   [junit4]    > 	at org.apache.solr.schema.TestManagedSchemaAPI.testAddFieldAndDocument(TestManagedSchemaAPI.java:101)
   [junit4]    > 	at org.apache.solr.schema.TestManagedSchemaAPI.test(TestManagedSchemaAPI.java:69)
   [junit4]    > 	at java.lang.Thread.run(Thread.java:745)
   [junit4]    > Caused by: org.apache.solr.client.solrj.impl.HttpSolrClient$RemoteSolrException: Error from server at http://127.0.0.1:36313/solr/testschemaapi_shard1_replica1: ERROR: [doc=2] unknown field 'myNewField1'
   [junit4]    > 	at org.apache.solr.client.solrj.impl.HttpSolrClient.executeMethod(HttpSolrClient.java:577)
   [junit4]    > 	at org.apache.solr.client.solrj.impl.HttpSolrClient.request(HttpSolrClient.java:241)
   [junit4]    > 	at org.apache.solr.client.solrj.impl.HttpSolrClient.request(HttpSolrClient.java:230)
   [junit4]    > 	at org.apache.solr.client.solrj.impl.LBHttpSolrClient.doRequest(LBHttpSolrClient.java:372)
   [junit4]    > 	at org.apache.solr.client.solrj.impl.LBHttpSolrClient.request(LBHttpSolrClient.java:325)
   [junit4]    > 	at org.apache.solr.client.solrj.impl.CloudSolrClient$2.call(CloudSolrClient.java:607)
   [junit4]    > 	at org.apache.solr.client.solrj.impl.CloudSolrClient$2.call(CloudSolrClient.java:604)
   [junit4]    > 	at java.util.concurrent.FutureTask.run(FutureTask.java:262)
   [junit4]    > 	at org.apache.solr.common.util.ExecutorUtil$MDCAwareThreadPoolExecutor$1.run(ExecutorUtil.java:231)
   [junit4]    > 	at java.util.concurrent.ThreadPoolExecutor.runWorker(ThreadPoolExecutor.java:1145)
   [junit4]    > 	at java.util.concurrent.ThreadPoolExecutor$Worker.run(ThreadPoolExecutor.java:615)
   [junit4]    > 	... 1 more
   [junit4]   2> 963319 INFO  (SUITE-TestManagedSchemaAPI-seed#[91AE8EA7EC777680]-worker) [    ] o.a.s.SolrTestCaseJ4 ###deleteCore
   [junit4]   2> NOTE: leaving temporary files on disk at: /home/jenkins/workspace/Lucene-Solr-5.5-Linux/solr/build/solr-core/test/J2/temp/solr.schema.TestManagedSchemaAPI_91AE8EA7EC777680-001
   [junit4]   2> May 05, 2016 8:55:45 PM com.carrotsearch.randomizedtesting.ThreadLeakControl checkThreadLeaks
   [junit4]   2> WARNING: Will linger awaiting termination of 1 leaked thread(s).
   [junit4]   2> NOTE: test params are: codec=CheapBastard, sim=RandomSimilarity(queryNorm=false,coord=yes): {}, locale=ar, timezone=America/Curacao
   [junit4]   2> NOTE: Linux 4.4.0-21-generic amd64/Oracle Corporation 1.7.0_80 (64-bit)/cpus=12,threads=1,free=176153440,total=518979584
   [junit4]   2> NOTE: All tests run in this JVM: [FullSolrCloudDistribCmdsTest, SuggesterTest, HardAutoCommitTest, ExitableDirectoryReaderTest, TestFuzzyAnalyzedSuggestions, TestConfigSets, TestOverriddenPrefixQueryForCustomFieldType, FieldAnalysisRequestHandlerTest, TestSchemaResource, TestHdfsUpdateLog, TestCryptoKeys, SmileWriterTest, TestPostingsSolrHighlighter, BasicDistributedZk2Test, ZkStateReaderTest, HdfsLockFactoryTest, TestMaxScoreQueryParser, TestZkChroot, TestSolrDynamicMBean, AtomicUpdatesTest, TestExtendedDismaxParser, OverseerTest, TestReqParamsAPI, WrapperMergePolicyFactoryTest, TestReloadAndDeleteDocs, TestAnalyzeInfixSuggestions, TestIndexingPerformance, SolrXmlInZkTest, TestTolerantSearch, BadIndexSchemaTest, StatelessScriptUpdateProcessorFactoryTest, BlockDirectoryTest, LeaderElectionTest, PluginInfoTest, DocValuesMissingTest, SaslZkACLProviderTest, HdfsWriteToMultipleCollectionsTest, UnloadDistributedZkTest, AssignTest, BlockJoinFacetSimpleTest, TestReRankQParserPlugin, StatsComponentTest, TestCollapseQParserPlugin, RequestHandlersTest, CoreMergeIndexesAdminHandlerTest, SampleTest, DocValuesMultiTest, TestSearcherReuse, TestTestInjection, DirectUpdateHandlerTest, TestBulkSchemaAPI, DistributedFacetPivotLargeTest, TestDistribIDF, DateMathParserTest, DistributedFacetPivotSmallTest, TestTrackingShardHandlerFactory, TestInfoStreamLogging, RulesTest, ClusterStateTest, PrimitiveFieldTypeTest, CollectionReloadTest, TestConfigOverlay, TestStressReorder, TestReload, TestSolr4Spatial2, HdfsChaosMonkeySafeLeaderTest, TestSolrQueryParser, TestSolrConfigHandlerConcurrent, HttpPartitionTest, TestPerFieldSimilarityWithDefaultOverride, TestFieldSortValues, TestChildDocTransformer, SpatialHeatmapFacetsTest, TermVectorComponentDistributedTest, TestSolrIndexConfig, TestExclusionRuleCollectionAccess, TestUseDocValuesAsStored2, TestPHPSerializedResponseWriter, TestRawTransformer, SuggesterTSTTest, HLLSerializationTest, TestSearchPerf, TestUtils, TestManagedSchemaAPI]
   [junit4] Completed [217/572 (1!)] on J2 in 13.40s, 1 test, 1 error <<< FAILURES!

[...truncated 1115 lines...]
BUILD FAILED
/home/jenkins/workspace/Lucene-Solr-5.5-Linux/build.xml:750: The following error occurred while executing this line:
/home/jenkins/workspace/Lucene-Solr-5.5-Linux/build.xml:694: The following error occurred while executing this line:
/home/jenkins/workspace/Lucene-Solr-5.5-Linux/build.xml:59: The following error occurred while executing this line:
/home/jenkins/workspace/Lucene-Solr-5.5-Linux/solr/build.xml:233: The following error occurred while executing this line:
/home/jenkins/workspace/Lucene-Solr-5.5-Linux/solr/common-build.xml:534: The following error occurred while executing this line:
/home/jenkins/workspace/Lucene-Solr-5.5-Linux/lucene/common-build.xml:1477: The following error occurred while executing this line:
/home/jenkins/workspace/Lucene-Solr-5.5-Linux/lucene/common-build.xml:1033: There were test failures: 572 suites (7 ignored), 2293 tests, 1 error, 84 ignored (39 assumptions) [seed: 91AE8EA7EC777680]

Total time: 55 minutes 30 seconds
Build step 'Invoke Ant' marked build as failure
Archiving artifacts
[WARNINGS] Skipping publisher since build result is FAILURE
Recording test results
Email was triggered for: Failure - Any
Sending email for trigger: Failure - Any



Mime
View raw message