lucene-dev mailing list archives

Site index · List index
Message view « Date » · « Thread »
Top « Date » · « Thread »
From Policeman Jenkins Server <jenk...@thetaphi.de>
Subject [JENKINS] Lucene-Solr-master-MacOSX (64bit/jdk1.8.0) - Build # 3269 - Still Failing!
Date Sat, 14 May 2016 06:36:55 GMT
Build: http://jenkins.thetaphi.de/job/Lucene-Solr-master-MacOSX/3269/
Java: 64bit/jdk1.8.0 -XX:-UseCompressedOops -XX:+UseSerialGC

2 tests failed.
FAILED:  org.apache.solr.cloud.DistribDocExpirationUpdateProcessorTest.test

Error Message:
There are still nodes recoverying - waited for 45 seconds

Stack Trace:
java.lang.AssertionError: There are still nodes recoverying - waited for 45 seconds
	at __randomizedtesting.SeedInfo.seed([F1321BEA46285929:79662430E8D434D1]:0)
	at org.junit.Assert.fail(Assert.java:93)
	at org.apache.solr.cloud.AbstractDistribZkTestBase.waitForRecoveriesToFinish(AbstractDistribZkTestBase.java:182)
	at org.apache.solr.cloud.AbstractFullDistribZkTestBase.waitForRecoveriesToFinish(AbstractFullDistribZkTestBase.java:858)
	at org.apache.solr.cloud.DistribDocExpirationUpdateProcessorTest.test(DistribDocExpirationUpdateProcessorTest.java:74)
	at sun.reflect.NativeMethodAccessorImpl.invoke0(Native Method)
	at sun.reflect.NativeMethodAccessorImpl.invoke(NativeMethodAccessorImpl.java:62)
	at sun.reflect.DelegatingMethodAccessorImpl.invoke(DelegatingMethodAccessorImpl.java:43)
	at java.lang.reflect.Method.invoke(Method.java:498)
	at com.carrotsearch.randomizedtesting.RandomizedRunner.invoke(RandomizedRunner.java:1764)
	at com.carrotsearch.randomizedtesting.RandomizedRunner$8.evaluate(RandomizedRunner.java:871)
	at com.carrotsearch.randomizedtesting.RandomizedRunner$9.evaluate(RandomizedRunner.java:907)
	at com.carrotsearch.randomizedtesting.RandomizedRunner$10.evaluate(RandomizedRunner.java:921)
	at org.apache.solr.BaseDistributedSearchTestCase$ShardsRepeatRule$ShardsFixedStatement.callStatement(BaseDistributedSearchTestCase.java:985)
	at org.apache.solr.BaseDistributedSearchTestCase$ShardsRepeatRule$ShardsStatement.evaluate(BaseDistributedSearchTestCase.java:960)
	at com.carrotsearch.randomizedtesting.rules.SystemPropertiesRestoreRule$1.evaluate(SystemPropertiesRestoreRule.java:57)
	at org.apache.lucene.util.TestRuleSetupTeardownChained$1.evaluate(TestRuleSetupTeardownChained.java:49)
	at org.apache.lucene.util.AbstractBeforeAfterRule$1.evaluate(AbstractBeforeAfterRule.java:45)
	at org.apache.lucene.util.TestRuleThreadAndTestName$1.evaluate(TestRuleThreadAndTestName.java:48)
	at org.apache.lucene.util.TestRuleIgnoreAfterMaxFailures$1.evaluate(TestRuleIgnoreAfterMaxFailures.java:64)
	at org.apache.lucene.util.TestRuleMarkFailure$1.evaluate(TestRuleMarkFailure.java:47)
	at com.carrotsearch.randomizedtesting.rules.StatementAdapter.evaluate(StatementAdapter.java:36)
	at com.carrotsearch.randomizedtesting.ThreadLeakControl$StatementRunner.run(ThreadLeakControl.java:367)
	at com.carrotsearch.randomizedtesting.ThreadLeakControl.forkTimeoutingTask(ThreadLeakControl.java:809)
	at com.carrotsearch.randomizedtesting.ThreadLeakControl$3.evaluate(ThreadLeakControl.java:460)
	at com.carrotsearch.randomizedtesting.RandomizedRunner.runSingleTest(RandomizedRunner.java:880)
	at com.carrotsearch.randomizedtesting.RandomizedRunner$5.evaluate(RandomizedRunner.java:781)
	at com.carrotsearch.randomizedtesting.RandomizedRunner$6.evaluate(RandomizedRunner.java:816)
	at com.carrotsearch.randomizedtesting.RandomizedRunner$7.evaluate(RandomizedRunner.java:827)
	at com.carrotsearch.randomizedtesting.rules.StatementAdapter.evaluate(StatementAdapter.java:36)
	at com.carrotsearch.randomizedtesting.rules.SystemPropertiesRestoreRule$1.evaluate(SystemPropertiesRestoreRule.java:57)
	at org.apache.lucene.util.AbstractBeforeAfterRule$1.evaluate(AbstractBeforeAfterRule.java:45)
	at com.carrotsearch.randomizedtesting.rules.StatementAdapter.evaluate(StatementAdapter.java:36)
	at org.apache.lucene.util.TestRuleStoreClassName$1.evaluate(TestRuleStoreClassName.java:41)
	at com.carrotsearch.randomizedtesting.rules.NoShadowingOrOverridesOnMethodsRule$1.evaluate(NoShadowingOrOverridesOnMethodsRule.java:40)
	at com.carrotsearch.randomizedtesting.rules.NoShadowingOrOverridesOnMethodsRule$1.evaluate(NoShadowingOrOverridesOnMethodsRule.java:40)
	at com.carrotsearch.randomizedtesting.rules.StatementAdapter.evaluate(StatementAdapter.java:36)
	at com.carrotsearch.randomizedtesting.rules.StatementAdapter.evaluate(StatementAdapter.java:36)
	at com.carrotsearch.randomizedtesting.rules.StatementAdapter.evaluate(StatementAdapter.java:36)
	at org.apache.lucene.util.TestRuleAssertionsRequired$1.evaluate(TestRuleAssertionsRequired.java:53)
	at org.apache.lucene.util.TestRuleMarkFailure$1.evaluate(TestRuleMarkFailure.java:47)
	at org.apache.lucene.util.TestRuleIgnoreAfterMaxFailures$1.evaluate(TestRuleIgnoreAfterMaxFailures.java:64)
	at org.apache.lucene.util.TestRuleIgnoreTestSuites$1.evaluate(TestRuleIgnoreTestSuites.java:54)
	at com.carrotsearch.randomizedtesting.rules.StatementAdapter.evaluate(StatementAdapter.java:36)
	at com.carrotsearch.randomizedtesting.ThreadLeakControl$StatementRunner.run(ThreadLeakControl.java:367)
	at java.lang.Thread.run(Thread.java:745)


FAILED:  org.apache.solr.handler.TestReplicationHandler.doTestIndexAndConfigAliasReplication

Error Message:
expected:<1> but was:<0>

Stack Trace:
java.lang.AssertionError: expected:<1> but was:<0>
	at __randomizedtesting.SeedInfo.seed([F1321BEA46285929:641F5B280C0F6CF]:0)
	at org.junit.Assert.fail(Assert.java:93)
	at org.junit.Assert.failNotEquals(Assert.java:647)
	at org.junit.Assert.assertEquals(Assert.java:128)
	at org.junit.Assert.assertEquals(Assert.java:472)
	at org.junit.Assert.assertEquals(Assert.java:456)
	at org.apache.solr.handler.TestReplicationHandler.doTestIndexAndConfigAliasReplication(TestReplicationHandler.java:1327)
	at sun.reflect.NativeMethodAccessorImpl.invoke0(Native Method)
	at sun.reflect.NativeMethodAccessorImpl.invoke(NativeMethodAccessorImpl.java:62)
	at sun.reflect.DelegatingMethodAccessorImpl.invoke(DelegatingMethodAccessorImpl.java:43)
	at java.lang.reflect.Method.invoke(Method.java:498)
	at com.carrotsearch.randomizedtesting.RandomizedRunner.invoke(RandomizedRunner.java:1764)
	at com.carrotsearch.randomizedtesting.RandomizedRunner$8.evaluate(RandomizedRunner.java:871)
	at com.carrotsearch.randomizedtesting.RandomizedRunner$9.evaluate(RandomizedRunner.java:907)
	at com.carrotsearch.randomizedtesting.RandomizedRunner$10.evaluate(RandomizedRunner.java:921)
	at com.carrotsearch.randomizedtesting.rules.SystemPropertiesRestoreRule$1.evaluate(SystemPropertiesRestoreRule.java:57)
	at org.apache.lucene.util.TestRuleSetupTeardownChained$1.evaluate(TestRuleSetupTeardownChained.java:49)
	at org.apache.lucene.util.AbstractBeforeAfterRule$1.evaluate(AbstractBeforeAfterRule.java:45)
	at org.apache.lucene.util.TestRuleThreadAndTestName$1.evaluate(TestRuleThreadAndTestName.java:48)
	at org.apache.lucene.util.TestRuleIgnoreAfterMaxFailures$1.evaluate(TestRuleIgnoreAfterMaxFailures.java:64)
	at org.apache.lucene.util.TestRuleMarkFailure$1.evaluate(TestRuleMarkFailure.java:47)
	at com.carrotsearch.randomizedtesting.rules.StatementAdapter.evaluate(StatementAdapter.java:36)
	at com.carrotsearch.randomizedtesting.ThreadLeakControl$StatementRunner.run(ThreadLeakControl.java:367)
	at com.carrotsearch.randomizedtesting.ThreadLeakControl.forkTimeoutingTask(ThreadLeakControl.java:809)
	at com.carrotsearch.randomizedtesting.ThreadLeakControl$3.evaluate(ThreadLeakControl.java:460)
	at com.carrotsearch.randomizedtesting.RandomizedRunner.runSingleTest(RandomizedRunner.java:880)
	at com.carrotsearch.randomizedtesting.RandomizedRunner$5.evaluate(RandomizedRunner.java:781)
	at com.carrotsearch.randomizedtesting.RandomizedRunner$6.evaluate(RandomizedRunner.java:816)
	at com.carrotsearch.randomizedtesting.RandomizedRunner$7.evaluate(RandomizedRunner.java:827)
	at com.carrotsearch.randomizedtesting.rules.StatementAdapter.evaluate(StatementAdapter.java:36)
	at com.carrotsearch.randomizedtesting.rules.SystemPropertiesRestoreRule$1.evaluate(SystemPropertiesRestoreRule.java:57)
	at org.apache.lucene.util.AbstractBeforeAfterRule$1.evaluate(AbstractBeforeAfterRule.java:45)
	at com.carrotsearch.randomizedtesting.rules.StatementAdapter.evaluate(StatementAdapter.java:36)
	at org.apache.lucene.util.TestRuleStoreClassName$1.evaluate(TestRuleStoreClassName.java:41)
	at com.carrotsearch.randomizedtesting.rules.NoShadowingOrOverridesOnMethodsRule$1.evaluate(NoShadowingOrOverridesOnMethodsRule.java:40)
	at com.carrotsearch.randomizedtesting.rules.NoShadowingOrOverridesOnMethodsRule$1.evaluate(NoShadowingOrOverridesOnMethodsRule.java:40)
	at com.carrotsearch.randomizedtesting.rules.StatementAdapter.evaluate(StatementAdapter.java:36)
	at com.carrotsearch.randomizedtesting.rules.StatementAdapter.evaluate(StatementAdapter.java:36)
	at com.carrotsearch.randomizedtesting.rules.StatementAdapter.evaluate(StatementAdapter.java:36)
	at org.apache.lucene.util.TestRuleAssertionsRequired$1.evaluate(TestRuleAssertionsRequired.java:53)
	at org.apache.lucene.util.TestRuleMarkFailure$1.evaluate(TestRuleMarkFailure.java:47)
	at org.apache.lucene.util.TestRuleIgnoreAfterMaxFailures$1.evaluate(TestRuleIgnoreAfterMaxFailures.java:64)
	at org.apache.lucene.util.TestRuleIgnoreTestSuites$1.evaluate(TestRuleIgnoreTestSuites.java:54)
	at com.carrotsearch.randomizedtesting.rules.StatementAdapter.evaluate(StatementAdapter.java:36)
	at com.carrotsearch.randomizedtesting.ThreadLeakControl$StatementRunner.run(ThreadLeakControl.java:367)
	at java.lang.Thread.run(Thread.java:745)




Build Log:
[...truncated 10732 lines...]
   [junit4] Suite: org.apache.solr.cloud.DistribDocExpirationUpdateProcessorTest
   [junit4]   2> Creating dataDir: /Users/jenkins/workspace/Lucene-Solr-master-MacOSX/solr/build/solr-core/test/J1/temp/solr.cloud.DistribDocExpirationUpdateProcessorTest_F1321BEA46285929-001/init-core-data-001
   [junit4]   2> 524396 INFO  (SUITE-DistribDocExpirationUpdateProcessorTest-seed#[F1321BEA46285929]-worker) [    ] o.a.s.SolrTestCaseJ4 Randomized ssl (false) and clientAuth (false)
   [junit4]   2> 524400 INFO  (SUITE-DistribDocExpirationUpdateProcessorTest-seed#[F1321BEA46285929]-worker) [    ] o.a.s.BaseDistributedSearchTestCase Setting hostContext system property: /qlrf/
   [junit4]   2> 524406 INFO  (TEST-DistribDocExpirationUpdateProcessorTest.test-seed#[F1321BEA46285929]) [    ] o.a.s.c.ZkTestServer STARTING ZK TEST SERVER
   [junit4]   2> 524407 INFO  (Thread-1069) [    ] o.a.s.c.ZkTestServer client port:0.0.0.0/0.0.0.0:0
   [junit4]   2> 524407 INFO  (Thread-1069) [    ] o.a.s.c.ZkTestServer Starting server
   [junit4]   2> 524516 INFO  (TEST-DistribDocExpirationUpdateProcessorTest.test-seed#[F1321BEA46285929]) [    ] o.a.s.c.ZkTestServer start zk server on port:53561
   [junit4]   2> 524517 INFO  (TEST-DistribDocExpirationUpdateProcessorTest.test-seed#[F1321BEA46285929]) [    ] o.a.s.c.c.SolrZkClient Using default ZkCredentialsProvider
   [junit4]   2> 524517 INFO  (TEST-DistribDocExpirationUpdateProcessorTest.test-seed#[F1321BEA46285929]) [    ] o.a.s.c.c.ConnectionManager Waiting for client to connect to ZooKeeper
   [junit4]   2> 524526 INFO  (zkCallback-653-thread-1) [    ] o.a.s.c.c.ConnectionManager Watcher org.apache.solr.common.cloud.ConnectionManager@3ecd9687 name:ZooKeeperConnection Watcher:127.0.0.1:53561 got event WatchedEvent state:SyncConnected type:None path:null path:null type:None
   [junit4]   2> 524526 INFO  (TEST-DistribDocExpirationUpdateProcessorTest.test-seed#[F1321BEA46285929]) [    ] o.a.s.c.c.ConnectionManager Client is connected to ZooKeeper
   [junit4]   2> 524526 INFO  (TEST-DistribDocExpirationUpdateProcessorTest.test-seed#[F1321BEA46285929]) [    ] o.a.s.c.c.SolrZkClient Using default ZkACLProvider
   [junit4]   2> 524526 INFO  (TEST-DistribDocExpirationUpdateProcessorTest.test-seed#[F1321BEA46285929]) [    ] o.a.s.c.c.SolrZkClient makePath: /solr
   [junit4]   2> 524529 INFO  (TEST-DistribDocExpirationUpdateProcessorTest.test-seed#[F1321BEA46285929]) [    ] o.a.s.c.c.SolrZkClient Using default ZkCredentialsProvider
   [junit4]   2> 524530 INFO  (TEST-DistribDocExpirationUpdateProcessorTest.test-seed#[F1321BEA46285929]) [    ] o.a.s.c.c.ConnectionManager Waiting for client to connect to ZooKeeper
   [junit4]   2> 524531 INFO  (zkCallback-654-thread-1) [    ] o.a.s.c.c.ConnectionManager Watcher org.apache.solr.common.cloud.ConnectionManager@6c2ee69e name:ZooKeeperConnection Watcher:127.0.0.1:53561/solr got event WatchedEvent state:SyncConnected type:None path:null path:null type:None
   [junit4]   2> 524532 INFO  (TEST-DistribDocExpirationUpdateProcessorTest.test-seed#[F1321BEA46285929]) [    ] o.a.s.c.c.ConnectionManager Client is connected to ZooKeeper
   [junit4]   2> 524532 INFO  (TEST-DistribDocExpirationUpdateProcessorTest.test-seed#[F1321BEA46285929]) [    ] o.a.s.c.c.SolrZkClient Using default ZkACLProvider
   [junit4]   2> 524532 INFO  (TEST-DistribDocExpirationUpdateProcessorTest.test-seed#[F1321BEA46285929]) [    ] o.a.s.c.c.SolrZkClient makePath: /collections/collection1
   [junit4]   2> 524534 INFO  (TEST-DistribDocExpirationUpdateProcessorTest.test-seed#[F1321BEA46285929]) [    ] o.a.s.c.c.SolrZkClient makePath: /collections/collection1/shards
   [junit4]   2> 524537 INFO  (TEST-DistribDocExpirationUpdateProcessorTest.test-seed#[F1321BEA46285929]) [    ] o.a.s.c.c.SolrZkClient makePath: /collections/control_collection
   [junit4]   2> 524539 INFO  (TEST-DistribDocExpirationUpdateProcessorTest.test-seed#[F1321BEA46285929]) [    ] o.a.s.c.c.SolrZkClient makePath: /collections/control_collection/shards
   [junit4]   2> 524542 INFO  (TEST-DistribDocExpirationUpdateProcessorTest.test-seed#[F1321BEA46285929]) [    ] o.a.s.c.AbstractZkTestCase put /Users/jenkins/workspace/Lucene-Solr-master-MacOSX/solr/core/src/test-files/solr/collection1/conf/solrconfig-doc-expire-update-processor.xml to /configs/conf1/solrconfig.xml
   [junit4]   2> 524542 INFO  (TEST-DistribDocExpirationUpdateProcessorTest.test-seed#[F1321BEA46285929]) [    ] o.a.s.c.c.SolrZkClient makePath: /configs/conf1/solrconfig.xml
   [junit4]   2> 524546 INFO  (TEST-DistribDocExpirationUpdateProcessorTest.test-seed#[F1321BEA46285929]) [    ] o.a.s.c.AbstractZkTestCase put /Users/jenkins/workspace/Lucene-Solr-master-MacOSX/solr/core/src/test-files/solr/collection1/conf/schema15.xml to /configs/conf1/schema.xml
   [junit4]   2> 524546 INFO  (TEST-DistribDocExpirationUpdateProcessorTest.test-seed#[F1321BEA46285929]) [    ] o.a.s.c.c.SolrZkClient makePath: /configs/conf1/schema.xml
   [junit4]   2> 524549 INFO  (TEST-DistribDocExpirationUpdateProcessorTest.test-seed#[F1321BEA46285929]) [    ] o.a.s.c.AbstractZkTestCase put /Users/jenkins/workspace/Lucene-Solr-master-MacOSX/solr/core/src/test-files/solr/collection1/conf/solrconfig.snippet.randomindexconfig.xml to /configs/conf1/solrconfig.snippet.randomindexconfig.xml
   [junit4]   2> 524549 INFO  (TEST-DistribDocExpirationUpdateProcessorTest.test-seed#[F1321BEA46285929]) [    ] o.a.s.c.c.SolrZkClient makePath: /configs/conf1/solrconfig.snippet.randomindexconfig.xml
   [junit4]   2> 524553 INFO  (TEST-DistribDocExpirationUpdateProcessorTest.test-seed#[F1321BEA46285929]) [    ] o.a.s.c.AbstractZkTestCase put /Users/jenkins/workspace/Lucene-Solr-master-MacOSX/solr/core/src/test-files/solr/collection1/conf/stopwords.txt to /configs/conf1/stopwords.txt
   [junit4]   2> 524553 INFO  (TEST-DistribDocExpirationUpdateProcessorTest.test-seed#[F1321BEA46285929]) [    ] o.a.s.c.c.SolrZkClient makePath: /configs/conf1/stopwords.txt
   [junit4]   2> 524556 INFO  (TEST-DistribDocExpirationUpdateProcessorTest.test-seed#[F1321BEA46285929]) [    ] o.a.s.c.AbstractZkTestCase put /Users/jenkins/workspace/Lucene-Solr-master-MacOSX/solr/core/src/test-files/solr/collection1/conf/protwords.txt to /configs/conf1/protwords.txt
   [junit4]   2> 524556 INFO  (TEST-DistribDocExpirationUpdateProcessorTest.test-seed#[F1321BEA46285929]) [    ] o.a.s.c.c.SolrZkClient makePath: /configs/conf1/protwords.txt
   [junit4]   2> 524559 INFO  (TEST-DistribDocExpirationUpdateProcessorTest.test-seed#[F1321BEA46285929]) [    ] o.a.s.c.AbstractZkTestCase put /Users/jenkins/workspace/Lucene-Solr-master-MacOSX/solr/core/src/test-files/solr/collection1/conf/currency.xml to /configs/conf1/currency.xml
   [junit4]   2> 524559 INFO  (TEST-DistribDocExpirationUpdateProcessorTest.test-seed#[F1321BEA46285929]) [    ] o.a.s.c.c.SolrZkClient makePath: /configs/conf1/currency.xml
   [junit4]   2> 524562 INFO  (TEST-DistribDocExpirationUpdateProcessorTest.test-seed#[F1321BEA46285929]) [    ] o.a.s.c.AbstractZkTestCase put /Users/jenkins/workspace/Lucene-Solr-master-MacOSX/solr/core/src/test-files/solr/collection1/conf/enumsConfig.xml to /configs/conf1/enumsConfig.xml
   [junit4]   2> 524563 INFO  (TEST-DistribDocExpirationUpdateProcessorTest.test-seed#[F1321BEA46285929]) [    ] o.a.s.c.c.SolrZkClient makePath: /configs/conf1/enumsConfig.xml
   [junit4]   2> 524565 INFO  (TEST-DistribDocExpirationUpdateProcessorTest.test-seed#[F1321BEA46285929]) [    ] o.a.s.c.AbstractZkTestCase put /Users/jenkins/workspace/Lucene-Solr-master-MacOSX/solr/core/src/test-files/solr/collection1/conf/open-exchange-rates.json to /configs/conf1/open-exchange-rates.json
   [junit4]   2> 524565 INFO  (TEST-DistribDocExpirationUpdateProcessorTest.test-seed#[F1321BEA46285929]) [    ] o.a.s.c.c.SolrZkClient makePath: /configs/conf1/open-exchange-rates.json
   [junit4]   2> 524568 INFO  (TEST-DistribDocExpirationUpdateProcessorTest.test-seed#[F1321BEA46285929]) [    ] o.a.s.c.AbstractZkTestCase put /Users/jenkins/workspace/Lucene-Solr-master-MacOSX/solr/core/src/test-files/solr/collection1/conf/mapping-ISOLatin1Accent.txt to /configs/conf1/mapping-ISOLatin1Accent.txt
   [junit4]   2> 524568 INFO  (TEST-DistribDocExpirationUpdateProcessorTest.test-seed#[F1321BEA46285929]) [    ] o.a.s.c.c.SolrZkClient makePath: /configs/conf1/mapping-ISOLatin1Accent.txt
   [junit4]   2> 524571 INFO  (TEST-DistribDocExpirationUpdateProcessorTest.test-seed#[F1321BEA46285929]) [    ] o.a.s.c.AbstractZkTestCase put /Users/jenkins/workspace/Lucene-Solr-master-MacOSX/solr/core/src/test-files/solr/collection1/conf/old_synonyms.txt to /configs/conf1/old_synonyms.txt
   [junit4]   2> 524571 INFO  (TEST-DistribDocExpirationUpdateProcessorTest.test-seed#[F1321BEA46285929]) [    ] o.a.s.c.c.SolrZkClient makePath: /configs/conf1/old_synonyms.txt
   [junit4]   2> 524575 INFO  (TEST-DistribDocExpirationUpdateProcessorTest.test-seed#[F1321BEA46285929]) [    ] o.a.s.c.AbstractZkTestCase put /Users/jenkins/workspace/Lucene-Solr-master-MacOSX/solr/core/src/test-files/solr/collection1/conf/synonyms.txt to /configs/conf1/synonyms.txt
   [junit4]   2> 524575 INFO  (TEST-DistribDocExpirationUpdateProcessorTest.test-seed#[F1321BEA46285929]) [    ] o.a.s.c.c.SolrZkClient makePath: /configs/conf1/synonyms.txt
   [junit4]   2> 524877 INFO  (TEST-DistribDocExpirationUpdateProcessorTest.test-seed#[F1321BEA46285929]) [    ] o.a.s.SolrTestCaseJ4 Writing core.properties file to /Users/jenkins/workspace/Lucene-Solr-master-MacOSX/solr/build/solr-core/test/J1/temp/solr.cloud.DistribDocExpirationUpdateProcessorTest_F1321BEA46285929-001/control-001/cores/collection1
   [junit4]   2> 524879 INFO  (TEST-DistribDocExpirationUpdateProcessorTest.test-seed#[F1321BEA46285929]) [    ] o.e.j.s.Server jetty-9.3.8.v20160314
   [junit4]   2> 524889 INFO  (TEST-DistribDocExpirationUpdateProcessorTest.test-seed#[F1321BEA46285929]) [    ] o.e.j.s.h.ContextHandler Started o.e.j.s.ServletContextHandler@315adb9c{/qlrf,null,AVAILABLE}
   [junit4]   2> 524892 INFO  (TEST-DistribDocExpirationUpdateProcessorTest.test-seed#[F1321BEA46285929]) [    ] o.e.j.s.ServerConnector Started ServerConnector@69ab8763{HTTP/1.1,[http/1.1]}{127.0.0.1:53564}
   [junit4]   2> 524892 INFO  (TEST-DistribDocExpirationUpdateProcessorTest.test-seed#[F1321BEA46285929]) [    ] o.e.j.s.Server Started @530012ms
   [junit4]   2> 524892 INFO  (TEST-DistribDocExpirationUpdateProcessorTest.test-seed#[F1321BEA46285929]) [    ] o.a.s.c.s.e.JettySolrRunner Jetty properties: {solr.data.dir=/Users/jenkins/workspace/Lucene-Solr-master-MacOSX/solr/build/solr-core/test/J1/temp/solr.cloud.DistribDocExpirationUpdateProcessorTest_F1321BEA46285929-001/tempDir-001/control/data, hostContext=/qlrf, hostPort=53564, coreRootDirectory=/Users/jenkins/workspace/Lucene-Solr-master-MacOSX/solr/build/solr-core/test/J1/temp/solr.cloud.DistribDocExpirationUpdateProcessorTest_F1321BEA46285929-001/control-001/cores}
   [junit4]   2> 524892 INFO  (TEST-DistribDocExpirationUpdateProcessorTest.test-seed#[F1321BEA46285929]) [    ] o.a.s.s.SolrDispatchFilter SolrDispatchFilter.init(): sun.misc.Launcher$AppClassLoader@4554617c
   [junit4]   2> 524893 INFO  (TEST-DistribDocExpirationUpdateProcessorTest.test-seed#[F1321BEA46285929]) [    ] o.a.s.c.SolrResourceLoader new SolrResourceLoader for directory: '/Users/jenkins/workspace/Lucene-Solr-master-MacOSX/solr/build/solr-core/test/J1/temp/solr.cloud.DistribDocExpirationUpdateProcessorTest_F1321BEA46285929-001/control-001'
   [junit4]   2> 524893 INFO  (TEST-DistribDocExpirationUpdateProcessorTest.test-seed#[F1321BEA46285929]) [    ] o.a.s.c.SolrResourceLoader JNDI not configured for solr (NoInitialContextEx)
   [junit4]   2> 524893 INFO  (TEST-DistribDocExpirationUpdateProcessorTest.test-seed#[F1321BEA46285929]) [    ] o.a.s.c.SolrResourceLoader solr home defaulted to 'solr/' (could not find system property or JNDI)
   [junit4]   2> 524893 INFO  (TEST-DistribDocExpirationUpdateProcessorTest.test-seed#[F1321BEA46285929]) [    ] o.a.s.c.c.SolrZkClient Using default ZkCredentialsProvider
   [junit4]   2> 524894 INFO  (TEST-DistribDocExpirationUpdateProcessorTest.test-seed#[F1321BEA46285929]) [    ] o.a.s.c.c.ConnectionManager Waiting for client to connect to ZooKeeper
   [junit4]   2> 524895 INFO  (zkCallback-655-thread-1) [    ] o.a.s.c.c.ConnectionManager Watcher org.apache.solr.common.cloud.ConnectionManager@471710e4 name:ZooKeeperConnection Watcher:127.0.0.1:53561/solr got event WatchedEvent state:SyncConnected type:None path:null path:null type:None
   [junit4]   2> 524895 INFO  (TEST-DistribDocExpirationUpdateProcessorTest.test-seed#[F1321BEA46285929]) [    ] o.a.s.c.c.ConnectionManager Client is connected to ZooKeeper
   [junit4]   2> 524896 INFO  (TEST-DistribDocExpirationUpdateProcessorTest.test-seed#[F1321BEA46285929]) [    ] o.a.s.c.c.SolrZkClient Using default ZkACLProvider
   [junit4]   2> 524897 INFO  (TEST-DistribDocExpirationUpdateProcessorTest.test-seed#[F1321BEA46285929]) [    ] o.a.s.s.SolrDispatchFilter Loading solr.xml from SolrHome (not found in ZooKeeper)
   [junit4]   2> 524897 INFO  (TEST-DistribDocExpirationUpdateProcessorTest.test-seed#[F1321BEA46285929]) [    ] o.a.s.c.SolrXmlConfig Loading container configuration from /Users/jenkins/workspace/Lucene-Solr-master-MacOSX/solr/build/solr-core/test/J1/temp/solr.cloud.DistribDocExpirationUpdateProcessorTest_F1321BEA46285929-001/control-001/solr.xml
   [junit4]   2> 524950 INFO  (TEST-DistribDocExpirationUpdateProcessorTest.test-seed#[F1321BEA46285929]) [    ] o.a.s.c.CorePropertiesLocator Config-defined core root directory: /Users/jenkins/workspace/Lucene-Solr-master-MacOSX/solr/build/solr-core/test/J1/temp/solr.cloud.DistribDocExpirationUpdateProcessorTest_F1321BEA46285929-001/control-001/cores
   [junit4]   2> 524950 INFO  (TEST-DistribDocExpirationUpdateProcessorTest.test-seed#[F1321BEA46285929]) [    ] o.a.s.c.CoreContainer New CoreContainer 1854235195
   [junit4]   2> 524950 INFO  (TEST-DistribDocExpirationUpdateProcessorTest.test-seed#[F1321BEA46285929]) [    ] o.a.s.c.CoreContainer Loading cores into CoreContainer [instanceDir=/Users/jenkins/workspace/Lucene-Solr-master-MacOSX/solr/build/solr-core/test/J1/temp/solr.cloud.DistribDocExpirationUpdateProcessorTest_F1321BEA46285929-001/control-001]
   [junit4]   2> 524950 WARN  (TEST-DistribDocExpirationUpdateProcessorTest.test-seed#[F1321BEA46285929]) [    ] o.a.s.c.CoreContainer Couldn't add files from /Users/jenkins/workspace/Lucene-Solr-master-MacOSX/solr/build/solr-core/test/J1/temp/solr.cloud.DistribDocExpirationUpdateProcessorTest_F1321BEA46285929-001/control-001/lib to classpath: /Users/jenkins/workspace/Lucene-Solr-master-MacOSX/solr/build/solr-core/test/J1/temp/solr.cloud.DistribDocExpirationUpdateProcessorTest_F1321BEA46285929-001/control-001/lib
   [junit4]   2> 524950 INFO  (TEST-DistribDocExpirationUpdateProcessorTest.test-seed#[F1321BEA46285929]) [    ] o.a.s.h.c.HttpShardHandlerFactory created with socketTimeout : 90000,urlScheme : ,connTimeout : 15000,maxConnectionsPerHost : 20,maxConnections : 10000,corePoolSize : 0,maximumPoolSize : 2147483647,maxThreadIdleTime : 5,sizeOfQueue : -1,fairnessPolicy : false,
   [junit4]   2> 524953 INFO  (TEST-DistribDocExpirationUpdateProcessorTest.test-seed#[F1321BEA46285929]) [    ] o.a.s.u.UpdateShardHandler Creating UpdateShardHandler HTTP client with params: 
   [junit4]   2> 524954 INFO  (TEST-DistribDocExpirationUpdateProcessorTest.test-seed#[F1321BEA46285929]) [    ] o.a.s.l.LogWatcher SLF4J impl is org.slf4j.impl.Log4jLoggerFactory
   [junit4]   2> 524954 INFO  (TEST-DistribDocExpirationUpdateProcessorTest.test-seed#[F1321BEA46285929]) [    ] o.a.s.l.LogWatcher Registering Log Listener [Log4j (org.slf4j.impl.Log4jLoggerFactory)]
   [junit4]   2> 524954 INFO  (TEST-DistribDocExpirationUpdateProcessorTest.test-seed#[F1321BEA46285929]) [    ] o.a.s.c.ZkContainer Zookeeper client=127.0.0.1:53561/solr
   [junit4]   2> 524954 INFO  (TEST-DistribDocExpirationUpdateProcessorTest.test-seed#[F1321BEA46285929]) [    ] o.a.s.c.ZkController zkHost includes chroot
   [junit4]   2> 524954 INFO  (TEST-DistribDocExpirationUpdateProcessorTest.test-seed#[F1321BEA46285929]) [    ] o.a.s.c.c.SolrZkClient Using default ZkCredentialsProvider
   [junit4]   2> 524955 INFO  (TEST-DistribDocExpirationUpdateProcessorTest.test-seed#[F1321BEA46285929]) [    ] o.a.s.c.c.ConnectionManager Waiting for client to connect to ZooKeeper
   [junit4]   2> 524956 INFO  (zkCallback-658-thread-1) [    ] o.a.s.c.c.ConnectionManager Watcher org.apache.solr.common.cloud.ConnectionManager@7c22b629 name:ZooKeeperConnection Watcher:127.0.0.1:53561 got event WatchedEvent state:SyncConnected type:None path:null path:null type:None
   [junit4]   2> 524957 INFO  (TEST-DistribDocExpirationUpdateProcessorTest.test-seed#[F1321BEA46285929]) [    ] o.a.s.c.c.ConnectionManager Client is connected to ZooKeeper
   [junit4]   2> 524957 INFO  (TEST-DistribDocExpirationUpdateProcessorTest.test-seed#[F1321BEA46285929]) [    ] o.a.s.c.c.SolrZkClient Using default ZkACLProvider
   [junit4]   2> 524959 INFO  (TEST-DistribDocExpirationUpdateProcessorTest.test-seed#[F1321BEA46285929]) [n:127.0.0.1:53564_qlrf    ] o.a.s.c.ZkController Added new OnReconnect listener org.apache.solr.cloud.ZkController$$Lambda$47/1061890370@445f0782
   [junit4]   2> 524959 INFO  (TEST-DistribDocExpirationUpdateProcessorTest.test-seed#[F1321BEA46285929]) [n:127.0.0.1:53564_qlrf    ] o.a.s.c.c.ConnectionManager Waiting for client to connect to ZooKeeper
   [junit4]   2> 524961 INFO  (zkCallback-659-thread-1-processing-n:127.0.0.1:53564_qlrf) [n:127.0.0.1:53564_qlrf    ] o.a.s.c.c.ConnectionManager Watcher org.apache.solr.common.cloud.ConnectionManager@20c7885b name:ZooKeeperConnection Watcher:127.0.0.1:53561/solr got event WatchedEvent state:SyncConnected type:None path:null path:null type:None
   [junit4]   2> 524961 INFO  (TEST-DistribDocExpirationUpdateProcessorTest.test-seed#[F1321BEA46285929]) [n:127.0.0.1:53564_qlrf    ] o.a.s.c.c.ConnectionManager Client is connected to ZooKeeper
   [junit4]   2> 524962 INFO  (TEST-DistribDocExpirationUpdateProcessorTest.test-seed#[F1321BEA46285929]) [n:127.0.0.1:53564_qlrf    ] o.a.s.c.c.SolrZkClient makePath: /overseer/queue
   [junit4]   2> 524965 INFO  (TEST-DistribDocExpirationUpdateProcessorTest.test-seed#[F1321BEA46285929]) [n:127.0.0.1:53564_qlrf    ] o.a.s.c.c.SolrZkClient makePath: /overseer/collection-queue-work
   [junit4]   2> 524970 INFO  (TEST-DistribDocExpirationUpdateProcessorTest.test-seed#[F1321BEA46285929]) [n:127.0.0.1:53564_qlrf    ] o.a.s.c.c.SolrZkClient makePath: /overseer/collection-map-running
   [junit4]   2> 524973 INFO  (TEST-DistribDocExpirationUpdateProcessorTest.test-seed#[F1321BEA46285929]) [n:127.0.0.1:53564_qlrf    ] o.a.s.c.c.SolrZkClient makePath: /overseer/collection-map-completed
   [junit4]   2> 524976 INFO  (TEST-DistribDocExpirationUpdateProcessorTest.test-seed#[F1321BEA46285929]) [n:127.0.0.1:53564_qlrf    ] o.a.s.c.c.SolrZkClient makePath: /overseer/collection-map-failure
   [junit4]   2> 524980 INFO  (TEST-DistribDocExpirationUpdateProcessorTest.test-seed#[F1321BEA46285929]) [n:127.0.0.1:53564_qlrf    ] o.a.s.c.c.SolrZkClient makePath: /live_nodes
   [junit4]   2> 524983 INFO  (TEST-DistribDocExpirationUpdateProcessorTest.test-seed#[F1321BEA46285929]) [n:127.0.0.1:53564_qlrf    ] o.a.s.c.c.SolrZkClient makePath: /aliases.json
   [junit4]   2> 524985 INFO  (TEST-DistribDocExpirationUpdateProcessorTest.test-seed#[F1321BEA46285929]) [n:127.0.0.1:53564_qlrf    ] o.a.s.c.c.SolrZkClient makePath: /clusterstate.json
   [junit4]   2> 524987 INFO  (TEST-DistribDocExpirationUpdateProcessorTest.test-seed#[F1321BEA46285929]) [n:127.0.0.1:53564_qlrf    ] o.a.s.c.c.SolrZkClient makePath: /security.json
   [junit4]   2> 524988 INFO  (TEST-DistribDocExpirationUpdateProcessorTest.test-seed#[F1321BEA46285929]) [n:127.0.0.1:53564_qlrf    ] o.a.s.c.c.ZkStateReader Updating cluster state from ZooKeeper... 
   [junit4]   2> 524989 INFO  (TEST-DistribDocExpirationUpdateProcessorTest.test-seed#[F1321BEA46285929]) [n:127.0.0.1:53564_qlrf    ] o.a.s.c.c.ZkStateReader Updated live nodes from ZooKeeper... (0) -> (0)
   [junit4]   2> 524993 INFO  (TEST-DistribDocExpirationUpdateProcessorTest.test-seed#[F1321BEA46285929]) [n:127.0.0.1:53564_qlrf    ] o.a.s.c.c.SolrZkClient makePath: /overseer_elect
   [junit4]   2> 524995 INFO  (TEST-DistribDocExpirationUpdateProcessorTest.test-seed#[F1321BEA46285929]) [n:127.0.0.1:53564_qlrf    ] o.a.s.c.c.SolrZkClient makePath: /overseer_elect/election
   [junit4]   2> 524997 INFO  (TEST-DistribDocExpirationUpdateProcessorTest.test-seed#[F1321BEA46285929]) [n:127.0.0.1:53564_qlrf    ] o.a.s.c.Overseer Overseer (id=null) closing
   [junit4]   2> 524998 INFO  (TEST-DistribDocExpirationUpdateProcessorTest.test-seed#[F1321BEA46285929]) [n:127.0.0.1:53564_qlrf    ] o.a.s.c.LeaderElector Joined leadership election with path: /overseer_elect/election/95892575990251524-127.0.0.1:53564_qlrf-n_0000000000
   [junit4]   2> 524998 INFO  (TEST-DistribDocExpirationUpdateProcessorTest.test-seed#[F1321BEA46285929]) [n:127.0.0.1:53564_qlrf    ] o.a.s.c.OverseerElectionContext I am going to be the leader 127.0.0.1:53564_qlrf
   [junit4]   2> 524999 INFO  (TEST-DistribDocExpirationUpdateProcessorTest.test-seed#[F1321BEA46285929]) [n:127.0.0.1:53564_qlrf    ] o.a.s.c.c.SolrZkClient makePath: /overseer_elect/leader
   [junit4]   2> 525001 INFO  (TEST-DistribDocExpirationUpdateProcessorTest.test-seed#[F1321BEA46285929]) [n:127.0.0.1:53564_qlrf    ] o.a.s.c.Overseer Overseer (id=95892575990251524-127.0.0.1:53564_qlrf-n_0000000000) starting
   [junit4]   2> 525003 INFO  (TEST-DistribDocExpirationUpdateProcessorTest.test-seed#[F1321BEA46285929]) [n:127.0.0.1:53564_qlrf    ] o.a.s.c.c.SolrZkClient makePath: /overseer/queue-work
   [junit4]   2> 525013 INFO  (TEST-DistribDocExpirationUpdateProcessorTest.test-seed#[F1321BEA46285929]) [n:127.0.0.1:53564_qlrf    ] o.a.s.c.OverseerAutoReplicaFailoverThread Starting OverseerAutoReplicaFailoverThread autoReplicaFailoverWorkLoopDelay=10000 autoReplicaFailoverWaitAfterExpiration=30000 autoReplicaFailoverBadNodeExpiration=60000
   [junit4]   2> 525013 INFO  (OverseerCollectionConfigSetProcessor-95892575990251524-127.0.0.1:53564_qlrf-n_0000000000) [n:127.0.0.1:53564_qlrf    ] o.a.s.c.OverseerTaskProcessor Process current queue of overseer operations
   [junit4]   2> 525014 INFO  (OverseerStateUpdate-95892575990251524-127.0.0.1:53564_qlrf-n_0000000000) [n:127.0.0.1:53564_qlrf    ] o.a.s.c.Overseer Starting to work on the main queue
   [junit4]   2> 525014 INFO  (TEST-DistribDocExpirationUpdateProcessorTest.test-seed#[F1321BEA46285929]) [n:127.0.0.1:53564_qlrf    ] o.a.s.c.ZkController Register node as live in ZooKeeper:/live_nodes/127.0.0.1:53564_qlrf
   [junit4]   2> 525016 INFO  (TEST-DistribDocExpirationUpdateProcessorTest.test-seed#[F1321BEA46285929]) [n:127.0.0.1:53564_qlrf    ] o.a.s.c.c.SolrZkClient makePath: /live_nodes/127.0.0.1:53564_qlrf
   [junit4]   2> 525018 INFO  (OverseerStateUpdate-95892575990251524-127.0.0.1:53564_qlrf-n_0000000000) [n:127.0.0.1:53564_qlrf    ] o.a.s.c.c.ZkStateReader Updated live nodes from ZooKeeper... (0) -> (0)
   [junit4]   2> 525018 INFO  (zkCallback-659-thread-1-processing-n:127.0.0.1:53564_qlrf) [n:127.0.0.1:53564_qlrf    ] o.a.s.c.c.ZkStateReader A live node change: [WatchedEvent state:SyncConnected type:NodeChildrenChanged path:/live_nodes], has occurred - updating... (live nodes size: [0])
   [junit4]   2> 525019 INFO  (zkCallback-659-thread-1-processing-n:127.0.0.1:53564_qlrf) [n:127.0.0.1:53564_qlrf    ] o.a.s.c.c.ZkStateReader Updated live nodes from ZooKeeper... (0) -> (1)
   [junit4]   2> 525026 INFO  (TEST-DistribDocExpirationUpdateProcessorTest.test-seed#[F1321BEA46285929]) [n:127.0.0.1:53564_qlrf    ] o.a.s.c.CoreContainer Security conf doesn't exist. Skipping setup for authorization module.
   [junit4]   2> 525026 INFO  (TEST-DistribDocExpirationUpdateProcessorTest.test-seed#[F1321BEA46285929]) [n:127.0.0.1:53564_qlrf    ] o.a.s.c.CoreContainer No authentication plugin used.
   [junit4]   2> 525027 INFO  (TEST-DistribDocExpirationUpdateProcessorTest.test-seed#[F1321BEA46285929]) [n:127.0.0.1:53564_qlrf    ] o.a.s.c.CorePropertiesLocator Looking for core definitions underneath /Users/jenkins/workspace/Lucene-Solr-master-MacOSX/solr/build/solr-core/test/J1/temp/solr.cloud.DistribDocExpirationUpdateProcessorTest_F1321BEA46285929-001/control-001/cores
   [junit4]   2> 525028 INFO  (TEST-DistribDocExpirationUpdateProcessorTest.test-seed#[F1321BEA46285929]) [n:127.0.0.1:53564_qlrf    ] o.a.s.c.CoreDescriptor Created CoreDescriptor: {name=collection1, config=solrconfig.xml, transient=false, schema=schema.xml, loadOnStartup=true, configSetProperties=configsetprops.json, collection=control_collection, coreNodeName=, dataDir=data/, shard=}
   [junit4]   2> 525028 INFO  (TEST-DistribDocExpirationUpdateProcessorTest.test-seed#[F1321BEA46285929]) [n:127.0.0.1:53564_qlrf    ] o.a.s.c.CorePropertiesLocator Found core collection1 in /Users/jenkins/workspace/Lucene-Solr-master-MacOSX/solr/build/solr-core/test/J1/temp/solr.cloud.DistribDocExpirationUpdateProcessorTest_F1321BEA46285929-001/control-001/cores/collection1
   [junit4]   2> 525028 INFO  (TEST-DistribDocExpirationUpdateProcessorTest.test-seed#[F1321BEA46285929]) [n:127.0.0.1:53564_qlrf    ] o.a.s.c.CorePropertiesLocator Found 1 core definitions
   [junit4]   2> 525029 INFO  (TEST-DistribDocExpirationUpdateProcessorTest.test-seed#[F1321BEA46285929]) [n:127.0.0.1:53564_qlrf    ] o.a.s.s.SolrDispatchFilter user.dir=/Users/jenkins/workspace/Lucene-Solr-master-MacOSX/solr/build/solr-core/test/J1
   [junit4]   2> 525029 INFO  (TEST-DistribDocExpirationUpdateProcessorTest.test-seed#[F1321BEA46285929]) [n:127.0.0.1:53564_qlrf    ] o.a.s.s.SolrDispatchFilter SolrDispatchFilter.init() done
   [junit4]   2> 525030 INFO  (coreLoadExecutor-1175-thread-1-processing-n:127.0.0.1:53564_qlrf) [n:127.0.0.1:53564_qlrf c:control_collection   x:collection1] o.a.s.c.ZkController publishing state=down
   [junit4]   2> 525030 INFO  (coreLoadExecutor-1175-thread-1-processing-n:127.0.0.1:53564_qlrf) [n:127.0.0.1:53564_qlrf c:control_collection   x:collection1] o.a.s.c.ZkController numShards not found on descriptor - reading it from system property
   [junit4]   2> 525031 INFO  (coreLoadExecutor-1175-thread-1-processing-n:127.0.0.1:53564_qlrf) [n:127.0.0.1:53564_qlrf c:control_collection   x:collection1] o.a.s.c.ZkController Collection control_collection not visible yet, but flagging it so a watch is registered when it becomes visible
   [junit4]   2> 525032 INFO  (OverseerStateUpdate-95892575990251524-127.0.0.1:53564_qlrf-n_0000000000) [n:127.0.0.1:53564_qlrf    ] o.a.s.c.Overseer processMessage: queueSize: 1, message = {
   [junit4]   2>   "core":"collection1",
   [junit4]   2>   "roles":null,
   [junit4]   2>   "base_url":"http://127.0.0.1:53564/qlrf",
   [junit4]   2>   "node_name":"127.0.0.1:53564_qlrf",
   [junit4]   2>   "numShards":"1",
   [junit4]   2>   "state":"down",
   [junit4]   2>   "shard":null,
   [junit4]   2>   "collection":"control_collection",
   [junit4]   2>   "operation":"state"} current state version: 0
   [junit4]   2> 525032 INFO  (coreLoadExecutor-1175-thread-1-processing-n:127.0.0.1:53564_qlrf) [n:127.0.0.1:53564_qlrf c:control_collection   x:collection1] o.a.s.c.c.ZkStateReader Deleting data for [control_collection]
   [junit4]   2> 525032 INFO  (OverseerStateUpdate-95892575990251524-127.0.0.1:53564_qlrf-n_0000000000) [n:127.0.0.1:53564_qlrf    ] o.a.s.c.o.ReplicaMutator Update state numShards=1 message={
   [junit4]   2>   "core":"collection1",
   [junit4]   2>   "roles":null,
   [junit4]   2>   "base_url":"http://127.0.0.1:53564/qlrf",
   [junit4]   2>   "node_name":"127.0.0.1:53564_qlrf",
   [junit4]   2>   "numShards":"1",
   [junit4]   2>   "state":"down",
   [junit4]   2>   "shard":null,
   [junit4]   2>   "collection":"control_collection",
   [junit4]   2>   "operation":"state"}
   [junit4]   2> 525033 INFO  (OverseerStateUpdate-95892575990251524-127.0.0.1:53564_qlrf-n_0000000000) [n:127.0.0.1:53564_qlrf    ] o.a.s.c.o.ClusterStateMutator building a new cName: control_collection
   [junit4]   2> 525034 INFO  (OverseerStateUpdate-95892575990251524-127.0.0.1:53564_qlrf-n_0000000000) [n:127.0.0.1:53564_qlrf    ] o.a.s.c.o.ReplicaMutator Assigning new node to shard shard=shard1
   [junit4]   2> 525034 INFO  (coreLoadExecutor-1175-thread-1-processing-n:127.0.0.1:53564_qlrf) [n:127.0.0.1:53564_qlrf c:control_collection   x:collection1] o.a.s.c.ZkController look for our core node name
   [junit4]   2> 525035 INFO  (zkCallback-659-thread-1-processing-n:127.0.0.1:53564_qlrf) [n:127.0.0.1:53564_qlrf    ] o.a.s.c.c.ZkStateReader A cluster state change: [WatchedEvent state:SyncConnected type:NodeDataChanged path:/clusterstate.json], has occurred - updating... (live nodes size: [1])
   [junit4]   2> 526045 INFO  (coreLoadExecutor-1175-thread-1-processing-n:127.0.0.1:53564_qlrf) [n:127.0.0.1:53564_qlrf c:control_collection   x:collection1] o.a.s.c.ZkController waiting to find shard id in clusterstate for collection1
   [junit4]   2> 526045 INFO  (coreLoadExecutor-1175-thread-1-processing-n:127.0.0.1:53564_qlrf) [n:127.0.0.1:53564_qlrf c:control_collection   x:collection1] o.a.s.c.ZkController Check for collection zkNode:control_collection
   [junit4]   2> 526046 INFO  (coreLoadExecutor-1175-thread-1-processing-n:127.0.0.1:53564_qlrf) [n:127.0.0.1:53564_qlrf c:control_collection   x:collection1] o.a.s.c.ZkController Collection zkNode exists
   [junit4]   2> 526046 INFO  (coreLoadExecutor-1175-thread-1-processing-n:127.0.0.1:53564_qlrf) [n:127.0.0.1:53564_qlrf c:control_collection   x:collection1] o.a.s.c.c.ZkStateReader Load collection config from: [/collections/control_collection]
   [junit4]   2> 526047 INFO  (coreLoadExecutor-1175-thread-1-processing-n:127.0.0.1:53564_qlrf) [n:127.0.0.1:53564_qlrf c:control_collection   x:collection1] o.a.s.c.c.ZkStateReader path=[/collections/control_collection] [configName]=[conf1] specified config exists in ZooKeeper
   [junit4]   2> 526047 INFO  (coreLoadExecutor-1175-thread-1-processing-n:127.0.0.1:53564_qlrf) [n:127.0.0.1:53564_qlrf c:control_collection   x:collection1] o.a.s.c.SolrResourceLoader new SolrResourceLoader for directory: '/Users/jenkins/workspace/Lucene-Solr-master-MacOSX/solr/build/solr-core/test/J1/temp/solr.cloud.DistribDocExpirationUpdateProcessorTest_F1321BEA46285929-001/control-001/cores/collection1'
   [junit4]   2> 526048 INFO  (coreLoadExecutor-1175-thread-1-processing-n:127.0.0.1:53564_qlrf) [n:127.0.0.1:53564_qlrf c:control_collection   x:collection1] o.a.s.c.SolrResourceLoader JNDI not configured for solr (NoInitialContextEx)
   [junit4]   2> 526048 INFO  (coreLoadExecutor-1175-thread-1-processing-n:127.0.0.1:53564_qlrf) [n:127.0.0.1:53564_qlrf c:control_collection   x:collection1] o.a.s.c.SolrResourceLoader solr home defaulted to 'solr/' (could not find system property or JNDI)
   [junit4]   2> 526055 INFO  (coreLoadExecutor-1175-thread-1-processing-n:127.0.0.1:53564_qlrf) [n:127.0.0.1:53564_qlrf c:control_collection   x:collection1] o.a.s.c.Config loaded config solrconfig.xml with version 0 
   [junit4]   2> 526066 INFO  (coreLoadExecutor-1175-thread-1-processing-n:127.0.0.1:53564_qlrf) [n:127.0.0.1:53564_qlrf c:control_collection   x:collection1] o.a.s.c.SolrConfig current version of requestparams : -1
   [junit4]   2> 526072 WARN  (coreLoadExecutor-1175-thread-1-processing-n:127.0.0.1:53564_qlrf) [n:127.0.0.1:53564_qlrf c:control_collection   x:collection1] o.a.s.c.Config Beginning with Solr 5.5, <mergePolicy> is deprecated, use <mergePolicyFactory> instead.
   [junit4]   2> 526073 INFO  (coreLoadExecutor-1175-thread-1-processing-n:127.0.0.1:53564_qlrf) [n:127.0.0.1:53564_qlrf c:control_collection   x:collection1] o.a.s.c.SolrConfig Using Lucene MatchVersion: 7.0.0
   [junit4]   2> 526102 INFO  (coreLoadExecutor-1175-thread-1-processing-n:127.0.0.1:53564_qlrf) [n:127.0.0.1:53564_qlrf c:control_collection   x:collection1] o.a.s.c.SolrConfig Loaded SolrConfig: solrconfig.xml
   [junit4]   2> 526111 INFO  (coreLoadExecutor-1175-thread-1-processing-n:127.0.0.1:53564_qlrf) [n:127.0.0.1:53564_qlrf c:control_collection   x:collection1] o.a.s.s.IndexSchema [collection1] Schema name=test
   [junit4]   2> 526226 INFO  (coreLoadExecutor-1175-thread-1-processing-n:127.0.0.1:53564_qlrf) [n:127.0.0.1:53564_qlrf c:control_collection   x:collection1] o.a.s.s.IndexSchema default search field in schema is text
   [junit4]   2> 526227 INFO  (coreLoadExecutor-1175-thread-1-processing-n:127.0.0.1:53564_qlrf) [n:127.0.0.1:53564_qlrf c:control_collection   x:collection1] o.a.s.s.IndexSchema unique key field: id
   [junit4]   2> 526228 INFO  (coreLoadExecutor-1175-thread-1-processing-n:127.0.0.1:53564_qlrf) [n:127.0.0.1:53564_qlrf c:control_collection   x:collection1] o.a.s.s.FileExchangeRateProvider Reloading exchange rates from file currency.xml
   [junit4]   2> 526233 INFO  (coreLoadExecutor-1175-thread-1-processing-n:127.0.0.1:53564_qlrf) [n:127.0.0.1:53564_qlrf c:control_collection   x:collection1] o.a.s.s.FileExchangeRateProvider Reloading exchange rates from file currency.xml
   [junit4]   2> 526272 INFO  (coreLoadExecutor-1175-thread-1-processing-n:127.0.0.1:53564_qlrf) [n:127.0.0.1:53564_qlrf c:control_collection   x:collection1] o.a.s.c.ConfigSetProperties Did not find ConfigSet properties, assuming default properties: Can't find resource 'configsetprops.json' in classpath or '/configs/conf1', cwd=/Users/jenkins/workspace/Lucene-Solr-master-MacOSX/solr/build/solr-core/test/J1
   [junit4]   2> 526272 INFO  (coreLoadExecutor-1175-thread-1-processing-n:127.0.0.1:53564_qlrf) [n:127.0.0.1:53564_qlrf c:control_collection   x:collection1] o.a.s.c.CoreContainer Creating SolrCore 'collection1' using configuration from collection control_collection
   [junit4]   2> 526272 INFO  (coreLoadExecutor-1175-thread-1-processing-n:127.0.0.1:53564_qlrf) [n:127.0.0.1:53564_qlrf c:control_collection s:shard1 r:core_node1 x:collection1] o.a.s.c.SolrCore org.apache.solr.core.MockDirectoryFactory
   [junit4]   2> 526272 INFO  (coreLoadExecutor-1175-thread-1-processing-n:127.0.0.1:53564_qlrf) [n:127.0.0.1:53564_qlrf c:control_collection s:shard1 r:core_node1 x:collection1] o.a.s.c.SolrCore [[collection1] ] Opening new SolrCore at [/Users/jenkins/workspace/Lucene-Solr-master-MacOSX/solr/build/solr-core/test/J1/temp/solr.cloud.DistribDocExpirationUpdateProcessorTest_F1321BEA46285929-001/control-001/cores/collection1], dataDir=[/Users/jenkins/workspace/Lucene-Solr-master-MacOSX/solr/build/solr-core/test/J1/temp/solr.cloud.DistribDocExpirationUpdateProcessorTest_F1321BEA46285929-001/control-001/cores/collection1/data/]
   [junit4]   2> 526272 INFO  (coreLoadExecutor-1175-thread-1-processing-n:127.0.0.1:53564_qlrf) [n:127.0.0.1:53564_qlrf c:control_collection s:shard1 r:core_node1 x:collection1] o.a.s.c.SolrCore JMX monitoring not detected for core: collection1
   [junit4]   2> 526272 INFO  (coreLoadExecutor-1175-thread-1-processing-n:127.0.0.1:53564_qlrf) [n:127.0.0.1:53564_qlrf c:control_collection s:shard1 r:core_node1 x:collection1] o.a.s.c.CachingDirectoryFactory return new directory for /Users/jenkins/workspace/Lucene-Solr-master-MacOSX/solr/build/solr-core/test/J1/temp/solr.cloud.DistribDocExpirationUpdateProcessorTest_F1321BEA46285929-001/control-001/cores/collection1/data
   [junit4]   2> 526273 INFO  (coreLoadExecutor-1175-thread-1-processing-n:127.0.0.1:53564_qlrf) [n:127.0.0.1:53564_qlrf c:control_collection s:shard1 r:core_node1 x:collection1] o.a.s.c.SolrCore New index directory detected: old=null new=/Users/jenkins/workspace/Lucene-Solr-master-MacOSX/solr/build/solr-core/test/J1/temp/solr.cloud.DistribDocExpirationUpdateProcessorTest_F1321BEA46285929-001/control-001/cores/collection1/data/index/
   [junit4]   2> 526273 WARN  (coreLoadExecutor-1175-thread-1-processing-n:127.0.0.1:53564_qlrf) [n:127.0.0.1:53564_qlrf c:control_collection s:shard1 r:core_node1 x:collection1] o.a.s.c.SolrCore [collection1] Solr index directory '/Users/jenkins/workspace/Lucene-Solr-master-MacOSX/solr/build/solr-core/test/J1/temp/solr.cloud.DistribDocExpirationUpdateProcessorTest_F1321BEA46285929-001/control-001/cores/collection1/data/index' doesn't exist. Creating new index...
   [junit4]   2> 526274 INFO  (coreLoadExecutor-1175-thread-1-processing-n:127.0.0.1:53564_qlrf) [n:127.0.0.1:53564_qlrf c:control_collection s:shard1 r:core_node1 x:collection1] o.a.s.c.CachingDirectoryFactory return new directory for /Users/jenkins/workspace/Lucene-Solr-master-MacOSX/solr/build/solr-core/test/J1/temp/solr.cloud.DistribDocExpirationUpdateProcessorTest_F1321BEA46285929-001/control-001/cores/collection1/data/index
   [junit4]   2> 526274 INFO  (coreLoadExecutor-1175-thread-1-processing-n:127.0.0.1:53564_qlrf) [n:127.0.0.1:53564_qlrf c:control_collection s:shard1 r:core_node1 x:collection1] o.a.s.u.RandomMergePolicy RandomMergePolicy wrapping class org.apache.lucene.index.TieredMergePolicy: [TieredMergePolicy: maxMergeAtOnce=10, maxMergeAtOnceExplicit=49, maxMergedSegmentMB=77.9228515625, floorSegmentMB=1.568359375, forceMergeDeletesPctAllowed=2.8369858171607976, segmentsPerTier=31.0, maxCFSSegmentSizeMB=8.796093022207999E12, noCFSRatio=0.0
   [junit4]   2> 526274 INFO  (coreLoadExecutor-1175-thread-1-processing-n:127.0.0.1:53564_qlrf) [n:127.0.0.1:53564_qlrf c:control_collection s:shard1 r:core_node1 x:collection1] o.a.s.c.SolrDeletionPolicy SolrDeletionPolicy.onCommit: commits: num=1
   [junit4]   2> 	commit{dir=MockDirectoryWrapper(RAMDirectory@374091b6 lockFactory=org.apache.lucene.store.SingleInstanceLockFactory@4c18c4e),segFN=segments_1,generation=1}
   [junit4]   2> 526274 INFO  (coreLoadExecutor-1175-thread-1-processing-n:127.0.0.1:53564_qlrf) [n:127.0.0.1:53564_qlrf c:control_collection s:shard1 r:core_node1 x:collection1] o.a.s.c.SolrDeletionPolicy newest commit generation = 1
   [junit4]   2> 526275 INFO  (OldIndexDirectoryCleanupThreadForCore-collection1) [n:127.0.0.1:53564_qlrf c:control_collection s:shard1 r:core_node1 x:collection1] o.a.s.c.SolrCore Looking for old index directories to cleanup for core collection1 in /Users/jenkins/workspace/Lucene-Solr-master-MacOSX/solr/build/solr-core/test/J1/temp/solr.cloud.DistribDocExpirationUpdateProcessorTest_F1321BEA46285929-001/control-001/cores/collection1/data/
   [junit4]   2> 526275 WARN  (OldIndexDirectoryCleanupThreadForCore-collection1) [n:127.0.0.1:53564_qlrf c:control_collection s:shard1 r:core_node1 x:collection1] o.a.s.c.DirectoryFactory /Users/jenkins/workspace/Lucene-Solr-master-MacOSX/solr/build/solr-core/test/J1/temp/solr.cloud.DistribDocExpirationUpdateProcessorTest_F1321BEA46285929-001/control-001/cores/collection1/data/ does not point to a valid data directory; skipping clean-up of old index directories.
   [junit4]   2> 526279 INFO  (coreLoadExecutor-1175-thread-1-processing-n:127.0.0.1:53564_qlrf) [n:127.0.0.1:53564_qlrf c:control_collection s:shard1 r:core_node1 x:collection1] o.a.s.u.p.UpdateRequestProcessorChain creating updateRequestProcessorChain "convert-ttl-defaults"
   [junit4]   2> 526320 INFO  (coreLoadExecutor-1175-thread-1-processing-n:127.0.0.1:53564_qlrf) [n:127.0.0.1:53564_qlrf c:control_collection s:shard1 r:core_node1 x:collection1] o.a.s.u.p.UpdateRequestProcessorChain creating updateRequestProcessorChain "convert-ttl-field"
   [junit4]   2> 526320 INFO  (coreLoadExecutor-1175-thread-1-processing-n:127.0.0.1:53564_qlrf) [n:127.0.0.1:53564_qlrf c:control_collection s:shard1 r:core_node1 x:collection1] o.a.s.u.p.UpdateRequestProcessorChain creating updateRequestProcessorChain "convert-ttl-param"
   [junit4]   2> 526320 INFO  (coreLoadExecutor-1175-thread-1-processing-n:127.0.0.1:53564_qlrf) [n:127.0.0.1:53564_qlrf c:control_collection s:shard1 r:core_node1 x:collection1] o.a.s.u.p.UpdateRequestProcessorChain creating updateRequestProcessorChain "convert-ttl-field-with-param-default"
   [junit4]   2> 526320 INFO  (coreLoadExecutor-1175-thread-1-processing-n:127.0.0.1:53564_qlrf) [n:127.0.0.1:53564_qlrf c:control_collection s:shard1 r:core_node1 x:collection1] o.a.s.u.p.UpdateRequestProcessorChain creating updateRequestProcessorChain "scheduled-delete" (default)
   [junit4]   2> 526370 INFO  (coreLoadExecutor-1175-thread-1-processing-n:127.0.0.1:53564_qlrf) [n:127.0.0.1:53564_qlrf c:control_collection s:shard1 r:core_node1 x:collection1] o.a.s.u.p.UpdateRequestProcessorChain inserting DistributedUpdateProcessorFactory into updateRequestProcessorChain "scheduled-delete" (default)
   [junit4]   2> 526374 INFO  (coreLoadExecutor-1175-thread-1-processing-n:127.0.0.1:53564_qlrf) [n:127.0.0.1:53564_qlrf c:control_collection s:shard1 r:core_node1 x:collection1] o.a.s.h.l.XMLLoader xsltCacheLifetimeSeconds=60
   [junit4]   2> 526375 INFO  (coreLoadExecutor-1175-thread-1-processing-n:127.0.0.1:53564_qlrf) [n:127.0.0.1:53564_qlrf c:control_collection s:shard1 r:core_node1 x:collection1] o.a.s.h.l.XMLLoader xsltCacheLifetimeSeconds=60
   [junit4]   2> 526376 INFO  (coreLoadExecutor-1175-thread-1-processing-n:127.0.0.1:53564_qlrf) [n:127.0.0.1:53564_qlrf c:control_collection s:shard1 r:core_node1 x:collection1] o.a.s.h.l.XMLLoader xsltCacheLifetimeSeconds=60
   [junit4]   2> 526376 INFO  (coreLoadExecutor-1175-thread-1-processing-n:127.0.0.1:53564_qlrf) [n:127.0.0.1:53564_qlrf c:control_collection s:shard1 r:core_node1 x:collection1] o.a.s.h.l.XMLLoader xsltCacheLifetimeSeconds=60
   [junit4]   2> 526379 INFO  (coreLoadExecutor-1175-thread-1-processing-n:127.0.0.1:53564_qlrf) [n:127.0.0.1:53564_qlrf c:control_collection s:shard1 r:core_node1 x:collection1] o.a.s.c.RequestHandlers Registered paths: /admin/mbeans,,/update/json/docs,/admin/luke,/export,/get,/admin/properties,/update/json,/admin/threads,/update/csv,/sql,/graph,/select,/admin/segments,/admin/system,/replication,/config,/stream,/schema,/admin/plugins,/admin/logging,/admin/ping,/update,/admin/file
   [junit4]   2> 526379 INFO  (coreLoadExecutor-1175-thread-1-processing-n:127.0.0.1:53564_qlrf) [n:127.0.0.1:53564_qlrf c:control_collection s:shard1 r:core_node1 x:collection1] o.a.s.c.SolrCore Using default statsCache cache: org.apache.solr.search.stats.LocalStatsCache
   [junit4]   2> 526380 INFO  (coreLoadExecutor-1175-thread-1-processing-n:127.0.0.1:53564_qlrf) [n:127.0.0.1:53564_qlrf c:control_collection s:shard1 r:core_node1 x:collection1] o.a.s.u.UpdateHandler Using UpdateLog implementation: org.apache.solr.update.UpdateLog
   [junit4]   2> 526380 INFO  (coreLoadExecutor-1175-thread-1-processing-n:127.0.0.1:53564_qlrf) [n:127.0.0.1:53564_qlrf c:control_collection s:shard1 r:core_node1 x:collection1] o.a.s.u.UpdateLog Initializing UpdateLog: dataDir= defaultSyncLevel=FLUSH numRecordsToKeep=100 maxNumLogsToKeep=10 numVersionBuckets=65536
   [junit4]   2> 526382 INFO  (coreLoadExecutor-1175-thread-1-processing-n:127.0.0.1:53564_qlrf) [n:127.0.0.1:53564_qlrf c:control_collection s:shard1 r:core_node1 x:collection1] o.a.s.u.CommitTracker Hard AutoCommit: disabled
   [junit4]   2> 526382 INFO  (coreLoadExecutor-1175-thread-1-processing-n:127.0.0.1:53564_qlrf) [n:127.0.0.1:53564_qlrf c:control_collection s:shard1 r:core_node1 x:collection1] o.a.s.u.CommitTracker Soft AutoCommit: disabled
   [junit4]   2> 526382 INFO  (coreLoadExecutor-1175-thread-1-processing-n:127.0.0.1:53564_qlrf) [n:127.0.0.1:53564_qlrf c:control_collection s:shard1 r:core_node1 x:collection1] o.a.s.u.RandomMergePolicy RandomMergePolicy wrapping class org.apache.lucene.index.LogByteSizeMergePolicy: [LogByteSizeMergePolicy: minMergeSize=1677721, mergeFactor=31, maxMergeSize=2147483648, maxMergeSizeForForcedMerge=9223372036854775807, calibrateSizeByDeletes=false, maxMergeDocs=2147483647, maxCFSSegmentSizeMB=8.796093022207999E12, noCFSRatio=0.4272908736955129]
   [junit4]   2> 526383 INFO  (coreLoadExecutor-1175-thread-1-processing-n:127.0.0.1:53564_qlrf) [n:127.0.0.1:53564_qlrf c:control_collection s:shard1 r:core_node1 x:collection1] o.a.s.c.SolrDeletionPolicy SolrDeletionPolicy.onInit: commits: num=1
   [junit4]   2> 	commit{dir=MockDirectoryWrapper(RAMDirectory@374091b6 lockFactory=org.apache.lucene.store.SingleInstanceLockFactory@4c18c4e),segFN=segments_1,generation=1}
   [junit4]   2> 526383 INFO  (coreLoadExecutor-1175-thread-1-processing-n:127.0.0.1:53564_qlrf) [n:127.0.0.1:53564_qlrf c:control_collection s:shard1 r:core_node1 x:collection1] o.a.s.c.SolrDeletionPolicy newest commit generation = 1
   [junit4]   2> 526383 INFO  (coreLoadExecutor-1175-thread-1-processing-n:127.0.0.1:53564_qlrf) [n:127.0.0.1:53564_qlrf c:control_collection s:shard1 r:core_node1 x:collection1] o.a.s.s.SolrIndexSearcher Opening [Searcher@6fb469b8[collection1] main]
   [junit4]   2> 526383 INFO  (coreLoadExecutor-1175-thread-1-processing-n:127.0.0.1:53564_qlrf) [n:127.0.0.1:53564_qlrf c:control_collection s:shard1 r:core_node1 x:collection1] o.a.s.c.c.ZkStateReader Load collection config from: [/collections/control_collection]
   [junit4]   2> 526384 INFO  (coreLoadExecutor-1175-thread-1-processing-n:127.0.0.1:53564_qlrf) [n:127.0.0.1:53564_qlrf c:control_collection s:shard1 r:core_node1 x:collection1] o.a.s.c.c.ZkStateReader path=[/collections/control_collection] [configName]=[conf1] specified config exists in ZooKeeper
   [junit4]   2> 526385 INFO  (coreLoadExecutor-1175-thread-1-processing-n:127.0.0.1:53564_qlrf) [n:127.0.0.1:53564_qlrf c:control_collection s:shard1 r:core_node1 x:collection1] o.a.s.r.ManagedResourceStorage Setting up ZooKeeper-based storage for the RestManager with znodeBase: /configs/conf1
   [junit4]   2> 526385 INFO  (coreLoadExecutor-1175-thread-1-processing-n:127.0.0.1:53564_qlrf) [n:127.0.0.1:53564_qlrf c:control_collection s:shard1 r:core_node1 x:collection1] o.a.s.r.ManagedResourceStorage Configured ZooKeeperStorageIO with znodeBase: /configs/conf1
   [junit4]   2> 526385 INFO  (coreLoadExecutor-1175-thread-1-processing-n:127.0.0.1:53564_qlrf) [n:127.0.0.1:53564_qlrf c:control_collection s:shard1 r:core_node1 x:collection1] o.a.s.r.RestManager Initializing RestManager with initArgs: {}
   [junit4]   2> 526386 INFO  (coreLoadExecutor-1175-thread-1-processing-n:127.0.0.1:53564_qlrf) [n:127.0.0.1:53564_qlrf c:control_collection s:shard1 r:core_node1 x:collection1] o.a.s.r.ManagedResourceStorage Reading _rest_managed.json using ZooKeeperStorageIO:path=/configs/conf1
   [junit4]   2> 526387 INFO  (coreLoadExecutor-1175-thread-1-processing-n:127.0.0.1:53564_qlrf) [n:127.0.0.1:53564_qlrf c:control_collection s:shard1 r:core_node1 x:collection1] o.a.s.r.ManagedResourceStorage No data found for znode /configs/conf1/_rest_managed.json
   [junit4]   2> 526387 INFO  (coreLoadExecutor-1175-thread-1-processing-n:127.0.0.1:53564_qlrf) [n:127.0.0.1:53564_qlrf c:control_collection s:shard1 r:core_node1 x:collection1] o.a.s.r.ManagedResourceStorage Loaded null at path _rest_managed.json using ZooKeeperStorageIO:path=/configs/conf1
   [junit4]   2> 526387 INFO  (coreLoadExecutor-1175-thread-1-processing-n:127.0.0.1:53564_qlrf) [n:127.0.0.1:53564_qlrf c:control_collection s:shard1 r:core_node1 x:collection1] o.a.s.r.RestManager Initializing 0 registered ManagedResources
   [junit4]   2> 526414 INFO  (coreLoadExecutor-1175-thread-1-processing-n:127.0.0.1:53564_qlrf) [n:127.0.0.1:53564_qlrf c:control_collection s:shard1 r:core_node1 x:collection1] o.a.s.h.ReplicationHandler Commits will be reserved for  10000
   [junit4]   2> 526414 INFO  (coreLoadExecutor-1175-thread-1-processing-n:127.0.0.1:53564_qlrf) [n:127.0.0.1:53564_qlrf c:control_collection s:shard1 r:core_node1 x:collection1] o.a.s.u.UpdateLog Looking up max value of version field to seed version buckets
   [junit4]   2> 526414 INFO  (searcherExecutor-1176-thread-1-processing-n:127.0.0.1:53564_qlrf x:collection1 s:shard1 c:control_collection r:core_node1) [n:127.0.0.1:53564_qlrf c:control_collection s:shard1 r:core_node1 x:collection1] o.a.s.c.SolrCore [collection1] Registered new searcher Searcher@6fb469b8[collection1] main{ExitableDirectoryReader(UninvertingDirectoryReader())}
   [junit4]   2> 526414 INFO  (coreLoadExecutor-1175-thread-1-processing-n:127.0.0.1:53564_qlrf) [n:127.0.0.1:53564_qlrf c:control_collection s:shard1 r:core_node1 x:collection1] o.a.s.u.VersionInfo Refreshing highest value of _version_ for 65536 version buckets from index
   [junit4]   2> 526414 INFO  (coreLoadExecutor-1175-thread-1-processing-n:127.0.0.1:53564_qlrf) [n:127.0.0.1:53564_qlrf c:control_collection s:shard1 r:core_node1 x:collection1] o.a.s.u.VersionInfo No terms found for _version_, cannot seed version bucket highest value from index
   [junit4]   2> 526414 INFO  (coreLoadExecutor-1175-thread-1-processing-n:127.0.0.1:53564_qlrf) [n:127.0.0.1:53564_qlrf c:control_collection s:shard1 r:core_node1 x:collection1] o.a.s.u.UpdateLog Could not find max version in index or recent updates, using new clock 1534281217946419200
   [junit4]   2> 526416 INFO  (coreLoadExecutor-1175-thread-1-processing-n:127.0.0.1:53564_qlrf) [n:127.0.0.1:53564_qlrf c:control_collection s:shard1 r:core_node1 x:collection1] o.a.s.u.UpdateLog Took 2.0ms to seed version buckets with highest version 1534281217946419200
   [junit4]   2> 526417 INFO  (coreLoadExecutor-1175-thread-1-processing-n:127.0.0.1:53564_qlrf) [n:127.0.0.1:53564_qlrf c:control_collection s:shard1 r:core_node1 x:collection1] o.a.s.c.ZkController watch zkdir /configs/conf1
   [junit4]   2> 526417 INFO  (coreLoadExecutor-1175-thread-1-processing-n:127.0.0.1:53564_qlrf) [n:127.0.0.1:53564_qlrf c:control_collection s:shard1 r:core_node1 x:collection1] o.a.s.c.CoreContainer registering core: collection1
   [junit4]   2> 526418 INFO  (coreZkRegister-1169-thread-1-processing-n:127.0.0.1:53564_qlrf x:collection1 s:shard1 c:control_collection r:core_node1) [n:127.0.0.1:53564_qlrf c:control_collection s:shard1 r:core_node1 x:collection1] o.a.s.c.ZkController Register replica - core:collection1 address:http://127.0.0.1:53564/qlrf collection:control_collection shard:shard1
   [junit4]   2> 526426 INFO  (coreZkRegister-1169-thread-1-processing-n:127.0.0.1:53564_qlrf x:collection1 s:shard1 c:control_collection r:core_node1) [n:127.0.0.1:53564_qlrf c:control_collection s:shard1 r:core_node1 x:collection1] o.a.s.c.c.SolrZkClient makePath: /collections/control_collection/leader_elect/shard1/election
   [junit4]   2> 526433 INFO  (coreZkRegister-1169-thread-1-processing-n:127.0.0.1:53564_qlrf x:collection1 s:shard1 c:control_collection r:core_node1) [n:127.0.0.1:53564_qlrf c:control_collection s:shard1 r:core_node1 x:collection1] o.a.s.c.LeaderElector Joined leadership election with path: /collections/control_collection/leader_elect/shard1/election/95892575990251524-core_node1-n_0000000000
   [junit4]   2> 526433 INFO  (coreZkRegister-1169-thread-1-processing-n:127.0.0.1:53564_qlrf x:collection1 s:shard1 c:control_collection r:core_node1) [n:127.0.0.1:53564_qlrf c:control_collection s:shard1 r:core_node1 x:collection1] o.a.s.c.ShardLeaderElectionContext Running the leader process for shard=shard1 and weAreReplacement=false and leaderVoteWait=10000
   [junit4]   2> 526438 INFO  (coreZkRegister-1169-thread-1-processing-n:127.0.0.1:53564_qlrf x:collection1 s:shard1 c:control_collection r:core_node1) [n:127.0.0.1:53564_qlrf c:control_collection s:shard1 r:core_node1 x:collection1] o.a.s.c.ShardLeaderElectionContext Enough replicas found to continue.
   [junit4]   2> 526439 INFO  (coreZkRegister-1169-thread-1-processing-n:127.0.0.1:53564_qlrf x:collection1 s:shard1 c:control_collection r:core_node1) [n:127.0.0.1:53564_qlrf c:control_collection s:shard1 r:core_node1 x:collection1] o.a.s.c.ShardLeaderElectionContext I may be the new leader - try and sync
   [junit4]   2> 526439 INFO  (coreZkRegister-1169-thread-1-processing-n:127.0.0.1:53564_qlrf x:collection1 s:shard1 c:control_collection r:core_node1) [n:127.0.0.1:53564_qlrf c:control_collection s:shard1 r:core_node1 x:collection1] o.a.s.c.SyncStrategy Sync replicas to http://127.0.0.1:53564/qlrf/collection1/
   [junit4]   2> 526439 INFO  (coreZkRegister-1169-thread-1-processing-n:127.0.0.1:53564_qlrf x:collection1 s:shard1 c:control_collection r:core_node1) [n:127.0.0.1:53564_qlrf c:control_collection s:shard1 r:core_node1 x:collection1] o.a.s.c.SyncStrategy Sync Success - now sync replicas to me
   [junit4]   2> 526439 INFO  (coreZkRegister-1169-thread-1-processing-n:127.0.0.1:53564_qlrf x:collection1 s:shard1 c:control_collection r:core_node1) [n:127.0.0.1:53564_qlrf c:control_collection s:shard1 r:core_node1 x:collection1] o.a.s.c.SyncStrategy http://127.0.0.1:53564/qlrf/collection1/ has no replicas
   [junit4]   2> 526439 INFO  (OverseerStateUpdate-95892575990251524-127.0.0.1:53564_qlrf-n_0000000000) [n:127.0.0.1:53564_qlrf    ] o.a.s.c.Overseer processMessage: queueSize: 1, message = {
   [junit4]   2>   "operation":"leader",
   [junit4]   2>   "shard":"shard1",
   [junit4]   2>   "collection":"control_collection"} current state version: 1
   [junit4]   2> 526440 INFO  (coreZkRegister-1169-thread-1-processing-n:127.0.0.1:53564_qlrf x:collection1 s:shard1 c:control_collection r:core_node1) [n:127.0.0.1:53564_qlrf c:control_collection s:shard1 r:core_node1 x:collection1] o.a.s.c.c.SolrZkClient makePath: /collections/control_collection/leaders/shard1
   [junit4]   2> 526445 INFO  (coreZkRegister-1169-thread-1-processing-n:127.0.0.1:53564_qlrf x:collection1 s:shard1 c:control_collection r:core_node1) [n:127.0.0.1:53564_qlrf c:control_collection s:shard1 r:core_node1 x:collection1] o.a.s.c.ShardLeaderElectionContextBase Creating leader registration node /collections/control_collection/leaders/shard1/leader after winning as /collections/control_collection/leader_elect/shard1/election/95892575990251524-core_node1-n_0000000000
   [junit4]   2> 526449 INFO  (coreZkRegister-1169-thread-1-processing-n:127.0.0.1:53564_qlrf x:collection1 s:shard1 c:control_collection r:core_node1) [n:127.0.0.1:53564_qlrf c:control_collection s:shard1 r:core_node1 x:collection1] o.a.s.c.ShardLeaderElectionContext I am the new leader: http://127.0.0.1:53564/qlrf/collection1/ shard1
   [junit4]   2> 526450 INFO  (OverseerStateUpdate-95892575990251524-127.0.0.1:53564_qlrf-n_0000000000) [n:127.0.0.1:53564_qlrf    ] o.a.s.c.Overseer processMessage: queueSize: 1, message = {
   [junit4]   2>   "operation":"leader",
   [junit4]   2>   "shard":"shard1",
   [junit4]   2>   "collection":"control_collection",
   [junit4]   2>   "base_url":"http://127.0.0.1:53564/qlrf",
   [junit4]   2>   "core":"collection1",
   [junit4]   2>   "state":"active"} current state version: 1
   [junit4]   2> 526557 INFO  (zkCallback-659-thread-1-processing-n:127.0.0.1:53564_qlrf) [n:127.0.0.1:53564_qlrf    ] o.a.s.c.c.ZkStateReader A cluster state change: [WatchedEvent state:SyncConnected type:NodeDataChanged path:/clusterstate.json], has occurred - updating... (live nodes size: [1])
   [junit4]   2> 526561 INFO  (TEST-DistribDocExpirationUpdateProcessorTest.test-seed#[F1321BEA46285929]) [    ] o.a.s.c.s.i.CloudSolrClient Final constructed zkHost string: 127.0.0.1:53561/solr
   [junit4]   2> 526562 INFO  (TEST-DistribDocExpirationUpdateProcessorTest.test-seed#[F1321BEA46285929]) [    ] o.a.s.c.c.SolrZkClient Using default ZkCredentialsProvider
   [junit4]   2> 526562 INFO  (TEST-DistribDocExpirationUpdateProcessorTest.test-seed#[F1321BEA46285929]) [    ] o.a.s.c.c.ConnectionManager Waiting for client to connect to ZooKeeper
   [junit4]   2> 526564 INFO  (zkCallback-663-thread-1) [    ] o.a.s.c.c.ConnectionManager Watcher org.apache.solr.common.cloud.ConnectionManager@2b6ffb7 name:ZooKeeperConnection Watcher:127.0.0.1:53561/solr got event WatchedEvent state:SyncConnected type:None path:null path:null type:None
   [junit4]   2> 526564 INFO  (TEST-DistribDocExpirationUpdateProcessorTest.test-seed#[F1321BEA46285929]) [    ] o.a.s.c.c.ConnectionManager Client is connected to ZooKeeper
   [junit4]   2> 526564 INFO  (TEST-DistribDocExpirationUpdateProcessorTest.test-seed#[F1321BEA46285929]) [    ] o.a.s.c.c.SolrZkClient Using default ZkACLProvider
   [junit4]   2> 526564 INFO  (TEST-DistribDocExpirationUpdateProcessorTest.test-seed#[F1321BEA46285929]) [    ] o.a.s.c.c.ZkStateReader Updating cluster state from ZooKeeper... 
   [junit4]   2> 526565 INFO  (TEST-DistribDocExpirationUpdateProcessorTest.test-seed#[F1321BEA46285929]) [    ] o.a.s.c.c.ZkStateReader Updated live nodes from ZooKeeper... (0) -> (1)
   [junit4]   2> 526568 INFO  (TEST-DistribDocExpirationUpdateProcessorTest.test-seed#[F1321BEA46285929]) [    ] o.a.s.c.ChaosMonkey monkey: init - expire sessions:false cause connection loss:false
   [junit4]   2> 526569 INFO  (TEST-DistribDocExpirationUpdateProcessorTest.test-seed#[F1321BEA46285929]) [    ] o.a.s.c.AbstractFullDistribZkTestBase Creating collection1 with stateFormat=2
   [junit4]   2> 526569 INFO  (TEST-DistribDocExpirationUpdateProcessorTest.test-seed#[F1321BEA46285929]) [    ] o.a.s.c.c.SolrZkClient Using default ZkCredentialsProvider
   [junit4]   2> 526569 INFO  (TEST-DistribDocExpirationUpdateProcessorTest.test-seed#[F1321BEA46285929]) [    ] o.a.s.c.c.ConnectionManager Waiting for client to connect to ZooKeeper
   [junit4]   2> 526572 INFO  (zkCallback-664-thread-1) [    ] o.a.s.c.c.ConnectionManager Watcher org.apache.solr.common.cloud.ConnectionManager@248a9511 name:ZooKeeperConnection Watcher:127.0.0.1:53561/solr got event WatchedEvent state:SyncConnected type:None path:null path:null type:None
   [junit4]   2> 526572 INFO  (TEST-DistribDocExpirationUpdateProcessorTest.test-seed#[F1321BEA46285929]) [    ] o.a.s.c.c.ConnectionManager Client is connected to ZooKeeper
   [junit4]   2> 526572 INFO  (TEST-DistribDocExpirationUpdateProcessorTest.test-seed#[F1321BEA46285929]) [    ] o.a.s.c.c.SolrZkClient Using default ZkACLProvider
   [junit4]   2> 526576 INFO  (OverseerStateUpdate-95892575990251524-127.0.0.1:53564_qlrf-n_0000000000) [n:127.0.0.1:53564_qlrf    ] o.a.s.c.Overseer processMessage: queueSize: 1, message = {
   [junit4]   2>   "operation":"create",
   [junit4]   2>   "name":"collection1",
   [junit4]   2>   "numShards":"2",
   [junit4]   2>   "stateFormat":"2"} current state version: 2
   [junit4]   2> 526577 INFO  (OverseerStateUpdate-95892575990251524-127.0.0.1:53564_qlrf-n_0000000000) [n:127.0.0.1:53564_qlrf    ] o.a.s.c.o.ClusterStateMutator building a new cName: collection1
   [junit4]   2> 526608 INFO  (coreZkRegister-1169-thread-1-processing-n:127.0.0.1:53564_qlrf x:collection1 s:shard1 c:control_collection r:core_node1) [n:127.0.0.1:53564_qlrf c:control_collection s:shard1 r:core_node1 x:collection1] o.a.s.c.ZkController We are http://127.0.0.1:53564/qlrf/collection1/ and leader is http://127.0.0.1:53564/qlrf/collection1/
   [junit4]   2> 526609 INFO  (coreZkRegister-1169-thread-1-processing-n:127.0.0.1:53564_qlrf x:collection1 s:shard1 c:control_collection r:core_node1) [n:127.0.0.1:53564_qlrf c:control_collection s:shard1 r:core_node1 x:collection1] o.a.s.c.ZkController No LogReplay needed for core=collection1 baseURL=http://127.0.0.1:53564/qlrf
   [junit4]   2> 526609 INFO  (coreZkRegister-1169-thread-1-processing-n:127.0.0.1:53564_qlrf x:collection1 s:shard1 c:control_collection r:core_node1) [n:127.0.0.1:53564_qlrf c:control_collection s:shard1 r:core_node1 x:collection1] o.a.s.c.ZkController I am the leader, no recovery necessary
   [junit4]   2> 526609 INFO  (coreZkRegister-1169-thread-1-processing-n:127.0.0.1:53564_qlrf x:collection1 s:shard1 c:control_collection r:core_node1) [n:127.0.0.1:53564_qlrf c:control_collection s:shard1 r:core_node1 x:collection1] o.a.s.c.ZkController publishing state=active
   [junit4]   2> 526609 INFO  (coreZkRegister-1169-thread-1-processing-n:127.0.0.1:53564_qlrf x:collection1 s:shard1 c:control_collection r:core_node1) [n:127.0.0.1:53564_qlrf c:control_collection s:shard1 r:core_node1 x:collection1] o.a.s.c.ZkController numShards not found on descriptor - reading it from system property
   [junit4]   2> 526612 INFO  (OverseerStateUpdate-95892575990251524-127.0.0.1:53564_qlrf-n_0000000000) [n:127.0.0.1:53564_qlrf    ] o.a.s.c.Overseer processMessage: queueSize: 1, message = {
   [junit4]   2>   "core":"collection1",
   [junit4]   2>   "core_node_name":"core_node1",
   [junit4]   2>   "roles":null,
   [junit4]   2>   "base_url":"http://127.0.0.1:53564/qlrf",
   [junit4]   2>   "node_name":"127.0.0.1:53564_qlrf",
   [junit4]   2>   "numShards":"2",
   [junit4]   2>   "state":"active",
   [junit4]   2>   "shard":"shard1",
   [junit4]   2>   "collection":"control_collection",
   [junit4]   2>   "operation":"state"} current state version: 2
   [junit4]   2> 526613 INFO  (OverseerStateUpdate-95892575990251524-127.0.0.1:53564_qlrf-n_0000000000) [n:127.0.0.1:53564_qlrf    ] o.a.s.c.o.ReplicaMutator Update state numShards=2 message={
   [junit4]   2>   "core":"collection1",
   [junit4]   2>   "core_node_name":"core_node1",
   [junit4]   2>   "roles":null,
   [junit4]   2>   "base_url":"http://127.0.0.1:53564/qlrf",
   [junit4]   2>   "node_name":"127.0.0.1:53564_qlrf",
   [junit4]   2>   "numShards":"2",
   [junit4]   2>   "state":"active",
   [junit4]   2>   "shard":"shard1",
   [junit4]   2>   "collection":"control_collection",
   [junit4]   2>   "operation":"state"}
   [junit4]   2> 526613 INFO  (OverseerStateUpdate-95892575990251524-127.0.0.1:53564_qlrf-n_0000000000) [n:127.0.0.1:53564_qlrf    ] o.a.s.c.o.ZkStateWriter going to create_collection /collections/collection1/state.json
   [junit4]   2> 526728 INFO  (zkCallback-659-thread-1-processing-n:127.0.0.1:53564_qlrf) [n:127.0.0.1:53564_qlrf    ] o.a.s.c.c.ZkStateReader A cluster state change: [WatchedEvent state:SyncConnected type:NodeDataChanged path:/clusterstate.json], has occurred - updating... (live nodes size: [1])
   [junit4]   2> 526728 INFO  (zkCallback-663-thread-1) [    ] o.a.s.c.c.ZkStateReader A cluster state change: [WatchedEvent state:SyncConnected type:NodeDataChanged path:/clusterstate.json], has occurred - updating... (live nodes size: [1])
   [junit4]   2> 527059 INFO  (TEST-DistribDocExpirationUpdateProcessorTest.test-seed#[F1321BEA46285929]) [    ] o.a.s.SolrTestCaseJ4 Writing core.properties file to /Users/jenkins/workspace/Lucene-Solr-master-MacOSX/solr/build/solr-core/test/J1/temp/solr.cloud.DistribDocExpirationUpdateProcessorTest_F1321BEA46285929-001/shard-1-001/cores/collection1
   [junit4]   2> 527062 INFO  (TEST-DistribDocExpirationUpdateProcessorTest.test-seed#[F1321BEA46285929]) [    ] o.a.s.c.AbstractFullDistribZkTestBase create jetty 1 in directory /Users/jenkins/workspace/Lucene-Solr-master-MacOSX/solr/build/solr-core/test/J1/temp/solr.cloud.DistribDocExpirationUpdateProcessorTest_F1321BEA46285929-001/shard-1-001
   [junit4]   2> 527063 INFO  (TEST-DistribDocExpirationUpdateProcessorTest.test-seed#[F1321BEA46285929]) [    ] o.e.j.s.Server jetty-9.3.8.v20160314
   [junit4]   2> 527065 INFO  (TEST-DistribDocExpirationUpdateProcessorTest.test-seed#[F1321BEA46285929]) [    ] o.e.j.s.h.ContextHandler Started o.e.j.s.ServletContextHandler@2f2ec080{/qlrf,null,AVAILABLE}
   [junit4]   2> 527066 INFO  (TEST-DistribDocExpirationUpdateProcessorTest.test-seed#[F1321BEA46285929]) [    ] o.e.j.s.ServerConnector Started ServerConnector@463b0c22{HTTP/1.1,[http/1.1]}{127.0.0.1:53570}
   [junit4]   2> 527066 INFO  (TEST-DistribDocExpirationUpdateProcessorTest.test-seed#[F1321BEA46285929]) [    ] o.e.j.s.Server Started @532186ms
   [junit4]   2> 527066 INFO  (TEST-DistribDocExpirationUpdateProcessorTest.test-seed#[F1321BEA46285929]) [    ] o.a.s.c.s.e.JettySolrRunner Jetty properties: {solr.data.dir=/Users/jenkins/workspace/Lucene-Solr-master-MacOSX/solr/build/solr-core/test/J1/temp/solr.cloud.DistribDocExpirationUpdateProcessorTest_F1321BEA46285929-001/tempDir-001/jetty1, solrconfig=solrconfig.xml, hostContext=/qlrf, hostPort=53570, coreRootDirectory=/Users/jenkins/workspace/Lucene-Solr-master-MacOSX/solr/build/solr-core/test/J1/temp/solr.cloud.DistribDocExpirationUpdateProcessorTest_F1321BEA46285929-001/shard-1-001/cores}
   [junit4]   2> 527066 INFO  (TEST-DistribDocExpirationUpdateProcessorTest.test-seed#[F1321BEA46285929]) [    ] o.a.s.s.SolrDispatchFilter SolrDispatchFilter.init(): sun.misc.Launcher$AppClassLoader@4554617c
   [junit4]   2> 527067 INFO  (TEST-DistribDocExpirationUpdateProcessorTest.test-seed#[F1321BEA46285929]) [    ] o.a.s.c.SolrResourceLoader new SolrResourceLoader for directory: '/Users/jenkins/workspace/Lucene-Solr-master-MacOSX/solr/build/solr-core/test/J1/temp/solr.cloud.DistribDocExpirationUpdateProcessorTest_F1321BEA46285929-001/shard-1-001'
   [junit4]   2> 527067 INFO  (TEST-DistribDocExpirationUpdateProcessorTest.test-seed#[F1321BEA46285929]) [    ] o.a.s.c.SolrResourceLoader JNDI not configured for solr (NoInitialContextEx)
   [junit4]   2> 527067 INFO  (TEST-DistribDocExpirationUpdateProcessorTest.test-seed#[F1321BEA46285929]) [    ] o.a.s.c.SolrResourceLoader solr home defaulted to 'solr/' (could not find system property or JNDI)
   [junit4]   2> 527067 INFO  (TEST-DistribDocExpirationUpdateProcessorTest.test-seed#[F1321BEA46285929]) [    ] o.a.s.c.c.SolrZkClient Using default ZkCredentialsProvider
   [junit4]   2> 527068 INFO  (TEST-DistribDocExpirationUpdateProcessorTest.test-seed#[F1321BEA46285929]) [    ] o.a.s.c.c.ConnectionManager Waiting for client to connect to ZooKeeper
   [junit4]   2> 527070 INFO  (zkCallback-665-thread-1) [    ] o.a.s.c.c.ConnectionManager Watcher org.apache.solr.common.cloud.ConnectionManager@7db6735c name:ZooKeeperConnection Watcher:127.0.0.1:53561/solr got event WatchedEvent state:SyncConnected type:None path:null path:null type:None
   [junit4]   2> 527070 INFO  (TEST-DistribDocExpirationUpdateProcessorTest.test-seed#[F1321BEA46285929]) [    ] o.a.s.c.c.ConnectionManager Client is connected to ZooKeeper
   [junit4]   2> 527070 INFO  (TEST-DistribDocExpirationUpdateProcessorTest.test-seed#[F1321BEA46285929]) [    ] o.a.s.c.c.SolrZkClient Using default ZkACLProvider
   [junit4]   2> 527072 INFO  (TEST-DistribDocExpirationUpdateProcessorTest.test-seed#[F1321BEA46285929]) [    ] o.a.s.s.SolrDispatchFilter Loading solr.xml from SolrHome (not found in ZooKeeper)
   [junit4]   2> 527072 INFO  (TEST-DistribDocExpirationUpdateProcessorTest.test-seed#[F1321BEA46285929]) [    ] o.a.s.c.SolrXmlConfig Loading container configuration from /Users/jenkins/workspace/Lucene-Solr-master-MacOSX/solr/build/solr-core/test/J1/temp/solr.cloud.DistribDocExpirationUpdateProcessorTest_F1321BEA46285929-001/shard-1-001/solr.xml
   [junit4]   2> 527170 INFO  (TEST-DistribDocExpirationUpdateProcessorTest.test-seed#[F1321BEA46285929]) [    ] o.a.s.c.CorePropertiesLocator Config-defined core root directory: /Users/jenkins/workspace/Lucene-Solr-master-MacOSX/solr/build/solr-core/test/J1/temp/solr.cloud.DistribDocExpirationUpdateProcessorTest_F1321BEA46285929-001/shard-1-001/cores
   [junit4]   2> 527170 INFO  (TEST-DistribDocExpirationUpdateProcessorTest.test-seed#[F1321BEA46285929]) [    ] o.a.s.c.CoreContainer New CoreContainer 1813983624
   [junit4]   2> 527170 INFO  (TEST-DistribDocExpirationUpdateProcessorTest.test-seed#[F1321BEA46285929]) [    ] o.a.s.c.CoreContainer Loading cores into CoreContainer [instanceDir=/Users/jenkins/workspace/Lucene-Solr-master-MacOSX/solr/build/solr-core/test/J1/temp/solr.cloud.DistribDocExpirationUpdateProcessorTest_F1321BEA46285929-001/shard-1-001]
   [junit4]   2> 527170 WARN  (TEST-DistribDocExpirationUpdateProcessorTest.test-seed#[F1321BEA46285929]) [    ] o.a.s.c.CoreContainer Couldn't add files from /Users/jenkins/workspace/Lucene-Solr-master-MacOSX/solr/build/solr-core/test/J1/temp/solr.cloud.DistribDocExpirationUpdateProcessorTest_F1321BEA46285929-001/shard-1-001/lib to classpath: /Users/jenkins/workspace/Lucene-Solr-master-MacOSX/solr/build/solr-core/test/J1/temp/solr.cloud.DistribDocExpirationUpdateProcessorTest_F1321BEA46285929-001/shard-1-001/lib
   [junit4]   2> 527171 INFO  (TEST-DistribDocExpirationUpdateProcessorTest.test-seed#[F1321BEA46285929]) [    ] o.a.s.h.c.HttpShardHandlerFactory created with socketTimeout : 90000,urlScheme : ,connTimeout : 15000,maxConnectionsPerHost : 20,maxConnections : 10000,corePoolSize : 0,maximumPoolSize : 2147483647,maxThreadIdleTime : 5,sizeOfQueue : -1,fairnessPolicy : false,
   [junit4]   2> 527175 INFO  (TEST-DistribDocExpirationUpdateProcessorTest.test-seed#[F1321BEA46285929]) [    ] o.a.s.u.UpdateShardHandler Creating UpdateShardHandler HTTP client with params: 
   [junit4]   2> 527178 INFO  (TEST-DistribDocExpirationUpdateProcessorTest.test-seed#[F1321BEA46285929]) [    ] o.a.s.l.LogWatcher SLF4J impl is org.slf4j.impl.Log4jLoggerFactory
   [junit4]   2> 527178 INFO  (TEST-DistribDocExpirationUpdateProcessorTest.test-seed#[F1321BEA46285929]) [    ] o.a.s.l.LogWatcher Registering Log Listener [Log4j (org.slf4j.impl.Log4jLoggerFactory)]
   [junit4]   2> 527178 INFO  (TEST-DistribDocExpirationUpdateProcessorTest.test-seed#[F1321BEA46285929]) [    ] o.a.s.c.ZkContainer Zookeeper client=127.0.0.1:53561/solr
   [junit4]   2> 527178 INFO  (TEST-DistribDocExpirationUpdateProcessorTest.test-seed#[F1321BEA46285929]) [    ] o.a.s.c.ZkController zkHost includes chroot
   [junit4]   2> 527178 INFO  (TEST-DistribDocExpirationUpdateProcessorTest.test-seed#[F1321BEA46285929]) [    ] o.a.s.c.c.SolrZkClient Using default ZkCredentialsProvider
   [junit4]   2> 527180 INFO  (TEST-DistribDocExpirationUpdateProcessorTest.test-seed#[F1321BEA46285929]) [    ] o.a.s.c.c.ConnectionManager Waiting for client to connect to ZooKeeper
   [junit4]   2> 527181 INFO  (zkCallback-668-thread-1) [    ] o.a.s.c.c.ConnectionManager Watcher org.apache.solr.common.cloud.ConnectionManager@5a94318f name:ZooKeeperConnection Watcher:127.0.0.1:53561 got event WatchedEvent state:SyncConnected type:None path:null path:null type:None
   [junit4]   2> 527182 INFO  (TEST-DistribDocExpirationUpdateProcessorTest.test-seed#[F1321BEA46285929]) [    ] o.a.s.c.c.ConnectionManager Client is connected to ZooKeeper
   [junit4]   2> 527182 INFO  (TEST-DistribDocExpirationUpdateProcessorTest.test-seed#[F1321BEA46285929]) [    ] o.a.s.c.c.SolrZkClient Using default ZkACLProvider
   [junit4]   2> 527184 INFO  (TEST-DistribDocExpirationUpdateProcessorTest.test-seed#[F1321BEA46285929]) [n:127.0.0.1:53570_qlrf    ] o.a.s.c.ZkController Added new OnReconnect listener org.apache.solr.cloud.ZkController$$Lambda$47/1061890370@4ff47992
   [junit4]   2> 527185 INFO  (TEST-DistribDocExpirationUpdateProcessorTest.test-seed#[F1321BEA46285929]) [n:127.0.0.1:53570_qlrf    ] o.a.s.c.c.ConnectionManager Waiting for client to connect to ZooKeeper
   [junit4]   2> 527187 INFO  (zkCallback-669-thread-1-processing-n:127.0.0.1:53570_qlrf) [n:127.0.0.1:53570_qlrf    ] o.a.s.c.c.ConnectionManager Watcher org.apache.solr.common.cloud.ConnectionManager@291e0363 name:ZooKeeperConnection Watcher:127.0.0.1:53561/solr got event WatchedEvent state:SyncConnected type:None path:null path:null type:None
   [junit4]   2> 527187 INFO  (TEST-DistribDocExpirationUpdateProcessorTest.test-seed#[F1321BEA46285929]) [n:127.0.0.1:53570_qlrf    ] o.a.s.c.c.ConnectionManager Client is connected to ZooKeeper
   [junit4]   2> 527200 INFO  (TEST-DistribDocExpirationUpdateProcessorTest.test-seed#[F1321BEA46285929]) [n:127.0.0.1:53570_qlrf    ] o.a.s.c.c.ZkStateReader Updating cluster state from ZooKeeper... 
   [junit4]   2> 527202 INFO  (TEST-DistribDocExpirationUpdateProcessorTest.test-seed#[F1321BEA46285929]) [n:127.0.0.1:53570_qlrf    ] o.a.s.c.c.ZkStateReader Updated live nodes from ZooKeeper... (0) -> (1)
   [junit4]   2> 527207 INFO  (TEST-DistribDocExpirationUpdateProcessorTest.test-seed#[F1321BEA46285929]) [n:127.0.0.1:53570_qlrf    ] o.a.s.c.Overseer Overseer (id=null) closing
   [junit4]   2> 527208 INFO  (TEST-DistribDocExpirationUpdateProcessorTest.test-seed#[F1321BEA46285929]) [n:127.0.0.1:53570_qlrf    ] o.a.s.c.LeaderElector Joined leadership election with path: /overseer_elect/election/95892575990251529-127.0.0.1:53570_qlrf-n_0000000001
   [junit4]   2> 527209 INFO  (TEST-DistribDocExpirationUpdateProcessorTest.test-seed#[F1321BEA46285929]) [n:127.0.0.1:53570_qlrf    ] o.a.s.c.LeaderElector Watching path /overseer_elect/election/95892575990251524-127.0.0.1:53564_qlrf-n_0000000000 to know if I could be the leader
   [junit4]   2> 527210 INFO  (TEST-DistribDocExpirationUpdateProcessorTest.test-seed#[F1321BEA46285929]) [n:127.0.0.1:53570_qlrf    ] o.a.s.c.ZkController Publish node=127.0.0.1:53570_qlrf as DOWN
   [junit4]   2> 527213 INFO  (OverseerStateUpdate-95892575990251524-127.0.0.1:53564_qlrf-n_0000000000) [n:127.0.0.1:53564_qlrf    ] o.a.s.c.Overseer processMessage: queueSize: 1, message = {
   [junit4]   2>   "operation":"downnode",
   [junit4]   2>   "node_name":"127.0.0.1:53570_qlrf"} current state version: 3
   [junit4]   2> 527213 INFO  (OverseerStateUpdate-95892575990251524-127.0.0.1:53564_qlrf-n_0000000000) [n:127.0.0.1:53564_qlrf    ] o.a.s.c.o.NodeMutator DownNode state invoked for node: 127.0.0.1:53570_qlrf
   [junit4]   2> 527216 INFO  (zkCallback-659-thread-1-processing-n:127.0.0.1:53564_qlrf) [n:127.0.0.1:53564_qlrf    ] o.a.s.c.c.ZkStateReader A cluster state change: [WatchedEvent state:SyncConnected type:NodeDataChanged path:/clusterstate.json], has occurred - updating... (live nodes size: [1])
   [junit4]   2> 527216 INFO  (zkCallback-663-thread-1) [    ] o.a.s.c.c.ZkStateReader A cluster state change: [WatchedEvent state:SyncConnected type:NodeDataChanged path:/clusterstate.json], has occurred - updating... (live nodes size: [1])
   [junit4]   2> 527216 INFO  (zkCallback-669-thread-1-processing-n:127.0.0.1:53570_qlrf) [n:127.0.0.1:53570_qlrf    ] o.a.s.c.c.ZkStateReader A cluster state change: [WatchedEvent state:SyncConnected type:NodeDataChanged path:/clusterstate.json], has occurred - updating... (live nodes size: [1])
   [junit4]   2> 527325 INFO  (OverseerStateUpdate-95892575990251524-127.0.0.1:53564_qlrf-n_0000000000) [n:127.0.0.1:53564_qlrf    ] o.a.s.c.o.ZkStateWriter going to update_collection /collections/collection1/state.json version: 0
   [junit4]   2> 528218 INFO  (TEST-DistribDocExpirationUpdateProcessorTest.test-seed#[F1321BEA46285929]) [n:127.0.0.1:53570_qlrf    ] o.a.s.c.ZkController Register node as live in ZooKeeper:/live_nodes/127.0.0.1:53570_qlrf
   [junit4]   2> 528219 INFO  (TEST-DistribDocExpirationUpdateProcessorTest.test-seed#[F1321BEA46285929]) [n:127.0.0.1:53570_qlrf    ] o.a.s.c.c.SolrZkClient makePath: /live_nodes/127.0.0.1:53570_qlrf
   [junit4]   2> 528221 INFO  (zkCallback-659-thread-1-processing-n:127.0.0.1:53564_qlrf) [n:127.0.0.1:53564_qlrf    ] o.a.s.c.c.ZkStateReader A live node change: [WatchedEvent state:SyncConnected type:NodeChildrenChanged path:/live_nodes], has occurred - updating... (live nodes size: [1])
   [junit4]   2> 528221 INFO  (zkCallback-663-thread-1) [    ] o.a.s.c.c.ZkStateReader A live node change: [WatchedEvent state:SyncConnected type:NodeChildrenChanged path:/live_nodes], has occurred - updating... (live nodes size: [1])
   [junit4]   2> 528221 INFO  (zkCallback-669-thread-1-processing-n:127.0.0.1:53570_qlrf) [n:127.0.0.1:53570_qlrf    ] o.a.s.c.c.ZkStateReader A live node change: [WatchedEvent state:SyncConnected type:NodeChildrenChanged path:/live_nodes], has occurred - updating... (live nodes size: [1])
   [junit4]   2> 528222 INFO  (zkCallback-659-thread-1-processing-n:127.0.0.1:53564_qlrf) [n:127.0.0.1:53564_qlrf    ] o.a.s.c.c.ZkStateReader Updated live nodes from ZooKeeper... (1) -> (2)
   [junit4]   2> 528222 INFO  (zkCallback-663-thread-1) [    ] o.a.s.c.c.ZkStateReader Updated live nodes from ZooKeeper... (1) -> (2)
   [junit4]   2> 528222 INFO  (zkCallback-669-thread-1-processing-n:127.0.0.1:53570_qlrf) [n:127.0.0.1:53570_qlrf    ] o.a.s.c.c.ZkStateReader Updated live nodes from ZooKeeper... (1) -> (2)
   [junit4]   2> 528233 INFO  (TEST-DistribDocExpirationUpdateProcessorTest.test-seed#[F1321BEA46285929]) [n:127.0.0.1:53570_qlrf    ] o.a.s.c.CoreContainer Security conf doesn't exist. Skipping setup for authorization module.
   [junit4]   2> 528233 INFO  (TEST-DistribDocExpirationUpdateProcessorTest.test-seed#[F1321BEA46285929]) [n:127.0.0.1:53570_qlrf    ] o.a.s.c.CoreContainer No authentication plugin used.
   [junit4]   2> 528234 INFO  (TEST-DistribDocExpirationUpdateProcessorTest.test-seed#[F1321BEA46285929]) [n:127.0.0.1:53570_qlrf    ] o.a.s.c.CorePropertiesLocator Looking for core definitions underneath /Users/jenkins/workspace/Lucene-Solr-master-MacOSX/solr/build/solr-core/test/J1/temp/solr.cloud.DistribDocExpirationUpdateProcessorTest_F1321BEA46285929-001/shard-1-001/cores
   [junit4]   2> 528235 INFO  (TEST-DistribDocExpirationUpdateProcessorTest.test-seed#[F1321BEA46285929]) [n:127.0.0.1:53570_qlrf    ] o.a.s.c.CoreDescriptor Created CoreDescriptor: {name=collection1, config=solrconfig.xml, transient=false, schema=schema.xml, loadOnStartup=true, configSetProperties=configsetprops.json, collection=collection1, coreNodeName=, dataDir=data/, shard=}
   [junit4]   2> 528235 INFO  (TEST-DistribDocExpirationUpdateProcessorTest.test-seed#[F1321BEA46285929]) [n:127.0.0.1:53570_qlrf    ] o.a.s.c.CorePropertiesLocator Found core collection1 in /Users/jenkins/workspace/Lucene-Solr-master-MacOSX/solr/build/solr-core/test/J1/temp/solr.cloud.DistribDocExpirationUpdateProcessorTest_F1321BEA46285929-001/shard-1-001/cores/collection1
   [junit4]   2> 528236 INFO  (TEST-DistribDocExpirationUpdateProcessorTest.test-seed#[F1321BEA46285929]) [n:127.0.0.1:53570_qlrf    ] o.a.s.c.CorePropertiesLocator Found 1 core definitions
   [junit4]   2> 528237 INFO  (TEST-DistribDocExpirationUpdateProcessorTest.test-seed#[F1321BEA46285929]) [n:127.0.0.1:53570_qlrf    ] o.a.s.s.SolrDispatchFilter user.dir=/Users/jenkins/workspace/Lucene-Solr-master-MacOSX/solr/build/solr-core/test/J1
   [junit4]   2> 528237 INFO  (TEST-DistribDocExpirationUpdateProcessorTest.test-seed#[F1321BEA46285929]) [n:127.0.0.1:53570_qlrf    ] o.a.s.s.SolrDispatchFilter SolrDispatchFilter.init() done
   [junit4]   2> 528238 INFO  (coreLoadExecutor-1187-thread-1-processing-n:127.0.0.1:53570_qlrf) [n:127.0.0.1:53570_qlrf c:collection1   x:collection1] o.a.s.c.ZkController publishing state=down
   [junit4]   2> 528238 INFO  (coreLoadExecutor-1187-thread-1-processing-n:127.0.0.1:53570_qlrf) [n:127.0.0.1:53570_qlrf c:collection1   x:collection1] o.a.s.c.ZkController numShards not found on descriptor - reading it from system property
   [junit4]   2> 528239 INFO  (coreLoadExecutor-1187-thread-1-processing-n:127.0.0.1:53570_qlrf) [n:127.0.0.1:53570_qlrf c:collection1   x:collection1] o.a.s.c.ZkController Registering watch for collection collection1
   [junit4]   2> 528240 INFO  (coreLoadExecutor-1187-thread-1-processing-n:127.0.0.1:53570_qlrf) [n:127.0.0.1:53570_qlrf c:collection1   x:collection1] o.a.s.c.c.ZkStateReader Add data for [collection1] ver [1]
   [junit4]   2> 528240 INFO  (coreLoadExecutor-1187-thread-1-processing-n:127.0.0.1:53570_qlrf) [n:127.0.0.1:53570_qlrf c:collection1   x:collection1] o.a.s.c.ZkController look for our core node name
   [junit4]   2> 528240 INFO  (OverseerStateUpdate-95892575990251524-127.0.0.1:53564_qlrf-n_0000000000) [n:127.0.0.1:53564_qlrf    ] o.a.s.c.Overseer processMessage: queueSize: 1, message = {
   [junit4]   2>   "core":"collection1",
   [junit4]   2>   "roles":null,
   [junit4]   2>   "base_url":"http://127.0.0.1:53570/qlrf",
   [junit4]   2>   "node_name":"127.0.0.1:53570_qlrf",
   [junit4]   2>   "numShards":"2",
   [junit4]   2>   "state":"down",
   [junit4]   2>   "shard":null,
   [junit4]   2>   "collection":"collection1",
   [junit4]   2>   "operation":"state"} current state version: 4
   [junit4]   2> 528241 INFO  (OverseerStateUpdate-95892575990251524-127.0.0.1:53564_qlrf-n_0000000000) [n:127.0.0.1:53564_qlrf    ] o.a.s.c.o.ReplicaMutator Update state numShards=2 message={
   [junit4]   2>   "core":"collection1",
   [junit4]   2>   "roles":null,
   [junit4]   2>   "base_url":"http://127.0.0.1:53570/qlrf",
   [junit4]   2>   "node_name":"127.0.0.1:53570_qlrf",
   [junit4]   2>   "numShards":"2",
   [junit4]   2>   "state":"down",
   [junit4]   2>   "shard":null,
   [junit4]   2>   "collection":"collection1",
   [junit4]   2>   "operation":"state"}
   [junit4]   2> 528241 INFO  (OverseerStateUpdate-95892575990251524-127.0.0.1:53564_qlrf-n_0000000000) [n:127.0.0.1:53564_qlrf    ] o.a.s.c.o.ReplicaMutator Coll

[...truncated too long message...]

c.CachingDirectoryFactory Closing directory: /Users/jenkins/workspace/Lucene-Solr-master-MacOSX/solr/build/solr-core/test/J0/temp/solr.handler.TestReplicationHandler_F1321BEA46285929-001/solr-instance-029/collection1/data/index
   [junit4]   2> 2110100 INFO  (TEST-TestReplicationHandler.testRateLimitedReplication-seed#[F1321BEA46285929]) [    ] o.e.j.s.h.ContextHandler Stopped o.e.j.s.ServletContextHandler@b4564ef{/solr,null,UNAVAILABLE}
   [junit4]   2> 2110102 INFO  (TEST-TestReplicationHandler.testRateLimitedReplication-seed#[F1321BEA46285929]) [    ] o.e.j.s.ServerConnector Stopped ServerConnector@661954a0{HTTP/1.1,[http/1.1]}{127.0.0.1:0}
   [junit4]   2> 2110102 INFO  (TEST-TestReplicationHandler.testRateLimitedReplication-seed#[F1321BEA46285929]) [    ] o.a.s.c.CoreContainer Shutting down CoreContainer instance=1059448328
   [junit4]   2> 2110104 INFO  (coreCloseExecutor-6535-thread-1) [    x:collection1] o.a.s.c.SolrCore [collection1]  CLOSING SolrCore org.apache.solr.core.SolrCore@592e3f54
   [junit4]   2> 2110104 INFO  (coreCloseExecutor-6535-thread-1) [    x:collection1] o.a.s.u.DirectUpdateHandler2 closing DirectUpdateHandler2{commits=0,autocommits=0,soft autocommits=0,optimizes=0,rollbacks=0,expungeDeletes=0,docsPending=0,adds=0,deletesById=0,deletesByQuery=0,errors=0,cumulative_adds=0,cumulative_deletesById=0,cumulative_deletesByQuery=0,cumulative_errors=0}
   [junit4]   2> 2110104 INFO  (coreCloseExecutor-6535-thread-1) [    x:collection1] o.a.s.u.SolrCoreState Closing SolrCoreState
   [junit4]   2> 2110104 INFO  (coreCloseExecutor-6535-thread-1) [    x:collection1] o.a.s.u.DefaultSolrCoreState SolrCoreState ref count has reached 0 - closing IndexWriter
   [junit4]   2> 2110104 INFO  (coreCloseExecutor-6535-thread-1) [    x:collection1] o.a.s.u.DefaultSolrCoreState closing IndexWriter with IndexWriterCloser
   [junit4]   2> 2110105 INFO  (coreCloseExecutor-6535-thread-1) [    x:collection1] o.a.s.c.SolrCore [collection1] Closing main searcher on request.
   [junit4]   2> 2110105 INFO  (coreCloseExecutor-6535-thread-1) [    x:collection1] o.a.s.c.CachingDirectoryFactory Closing NRTCachingDirectoryFactory - 2 directories currently being tracked
   [junit4]   2> 2110105 INFO  (coreCloseExecutor-6535-thread-1) [    x:collection1] o.a.s.c.CachingDirectoryFactory looking to close /Users/jenkins/workspace/Lucene-Solr-master-MacOSX/solr/build/solr-core/test/J0/temp/solr.handler.TestReplicationHandler_F1321BEA46285929-001/solr-instance-030/collection1/data [CachedDir<<refCount=0;path=/Users/jenkins/workspace/Lucene-Solr-master-MacOSX/solr/build/solr-core/test/J0/temp/solr.handler.TestReplicationHandler_F1321BEA46285929-001/solr-instance-030/collection1/data;done=false>>]
   [junit4]   2> 2110105 INFO  (coreCloseExecutor-6535-thread-1) [    x:collection1] o.a.s.c.CachingDirectoryFactory Closing directory, CoreContainer#isShutdown=true
   [junit4]   2> 2110105 INFO  (coreCloseExecutor-6535-thread-1) [    x:collection1] o.a.s.c.CachingDirectoryFactory Closing directory: /Users/jenkins/workspace/Lucene-Solr-master-MacOSX/solr/build/solr-core/test/J0/temp/solr.handler.TestReplicationHandler_F1321BEA46285929-001/solr-instance-030/collection1/data
   [junit4]   2> 2110105 INFO  (coreCloseExecutor-6535-thread-1) [    x:collection1] o.a.s.c.CachingDirectoryFactory looking to close /Users/jenkins/workspace/Lucene-Solr-master-MacOSX/solr/build/solr-core/test/J0/temp/solr.handler.TestReplicationHandler_F1321BEA46285929-001/solr-instance-030/collection1/data/index [CachedDir<<refCount=0;path=/Users/jenkins/workspace/Lucene-Solr-master-MacOSX/solr/build/solr-core/test/J0/temp/solr.handler.TestReplicationHandler_F1321BEA46285929-001/solr-instance-030/collection1/data/index;done=false>>]
   [junit4]   2> 2110105 INFO  (coreCloseExecutor-6535-thread-1) [    x:collection1] o.a.s.c.CachingDirectoryFactory Closing directory, CoreContainer#isShutdown=true
   [junit4]   2> 2110105 INFO  (coreCloseExecutor-6535-thread-1) [    x:collection1] o.a.s.c.CachingDirectoryFactory Closing directory: /Users/jenkins/workspace/Lucene-Solr-master-MacOSX/solr/build/solr-core/test/J0/temp/solr.handler.TestReplicationHandler_F1321BEA46285929-001/solr-instance-030/collection1/data/index
   [junit4]   2> 2110106 INFO  (TEST-TestReplicationHandler.testRateLimitedReplication-seed#[F1321BEA46285929]) [    ] o.e.j.s.h.ContextHandler Stopped o.e.j.s.ServletContextHandler@4014aeb9{/solr,null,UNAVAILABLE}
   [junit4]   2> 2110108 INFO  (SUITE-TestReplicationHandler-seed#[F1321BEA46285929]-worker) [    ] o.a.s.SolrTestCaseJ4 ###deleteCore
   [junit4]   2> NOTE: leaving temporary files on disk at: /Users/jenkins/workspace/Lucene-Solr-master-MacOSX/solr/build/solr-core/test/J0/temp/solr.handler.TestReplicationHandler_F1321BEA46285929-001
   [junit4]   2> NOTE: test params are: codec=Lucene62, sim=ClassicSimilarity, locale=sl-SI, timezone=America/Marigot
   [junit4]   2> NOTE: Mac OS X 10.11.4 x86_64/Oracle Corporation 1.8.0_72 (64-bit)/cpus=3,threads=1,free=109859696,total=518979584
   [junit4]   2> NOTE: All tests run in this JVM: [CollectionStateFormat2Test, TermsComponentTest, ChangedSchemaMergeTest, TestFileDictionaryLookup, OutOfBoxZkACLAndCredentialsProvidersTest, MigrateRouteKeyTest, TestDistributedSearch, TestGeoJSONResponseWriter, TestOverriddenPrefixQueryForCustomFieldType, HighlighterTest, PingRequestHandlerTest, TestJmxIntegration, ClassificationUpdateProcessorFactoryTest, DirectSolrSpellCheckerTest, DocValuesTest, ShardRoutingTest, HardAutoCommitTest, SimpleCollectionCreateDeleteTest, TestTrieFacet, TestExtendedDismaxParser, TestSweetSpotSimilarityFactory, BlockDirectoryTest, CircularListTest, TestSchemaResource, CloudExitableDirectoryReaderTest, AnalysisAfterCoreReloadTest, ParsingFieldUpdateProcessorsTest, IndexSchemaTest, TestDocumentBuilder, JSONWriterTest, PathHierarchyTokenizerFactoryTest, DocValuesMultiTest, SpatialHeatmapFacetsTest, TestConfigOverlay, HighlighterMaxOffsetTest, TestUseDocValuesAsStored2, DistributedFacetPivotLongTailTest, TestReRankQParserPlugin, SpatialRPTFieldTypeTest, SolrCoreTest, HdfsDirectoryFactoryTest, TestSolrCLIRunExample, TestXIncludeConfig, UUIDUpdateProcessorFallbackTest, CdcrReplicationDistributedZkTest, TestSSLRandomization, TestExpandComponent, TestArbitraryIndexDir, TestCodecSupport, PrimitiveFieldTypeTest, TestManagedSynonymFilterFactory, StandardRequestHandlerTest, DistribCursorPagingTest, TestCursorMarkWithoutUniqueKey, ReturnFieldsTest, TestChildDocTransformer, TestCloudManagedSchema, TestSolrDynamicMBean, TestReqParamsAPI, TestRebalanceLeaders, TestSolrConfigHandlerConcurrent, DistributedSuggestComponentTest, MBeansHandlerTest, DirectoryFactoryTest, StatelessScriptUpdateProcessorFactoryTest, TestSubQueryTransformerCrossCore, TestRawResponseWriter, TestWordDelimiterFilterFactory, HdfsChaosMonkeyNothingIsSafeTest, ClusterStateTest, DocumentBuilderTest, RequiredFieldsTest, DocValuesMissingTest, FullHLLTest, FastVectorHighlighterTest, XmlUpdateRequestHandlerTest, TriLevelCompositeIdRoutingTest, TestManagedResource, TestPartialUpdateDeduplication, TestConfigReload, LeaderElectionTest, TestSurroundQueryParser, TestEmbeddedSolrServerConstructors, TestFieldResource, TestIBSimilarityFactory, ZkStateReaderTest, MoreLikeThisHandlerTest, ConnectionManagerTest, MergeStrategyTest, CheckHdfsIndexTest, TestTolerantSearch, BasicAuthIntegrationTest, TestRestManager, TestSolrDeletionPolicy1, ChaosMonkeyNothingIsSafeTest, RollingRestartTest, TestCloudBackupRestore, TestOnReconnectListenerSupport, TestSolrQueryParserDefaultOperatorResource, AddBlockUpdateTest, TestPhraseSuggestions, SuggestComponentTest, TestDFRSimilarityFactory, TestMissingGroups, TestNRTOpen, BitVectorTest, TestAnalyzedSuggestions, DistributedExpandComponentTest, LeaderInitiatedRecoveryOnCommitTest, TestAnalyzeInfixSuggestions, SimpleFacetsTest, DirectUpdateHandlerTest, TestSort, SampleTest, SyncSliceTest, TestScoreJoinQPScore, ClusterStateUpdateTest, TestLeaderElectionZkExpiry, TestDistribIDF, TestHdfsUpdateLog, TestTrackingShardHandlerFactory, SuggesterFSTTest, DisMaxRequestHandlerTest, TestCollectionAPI, RecoveryAfterSoftCommitTest, DistributedSpellCheckComponentTest, HttpPartitionTest, TestSchemaManager, PeerSyncTest, TestDownShardTolerantSearch, SegmentsInfoRequestHandlerTest, TestMergePolicyConfig, TestCoreContainer, TestSQLHandler, InfoHandlerTest, HdfsBasicDistributedZk2Test, HdfsCollectionsAPIDistributedZkTest, TestJsonFacets, TestStressReorder, TestComplexPhraseQParserPlugin, BasicDistributedZkTest, ChaosMonkeySafeLeaderTest, CollectionsAPIDistributedZkTest, TestReplicationHandler]
   [junit4] Completed [310/597 (2!)] on J0 in 134.42s, 15 tests, 1 failure, 1 skipped <<< FAILURES!

[...truncated 936 lines...]
BUILD FAILED
/Users/jenkins/workspace/Lucene-Solr-master-MacOSX/build.xml:740: The following error occurred while executing this line:
/Users/jenkins/workspace/Lucene-Solr-master-MacOSX/build.xml:684: The following error occurred while executing this line:
/Users/jenkins/workspace/Lucene-Solr-master-MacOSX/build.xml:59: The following error occurred while executing this line:
/Users/jenkins/workspace/Lucene-Solr-master-MacOSX/solr/build.xml:233: The following error occurred while executing this line:
/Users/jenkins/workspace/Lucene-Solr-master-MacOSX/solr/common-build.xml:529: The following error occurred while executing this line:
/Users/jenkins/workspace/Lucene-Solr-master-MacOSX/lucene/common-build.xml:1457: The following error occurred while executing this line:
/Users/jenkins/workspace/Lucene-Solr-master-MacOSX/lucene/common-build.xml:1014: There were test failures: 597 suites (10 ignored), 2413 tests, 2 failures, 121 ignored (71 assumptions) [seed: F1321BEA46285929]

Total time: 85 minutes 49 seconds
Build step 'Invoke Ant' marked build as failure
Archiving artifacts
[WARNINGS] Skipping publisher since build result is FAILURE
Recording test results
Email was triggered for: Failure - Any
Sending email for trigger: Failure - Any



Mime
View raw message