lucene-dev mailing list archives

Site index · List index
Message view « Date » · « Thread »
Top « Date » · « Thread »
From Policeman Jenkins Server <jenk...@thetaphi.de>
Subject [JENKINS] Lucene-Solr-master-Linux (64bit/jdk1.8.0_92) - Build # 16834 - Still Failing!
Date Thu, 26 May 2016 05:11:09 GMT
Build: http://jenkins.thetaphi.de/job/Lucene-Solr-master-Linux/16834/
Java: 64bit/jdk1.8.0_92 -XX:-UseCompressedOops -XX:+UseParallelGC

1 tests failed.
FAILED:  junit.framework.TestSuite.org.apache.solr.schema.TestManagedSchemaAPI

Error Message:
ObjectTracker found 1 object(s) that were not released!!! [MockDirectoryWrapper]

Stack Trace:
java.lang.AssertionError: ObjectTracker found 1 object(s) that were not released!!! [MockDirectoryWrapper]
	at __randomizedtesting.SeedInfo.seed([397ECD0448C550B7]:0)
	at org.junit.Assert.fail(Assert.java:93)
	at org.junit.Assert.assertTrue(Assert.java:43)
	at org.junit.Assert.assertNull(Assert.java:551)
	at org.apache.solr.SolrTestCaseJ4.afterClass(SolrTestCaseJ4.java:255)
	at sun.reflect.GeneratedMethodAccessor17.invoke(Unknown Source)
	at sun.reflect.DelegatingMethodAccessorImpl.invoke(DelegatingMethodAccessorImpl.java:43)
	at java.lang.reflect.Method.invoke(Method.java:498)
	at com.carrotsearch.randomizedtesting.RandomizedRunner.invoke(RandomizedRunner.java:1764)
	at com.carrotsearch.randomizedtesting.RandomizedRunner$7.evaluate(RandomizedRunner.java:834)
	at com.carrotsearch.randomizedtesting.rules.StatementAdapter.evaluate(StatementAdapter.java:36)
	at com.carrotsearch.randomizedtesting.rules.SystemPropertiesRestoreRule$1.evaluate(SystemPropertiesRestoreRule.java:57)
	at org.apache.lucene.util.AbstractBeforeAfterRule$1.evaluate(AbstractBeforeAfterRule.java:45)
	at com.carrotsearch.randomizedtesting.rules.StatementAdapter.evaluate(StatementAdapter.java:36)
	at org.apache.lucene.util.TestRuleStoreClassName$1.evaluate(TestRuleStoreClassName.java:41)
	at com.carrotsearch.randomizedtesting.rules.NoShadowingOrOverridesOnMethodsRule$1.evaluate(NoShadowingOrOverridesOnMethodsRule.java:40)
	at com.carrotsearch.randomizedtesting.rules.NoShadowingOrOverridesOnMethodsRule$1.evaluate(NoShadowingOrOverridesOnMethodsRule.java:40)
	at com.carrotsearch.randomizedtesting.rules.StatementAdapter.evaluate(StatementAdapter.java:36)
	at com.carrotsearch.randomizedtesting.rules.StatementAdapter.evaluate(StatementAdapter.java:36)
	at com.carrotsearch.randomizedtesting.rules.StatementAdapter.evaluate(StatementAdapter.java:36)
	at org.apache.lucene.util.TestRuleAssertionsRequired$1.evaluate(TestRuleAssertionsRequired.java:53)
	at org.apache.lucene.util.TestRuleMarkFailure$1.evaluate(TestRuleMarkFailure.java:47)
	at org.apache.lucene.util.TestRuleIgnoreAfterMaxFailures$1.evaluate(TestRuleIgnoreAfterMaxFailures.java:64)
	at org.apache.lucene.util.TestRuleIgnoreTestSuites$1.evaluate(TestRuleIgnoreTestSuites.java:54)
	at com.carrotsearch.randomizedtesting.rules.StatementAdapter.evaluate(StatementAdapter.java:36)
	at com.carrotsearch.randomizedtesting.ThreadLeakControl$StatementRunner.run(ThreadLeakControl.java:367)
	at java.lang.Thread.run(Thread.java:745)




Build Log:
[...truncated 12226 lines...]
   [junit4] Suite: org.apache.solr.schema.TestManagedSchemaAPI
   [junit4]   2> Creating dataDir: /home/jenkins/workspace/Lucene-Solr-master-Linux/solr/build/solr-core/test/J2/temp/solr.schema.TestManagedSchemaAPI_397ECD0448C550B7-001/init-core-data-001
   [junit4]   2> 2450984 INFO  (SUITE-TestManagedSchemaAPI-seed#[397ECD0448C550B7]-worker) [    ] o.a.s.SolrTestCaseJ4 Randomized ssl (true) and clientAuth (false)
   [junit4]   2> 2450986 INFO  (SUITE-TestManagedSchemaAPI-seed#[397ECD0448C550B7]-worker) [    ] o.a.s.c.ZkTestServer STARTING ZK TEST SERVER
   [junit4]   2> 2450987 INFO  (Thread-4780) [    ] o.a.s.c.ZkTestServer client port:0.0.0.0/0.0.0.0:0
   [junit4]   2> 2450987 INFO  (Thread-4780) [    ] o.a.s.c.ZkTestServer Starting server
   [junit4]   2> 2451087 INFO  (SUITE-TestManagedSchemaAPI-seed#[397ECD0448C550B7]-worker) [    ] o.a.s.c.ZkTestServer start zk server on port:35736
   [junit4]   2> 2451087 INFO  (SUITE-TestManagedSchemaAPI-seed#[397ECD0448C550B7]-worker) [    ] o.a.s.c.c.SolrZkClient Using default ZkCredentialsProvider
   [junit4]   2> 2451089 INFO  (SUITE-TestManagedSchemaAPI-seed#[397ECD0448C550B7]-worker) [    ] o.a.s.c.c.ConnectionManager Waiting for client to connect to ZooKeeper
   [junit4]   2> 2451092 INFO  (zkCallback-3301-thread-1) [    ] o.a.s.c.c.ConnectionManager Watcher org.apache.solr.common.cloud.ConnectionManager@106d4e93 name:ZooKeeperConnection Watcher:127.0.0.1:35736 got event WatchedEvent state:SyncConnected type:None path:null path:null type:None
   [junit4]   2> 2451092 INFO  (SUITE-TestManagedSchemaAPI-seed#[397ECD0448C550B7]-worker) [    ] o.a.s.c.c.ConnectionManager Client is connected to ZooKeeper
   [junit4]   2> 2451093 INFO  (SUITE-TestManagedSchemaAPI-seed#[397ECD0448C550B7]-worker) [    ] o.a.s.c.c.SolrZkClient Using default ZkACLProvider
   [junit4]   2> 2451093 INFO  (SUITE-TestManagedSchemaAPI-seed#[397ECD0448C550B7]-worker) [    ] o.a.s.c.c.SolrZkClient makePath: /solr/solr.xml
   [junit4]   2> 2451096 INFO  (SUITE-TestManagedSchemaAPI-seed#[397ECD0448C550B7]-worker) [    ] o.a.s.c.c.SolrZkClient makePath: /solr/clusterprops.json
   [junit4]   2> 2451102 INFO  (jetty-launcher-3300-thread-1) [    ] o.e.j.s.Server jetty-9.3.8.v20160314
   [junit4]   2> 2451103 INFO  (jetty-launcher-3300-thread-1) [    ] o.e.j.s.h.ContextHandler Started o.e.j.s.ServletContextHandler@4dcc7967{/solr,null,AVAILABLE}
   [junit4]   2> 2451105 INFO  (jetty-launcher-3300-thread-2) [    ] o.e.j.s.Server jetty-9.3.8.v20160314
   [junit4]   2> 2451107 INFO  (jetty-launcher-3300-thread-2) [    ] o.e.j.s.h.ContextHandler Started o.e.j.s.ServletContextHandler@452bc1ff{/solr,null,AVAILABLE}
   [junit4]   2> 2451114 INFO  (jetty-launcher-3300-thread-1) [    ] o.e.j.s.ServerConnector Started ServerConnector@21b76dbb{SSL,[ssl, http/1.1]}{127.0.0.1:40404}
   [junit4]   2> 2451118 INFO  (jetty-launcher-3300-thread-2) [    ] o.e.j.s.ServerConnector Started ServerConnector@42760109{SSL,[ssl, http/1.1]}{127.0.0.1:45208}
   [junit4]   2> 2451119 INFO  (jetty-launcher-3300-thread-2) [    ] o.e.j.s.Server Started @2453031ms
   [junit4]   2> 2451119 INFO  (jetty-launcher-3300-thread-1) [    ] o.e.j.s.Server Started @2453031ms
   [junit4]   2> 2451119 INFO  (jetty-launcher-3300-thread-2) [    ] o.a.s.c.s.e.JettySolrRunner Jetty properties: {hostContext=/solr, hostPort=45208}
   [junit4]   2> 2451119 INFO  (jetty-launcher-3300-thread-1) [    ] o.a.s.c.s.e.JettySolrRunner Jetty properties: {hostContext=/solr, hostPort=40404}
   [junit4]   2> 2451119 INFO  (jetty-launcher-3300-thread-2) [    ] o.a.s.s.SolrDispatchFilter SolrDispatchFilter.init(): sun.misc.Launcher$AppClassLoader@73d16e93
   [junit4]   2> 2451119 INFO  (jetty-launcher-3300-thread-1) [    ] o.a.s.s.SolrDispatchFilter SolrDispatchFilter.init(): sun.misc.Launcher$AppClassLoader@73d16e93
   [junit4]   2> 2451119 INFO  (jetty-launcher-3300-thread-2) [    ] o.a.s.c.SolrResourceLoader new SolrResourceLoader for directory: '/home/jenkins/workspace/Lucene-Solr-master-Linux/solr/build/solr-core/test/J2/temp/solr.schema.TestManagedSchemaAPI_397ECD0448C550B7-001/tempDir-001/node2'
   [junit4]   2> 2451119 INFO  (jetty-launcher-3300-thread-1) [    ] o.a.s.c.SolrResourceLoader new SolrResourceLoader for directory: '/home/jenkins/workspace/Lucene-Solr-master-Linux/solr/build/solr-core/test/J2/temp/solr.schema.TestManagedSchemaAPI_397ECD0448C550B7-001/tempDir-001/node1'
   [junit4]   2> 2451119 INFO  (jetty-launcher-3300-thread-2) [    ] o.a.s.c.SolrResourceLoader JNDI not configured for solr (NoInitialContextEx)
   [junit4]   2> 2451119 INFO  (jetty-launcher-3300-thread-1) [    ] o.a.s.c.SolrResourceLoader JNDI not configured for solr (NoInitialContextEx)
   [junit4]   2> 2451119 INFO  (jetty-launcher-3300-thread-2) [    ] o.a.s.c.SolrResourceLoader solr home defaulted to 'solr/' (could not find system property or JNDI)
   [junit4]   2> 2451119 INFO  (jetty-launcher-3300-thread-1) [    ] o.a.s.c.SolrResourceLoader solr home defaulted to 'solr/' (could not find system property or JNDI)
   [junit4]   2> 2451120 INFO  (jetty-launcher-3300-thread-2) [    ] o.a.s.c.c.SolrZkClient Using default ZkCredentialsProvider
   [junit4]   2> 2451120 INFO  (jetty-launcher-3300-thread-1) [    ] o.a.s.c.c.SolrZkClient Using default ZkCredentialsProvider
   [junit4]   2> 2451120 INFO  (jetty-launcher-3300-thread-2) [    ] o.a.s.c.c.ConnectionManager Waiting for client to connect to ZooKeeper
   [junit4]   2> 2451121 INFO  (zkCallback-3302-thread-1) [    ] o.a.s.c.c.ConnectionManager Watcher org.apache.solr.common.cloud.ConnectionManager@7f5eeed8 name:ZooKeeperConnection Watcher:127.0.0.1:35736/solr got event WatchedEvent state:SyncConnected type:None path:null path:null type:None
   [junit4]   2> 2451121 INFO  (jetty-launcher-3300-thread-2) [    ] o.a.s.c.c.ConnectionManager Client is connected to ZooKeeper
   [junit4]   2> 2451121 INFO  (jetty-launcher-3300-thread-2) [    ] o.a.s.c.c.SolrZkClient Using default ZkACLProvider
   [junit4]   2> 2451121 INFO  (jetty-launcher-3300-thread-2) [    ] o.a.s.s.SolrDispatchFilter solr.xml found in ZooKeeper. Loading...
   [junit4]   2> 2451124 INFO  (jetty-launcher-3300-thread-1) [    ] o.a.s.c.c.ConnectionManager Waiting for client to connect to ZooKeeper
   [junit4]   2> 2451125 INFO  (zkCallback-3303-thread-1) [    ] o.a.s.c.c.ConnectionManager Watcher org.apache.solr.common.cloud.ConnectionManager@94a215d name:ZooKeeperConnection Watcher:127.0.0.1:35736/solr got event WatchedEvent state:SyncConnected type:None path:null path:null type:None
   [junit4]   2> 2451125 INFO  (jetty-launcher-3300-thread-1) [    ] o.a.s.c.c.ConnectionManager Client is connected to ZooKeeper
   [junit4]   2> 2451125 INFO  (jetty-launcher-3300-thread-1) [    ] o.a.s.c.c.SolrZkClient Using default ZkACLProvider
   [junit4]   2> 2451125 INFO  (jetty-launcher-3300-thread-1) [    ] o.a.s.s.SolrDispatchFilter solr.xml found in ZooKeeper. Loading...
   [junit4]   2> 2451129 INFO  (jetty-launcher-3300-thread-2) [    ] o.a.s.c.CorePropertiesLocator Config-defined core root directory: /home/jenkins/workspace/Lucene-Solr-master-Linux/solr/build/solr-core/test/J2/temp/solr.schema.TestManagedSchemaAPI_397ECD0448C550B7-001/tempDir-001/node2/.
   [junit4]   2> 2451129 INFO  (jetty-launcher-3300-thread-2) [    ] o.a.s.c.CoreContainer New CoreContainer 2102016171
   [junit4]   2> 2451129 INFO  (jetty-launcher-3300-thread-2) [    ] o.a.s.c.CoreContainer Loading cores into CoreContainer [instanceDir=/home/jenkins/workspace/Lucene-Solr-master-Linux/solr/build/solr-core/test/J2/temp/solr.schema.TestManagedSchemaAPI_397ECD0448C550B7-001/tempDir-001/node2]
   [junit4]   2> 2451130 WARN  (jetty-launcher-3300-thread-2) [    ] o.a.s.c.CoreContainer Couldn't add files from /home/jenkins/workspace/Lucene-Solr-master-Linux/solr/build/solr-core/test/J2/temp/solr.schema.TestManagedSchemaAPI_397ECD0448C550B7-001/tempDir-001/node2/lib to classpath: /home/jenkins/workspace/Lucene-Solr-master-Linux/solr/build/solr-core/test/J2/temp/solr.schema.TestManagedSchemaAPI_397ECD0448C550B7-001/tempDir-001/node2/lib
   [junit4]   2> 2451131 INFO  (jetty-launcher-3300-thread-2) [    ] o.a.s.h.c.HttpShardHandlerFactory created with socketTimeout : 90000,urlScheme : https,connTimeout : 15000,maxConnectionsPerHost : 20,maxConnections : 10000,corePoolSize : 0,maximumPoolSize : 2147483647,maxThreadIdleTime : 5,sizeOfQueue : -1,fairnessPolicy : false,
   [junit4]   2> 2451133 INFO  (jetty-launcher-3300-thread-2) [    ] o.a.s.u.UpdateShardHandler Creating UpdateShardHandler HTTP client with params: 
   [junit4]   2> 2451134 INFO  (jetty-launcher-3300-thread-1) [    ] o.a.s.c.CorePropertiesLocator Config-defined core root directory: /home/jenkins/workspace/Lucene-Solr-master-Linux/solr/build/solr-core/test/J2/temp/solr.schema.TestManagedSchemaAPI_397ECD0448C550B7-001/tempDir-001/node1/.
   [junit4]   2> 2451134 INFO  (jetty-launcher-3300-thread-1) [    ] o.a.s.c.CoreContainer New CoreContainer 342623988
   [junit4]   2> 2451134 INFO  (jetty-launcher-3300-thread-1) [    ] o.a.s.c.CoreContainer Loading cores into CoreContainer [instanceDir=/home/jenkins/workspace/Lucene-Solr-master-Linux/solr/build/solr-core/test/J2/temp/solr.schema.TestManagedSchemaAPI_397ECD0448C550B7-001/tempDir-001/node1]
   [junit4]   2> 2451134 INFO  (jetty-launcher-3300-thread-2) [    ] o.a.s.l.LogWatcher SLF4J impl is org.slf4j.impl.Log4jLoggerFactory
   [junit4]   2> 2451134 WARN  (jetty-launcher-3300-thread-1) [    ] o.a.s.c.CoreContainer Couldn't add files from /home/jenkins/workspace/Lucene-Solr-master-Linux/solr/build/solr-core/test/J2/temp/solr.schema.TestManagedSchemaAPI_397ECD0448C550B7-001/tempDir-001/node1/lib to classpath: /home/jenkins/workspace/Lucene-Solr-master-Linux/solr/build/solr-core/test/J2/temp/solr.schema.TestManagedSchemaAPI_397ECD0448C550B7-001/tempDir-001/node1/lib
   [junit4]   2> 2451134 INFO  (jetty-launcher-3300-thread-2) [    ] o.a.s.l.LogWatcher Registering Log Listener [Log4j (org.slf4j.impl.Log4jLoggerFactory)]
   [junit4]   2> 2451134 INFO  (jetty-launcher-3300-thread-1) [    ] o.a.s.h.c.HttpShardHandlerFactory created with socketTimeout : 90000,urlScheme : https,connTimeout : 15000,maxConnectionsPerHost : 20,maxConnections : 10000,corePoolSize : 0,maximumPoolSize : 2147483647,maxThreadIdleTime : 5,sizeOfQueue : -1,fairnessPolicy : false,
   [junit4]   2> 2451134 INFO  (jetty-launcher-3300-thread-2) [    ] o.a.s.c.ZkContainer Zookeeper client=127.0.0.1:35736/solr
   [junit4]   2> 2451135 INFO  (jetty-launcher-3300-thread-2) [    ] o.a.s.c.ZkController zkHost includes chroot
   [junit4]   2> 2451135 INFO  (jetty-launcher-3300-thread-2) [    ] o.a.s.c.c.SolrZkClient Using default ZkCredentialsProvider
   [junit4]   2> 2451135 INFO  (jetty-launcher-3300-thread-2) [    ] o.a.s.c.c.ConnectionManager Waiting for client to connect to ZooKeeper
   [junit4]   2> 2451136 INFO  (jetty-launcher-3300-thread-1) [    ] o.a.s.u.UpdateShardHandler Creating UpdateShardHandler HTTP client with params: 
   [junit4]   2> 2451137 INFO  (zkCallback-3306-thread-1) [    ] o.a.s.c.c.ConnectionManager Watcher org.apache.solr.common.cloud.ConnectionManager@1944885e name:ZooKeeperConnection Watcher:127.0.0.1:35736 got event WatchedEvent state:SyncConnected type:None path:null path:null type:None
   [junit4]   2> 2451137 INFO  (jetty-launcher-3300-thread-2) [    ] o.a.s.c.c.ConnectionManager Client is connected to ZooKeeper
   [junit4]   2> 2451137 INFO  (jetty-launcher-3300-thread-2) [    ] o.a.s.c.c.SolrZkClient Using default ZkACLProvider
   [junit4]   2> 2451137 INFO  (jetty-launcher-3300-thread-1) [    ] o.a.s.l.LogWatcher SLF4J impl is org.slf4j.impl.Log4jLoggerFactory
   [junit4]   2> 2451137 INFO  (jetty-launcher-3300-thread-1) [    ] o.a.s.l.LogWatcher Registering Log Listener [Log4j (org.slf4j.impl.Log4jLoggerFactory)]
   [junit4]   2> 2451137 INFO  (jetty-launcher-3300-thread-1) [    ] o.a.s.c.ZkContainer Zookeeper client=127.0.0.1:35736/solr
   [junit4]   2> 2451137 INFO  (jetty-launcher-3300-thread-1) [    ] o.a.s.c.ZkController zkHost includes chroot
   [junit4]   2> 2451137 INFO  (jetty-launcher-3300-thread-1) [    ] o.a.s.c.c.SolrZkClient Using default ZkCredentialsProvider
   [junit4]   2> 2451137 INFO  (jetty-launcher-3300-thread-2) [n:127.0.0.1:45208_solr    ] o.a.s.c.ZkController Added new OnReconnect listener org.apache.solr.cloud.ZkController$$Lambda$52/499837687@1ebce200
   [junit4]   2> 2451137 INFO  (jetty-launcher-3300-thread-1) [    ] o.a.s.c.c.ConnectionManager Waiting for client to connect to ZooKeeper
   [junit4]   2> 2451137 INFO  (jetty-launcher-3300-thread-2) [n:127.0.0.1:45208_solr    ] o.a.s.c.c.ConnectionManager Waiting for client to connect to ZooKeeper
   [junit4]   2> 2451138 INFO  (zkCallback-3309-thread-1) [    ] o.a.s.c.c.ConnectionManager Watcher org.apache.solr.common.cloud.ConnectionManager@2d995b2d name:ZooKeeperConnection Watcher:127.0.0.1:35736 got event WatchedEvent state:SyncConnected type:None path:null path:null type:None
   [junit4]   2> 2451138 INFO  (jetty-launcher-3300-thread-1) [    ] o.a.s.c.c.ConnectionManager Client is connected to ZooKeeper
   [junit4]   2> 2451138 INFO  (zkCallback-3310-thread-1-processing-n:127.0.0.1:45208_solr) [n:127.0.0.1:45208_solr    ] o.a.s.c.c.ConnectionManager Watcher org.apache.solr.common.cloud.ConnectionManager@413e0b63 name:ZooKeeperConnection Watcher:127.0.0.1:35736/solr got event WatchedEvent state:SyncConnected type:None path:null path:null type:None
   [junit4]   2> 2451138 INFO  (jetty-launcher-3300-thread-2) [n:127.0.0.1:45208_solr    ] o.a.s.c.c.ConnectionManager Client is connected to ZooKeeper
   [junit4]   2> 2451138 INFO  (jetty-launcher-3300-thread-1) [    ] o.a.s.c.c.SolrZkClient Using default ZkACLProvider
   [junit4]   2> 2451138 INFO  (jetty-launcher-3300-thread-2) [n:127.0.0.1:45208_solr    ] o.a.s.c.c.SolrZkClient makePath: /overseer/queue
   [junit4]   2> 2451138 INFO  (jetty-launcher-3300-thread-1) [n:127.0.0.1:40404_solr    ] o.a.s.c.ZkController Added new OnReconnect listener org.apache.solr.cloud.ZkController$$Lambda$52/499837687@6894432d
   [junit4]   2> 2451139 INFO  (jetty-launcher-3300-thread-1) [n:127.0.0.1:40404_solr    ] o.a.s.c.c.ConnectionManager Waiting for client to connect to ZooKeeper
   [junit4]   2> 2451139 INFO  (zkCallback-3311-thread-1-processing-n:127.0.0.1:40404_solr) [n:127.0.0.1:40404_solr    ] o.a.s.c.c.ConnectionManager Watcher org.apache.solr.common.cloud.ConnectionManager@65b26399 name:ZooKeeperConnection Watcher:127.0.0.1:35736/solr got event WatchedEvent state:SyncConnected type:None path:null path:null type:None
   [junit4]   2> 2451139 INFO  (jetty-launcher-3300-thread-2) [n:127.0.0.1:45208_solr    ] o.a.s.c.c.SolrZkClient makePath: /overseer/collection-queue-work
   [junit4]   2> 2451139 INFO  (jetty-launcher-3300-thread-1) [n:127.0.0.1:40404_solr    ] o.a.s.c.c.ConnectionManager Client is connected to ZooKeeper
   [junit4]   2> 2451140 INFO  (jetty-launcher-3300-thread-2) [n:127.0.0.1:45208_solr    ] o.a.s.c.c.SolrZkClient makePath: /overseer/collection-map-running
   [junit4]   2> 2451140 INFO  (jetty-launcher-3300-thread-1) [n:127.0.0.1:40404_solr    ] o.a.s.c.c.SolrZkClient makePath: /overseer/collection-map-running
   [junit4]   2> 2451141 INFO  (jetty-launcher-3300-thread-2) [n:127.0.0.1:45208_solr    ] o.a.s.c.c.SolrZkClient makePath: /overseer/collection-map-completed
   [junit4]   2> 2451141 INFO  (jetty-launcher-3300-thread-1) [n:127.0.0.1:40404_solr    ] o.a.s.c.c.SolrZkClient makePath: /overseer/collection-map-completed
   [junit4]   2> 2451141 INFO  (jetty-launcher-3300-thread-2) [n:127.0.0.1:45208_solr    ] o.a.s.c.c.SolrZkClient makePath: /overseer/collection-map-failure
   [junit4]   2> 2451142 INFO  (jetty-launcher-3300-thread-1) [n:127.0.0.1:40404_solr    ] o.a.s.c.c.SolrZkClient makePath: /overseer/collection-map-failure
   [junit4]   2> 2451142 INFO  (jetty-launcher-3300-thread-2) [n:127.0.0.1:45208_solr    ] o.a.s.c.c.SolrZkClient makePath: /live_nodes
   [junit4]   2> 2451142 INFO  (jetty-launcher-3300-thread-1) [n:127.0.0.1:40404_solr    ] o.a.s.c.c.SolrZkClient makePath: /live_nodes
   [junit4]   2> 2451142 INFO  (jetty-launcher-3300-thread-1) [n:127.0.0.1:40404_solr    ] o.a.s.c.c.SolrZkClient makePath: /collections
   [junit4]   2> 2451142 INFO  (jetty-launcher-3300-thread-2) [n:127.0.0.1:45208_solr    ] o.a.s.c.c.SolrZkClient makePath: /collections
   [junit4]   2> 2451142 INFO  (jetty-launcher-3300-thread-1) [n:127.0.0.1:40404_solr    ] o.a.s.c.c.SolrZkClient makePath: /aliases.json
   [junit4]   2> 2451143 INFO  (jetty-launcher-3300-thread-2) [n:127.0.0.1:45208_solr    ] o.a.s.c.c.SolrZkClient makePath: /aliases.json
   [junit4]   2> 2451143 INFO  (jetty-launcher-3300-thread-2) [n:127.0.0.1:45208_solr    ] o.a.s.c.c.SolrZkClient makePath: /clusterstate.json
   [junit4]   2> 2451143 INFO  (jetty-launcher-3300-thread-1) [n:127.0.0.1:40404_solr    ] o.a.s.c.c.SolrZkClient makePath: /clusterstate.json
   [junit4]   2> 2451143 INFO  (jetty-launcher-3300-thread-1) [n:127.0.0.1:40404_solr    ] o.a.s.c.c.SolrZkClient makePath: /security.json
   [junit4]   2> 2451143 INFO  (jetty-launcher-3300-thread-2) [n:127.0.0.1:45208_solr    ] o.a.s.c.c.SolrZkClient makePath: /security.json
   [junit4]   2> 2451143 INFO  (jetty-launcher-3300-thread-2) [n:127.0.0.1:45208_solr    ] o.a.s.c.c.ZkStateReader Updating cluster state from ZooKeeper... 
   [junit4]   2> 2451143 INFO  (jetty-launcher-3300-thread-1) [n:127.0.0.1:40404_solr    ] o.a.s.c.c.ZkStateReader Updating cluster state from ZooKeeper... 
   [junit4]   2> 2451144 INFO  (jetty-launcher-3300-thread-2) [n:127.0.0.1:45208_solr    ] o.a.s.c.c.ZkStateReader Loaded cluster properties: {urlScheme=https}
   [junit4]   2> 2451144 INFO  (jetty-launcher-3300-thread-1) [n:127.0.0.1:40404_solr    ] o.a.s.c.c.ZkStateReader Loaded cluster properties: {urlScheme=https}
   [junit4]   2> 2451144 INFO  (jetty-launcher-3300-thread-2) [n:127.0.0.1:45208_solr    ] o.a.s.c.c.ZkStateReader Updated live nodes from ZooKeeper... (0) -> (0)
   [junit4]   2> 2451144 INFO  (jetty-launcher-3300-thread-1) [n:127.0.0.1:40404_solr    ] o.a.s.c.c.ZkStateReader Updated live nodes from ZooKeeper... (0) -> (0)
   [junit4]   2> 2451144 INFO  (jetty-launcher-3300-thread-2) [n:127.0.0.1:45208_solr    ] o.a.s.c.c.SolrZkClient makePath: /overseer_elect
   [junit4]   2> 2451144 INFO  (jetty-launcher-3300-thread-1) [n:127.0.0.1:40404_solr    ] o.a.s.c.c.SolrZkClient makePath: /overseer_elect
   [junit4]   2> 2451145 INFO  (jetty-launcher-3300-thread-2) [n:127.0.0.1:45208_solr    ] o.a.s.c.c.SolrZkClient makePath: /overseer_elect/election
   [junit4]   2> 2451145 INFO  (jetty-launcher-3300-thread-1) [n:127.0.0.1:40404_solr    ] o.a.s.c.c.SolrZkClient makePath: /overseer_elect/election
   [junit4]   2> 2451145 INFO  (jetty-launcher-3300-thread-1) [n:127.0.0.1:40404_solr    ] o.a.s.c.Overseer Overseer (id=null) closing
   [junit4]   2> 2451145 INFO  (jetty-launcher-3300-thread-2) [n:127.0.0.1:45208_solr    ] o.a.s.c.Overseer Overseer (id=null) closing
   [junit4]   2> 2451146 INFO  (jetty-launcher-3300-thread-1) [n:127.0.0.1:40404_solr    ] o.a.s.c.LeaderElector Joined leadership election with path: /overseer_elect/election/95960391517732870-127.0.0.1:40404_solr-n_0000000000
   [junit4]   2> 2451146 INFO  (jetty-launcher-3300-thread-2) [n:127.0.0.1:45208_solr    ] o.a.s.c.LeaderElector Joined leadership election with path: /overseer_elect/election/95960391517732869-127.0.0.1:45208_solr-n_0000000001
   [junit4]   2> 2451146 INFO  (jetty-launcher-3300-thread-1) [n:127.0.0.1:40404_solr    ] o.a.s.c.OverseerElectionContext I am going to be the leader 127.0.0.1:40404_solr
   [junit4]   2> 2451146 INFO  (jetty-launcher-3300-thread-1) [n:127.0.0.1:40404_solr    ] o.a.s.c.c.SolrZkClient makePath: /overseer_elect/leader
   [junit4]   2> 2451146 INFO  (jetty-launcher-3300-thread-2) [n:127.0.0.1:45208_solr    ] o.a.s.c.LeaderElector Watching path /overseer_elect/election/95960391517732870-127.0.0.1:40404_solr-n_0000000000 to know if I could be the leader
   [junit4]   2> 2451146 INFO  (jetty-launcher-3300-thread-2) [n:127.0.0.1:45208_solr    ] o.a.s.c.ZkController Register node as live in ZooKeeper:/live_nodes/127.0.0.1:45208_solr
   [junit4]   2> 2451146 INFO  (jetty-launcher-3300-thread-2) [n:127.0.0.1:45208_solr    ] o.a.s.c.c.SolrZkClient makePath: /live_nodes/127.0.0.1:45208_solr
   [junit4]   2> 2451147 INFO  (jetty-launcher-3300-thread-1) [n:127.0.0.1:40404_solr    ] o.a.s.c.Overseer Overseer (id=95960391517732870-127.0.0.1:40404_solr-n_0000000000) starting
   [junit4]   2> 2451147 INFO  (zkCallback-3311-thread-1-processing-n:127.0.0.1:40404_solr) [n:127.0.0.1:40404_solr    ] o.a.s.c.c.ZkStateReader A live node change: [WatchedEvent state:SyncConnected type:NodeChildrenChanged path:/live_nodes], has occurred - updating... (live nodes size: [0])
   [junit4]   2> 2451147 INFO  (zkCallback-3310-thread-1-processing-n:127.0.0.1:45208_solr) [n:127.0.0.1:45208_solr    ] o.a.s.c.c.ZkStateReader A live node change: [WatchedEvent state:SyncConnected type:NodeChildrenChanged path:/live_nodes], has occurred - updating... (live nodes size: [0])
   [junit4]   2> 2451148 INFO  (zkCallback-3311-thread-1-processing-n:127.0.0.1:40404_solr) [n:127.0.0.1:40404_solr    ] o.a.s.c.c.ZkStateReader Updated live nodes from ZooKeeper... (0) -> (1)
   [junit4]   2> 2451149 INFO  (zkCallback-3310-thread-1-processing-n:127.0.0.1:45208_solr) [n:127.0.0.1:45208_solr    ] o.a.s.c.c.ZkStateReader Updated live nodes from ZooKeeper... (0) -> (1)
   [junit4]   2> 2451149 INFO  (jetty-launcher-3300-thread-1) [n:127.0.0.1:40404_solr    ] o.a.s.c.c.SolrZkClient makePath: /overseer/queue-work
   [junit4]   2> 2451151 INFO  (jetty-launcher-3300-thread-1) [n:127.0.0.1:40404_solr    ] o.a.s.c.OverseerAutoReplicaFailoverThread Starting OverseerAutoReplicaFailoverThread autoReplicaFailoverWorkLoopDelay=10000 autoReplicaFailoverWaitAfterExpiration=30000 autoReplicaFailoverBadNodeExpiration=60000
   [junit4]   2> 2451151 INFO  (OverseerCollectionConfigSetProcessor-95960391517732870-127.0.0.1:40404_solr-n_0000000000) [n:127.0.0.1:40404_solr    ] o.a.s.c.OverseerTaskProcessor Process current queue of overseer operations
   [junit4]   2> 2451151 INFO  (OverseerStateUpdate-95960391517732870-127.0.0.1:40404_solr-n_0000000000) [n:127.0.0.1:40404_solr    ] o.a.s.c.Overseer Starting to work on the main queue
   [junit4]   2> 2451152 INFO  (jetty-launcher-3300-thread-1) [n:127.0.0.1:40404_solr    ] o.a.s.c.ZkController Publish node=127.0.0.1:40404_solr as DOWN
   [junit4]   2> 2451153 INFO  (OverseerStateUpdate-95960391517732870-127.0.0.1:40404_solr-n_0000000000) [n:127.0.0.1:40404_solr    ] o.a.s.c.c.ZkStateReader Updated live nodes from ZooKeeper... (1) -> (1)
   [junit4]   2> 2451153 INFO  (OverseerStateUpdate-95960391517732870-127.0.0.1:40404_solr-n_0000000000) [n:127.0.0.1:40404_solr    ] o.a.s.c.Overseer processMessage: queueSize: 1, message = {
   [junit4]   2>   "operation":"downnode",
   [junit4]   2>   "node_name":"127.0.0.1:40404_solr"} current state version: 0
   [junit4]   2> 2451153 INFO  (OverseerStateUpdate-95960391517732870-127.0.0.1:40404_solr-n_0000000000) [n:127.0.0.1:40404_solr    ] o.a.s.c.o.NodeMutator DownNode state invoked for node: 127.0.0.1:40404_solr
   [junit4]   2> 2451158 INFO  (jetty-launcher-3300-thread-2) [n:127.0.0.1:45208_solr    ] o.a.s.c.CoreContainer Security conf doesn't exist. Skipping setup for authorization module.
   [junit4]   2> 2451158 INFO  (jetty-launcher-3300-thread-2) [n:127.0.0.1:45208_solr    ] o.a.s.c.CoreContainer No authentication plugin used.
   [junit4]   2> 2451158 INFO  (jetty-launcher-3300-thread-2) [n:127.0.0.1:45208_solr    ] o.a.s.c.CorePropertiesLocator Looking for core definitions underneath /home/jenkins/workspace/Lucene-Solr-master-Linux/solr/build/solr-core/test/J2/temp/solr.schema.TestManagedSchemaAPI_397ECD0448C550B7-001/tempDir-001/node2/.
   [junit4]   2> 2451158 INFO  (jetty-launcher-3300-thread-2) [n:127.0.0.1:45208_solr    ] o.a.s.c.CorePropertiesLocator Found 0 core definitions
   [junit4]   2> 2451161 INFO  (jetty-launcher-3300-thread-2) [n:127.0.0.1:45208_solr    ] o.a.s.s.SolrDispatchFilter user.dir=/home/jenkins/workspace/Lucene-Solr-master-Linux/solr/build/solr-core/test/J2
   [junit4]   2> 2451161 INFO  (jetty-launcher-3300-thread-2) [n:127.0.0.1:45208_solr    ] o.a.s.s.SolrDispatchFilter SolrDispatchFilter.init() done
   [junit4]   2> 2452153 INFO  (jetty-launcher-3300-thread-1) [n:127.0.0.1:40404_solr    ] o.a.s.c.ZkController Register node as live in ZooKeeper:/live_nodes/127.0.0.1:40404_solr
   [junit4]   2> 2452154 INFO  (jetty-launcher-3300-thread-1) [n:127.0.0.1:40404_solr    ] o.a.s.c.c.SolrZkClient makePath: /live_nodes/127.0.0.1:40404_solr
   [junit4]   2> 2452158 INFO  (zkCallback-3311-thread-1-processing-n:127.0.0.1:40404_solr) [n:127.0.0.1:40404_solr    ] o.a.s.c.c.ZkStateReader A live node change: [WatchedEvent state:SyncConnected type:NodeChildrenChanged path:/live_nodes], has occurred - updating... (live nodes size: [1])
   [junit4]   2> 2452158 INFO  (zkCallback-3310-thread-1-processing-n:127.0.0.1:45208_solr) [n:127.0.0.1:45208_solr    ] o.a.s.c.c.ZkStateReader A live node change: [WatchedEvent state:SyncConnected type:NodeChildrenChanged path:/live_nodes], has occurred - updating... (live nodes size: [1])
   [junit4]   2> 2452158 INFO  (zkCallback-3310-thread-1-processing-n:127.0.0.1:45208_solr) [n:127.0.0.1:45208_solr    ] o.a.s.c.c.ZkStateReader Updated live nodes from ZooKeeper... (1) -> (2)
   [junit4]   2> 2452158 INFO  (zkCallback-3311-thread-1-processing-n:127.0.0.1:40404_solr) [n:127.0.0.1:40404_solr    ] o.a.s.c.c.ZkStateReader Updated live nodes from ZooKeeper... (1) -> (2)
   [junit4]   2> 2452188 INFO  (jetty-launcher-3300-thread-1) [n:127.0.0.1:40404_solr    ] o.a.s.c.CoreContainer Security conf doesn't exist. Skipping setup for authorization module.
   [junit4]   2> 2452189 INFO  (jetty-launcher-3300-thread-1) [n:127.0.0.1:40404_solr    ] o.a.s.c.CoreContainer No authentication plugin used.
   [junit4]   2> 2452190 INFO  (jetty-launcher-3300-thread-1) [n:127.0.0.1:40404_solr    ] o.a.s.c.CorePropertiesLocator Looking for core definitions underneath /home/jenkins/workspace/Lucene-Solr-master-Linux/solr/build/solr-core/test/J2/temp/solr.schema.TestManagedSchemaAPI_397ECD0448C550B7-001/tempDir-001/node1/.
   [junit4]   2> 2452190 INFO  (jetty-launcher-3300-thread-1) [n:127.0.0.1:40404_solr    ] o.a.s.c.CorePropertiesLocator Found 0 core definitions
   [junit4]   2> 2452193 INFO  (jetty-launcher-3300-thread-1) [n:127.0.0.1:40404_solr    ] o.a.s.s.SolrDispatchFilter user.dir=/home/jenkins/workspace/Lucene-Solr-master-Linux/solr/build/solr-core/test/J2
   [junit4]   2> 2452193 INFO  (jetty-launcher-3300-thread-1) [n:127.0.0.1:40404_solr    ] o.a.s.s.SolrDispatchFilter SolrDispatchFilter.init() done
   [junit4]   2> 2452194 INFO  (SUITE-TestManagedSchemaAPI-seed#[397ECD0448C550B7]-worker) [    ] o.a.s.c.c.SolrZkClient Using default ZkCredentialsProvider
   [junit4]   2> 2452194 INFO  (SUITE-TestManagedSchemaAPI-seed#[397ECD0448C550B7]-worker) [    ] o.a.s.c.c.ConnectionManager Waiting for client to connect to ZooKeeper
   [junit4]   2> 2452195 INFO  (zkCallback-3314-thread-1) [    ] o.a.s.c.c.ConnectionManager Watcher org.apache.solr.common.cloud.ConnectionManager@337840bf name:ZooKeeperConnection Watcher:127.0.0.1:35736 got event WatchedEvent state:SyncConnected type:None path:null path:null type:None
   [junit4]   2> 2452195 INFO  (SUITE-TestManagedSchemaAPI-seed#[397ECD0448C550B7]-worker) [    ] o.a.s.c.c.ConnectionManager Client is connected to ZooKeeper
   [junit4]   2> 2452195 INFO  (SUITE-TestManagedSchemaAPI-seed#[397ECD0448C550B7]-worker) [    ] o.a.s.c.c.SolrZkClient Using default ZkACLProvider
   [junit4]   2> 2452196 INFO  (SUITE-TestManagedSchemaAPI-seed#[397ECD0448C550B7]-worker) [    ] o.a.s.c.s.i.CloudSolrClient Final constructed zkHost string: 127.0.0.1:35736/solr
   [junit4]   2> 2452197 INFO  (SUITE-TestManagedSchemaAPI-seed#[397ECD0448C550B7]-worker) [    ] o.a.s.c.c.SolrZkClient Using default ZkCredentialsProvider
   [junit4]   2> 2452197 INFO  (SUITE-TestManagedSchemaAPI-seed#[397ECD0448C550B7]-worker) [    ] o.a.s.c.c.ConnectionManager Waiting for client to connect to ZooKeeper
   [junit4]   2> 2452198 INFO  (zkCallback-3317-thread-1) [    ] o.a.s.c.c.ConnectionManager Watcher org.apache.solr.common.cloud.ConnectionManager@7e78f5b4 name:ZooKeeperConnection Watcher:127.0.0.1:35736/solr got event WatchedEvent state:SyncConnected type:None path:null path:null type:None
   [junit4]   2> 2452198 INFO  (SUITE-TestManagedSchemaAPI-seed#[397ECD0448C550B7]-worker) [    ] o.a.s.c.c.ConnectionManager Client is connected to ZooKeeper
   [junit4]   2> 2452198 INFO  (SUITE-TestManagedSchemaAPI-seed#[397ECD0448C550B7]-worker) [    ] o.a.s.c.c.SolrZkClient Using default ZkACLProvider
   [junit4]   2> 2452198 INFO  (SUITE-TestManagedSchemaAPI-seed#[397ECD0448C550B7]-worker) [    ] o.a.s.c.c.ZkStateReader Updating cluster state from ZooKeeper... 
   [junit4]   2> 2452198 INFO  (SUITE-TestManagedSchemaAPI-seed#[397ECD0448C550B7]-worker) [    ] o.a.s.c.c.ZkStateReader Loaded cluster properties: {urlScheme=https}
   [junit4]   2> 2452199 INFO  (SUITE-TestManagedSchemaAPI-seed#[397ECD0448C550B7]-worker) [    ] o.a.s.c.c.ZkStateReader Updated live nodes from ZooKeeper... (0) -> (2)
   [junit4]   2> 2452199 INFO  (SUITE-TestManagedSchemaAPI-seed#[397ECD0448C550B7]-worker) [    ] o.a.s.c.c.SolrZkClient makePath: /configs/conf1/solrconfig.xml
   [junit4]   2> 2452200 INFO  (SUITE-TestManagedSchemaAPI-seed#[397ECD0448C550B7]-worker) [    ] o.a.s.c.c.SolrZkClient makePath: /configs/conf1/managed-schema
   [junit4]   2> 2452239 INFO  (TEST-TestManagedSchemaAPI.test-seed#[397ECD0448C550B7]) [    ] o.a.s.SolrTestCaseJ4 ###Starting test
   [junit4]   2> 2452271 INFO  (qtp477357271-17098) [n:127.0.0.1:45208_solr    ] o.a.s.h.a.CollectionsHandler Invoked Collection Action :create with params replicationFactor=2&collection.configName=conf1&name=testschemaapi&action=CREATE&numShards=1&wt=javabin&version=2 and sendToOCPQueue=true
   [junit4]   2> 2452277 INFO  (OverseerCollectionConfigSetProcessor-95960391517732870-127.0.0.1:40404_solr-n_0000000000) [n:127.0.0.1:40404_solr    ] o.a.s.c.OverseerTaskProcessor Overseer Collection Message Handler: Get the message id:/overseer/collection-queue-work/qn-0000000000 message:{
   [junit4]   2>   "name":"testschemaapi",
   [junit4]   2>   "fromApi":"true",
   [junit4]   2>   "replicationFactor":"2",
   [junit4]   2>   "collection.configName":"conf1",
   [junit4]   2>   "numShards":"1",
   [junit4]   2>   "stateFormat":"2",
   [junit4]   2>   "operation":"create"}
   [junit4]   2> 2452278 INFO  (OverseerThreadFactory-6975-thread-1-processing-n:127.0.0.1:40404_solr) [n:127.0.0.1:40404_solr    ] o.a.s.c.OverseerCollectionMessageHandler OverseerCollectionMessageHandler.processMessage : create , {
   [junit4]   2>   "name":"testschemaapi",
   [junit4]   2>   "fromApi":"true",
   [junit4]   2>   "replicationFactor":"2",
   [junit4]   2>   "collection.configName":"conf1",
   [junit4]   2>   "numShards":"1",
   [junit4]   2>   "stateFormat":"2",
   [junit4]   2>   "operation":"create"}
   [junit4]   2> 2452278 INFO  (OverseerThreadFactory-6975-thread-1-processing-n:127.0.0.1:40404_solr) [n:127.0.0.1:40404_solr    ] o.a.s.c.OverseerCollectionMessageHandler Create collection testschemaapi
   [junit4]   2> 2452278 INFO  (OverseerThreadFactory-6975-thread-1-processing-n:127.0.0.1:40404_solr) [n:127.0.0.1:40404_solr    ] o.a.s.c.OverseerCollectionMessageHandler creating collections conf node /collections/testschemaapi 
   [junit4]   2> 2452279 INFO  (OverseerThreadFactory-6975-thread-1-processing-n:127.0.0.1:40404_solr) [n:127.0.0.1:40404_solr    ] o.a.s.c.c.SolrZkClient makePath: /collections/testschemaapi
   [junit4]   2> 2452279 INFO  (zkCallback-3311-thread-1-processing-n:127.0.0.1:40404_solr) [n:127.0.0.1:40404_solr    ] o.a.s.c.c.ZkStateReader A collections change: [WatchedEvent state:SyncConnected type:NodeChildrenChanged path:/collections], has occurred - updating...
   [junit4]   2> 2452279 INFO  (zkCallback-3317-thread-1) [    ] o.a.s.c.c.ZkStateReader A collections change: [WatchedEvent state:SyncConnected type:NodeChildrenChanged path:/collections], has occurred - updating...
   [junit4]   2> 2452280 INFO  (zkCallback-3310-thread-1-processing-n:127.0.0.1:45208_solr) [n:127.0.0.1:45208_solr    ] o.a.s.c.c.ZkStateReader A collections change: [WatchedEvent state:SyncConnected type:NodeChildrenChanged path:/collections], has occurred - updating...
   [junit4]   2> 2452281 INFO  (OverseerStateUpdate-95960391517732870-127.0.0.1:40404_solr-n_0000000000) [n:127.0.0.1:40404_solr    ] o.a.s.c.Overseer processMessage: queueSize: 1, message = {
   [junit4]   2>   "name":"testschemaapi",
   [junit4]   2>   "fromApi":"true",
   [junit4]   2>   "replicationFactor":"2",
   [junit4]   2>   "collection.configName":"conf1",
   [junit4]   2>   "numShards":"1",
   [junit4]   2>   "stateFormat":"2",
   [junit4]   2>   "operation":"create"} current state version: 0
   [junit4]   2> 2452281 INFO  (OverseerStateUpdate-95960391517732870-127.0.0.1:40404_solr-n_0000000000) [n:127.0.0.1:40404_solr    ] o.a.s.c.o.ClusterStateMutator building a new cName: testschemaapi
   [junit4]   2> 2452282 INFO  (OverseerStateUpdate-95960391517732870-127.0.0.1:40404_solr-n_0000000000) [n:127.0.0.1:40404_solr    ] o.a.s.c.o.ZkStateWriter going to create_collection /collections/testschemaapi/state.json
   [junit4]   2> 2452382 INFO  (OverseerThreadFactory-6975-thread-1-processing-n:127.0.0.1:40404_solr) [n:127.0.0.1:40404_solr    ] o.a.s.c.OverseerCollectionMessageHandler Creating SolrCores for new collection testschemaapi, shardNames [shard1] , replicationFactor : 2
   [junit4]   2> 2452382 INFO  (OverseerThreadFactory-6975-thread-1-processing-n:127.0.0.1:40404_solr) [n:127.0.0.1:40404_solr    ] o.a.s.c.OverseerCollectionMessageHandler Creating core testschemaapi_shard1_replica2 as part of shard shard1 of collection testschemaapi on 127.0.0.1:40404_solr
   [junit4]   2> 2452382 INFO  (OverseerThreadFactory-6975-thread-1-processing-n:127.0.0.1:40404_solr) [n:127.0.0.1:40404_solr    ] o.a.s.c.OverseerCollectionMessageHandler Creating core testschemaapi_shard1_replica1 as part of shard shard1 of collection testschemaapi on 127.0.0.1:45208_solr
   [junit4]   2> 2452394 INFO  (qtp477357271-17093) [n:127.0.0.1:45208_solr    ] o.a.s.h.a.CoreAdminOperation core create command qt=/admin/cores&collection.configName=conf1&name=testschemaapi_shard1_replica1&action=CREATE&numShards=1&collection=testschemaapi&shard=shard1&wt=javabin&version=2
   [junit4]   2> 2452394 INFO  (qtp477357271-17093) [n:127.0.0.1:45208_solr    ] o.a.s.c.CoreDescriptor Created CoreDescriptor: {name=testschemaapi_shard1_replica1, collection.configName=conf1, config=solrconfig.xml, transient=false, schema=schema.xml, loadOnStartup=true, configSetProperties=configsetprops.json, collection=testschemaapi, numShards=1, dataDir=data/, shard=shard1}
   [junit4]   2> 2452404 INFO  (qtp477357271-17093) [n:127.0.0.1:45208_solr c:testschemaapi s:shard1  x:testschemaapi_shard1_replica1] o.a.s.c.ZkController publishing state=down
   [junit4]   2> 2452405 INFO  (qtp477357271-17093) [n:127.0.0.1:45208_solr c:testschemaapi s:shard1  x:testschemaapi_shard1_replica1] o.a.s.c.ZkController Registering watch for collection testschemaapi
   [junit4]   2> 2452405 INFO  (OverseerStateUpdate-95960391517732870-127.0.0.1:40404_solr-n_0000000000) [n:127.0.0.1:40404_solr    ] o.a.s.c.Overseer processMessage: queueSize: 1, message = {
   [junit4]   2>   "core":"testschemaapi_shard1_replica1",
   [junit4]   2>   "roles":null,
   [junit4]   2>   "base_url":"https://127.0.0.1:45208/solr",
   [junit4]   2>   "node_name":"127.0.0.1:45208_solr",
   [junit4]   2>   "numShards":"1",
   [junit4]   2>   "state":"down",
   [junit4]   2>   "shard":"shard1",
   [junit4]   2>   "collection":"testschemaapi",
   [junit4]   2>   "operation":"state"} current state version: 0
   [junit4]   2> 2452406 INFO  (OverseerStateUpdate-95960391517732870-127.0.0.1:40404_solr-n_0000000000) [n:127.0.0.1:40404_solr    ] o.a.s.c.o.ReplicaMutator Update state numShards=1 message={
   [junit4]   2>   "core":"testschemaapi_shard1_replica1",
   [junit4]   2>   "roles":null,
   [junit4]   2>   "base_url":"https://127.0.0.1:45208/solr",
   [junit4]   2>   "node_name":"127.0.0.1:45208_solr",
   [junit4]   2>   "numShards":"1",
   [junit4]   2>   "state":"down",
   [junit4]   2>   "shard":"shard1",
   [junit4]   2>   "collection":"testschemaapi",
   [junit4]   2>   "operation":"state"}
   [junit4]   2> 2452408 INFO  (qtp477357271-17093) [n:127.0.0.1:45208_solr c:testschemaapi s:shard1  x:testschemaapi_shard1_replica1] o.a.s.c.c.ZkStateReader Add data for [testschemaapi] ver [0]
   [junit4]   2> 2452409 INFO  (qtp477357271-17093) [n:127.0.0.1:45208_solr c:testschemaapi s:shard1  x:testschemaapi_shard1_replica1] o.a.s.c.ZkController look for our core node name
   [junit4]   2> 2452418 INFO  (qtp422989082-17088) [n:127.0.0.1:40404_solr    ] o.a.s.h.a.CoreAdminOperation core create command qt=/admin/cores&collection.configName=conf1&name=testschemaapi_shard1_replica2&action=CREATE&numShards=1&collection=testschemaapi&shard=shard1&wt=javabin&version=2
   [junit4]   2> 2452418 INFO  (qtp422989082-17088) [n:127.0.0.1:40404_solr    ] o.a.s.c.CoreDescriptor Created CoreDescriptor: {name=testschemaapi_shard1_replica2, collection.configName=conf1, config=solrconfig.xml, transient=false, schema=schema.xml, loadOnStartup=true, configSetProperties=configsetprops.json, collection=testschemaapi, numShards=1, dataDir=data/, shard=shard1}
   [junit4]   2> 2452419 INFO  (qtp422989082-17088) [n:127.0.0.1:40404_solr c:testschemaapi s:shard1  x:testschemaapi_shard1_replica2] o.a.s.c.ZkController publishing state=down
   [junit4]   2> 2452419 INFO  (qtp422989082-17088) [n:127.0.0.1:40404_solr c:testschemaapi s:shard1  x:testschemaapi_shard1_replica2] o.a.s.c.ZkController Registering watch for collection testschemaapi
   [junit4]   2> 2452420 INFO  (OverseerStateUpdate-95960391517732870-127.0.0.1:40404_solr-n_0000000000) [n:127.0.0.1:40404_solr    ] o.a.s.c.Overseer processMessage: queueSize: 1, message = {
   [junit4]   2>   "core":"testschemaapi_shard1_replica2",
   [junit4]   2>   "roles":null,
   [junit4]   2>   "base_url":"https://127.0.0.1:40404/solr",
   [junit4]   2>   "node_name":"127.0.0.1:40404_solr",
   [junit4]   2>   "numShards":"1",
   [junit4]   2>   "state":"down",
   [junit4]   2>   "shard":"shard1",
   [junit4]   2>   "collection":"testschemaapi",
   [junit4]   2>   "operation":"state"} current state version: 0
   [junit4]   2> 2452420 INFO  (qtp422989082-17088) [n:127.0.0.1:40404_solr c:testschemaapi s:shard1  x:testschemaapi_shard1_replica2] o.a.s.c.c.ZkStateReader Add data for [testschemaapi] ver [0]
   [junit4]   2> 2452420 INFO  (OverseerStateUpdate-95960391517732870-127.0.0.1:40404_solr-n_0000000000) [n:127.0.0.1:40404_solr    ] o.a.s.c.o.ReplicaMutator Update state numShards=1 message={
   [junit4]   2>   "core":"testschemaapi_shard1_replica2",
   [junit4]   2>   "roles":null,
   [junit4]   2>   "base_url":"https://127.0.0.1:40404/solr",
   [junit4]   2>   "node_name":"127.0.0.1:40404_solr",
   [junit4]   2>   "numShards":"1",
   [junit4]   2>   "state":"down",
   [junit4]   2>   "shard":"shard1",
   [junit4]   2>   "collection":"testschemaapi",
   [junit4]   2>   "operation":"state"}
   [junit4]   2> 2452421 INFO  (qtp422989082-17088) [n:127.0.0.1:40404_solr c:testschemaapi s:shard1  x:testschemaapi_shard1_replica2] o.a.s.c.ZkController look for our core node name
   [junit4]   2> 2452522 INFO  (OverseerStateUpdate-95960391517732870-127.0.0.1:40404_solr-n_0000000000) [n:127.0.0.1:40404_solr    ] o.a.s.c.o.ZkStateWriter going to update_collection /collections/testschemaapi/state.json version: 0
   [junit4]   2> 2452523 INFO  (zkCallback-3311-thread-1-processing-n:127.0.0.1:40404_solr) [n:127.0.0.1:40404_solr    ] o.a.s.c.c.ZkStateReader A cluster state change: [WatchedEvent state:SyncConnected type:NodeDataChanged path:/collections/testschemaapi/state.json] for collection [testschemaapi] has occurred - updating... (live nodes size: [2])
   [junit4]   2> 2452523 INFO  (zkCallback-3310-thread-1-processing-n:127.0.0.1:45208_solr) [n:127.0.0.1:45208_solr    ] o.a.s.c.c.ZkStateReader A cluster state change: [WatchedEvent state:SyncConnected type:NodeDataChanged path:/collections/testschemaapi/state.json] for collection [testschemaapi] has occurred - updating... (live nodes size: [2])
   [junit4]   2> 2452523 INFO  (zkCallback-3311-thread-1-processing-n:127.0.0.1:40404_solr) [n:127.0.0.1:40404_solr    ] o.a.s.c.c.ZkStateReader Updating data for [testschemaapi] from [0] to [1]
   [junit4]   2> 2452523 INFO  (zkCallback-3310-thread-1-processing-n:127.0.0.1:45208_solr) [n:127.0.0.1:45208_solr    ] o.a.s.c.c.ZkStateReader Updating data for [testschemaapi] from [0] to [1]
   [junit4]   2> 2453409 INFO  (qtp477357271-17093) [n:127.0.0.1:45208_solr c:testschemaapi s:shard1  x:testschemaapi_shard1_replica1] o.a.s.c.ZkController waiting to find shard id in clusterstate for testschemaapi_shard1_replica1
   [junit4]   2> 2453409 INFO  (qtp477357271-17093) [n:127.0.0.1:45208_solr c:testschemaapi s:shard1  x:testschemaapi_shard1_replica1] o.a.s.c.ZkController Check for collection zkNode:testschemaapi
   [junit4]   2> 2453409 INFO  (qtp477357271-17093) [n:127.0.0.1:45208_solr c:testschemaapi s:shard1  x:testschemaapi_shard1_replica1] o.a.s.c.ZkController Collection zkNode exists
   [junit4]   2> 2453409 INFO  (qtp477357271-17093) [n:127.0.0.1:45208_solr c:testschemaapi s:shard1  x:testschemaapi_shard1_replica1] o.a.s.c.c.ZkStateReader Load collection config from: [/collections/testschemaapi]
   [junit4]   2> 2453410 INFO  (qtp477357271-17093) [n:127.0.0.1:45208_solr c:testschemaapi s:shard1  x:testschemaapi_shard1_replica1] o.a.s.c.c.ZkStateReader path=[/collections/testschemaapi] [configName]=[conf1] specified config exists in ZooKeeper
   [junit4]   2> 2453410 INFO  (qtp477357271-17093) [n:127.0.0.1:45208_solr c:testschemaapi s:shard1  x:testschemaapi_shard1_replica1] o.a.s.c.SolrResourceLoader new SolrResourceLoader for directory: '/home/jenkins/workspace/Lucene-Solr-master-Linux/solr/build/solr-core/test/J2/temp/solr.schema.TestManagedSchemaAPI_397ECD0448C550B7-001/tempDir-001/node2/testschemaapi_shard1_replica1'
   [junit4]   2> 2453410 INFO  (qtp477357271-17093) [n:127.0.0.1:45208_solr c:testschemaapi s:shard1  x:testschemaapi_shard1_replica1] o.a.s.c.SolrResourceLoader JNDI not configured for solr (NoInitialContextEx)
   [junit4]   2> 2453410 INFO  (qtp477357271-17093) [n:127.0.0.1:45208_solr c:testschemaapi s:shard1  x:testschemaapi_shard1_replica1] o.a.s.c.SolrResourceLoader solr home defaulted to 'solr/' (could not find system property or JNDI)
   [junit4]   2> 2453413 INFO  (qtp477357271-17093) [n:127.0.0.1:45208_solr c:testschemaapi s:shard1  x:testschemaapi_shard1_replica1] o.a.s.c.Config loaded config solrconfig.xml with version 0 
   [junit4]   2> 2453415 INFO  (qtp477357271-17093) [n:127.0.0.1:45208_solr c:testschemaapi s:shard1  x:testschemaapi_shard1_replica1] o.a.s.c.SolrConfig current version of requestparams : -1
   [junit4]   2> 2453418 INFO  (qtp477357271-17093) [n:127.0.0.1:45208_solr c:testschemaapi s:shard1  x:testschemaapi_shard1_replica1] o.a.s.c.SolrConfig Using Lucene MatchVersion: 7.0.0
   [junit4]   2> 2453421 INFO  (qtp422989082-17088) [n:127.0.0.1:40404_solr c:testschemaapi s:shard1  x:testschemaapi_shard1_replica2] o.a.s.c.ZkController waiting to find shard id in clusterstate for testschemaapi_shard1_replica2
   [junit4]   2> 2453421 INFO  (qtp422989082-17088) [n:127.0.0.1:40404_solr c:testschemaapi s:shard1  x:testschemaapi_shard1_replica2] o.a.s.c.ZkController Check for collection zkNode:testschemaapi
   [junit4]   2> 2453423 INFO  (qtp477357271-17093) [n:127.0.0.1:45208_solr c:testschemaapi s:shard1  x:testschemaapi_shard1_replica1] o.a.s.c.SolrConfig Loaded SolrConfig: solrconfig.xml
   [junit4]   2> 2453423 INFO  (qtp422989082-17088) [n:127.0.0.1:40404_solr c:testschemaapi s:shard1  x:testschemaapi_shard1_replica2] o.a.s.c.ZkController Collection zkNode exists
   [junit4]   2> 2453424 INFO  (qtp422989082-17088) [n:127.0.0.1:40404_solr c:testschemaapi s:shard1  x:testschemaapi_shard1_replica2] o.a.s.c.c.ZkStateReader Load collection config from: [/collections/testschemaapi]
   [junit4]   2> 2453427 INFO  (qtp477357271-17093) [n:127.0.0.1:45208_solr c:testschemaapi s:shard1  x:testschemaapi_shard1_replica1] o.a.s.s.IndexSchema [testschemaapi_shard1_replica1] Schema name=minimal
   [junit4]   2> 2453436 INFO  (qtp477357271-17093) [n:127.0.0.1:45208_solr c:testschemaapi s:shard1  x:testschemaapi_shard1_replica1] o.a.s.s.IndexSchema unique key field: id
   [junit4]   2> 2453438 INFO  (qtp422989082-17088) [n:127.0.0.1:40404_solr c:testschemaapi s:shard1  x:testschemaapi_shard1_replica2] o.a.s.c.c.ZkStateReader path=[/collections/testschemaapi] [configName]=[conf1] specified config exists in ZooKeeper
   [junit4]   2> 2453438 INFO  (qtp477357271-17093) [n:127.0.0.1:45208_solr c:testschemaapi s:shard1  x:testschemaapi_shard1_replica1] o.a.s.c.ConfigSetProperties Did not find ConfigSet properties, assuming default properties: Can't find resource 'configsetprops.json' in classpath or '/configs/conf1', cwd=/home/jenkins/workspace/Lucene-Solr-master-Linux/solr/build/solr-core/test/J2
   [junit4]   2> 2453438 INFO  (qtp422989082-17088) [n:127.0.0.1:40404_solr c:testschemaapi s:shard1  x:testschemaapi_shard1_replica2] o.a.s.c.SolrResourceLoader new SolrResourceLoader for directory: '/home/jenkins/workspace/Lucene-Solr-master-Linux/solr/build/solr-core/test/J2/temp/solr.schema.TestManagedSchemaAPI_397ECD0448C550B7-001/tempDir-001/node1/testschemaapi_shard1_replica2'
   [junit4]   2> 2453438 INFO  (qtp477357271-17093) [n:127.0.0.1:45208_solr c:testschemaapi s:shard1  x:testschemaapi_shard1_replica1] o.a.s.c.CoreContainer Creating SolrCore 'testschemaapi_shard1_replica1' using configuration from collection testschemaapi
   [junit4]   2> 2453438 INFO  (qtp422989082-17088) [n:127.0.0.1:40404_solr c:testschemaapi s:shard1  x:testschemaapi_shard1_replica2] o.a.s.c.SolrResourceLoader JNDI not configured for solr (NoInitialContextEx)
   [junit4]   2> 2453438 INFO  (qtp422989082-17088) [n:127.0.0.1:40404_solr c:testschemaapi s:shard1  x:testschemaapi_shard1_replica2] o.a.s.c.SolrResourceLoader solr home defaulted to 'solr/' (could not find system property or JNDI)
   [junit4]   2> 2453438 INFO  (qtp477357271-17093) [n:127.0.0.1:45208_solr c:testschemaapi s:shard1 r:core_node1 x:testschemaapi_shard1_replica1] o.a.s.c.SolrCore org.apache.solr.core.MockDirectoryFactory
   [junit4]   2> 2453439 INFO  (qtp477357271-17093) [n:127.0.0.1:45208_solr c:testschemaapi s:shard1 r:core_node1 x:testschemaapi_shard1_replica1] o.a.s.c.SolrCore [[testschemaapi_shard1_replica1] ] Opening new SolrCore at [/home/jenkins/workspace/Lucene-Solr-master-Linux/solr/build/solr-core/test/J2/temp/solr.schema.TestManagedSchemaAPI_397ECD0448C550B7-001/tempDir-001/node2/testschemaapi_shard1_replica1], dataDir=[/home/jenkins/workspace/Lucene-Solr-master-Linux/solr/build/solr-core/test/J2/temp/solr.schema.TestManagedSchemaAPI_397ECD0448C550B7-001/tempDir-001/node2/./testschemaapi_shard1_replica1/data/]
   [junit4]   2> 2453439 INFO  (qtp477357271-17093) [n:127.0.0.1:45208_solr c:testschemaapi s:shard1 r:core_node1 x:testschemaapi_shard1_replica1] o.a.s.c.SolrCore JMX monitoring not detected for core: testschemaapi_shard1_replica1
   [junit4]   2> 2453439 INFO  (qtp422989082-17088) [n:127.0.0.1:40404_solr c:testschemaapi s:shard1  x:testschemaapi_shard1_replica2] o.a.s.c.Config loaded config solrconfig.xml with version 0 
   [junit4]   2> 2453444 INFO  (qtp422989082-17088) [n:127.0.0.1:40404_solr c:testschemaapi s:shard1  x:testschemaapi_shard1_replica2] o.a.s.c.SolrConfig current version of requestparams : -1
   [junit4]   2> 2453444 INFO  (qtp477357271-17093) [n:127.0.0.1:45208_solr c:testschemaapi s:shard1 r:core_node1 x:testschemaapi_shard1_replica1] o.a.s.c.CachingDirectoryFactory return new directory for /home/jenkins/workspace/Lucene-Solr-master-Linux/solr/build/solr-core/test/J2/temp/solr.schema.TestManagedSchemaAPI_397ECD0448C550B7-001/tempDir-001/node2/./testschemaapi_shard1_replica1/data
   [junit4]   2> 2453444 INFO  (qtp477357271-17093) [n:127.0.0.1:45208_solr c:testschemaapi s:shard1 r:core_node1 x:testschemaapi_shard1_replica1] o.a.s.c.SolrCore New index directory detected: old=null new=/home/jenkins/workspace/Lucene-Solr-master-Linux/solr/build/solr-core/test/J2/temp/solr.schema.TestManagedSchemaAPI_397ECD0448C550B7-001/tempDir-001/node2/./testschemaapi_shard1_replica1/data/index/
   [junit4]   2> 2453444 WARN  (qtp477357271-17093) [n:127.0.0.1:45208_solr c:testschemaapi s:shard1 r:core_node1 x:testschemaapi_shard1_replica1] o.a.s.c.SolrCore [testschemaapi_shard1_replica1] Solr index directory '/home/jenkins/workspace/Lucene-Solr-master-Linux/solr/build/solr-core/test/J2/temp/solr.schema.TestManagedSchemaAPI_397ECD0448C550B7-001/tempDir-001/node2/./testschemaapi_shard1_replica1/data/index' doesn't exist. Creating new index...
   [junit4]   2> 2453445 INFO  (qtp477357271-17093) [n:127.0.0.1:45208_solr c:testschemaapi s:shard1 r:core_node1 x:testschemaapi_shard1_replica1] o.a.s.c.CachingDirectoryFactory return new directory for /home/jenkins/workspace/Lucene-Solr-master-Linux/solr/build/solr-core/test/J2/temp/solr.schema.TestManagedSchemaAPI_397ECD0448C550B7-001/tempDir-001/node2/./testschemaapi_shard1_replica1/data/index
   [junit4]   2> 2453445 INFO  (qtp477357271-17093) [n:127.0.0.1:45208_solr c:testschemaapi s:shard1 r:core_node1 x:testschemaapi_shard1_replica1] o.a.s.c.SolrDeletionPolicy SolrDeletionPolicy.onCommit: commits: num=1
   [junit4]   2> 	commit{dir=MockDirectoryWrapper(RAMDirectory@6cfd2fa8 lockFactory=org.apache.lucene.store.SingleInstanceLockFactory@39aa077d),segFN=segments_1,generation=1}
   [junit4]   2> 2453445 INFO  (qtp477357271-17093) [n:127.0.0.1:45208_solr c:testschemaapi s:shard1 r:core_node1 x:testschemaapi_shard1_replica1] o.a.s.c.SolrDeletionPolicy newest commit generation = 1
   [junit4]   2> 2453445 INFO  (OldIndexDirectoryCleanupThreadForCore-testschemaapi_shard1_replica1) [n:127.0.0.1:45208_solr c:testschemaapi s:shard1 r:core_node1 x:testschemaapi_shard1_replica1] o.a.s.c.SolrCore Looking for old index directories to cleanup for core testschemaapi_shard1_replica1 in /home/jenkins/workspace/Lucene-Solr-master-Linux/solr/build/solr-core/test/J2/temp/solr.schema.TestManagedSchemaAPI_397ECD0448C550B7-001/tempDir-001/node2/./testschemaapi_shard1_replica1/data/
   [junit4]   2> 2453445 WARN  (OldIndexDirectoryCleanupThreadForCore-testschemaapi_shard1_replica1) [n:127.0.0.1:45208_solr c:testschemaapi s:shard1 r:core_node1 x:testschemaapi_shard1_replica1] o.a.s.c.DirectoryFactory /home/jenkins/workspace/Lucene-Solr-master-Linux/solr/build/solr-core/test/J2/temp/solr.schema.TestManagedSchemaAPI_397ECD0448C550B7-001/tempDir-001/node2/./testschemaapi_shard1_replica1/data/ does not point to a valid data directory; skipping clean-up of old index directories.
   [junit4]   2> 2453446 INFO  (qtp422989082-17088) [n:127.0.0.1:40404_solr c:testschemaapi s:shard1  x:testschemaapi_shard1_replica2] o.a.s.c.SolrConfig Using Lucene MatchVersion: 7.0.0
   [junit4]   2> 2453446 INFO  (qtp477357271-17093) [n:127.0.0.1:45208_solr c:testschemaapi s:shard1 r:core_node1 x:testschemaapi_shard1_replica1] o.a.s.c.SolrCore no updateRequestProcessorChain defined as default, creating implicit default
   [junit4]   2> 2453448 INFO  (qtp477357271-17093) [n:127.0.0.1:45208_solr c:testschemaapi s:shard1 r:core_node1 x:testschemaapi_shard1_replica1] o.a.s.h.l.XMLLoader xsltCacheLifetimeSeconds=60
   [junit4]   2> 2453448 INFO  (qtp477357271-17093) [n:127.0.0.1:45208_solr c:testschemaapi s:shard1 r:core_node1 x:testschemaapi_shard1_replica1] o.a.s.h.l.XMLLoader xsltCacheLifetimeSeconds=60
   [junit4]   2> 2453449 INFO  (qtp477357271-17093) [n:127.0.0.1:45208_solr c:testschemaapi s:shard1 r:core_node1 x:testschemaapi_shard1_replica1] o.a.s.h.l.XMLLoader xsltCacheLifetimeSeconds=60
   [junit4]   2> 2453449 INFO  (qtp477357271-17093) [n:127.0.0.1:45208_solr c:testschemaapi s:shard1 r:core_node1 x:testschemaapi_shard1_replica1] o.a.s.h.l.XMLLoader xsltCacheLifetimeSeconds=60
   [junit4]   2> 2453450 INFO  (qtp477357271-17093) [n:127.0.0.1:45208_solr c:testschemaapi s:shard1 r:core_node1 x:testschemaapi_shard1_replica1] o.a.s.c.RequestHandlers Registered paths: /admin/mbeans,/update/csv,/sql,/update/json/docs,/admin/luke,/graph,/export,/select,/admin/segments,/get,/admin/system,/replication,/admin/properties,/config,/stream,/schema,/admin/plugins,/admin/logging,/update/json,/admin/ping,/admin/threads,/update,/admin/file
   [junit4]   2> 2453450 INFO  (qtp477357271-17093) [n:127.0.0.1:45208_solr c:testschemaapi s:shard1 r:core_node1 x:testschemaapi_shard1_replica1] o.a.s.c.SolrCore Using default statsCache cache: org.apache.solr.search.stats.LocalStatsCache
   [junit4]   2> 2453450 INFO  (qtp477357271-17093) [n:127.0.0.1:45208_solr c:testschemaapi s:shard1 r:core_node1 x:testschemaapi_shard1_replica1] o.a.s.u.UpdateHandler Using UpdateLog implementation: org.apache.solr.update.UpdateLog
   [junit4]   2> 2453450 INFO  (qtp477357271-17093) [n:127.0.0.1:45208_solr c:testschemaapi s:shard1 r:core_node1 x:testschemaapi_shard1_replica1] o.a.s.u.UpdateLog Initializing UpdateLog: dataDir=null defaultSyncLevel=FLUSH numRecordsToKeep=100 maxNumLogsToKeep=10 numVersionBuckets=65536
   [junit4]   2> 2453451 INFO  (qtp422989082-17088) [n:127.0.0.1:40404_solr c:testschemaapi s:shard1  x:testschemaapi_shard1_replica2] o.a.s.c.SolrConfig Loaded SolrConfig: solrconfig.xml
   [junit4]   2> 2453452 INFO  (qtp477357271-17093) [n:127.0.0.1:45208_solr c:testschemaapi s:shard1 r:core_node1 x:testschemaapi_shard1_replica1] o.a.s.u.CommitTracker Hard AutoCommit: disabled
   [junit4]   2> 2453452 INFO  (qtp477357271-17093) [n:127.0.0.1:45208_solr c:testschemaapi s:shard1 r:core_node1 x:testschemaapi_shard1_replica1] o.a.s.u.CommitTracker Soft AutoCommit: disabled
   [junit4]   2> 2453453 INFO  (qtp477357271-17093) [n:127.0.0.1:45208_solr c:testschemaapi s:shard1 r:core_node1 x:testschemaapi_shard1_replica1] o.a.s.c.SolrDeletionPolicy SolrDeletionPolicy.onInit: commits: num=1
   [junit4]   2> 	commit{dir=MockDirectoryWrapper(RAMDirectory@6cfd2fa8 lockFactory=org.apache.lucene.store.SingleInstanceLockFactory@39aa077d),segFN=segments_1,generation=1}
   [junit4]   2> 2453453 INFO  (qtp477357271-17093) [n:127.0.0.1:45208_solr c:testschemaapi s:shard1 r:core_node1 x:testschemaapi_shard1_replica1] o.a.s.c.SolrDeletionPolicy newest commit generation = 1
   [junit4]   2> 2453453 INFO  (qtp477357271-17093) [n:127.0.0.1:45208_solr c:testschemaapi s:shard1 r:core_node1 x:testschemaapi_shard1_replica1] o.a.s.s.SolrIndexSearcher Opening [Searcher@da3dbf9[testschemaapi_shard1_replica1] main]
   [junit4]   2> 2453453 INFO  (qtp477357271-17093) [n:127.0.0.1:45208_solr c:testschemaapi s:shard1 r:core_node1 x:testschemaapi_shard1_replica1] o.a.s.c.c.ZkStateReader Load collection config from: [/collections/testschemaapi]
   [junit4]   2> 2453456 INFO  (qtp477357271-17093) [n:127.0.0.1:45208_solr c:testschemaapi s:shard1 r:core_node1 x:testschemaapi_shard1_replica1] o.a.s.c.c.ZkStateReader path=[/collections/testschemaapi] [configName]=[conf1] specified config exists in ZooKeeper
   [junit4]   2> 2453456 INFO  (qtp477357271-17093) [n:127.0.0.1:45208_solr c:testschemaapi s:shard1 r:core_node1 x:testschemaapi_shard1_replica1] o.a.s.r.ManagedResourceStorage Setting up ZooKeeper-based storage for the RestManager with znodeBase: /configs/conf1
   [junit4]   2> 2453456 INFO  (qtp477357271-17093) [n:127.0.0.1:45208_solr c:testschemaapi s:shard1 r:core_node1 x:testschemaapi_shard1_replica1] o.a.s.r.ManagedResourceStorage Configured ZooKeeperStorageIO with znodeBase: /configs/conf1
   [junit4]   2> 2453456 INFO  (qtp477357271-17093) [n:127.0.0.1:45208_solr c:testschemaapi s:shard1 r:core_node1 x:testschemaapi_shard1_replica1] o.a.s.r.RestManager Initializing RestManager with initArgs: {}
   [junit4]   2> 2453457 INFO  (qtp477357271-17093) [n:127.0.0.1:45208_solr c:testschemaapi s:shard1 r:core_node1 x:testschemaapi_shard1_replica1] o.a.s.r.ManagedResourceStorage Reading _rest_managed.json using ZooKeeperStorageIO:path=/configs/conf1
   [junit4]   2> 2453460 INFO  (qtp422989082-17088) [n:127.0.0.1:40404_solr c:testschemaapi s:shard1  x:testschemaapi_shard1_replica2] o.a.s.s.IndexSchema [testschemaapi_shard1_replica2] Schema name=minimal
   [junit4]   2> 2453468 INFO  (qtp477357271-17093) [n:127.0.0.1:45208_solr c:testschemaapi s:shard1 r:core_node1 x:testschemaapi_shard1_replica1] o.a.s.r.ManagedResourceStorage No data found for znode /configs/conf1/_rest_managed.json
   [junit4]   2> 2453469 INFO  (qtp477357271-17093) [n:127.0.0.1:45208_solr c:testschemaapi s:shard1 r:core_node1 x:testschemaapi_shard1_replica1] o.a.s.r.ManagedResourceStorage Loaded null at path _rest_managed.json using ZooKeeperStorageIO:path=/configs/conf1
   [junit4]   2> 2453469 INFO  (qtp477357271-17093) [n:127.0.0.1:45208_solr c:testschemaapi s:shard1 r:core_node1 x:testschemaapi_shard1_replica1] o.a.s.r.RestManager Initializing 0 registered ManagedResources
   [junit4]   2> 2453469 INFO  (qtp477357271-17093) [n:127.0.0.1:45208_solr c:testschemaapi s:shard1 r:core_node1 x:testschemaapi_shard1_replica1] o.a.s.s.ZkIndexSchemaReader Creating ZooKeeper watch for the managed schema at /configs/conf1/managed-schema
   [junit4]   2> 2453470 INFO  (qtp477357271-17093) [n:127.0.0.1:45208_solr c:testschemaapi s:shard1 r:core_node1 x:testschemaapi_shard1_replica1] o.a.s.c.ZkController Added new OnReconnect listener ZkIndexSchemaReader: /configs/conf1/managed-schema, uniqueCoreId: testschemaapi_shard1_replica1:1697534943217354
   [junit4]   2> 2453470 INFO  (qtp477357271-17093) [n:127.0.0.1:45208_solr c:testschemaapi s:shard1 r:core_node1 x:testschemaapi_shard1_replica1] o.a.s.h.ReplicationHandler Commits will be reserved for  10000
   [junit4]   2> 2453470 INFO  (searcherExecutor-6980-thread-1-processing-n:127.0.0.1:45208_solr x:testschemaapi_shard1_replica1 s:shard1 c:testschemaapi r:core_node1) [n:127.0.0.1:45208_solr c:testschemaapi s:shard1 r:core_node1 x:testschemaapi_shard1_replica1] o.a.s.c.SolrCore [testschemaapi_shard1_replica1] Registered new searcher Searcher@da3dbf9[testschemaapi_shard1_replica1] main{ExitableDirectoryReader(UninvertingDirectoryReader())}
   [junit4]   2> 2453470 INFO  (qtp477357271-17093) [n:127.0.0.1:45208_solr c:testschemaapi s:shard1 r:core_node1 x:testschemaapi_shard1_replica1] o.a.s.u.UpdateLog Looking up max value of version field to seed version buckets
   [junit4]   2> 2453470 INFO  (qtp477357271-17093) [n:127.0.0.1:45208_solr c:testschemaapi s:shard1 r:core_node1 x:testschemaapi_shard1_replica1] o.a.s.u.VersionInfo Refreshing highest value of _version_ for 65536 version buckets from index
   [junit4]   2> 2453470 INFO  (qtp422989082-17088) [n:127.0.0.1:40404_solr c:testschemaapi s:shard1  x:testschemaapi_shard1_replica2] o.a.s.s.IndexSchema unique key field: id
   [junit4]   2> 2453470 INFO  (qtp477357271-17093) [n:127.0.0.1:45208_solr c:testschemaapi s:shard1 r:core_node1 x:testschemaapi_shard1_replica1] o.a.s.u.VersionInfo No terms found for _version_, cannot seed version bucket highest value from index
   [junit4]   2> 2453470 INFO  (qtp477357271-17093) [n:127.0.0.1:45208_solr c:testschemaapi s:shard1 r:core_node1 x:testschemaapi_shard1_replica1] o.a.s.u.UpdateLog Could not find max version in index or recent updates, using new clock 1535366266886291456
   [junit4]   2> 2453472 INFO  (qtp422989082-17088) [n:127.0.0.1:40404_solr c:testschemaapi s:shard1  x:testschemaapi_shard1_replica2] o.a.s.c.ConfigSetProperties Did not find ConfigSet properties, assuming default properties: Can't find resource 'configsetprops.json' in classpath or '/configs/conf1', cwd=/home/jenkins/workspace/Lucene-Solr-master-Linux/solr/build/solr-core/test/J2
   [junit4]   2> 2453472 INFO  (qtp477357271-17093) [n:127.0.0.1:45208_solr c:testschemaapi s:shard1 r:core_node1 x:testschemaapi_shard1_replica1] o.a.s.u.UpdateLog Took 1.0ms to seed version buckets with highest version 1535366266886291456
   [junit4]   2> 2453472 INFO  (qtp422989082-17088) [n:127.0.0.1:40404_solr c:testschemaapi s:shard1  x:testschemaapi_shard1_replica2] o.a.s.c.CoreContainer Creating SolrCore 'testschemaapi_shard1_replica2' using configuration from collection testschemaapi
   [junit4]   2> 2453472 INFO  (qtp477357271-17093) [n:127.0.0.1:45208_solr c:testschemaapi s:shard1 r:core_node1 x:testschemaapi_shard1_replica1] o.a.s.c.ZkController watch zkdir /configs/conf1
   [junit4]   2> 2453472 INFO  (qtp422989082-17088) [n:127.0.0.1:40404_solr c:testschemaapi s:shard1 r:core_node2 x:testschemaapi_shard1_replica2] o.a.s.c.SolrCore org.apache.solr.core.MockDirectoryFactory
   [junit4]   2> 2453472 INFO  (qtp477357271-17093) [n:127.0.0.1:45208_solr c:testschemaapi s:shard1 r:core_node1 x:testschemaapi_shard1_replica1] o.a.s.c.CoreContainer registering core: testschemaapi_shard1_replica1
   [junit4]   2> 2453473 INFO  (qtp422989082-17088) [n:127.0.0.1:40404_solr c:testschemaapi s:shard1 r:core_node2 x:testschemaapi_shard1_replica2] o.a.s.c.SolrCore [[testschemaapi_shard1_replica2] ] Opening new SolrCore at [/home/jenkins/workspace/Lucene-Solr-master-Linux/solr/build/solr-core/test/J2/temp/solr.schema.TestManagedSchemaAPI_397ECD0448C550B7-001/tempDir-001/node1/testschemaapi_shard1_replica2], dataDir=[/home/jenkins/workspace/Lucene-Solr-master-Linux/solr/build/solr-core/test/J2/temp/solr.schema.TestManagedSchemaAPI_397ECD0448C550B7-001/tempDir-001/node1/./testschemaapi_shard1_replica2/data/]
   [junit4]   2> 2453473 INFO  (qtp477357271-17093) [n:127.0.0.1:45208_solr c:testschemaapi s:shard1 r:core_node1 x:testschemaapi_shard1_replica1] o.a.s.c.ZkController Register replica - core:testschemaapi_shard1_replica1 address:https://127.0.0.1:45208/solr collection:testschemaapi shard:shard1
   [junit4]   2> 2453473 INFO  (qtp422989082-17088) [n:127.0.0.1:40404_solr c:testschemaapi s:shard1 r:core_node2 x:testschemaapi_shard1_replica2] o.a.s.c.SolrCore JMX monitoring not detected for core: testschemaapi_shard1_replica2
   [junit4]   2> 2453473 INFO  (qtp477357271-17093) [n:127.0.0.1:45208_solr c:testschemaapi s:shard1 r:core_node1 x:testschemaapi_shard1_replica1] o.a.s.c.c.SolrZkClient makePath: /collections/testschemaapi/leader_elect/shard1/election
   [junit4]   2> 2453473 INFO  (qtp422989082-17088) [n:127.0.0.1:40404_solr c:testschemaapi s:shard1 r:core_node2 x:testschemaapi_shard1_replica2] o.a.s.c.CachingDirectoryFactory return new directory for /home/jenkins/workspace/Lucene-Solr-master-Linux/solr/build/solr-core/test/J2/temp/solr.schema.TestManagedSchemaAPI_397ECD0448C550B7-001/tempDir-001/node1/./testschemaapi_shard1_replica2/data
   [junit4]   2> 2453473 INFO  (qtp422989082-17088) [n:127.0.0.1:40404_solr c:testschemaapi s:shard1 r:core_node2 x:testschemaapi_shard1_replica2] o.a.s.c.SolrCore New index directory detected: old=null new=/home/jenkins/workspace/Lucene-Solr-master-Linux/solr/build/solr-core/test/J2/temp/solr.schema.TestManagedSchemaAPI_397ECD0448C550B7-001/tempDir-001/node1/./testschemaapi_shard1_replica2/data/index/
   [junit4]   2> 2453473 WARN  (qtp422989082-17088) [n:127.0.0.1:40404_solr c:testschemaapi s:shard1 r:core_node2 x:testschemaapi_shard1_replica2] o.a.s.c.SolrCore [testschemaapi_shard1_replica2] Solr index directory '/home/jenkins/workspace/Lucene-Solr-master-Linux/solr/build/solr-core/test/J2/temp/solr.schema.TestManagedSchemaAPI_397ECD0448C550B7-001/tempDir-001/node1/./testschemaapi_shard1_replica2/data/index' doesn't exist. Creating new index...
   [junit4]   2> 2453474 INFO  (qtp422989082-17088) [n:127.0.0.1:40404_solr c:testschemaapi s:shard1 r:core_node2 x:testschemaapi_shard1_replica2] o.a.s.c.CachingDirectoryFactory return new directory for /home/jenkins/workspace/Lucene-Solr-master-Linux/solr/build/solr-core/test/J2/temp/solr.schema.TestManagedSchemaAPI_397ECD0448C550B7-001/tempDir-001/node1/./testschemaapi_shard1_replica2/data/index
   [junit4]   2> 2453474 INFO  (qtp422989082-17088) [n:127.0.0.1:40404_solr c:testschemaapi s:shard1 r:core_node2 x:testschemaapi_shard1_replica2] o.a.s.c.SolrDeletionPolicy SolrDeletionPolicy.onCommit: commits: num=1
   [junit4]   2> 	commit{dir=MockDirectoryWrapper(RAMDirectory@15d48c22 lockFactory=org.apache.lucene.store.SingleInstanceLockFactory@419326c8),segFN=segments_1,generation=1}
   [junit4]   2> 2453474 INFO  (qtp422989082-17088) [n:127.0.0.1:40404_solr c:testschemaapi s:shard1 r:core_node2 x:testschemaapi_shard1_replica2] o.a.s.c.SolrDeletionPolicy newest commit generation = 1
   [junit4]   2> 2453474 INFO  (qtp477357271-17093) [n:127.0.0.1:45208_solr c:testschemaapi s:shard1 r:core_node1 x:testschemaapi_shard1_replica1] o.a.s.c.LeaderElector Joined leadership election with path: /collections/testschemaapi/leader_elect/shard1/election/95960391517732869-core_node1-n_0000000000
   [junit4]   2> 2453474 INFO  (qtp477357271-17093) [n:127.0.0.1:45208_solr c:testschemaapi s:shard1 r:core_node1 x:testschemaapi_shard1_replica1] o.a.s.c.ShardLeaderElectionContext Running the leader process for shard=shard1 and weAreReplacement=false and leaderVoteWait=10000
   [junit4]   2> 2453474 INFO  (OldIndexDirectoryCleanupThreadForCore-testschemaapi_shard1_replica2) [n:127.0.0.1:40404_solr c:testschemaapi s:shard1 r:core_node2 x:testschemaapi_shard1_replica2] o.a.s.c.SolrCore Looking for old index directories to cleanup for core testschemaapi_shard1_replica2 in /home/jenkins/workspace/Lucene-Solr-master-Linux/solr/build/solr-core/test/J2/temp/solr.schema.TestManagedSchemaAPI_397ECD0448C550B7-001/tempDir-001/node1/./testschemaapi_shard1_replica2/data/
   [junit4]   2> 2453474 WARN  (OldIndexDirectoryCleanupThreadForCore-testschemaapi_shard1_replica2) [n:127.0.0.1:40404_solr c:testschemaapi s:shard1 r:core_node2 x:testschemaapi_shard1_replica2] o.a.s.c.DirectoryFactory /home/jenkins/workspace/Lucene-Solr-master-Linux/solr/build/solr-core/test/J2/temp/solr.schema.TestManagedSchemaAPI_397ECD0448C550B7-001/tempDir-001/node1/./testschemaapi_shard1_replica2/data/ does not point to a valid data directory; skipping clean-up of old index directories.
   [junit4]   2> 2453475 INFO  (qtp477357271-17093) [n:127.0.0.1:45208_solr c:testschemaapi s:shard1 r:core_node1 x:testschemaapi_shard1_replica1] o.a.s.c.ShardLeaderElectionContext Waiting until we see more replicas up for shard shard1: total=2 found=1 timeoutin=9999ms
   [junit4]   2> 2453475 INFO  (OverseerStateUpdate-95960391517732870-127.0.0.1:40404_solr-n_0000000000) [n:127.0.0.1:40404_solr    ] o.a.s.c.Overseer processMessage: queueSize: 1, message = {
   [junit4]   2>   "operation":"leader",
   [junit4]   2>   "shard":"shard1",
   [junit4]   2>   "collection":"testschemaapi"} current state version: 0
   [junit4]   2> 2453476 INFO  (qtp422989082-17088) [n:127.0.0.1:40404_solr c:testschemaapi s:shard1 r:core_node2 x:testschemaapi_shard1_replica2] o.a.s.c.SolrCore no updateRequestProcessorChain defined as default, creating implicit default
   [junit4]   2> 2453477 INFO  (qtp422989082-17088) [n:127.0.0.1:40404_solr c:testschemaapi s:shard1 r:core_node2 x:testschemaapi_shard1_replica2] o.a.s.h.l.XMLLoader xsltCacheLifetimeSeconds=60
   [junit4]   2> 2453477 INFO  (qtp422989082-17088) [n:127.0.0.1:40404_solr c:testschemaapi s:shard1 r:core_node2 x:testschemaapi_shard1_replica2] o.a.s.h.l.XMLLoader xsltCacheLifetimeSeconds=60
   [junit4]   2> 2453478 INFO  (qtp422989082-17088) [n:127.0.0.1:40404_solr c:testschemaapi s:shard1 r:core_node2 x:testschemaapi_shard1_replica2] o.a.s.h.l.XMLLoader xsltCacheLifetimeSeconds=60
   [junit4]   2> 2453479 INFO  (qtp422989082-17088) [n:127.0.0.1:40404_solr c:testschemaapi s:shard1 r:core_node2 x:testschemaapi_shard1_replica2] o.a.s.h.l.XMLLoader xsltCacheLifetimeSeconds=60
   [junit4]   2> 2453480 INFO  (qtp422989082-17088) [n:127.0.0.1:40404_solr c:testschemaapi s:shard1 r:core_node2 x:testschemaapi_shard1_replica2] o.a.s.c.RequestHandlers Registered paths: /admin/mbeans,/update/csv,/sql,/update/json/docs,/admin/luke,/graph,/export,/select,/admin/segments,/get,/admin/system,/replication,/admin/properties,/config,/stream,/schema,/admin/plugins,/admin/logging,/update/json,/admin/ping,/admin/threads,/update,/admin/file
   [junit4]   2> 2453480 INFO  (qtp422989082-17088) [n:127.0.0.1:40404_solr c:testschemaapi s:shard1 r:core_node2 x:testschemaapi_shard1_replica2] o.a.s.c.SolrCore Using default statsCache cache: org.apache.solr.search.stats.LocalStatsCache
   [junit4]   2> 2453480 INFO  (qtp422989082-17088) [n:127.0.0.1:40404_solr c:testschemaapi s:shard1 r:core_node2 x:testschemaapi_shard1_replica2] o.a.s.u.UpdateHandler Using UpdateLog implementation: org.apache.solr.update.UpdateLog
   [junit4]   2> 2453480 INFO  (qtp422989082-17088) [n:127.0.0.1:40404_solr c:testschemaapi s:shard1 r:core_node2 x:testschemaapi_shard1_replica2] o.a.s.u.UpdateLog Initializing UpdateLog: dataDir=null defaultSyncLevel=FLUSH numRecordsToKeep=100 maxNumLogsToKeep=10 numVersionBuckets=65536
   [junit4]   2> 2453481 INFO  (qtp422989082-17088) [n:127.0.0.1:40404_solr c:testschemaapi s:shard1 r:core_node2 x:testschemaapi_shard1_replica2] o.a.s.u.CommitTracker Hard AutoCommit: disabled
   [junit4]   2> 2453481 INFO  (qtp422989082-17088) [n:127.0.0.1:40404_solr c:testschemaapi s:shard1 r:core_node2 x:testschemaapi_shard1_replica2] o.a.s.u.CommitTracker Soft AutoCommit: disabled
   [junit4]   2> 2453481 INFO  (qtp422989082-17088) [n:127.0.0.1:40404_solr c:testschemaapi s:shard1 r:core_node2 x:testschemaapi_shard1_replica2] o.a.s.c.SolrDeletionPolicy SolrDeletionPolicy.onInit: commits: num=1
   [junit4]   2> 	commit{dir=MockDirectoryWrapper(RAMDirectory@15d48c22 lockFactory=org.apache.lucene.store.SingleInstanceLockFactory@419326c8),segFN=segments_1,generation=1}
   [junit4]   2> 2453481 INFO  (qtp422989082-17088) [n:127.0.0.1:40404_solr c:testschemaapi s:shard1 r:core_node2 x:testschemaapi_shard1_replica2] o.a.s.c.SolrDeletionPolicy newest commit generation = 1
   [junit4]   2> 2453481 INFO  (qtp422989082-17088) [n:127.0.0.1:40404_solr c:testschemaapi s:shard1 r:core_node2 x:testschemaapi_shard1_replica2] o.a.s.s.SolrIndexSearcher Opening [Searcher@2decafd3[testschemaapi_shard1_replica2] main]
   [junit4]   2> 2453482 INFO  (qtp422989082-17088) [n:127.0.0.1:40404_solr c:testschemaapi s:shard1 r:core_node2 x:testschemaapi_shard1_replica2] o.a.s.c.c.ZkStateReader Load collection config from: [/collections/testschemaapi]
   [junit4]   2> 2453482 INFO  (qtp422989082-17088) [n:127.0.0.1:40404_solr c:testschemaapi s:shard1 r:core_node2 x:testschemaapi_shard1_replica2] o.a.s.c.c.ZkStateReader path=[/collections/testschemaapi] [configName]=[conf1] specified config exists in ZooKeeper
   [junit4]   2> 2453482 INFO  (qtp422989082-17088) [n:127.0.0.1:40404_solr c:testschemaapi s:shard1 r:core_node2 x:testschemaapi_shard1_replica2] o.a.s.r.ManagedResourceStorage Setting up ZooKeeper-based storage for the RestManager with znodeBase: /configs/conf1
   [junit4]   2> 2453482 INFO  (qtp422989082-17088) [n:127.0.0.1:40404_solr c:testschemaapi s:shard1 r:core_node2 x:testschemaapi_shard1_replica2] o.a.s.r.ManagedResourceStorage Configured ZooKeeperStorageIO with znodeBase: /configs/conf1
   [junit4]   2> 2453482 INFO  (qtp422989082-17088) [n:127.0.0.1:40404_solr c:testschemaapi s:shard1 r:core_node2 x:testschemaapi_shard1_replica2] o.a.s.r.RestManager Initializing RestManager with initArgs: {}
   [junit4]   2> 2453482 INFO  (qtp422989082-17088) [n:127.0.0.1:40404_solr c:testschemaapi s:shard1 r:core_node2 x:testschemaapi_shard1_replica2] o.a.s.r.ManagedResourceStorage Reading _rest_managed.json using ZooKeeperStorageIO:path=/configs/conf1
   [junit4]   2> 2453482 INFO  (qtp422989082-17088) [n:127.0.0.1:40404_solr c:testschemaapi s:shard1 r:core_node2 x:testschemaapi_shard1_replica2] o.a.s.r.ManagedResourceStorage No data found for znode /configs/conf1/_rest_managed.json
   [junit4]   2> 2453482 INFO  (qtp422989082-17088) [n:127.0.0.1:40404_solr c:testschemaapi s:shard1 r:core_node2 x:testschemaapi_shard1_replica2] o.a.s.r.ManagedResourceStorage Loaded null at path _rest_managed.json using ZooKeeperStorageIO:path=/configs/conf1
   [junit4]   2> 2453482 INFO  (qtp422989082-17088) [n:127.0.0.1:40404_solr c:testschemaapi s:shard1 r:core_node2 x:testschemaapi_shard1_replica2] o.a.s.r.RestManager Initializing 0 registered ManagedResources
   [junit4]   2> 2453482 INFO  (qtp422989082-17088) [n:127.0.0.1:40404_solr c:testschemaapi s:shard1 r:core_node2 x:testschemaapi_shard1_replica2] o.a.s.s.ZkIndexSchemaReader Creating ZooKeeper watch for the managed schema at /configs/conf1/managed-schema
   [junit4]   2> 2453482 INFO  (qtp422989082-17088) [n:127.0.0.1:40404_solr c:testschemaapi s:shard1 r:core_node2 x:testschemaapi_shard1_replica2] o.a.s.c.ZkController Added new OnReconnect listener ZkIndexSchemaReader: /configs/conf1/managed-schema, uniqueCoreId: testschemaapi_shard1_replica2:1697534977105754
   [junit4]   2> 2453483 INFO  (qtp422989082-17088) [n:127.0.0.1:40404_solr c:testschemaapi s:shard1 r:core_node2 x:testschemaapi_shard1_replica2] o.a.s.h.ReplicationHandler Commits will be reserved for  10000
   [junit4]   2> 2453483 INFO  (searcherExecutor-6985-thread-1-processing-n:127.0.0.1:40404_solr x:testschemaapi_shard1_replica2 s:shard1 c:testschemaapi r:core_node2) [n:127.0.0.1:40404_solr c:testschemaapi s:shard1 r:core_node2 x:testschemaapi_shard1_replica2] o.a.s.c.SolrCore [testschemaapi_shard1_replica2] Registered new searcher Searcher@2decafd3[testschemaapi_shard1_replica2] main{ExitableDirectoryReader(UninvertingDirectoryReader())}
   [junit4]   2> 2453488 INFO  (qtp422989082-17088) [n:127.0.0.1:40404_solr c:testschemaapi s:shard1 r:core_node2 x:testschemaapi_shard1_replica2] o.a.s.u.UpdateLog Looking up max value of version field to seed version buckets
   [junit4]   2> 2453488 INFO  (qtp422989082-17088) [n:127.0.0.1:40404_solr c:testschemaapi s:shard1 r:core_node2 x:testschemaapi_shard1_replica2] o.a.s.u.VersionInfo Refreshing highest value of _version_ for 65536 version buckets from index
   [junit4]   2> 2453488 INFO  (qtp422989082-17088) [n:127.0.0.1:40404_solr c:testschemaapi s:shard1 r:core_node2 x:testschemaapi_shard1_replica2] o.a.s.u.VersionInfo No terms found for _version_, cannot seed version bucket highest value from index
   [junit4]   2> 2453488 INFO  (qtp422989082-17088) [n:127.0.0.1:40404_solr c:testschemaapi s:shard1 r:core_node2 x:testschemaapi_shard1_replica2] o.a.s.u.UpdateLog Could not find max version in index or recent updates, using new clock 1535366266905165824
   [junit4]   2> 2453490 INFO  (qtp422989082-17088) [n:127.0.0.1:40404_solr c:testschemaapi s:shard1 r:core_node2 x:testschemaapi_shard1_replica2] o.a.s.u.UpdateLog Took 2.0ms to seed version buckets with highest version 1535366266905165824
   [junit4]   2> 2453490 INFO  (qtp422989082-17088) [n:127.0.0.1:40404_solr c:testschemaapi s:shard1 r:core_node2 x:testschemaapi_shard1_replica2] o.a.s.c.ZkController watch zkdir /configs/conf1
   [junit4]   2> 2453491 INFO  (qtp422989082-17088) [n:127.0.0.1:40404_solr c:testschemaapi s:shard1 r:core_node2 x:testschemaapi_shard1_replica2] o.a.s.c.CoreContainer registering core: testschemaapi_shard1_replica2
   [junit4]   2> 2453491 INFO  (qtp422989082-17088) [n:127.0.0.1:40404_solr c:testschemaapi s:shard1 r:core_node2 x:testschemaapi_shard1_replica2] o.a.s.c.ZkController Register replica - core:testschemaapi_shard1_replica2 address:https://127.0.0.1:40404/solr collection:testschemaapi shard:shard1
   [junit4]   2> 2453500 INFO  (qtp422989082-17088) [n:127.0.0.1:40404_solr c:testschemaapi s:shard1 r:core_node2 x:testschemaapi_shard1_replica2] o.a.s.c.LeaderElector Joined leadership election with path: /collections/testschemaapi/leader_elect/shard1/election/95960391517732870-core_node2-n_0000000001
   [junit4]   2> 2453501 INFO  (qtp422989082-17088) [n:127.0.0.1:40404_solr c:testschemaapi s:shard1 r:core_node2 x:testschemaapi_shard1_replica2] o.a.s.c.LeaderElector Watching path /collections/testschemaapi/leader_elect/shard1/election/95960391517732869-core_node1-n_0000000000 to know if I could be the leader
   [junit4]   2> 2453577 INFO  (OverseerStateUpdate-95960391517732870-127.0.0.1:40404_solr-n_0000000000) [n:127.0.0.1:40404_solr    ] o.a.s.c.o.ZkStateWriter going to update_collection /collections/testschemaapi/state.json version: 1
   [junit4]   2> 2453578 INFO  (zkCallback-3310-thread-1-processing-n:127.0.0.1:45208_solr) [n:127.0.0.1:45208_solr    ] o.a.s.c.c.ZkStateReader A cluster state change: [WatchedEvent state:SyncConnected type:NodeDataChanged path:/collections/testschemaapi/state.json] for collection [testschemaapi] has occurred - updating... (live nodes size: [2])
   [junit4]   2> 2453578 INFO  (zkCallback-3311-thread-2-processing-n:127.0.0.1:40404_solr) [n:127.0.0.1:40404_solr    ] o.a.s.c.c.ZkStateReader A cluster state change: [WatchedEvent state:SyncConnected type:NodeDataChanged path:/collections/testschemaapi/state.json] for collection [testschemaapi] has occurred - updating... (live nodes size: [2])
   [junit4]   2> 2453578 INFO  (zkCallback-3310-thread-1-processing-n:127.0.0.1:45208_solr) [n:127.0.0.1:45208_solr    ] o.a.s.c.c.ZkStateReader Updating data for [testschemaapi] from [1] to [2]
   [junit4]   2> 2453578 INFO  (zkCallback-3311-thread-2-processing-n:127.0.0.1:40404_solr) [n:127.0.0.1:40404_solr    ] o.a.s.c.c.ZkStateReader Updating data for [testschemaapi] from [1] to [2]
   [junit4]   2> 2453975 INFO  (qtp477357271-17093) [n:127.0.0.1:45208_solr c:testschemaapi s:shard1 r:core_node1 x:testschemaapi_shard1_replica1] o.a.s.c.ShardLeaderElectionContext Enough replicas found to continue.
   [junit4]   2> 2453976 INFO  (qtp477357271-17093) [n:127.0.0.1:45208_solr c:testschemaapi s:shard1 r:core_node1 x:testschemaapi_shard1_replica1] o.a.s.c.ShardLeaderElectionContext I may be the new leader - try and sync
   [junit4]   2> 2453976 INFO  (qtp477357271-17093) [n:127.0.0.1:45208_solr c:testschemaapi s:shard1 r:core_node1 x:testschemaapi_shard1_replica1] o.a.s.c.SyncStrategy Sync replicas to https://127.0.0.1:45208/solr/testschemaapi_shard1_replica1/
   [junit4]   2> 2453976 INFO  (qtp477357271-17093) [n:127.0.0.1:45208_solr c:testschemaapi s:shard1 r:core_node1 x:testschemaapi_shard1_replica1] o.a.s.u.PeerSync PeerSync: core=testschemaapi_shard1_replica1 url=https://127.0.0.1:45208/solr START replicas=[https://127.0.0.1:40404/solr/testschemaapi_shard1_replica2/] nUpdates=100
   [junit4]   2> 2453977 INFO  (qtp477357271-17093) [n:127.0.0.1:45208_solr c:testschemaapi s:shard1 r:core_node1 x:testschemaapi_shard1_replica1] o.a.s.u.PeerSync PeerSync: core=testschemaapi_shard1_replica1 url=https://127.0.0.1:45208/solr DONE.  We have no versions.  sync failed.
   [junit4]   2> 2453977 INFO  (qtp477357271-17093) [n:127.0.0.1:45208_solr c:testschemaapi s:shard1 r:core_node1 x:testschemaapi_shard1_replica1] o.a.s.c.SyncStrategy Leader's attempt to sync with shard failed, moving to the next candidate
   [junit4]   2> 2453977 INFO  (qtp477357271-17093) [n:127.0.0.1:45208_solr c:testschemaapi s:shard1 r:core_node1 x:testschemaapi_shard1_replica1] o.a.s.c.ShardLeaderElectionContext We failed sync, but we have no versions - we can't sync in that case - we were active before, so become leader anyway
   [junit4]   2> 2453992 INFO  (qtp477357271-17093) [n:127.0.0.1:45208_solr c:testschemaapi s:shard1 r:core_node1 x:testschemaapi_shard1_replica1] o.a.s.c.c.SolrZkClient makePath: /collections/testschemaapi/leaders/shard1
   [junit4]   2> 2453993 INFO  (qtp477357271-17093) [n:127.0.0.1:45208_solr c:testschemaapi s:shard1 r:core_node1 x:testschemaapi_shard1_replica1] o.a.s.c.ShardLeaderElectionContextBase Creating leader registration node /collections/testschemaapi/leaders/shard1/leader after winning as /collections/testschemaapi/leader_elect/shard1/election/95960391517732869-core_node1-n_0000000000
   [junit4]   2> 2453995 INFO  (qtp477357271-17093) [n:127.0.0.1:45208_solr c:testschemaapi s:shard1 r:core_node1 x:testschemaapi_shard1_replica1] o.a.s.c.ShardLeaderElectionContext I am the new leader: https://127.0.0.1:45208/solr/testschemaapi_shard1_replica1/ shard1
   [junit4]   2> 2453997 INFO  (OverseerStateUpdate-95960391517732870-127.0.0.1:40404_solr-n_0000000000) [n:127.0.0.1:40404_solr    ] o.a.s.c.Overseer processMessage: queueSize: 1, message = {
   [junit4]   2>   "operation":"leader",
   [junit4]   2>   "shard":"shard1",
   [junit4]   2>   "collection":"testschemaapi",
   [junit4]   2>   "base_url":"https://127.0.0.1:45208/solr",
   [junit4]   2>   "core":"testschemaapi_shard1_replica1",
   [junit4]   2>   "state":"active"} current state version: 0
   [junit4]   2> 2453997 INFO  (qtp422989082-17084) [n:127.0.0.1:40404_solr c:testschemaapi s:shard1 r:core_node2 x:testschemaapi_shard1_replica2] o.a.s.c.S.Request [testschemaapi_shard1_replica2]  webapp=/solr path=/get params={distrib=false&qt=/get&fingerprint=false&getVersions=100&wt=javabin&version=2} status=0 QTime=0
   [junit4]   2> 2454105 INFO  (OverseerStateUpdate-95960391517732870-127.0.0.1:40404_solr-n_0000000000) [n:127.0.0.1:40404_solr    ] o.a.s.c.o.ZkStateWriter going to update_collection /collections/testschemaapi/state.json version: 2
   [junit4]   2> 2454106 INFO  (zkCallback-3311-thread-2-processing-n:127.0.0.1:40404_solr) [n:127.0.0.1:40404_solr    ] o.a.s.c.c.ZkStateReader A cluster state change: [WatchedEvent state:SyncConnected type:NodeDataChanged path:/collections/testschemaapi/state.json] for collection [testschemaapi] has occurred - updating... (live nodes size: [2])
   [junit4]   2> 2454106 INFO  (zkCallback-3310-thread-1-processing-n:127.0.0.1:45208_solr) [n:127.0.0.1:45208_solr    ] o.a.s.c.c.ZkStateReader A cluster state change: [WatchedEvent state:SyncConnected type:NodeDataChanged path:/collections/testschemaapi/state.json] for collection [testschemaapi] has occurred - updating... (live nodes size: [2])
   [junit4]   2> 2454106 INFO  (zkCallback-3310-thread-1-processing-n:127.0.0.1:45208_solr) [n:127.0.0.1:45208_solr    ] o.a.s.c.c.ZkStateReader Updating data for [testschemaapi] from [2] to [3]
   [junit4]   2> 2454106 INFO  (zkCallback-3311-thread-2-processing-n:127.0.0.1:40404_solr) [n:127.0.0.1:40404_solr    ] o.a.s.c.c.ZkStateReader Updating data for [testschemaapi] from [2] to [3]
   [junit4]   2> 2454155 INFO  (qtp477357271-17093) [n:127.0.0.1:45208_solr c:testschemaapi s:shard1 r:core_node1 x:testschemaapi_shard1_replica1] o.a.s.c.ZkController We are https://127.0.0.1:45208/solr/testschemaapi_shard1_replica1/ and leader is https://127.0.0.1:45208/solr/testschemaapi_shard1_replica1/
   [junit4]   2> 2454155 INFO  (qtp477357271-17093) [n:127.0.0.1:45208_solr c:testschemaapi s:shard1 r:core_node1 x:testschemaapi_shard1_replica1] o.a.s.c.ZkController No LogReplay needed for core=testschemaapi_shard1_replica1 baseURL=https://127.0.0.1:45208/solr
   [junit4]   2> 2454155 INFO  (qtp477357271-17093) [n:127.0.0.1:45208_solr c:testschemaapi s:shard1 r:core_node1 x:testschemaapi_shard1_replica1] o.a.s.c.ZkController I am the leader, no recovery necessary
   [junit4]   2> 2454155 INFO  (qtp477357271-17093) [n:127.0.0.1:45208_solr c:testschemaapi s:shard1 r:core_node1 x:testschemaapi_shard1_replica1] o.a.s.c.ZkController publishing state=active
   [junit4]   2> 2454156 INFO  (OverseerStateUpdate-95960391517732870-127.0.0.1:40404_solr-n_0000000000) [n:127.0.0.1:40404_solr    ] o.a.s.c.Overseer processMessage: queueSize: 1, message = {
   [junit4]   2>   "core":"testschemaapi_shard1_replica1",
   [junit4]   2>   "core_node_name":"core_node1",
   [junit4]   2>   "roles":null,
   [junit4]   2>   "base_url":"https://127.0.0.1:45208/solr",
   [junit4]   2>   "node_name":"127.0.0.1:45208_solr",
   [junit4]   2>   "numShards":"1",
   [junit4]   2>   "state":"active",
   [junit4]   2>   "shard":"shard1",
   [junit4]   2>   "collection":"testschemaapi",
   [junit4]   2>   "operation":"state"} current state version: 0
   [junit4]   2> 2454156 INFO  (OverseerStateUpdate-95960391517732870-127.0.0.1:40404_solr-n_0000000000) [n:127.0.0.1:40404_solr    ] o.a.s.c.o.ReplicaMutator Update state numShards=1 message={
   [junit4]   2>   "core":"testschemaapi_shard1_replica1",
   [junit4]   2>   "core_node_name":"core_node1",
   [junit4]   2>   "roles":null,
   [junit4]   2>   "base_url":"https://127.0.0.1:45208/solr",
   [junit4]   2>   "node_name":"127.0.0.1:45208_solr",
   [junit4]   2>   "numShards":"1",
   [junit4]   2>   "state":"active",
   [junit4]   2>   "shard":"shard1",
   [junit4]   2>   "collection":"testschemaapi",
   [junit4]   2>   "operation":"state"}
   [junit4]   2> 2454156 INFO  (qtp477357271-17093) [n:127.0.0.1:45208_solr c:testschemaapi s:shard1 r:core_node1 x:testschemaapi_shard1_replica1] o.a.s.s.HttpSolrCall [admin] webapp=null path=/admin/cores params={qt=/admin/cores&collection.configName=conf1&name=testschemaapi_shard1_replica1&action=CREATE&numShards=1&collection=testschemaapi&shard=shard1&wt=javabin&version=2} status=0 QTime=1762
   [junit4]   2> 2454257 INFO  (OverseerStateUpdate-95960391517732870-127.0.0.1:40404_solr-n_0000000000) [n:127.0.0.1:40404_solr    ] o.a.s.c.o.ZkStateWriter going to update_collection /collections/testschemaapi/state.json version: 3
   [junit4]   2> 2454258 INFO  (zkCallback-3310-thread-1-processing-n:127.0.0.1:45208_solr) [n:127.0.0.1:45208_solr    ] o.a.s.c.c.ZkStateReader A cluster state change: [WatchedEvent state:SyncConnected type:NodeDataChanged path:/collections/testschemaapi/state.json] for collection [testschemaapi] has occurred - updating... (live nodes size: [2])
   [junit4]   2> 2454258 INFO  (zkCallback-3311-thread-2-processing-n:127.0.0.1:40404_solr) [n:127.0.0.1:40404_solr    ] o.a.s.c.c.ZkStateReader A cluster state change: [WatchedEvent state:SyncConnected type:NodeDataChanged path:/collections/testschemaapi/state.json] for collection [testschemaapi] has occurred - updating... (live nodes size: [2])
   [junit4]   2> 2454260 INFO  (zkCallback-3311-thread-2-processing-n:127.0.0.1:40404_solr) [n:127.0.0.1:40404_solr    ] o.a.s.c.c.ZkStateReader Updating data for [testschemaapi] from [3] to [4]
   [junit4]   2> 2454260 INFO  (zkCallback-3310-thread-1-processing-n:127.0.0.1:45208_solr) [n:127.0.0.1:45208_solr    ] o.a.s.c.c.ZkStateReader Updating data for [testschemaapi] from [3] to [4]
   [junit4]   2> 2454502 INFO  (qtp422989082-17088) [n:127.0.0.1:40404_solr c:testschemaapi s:shard1 r:core_node2 x:testschemaapi_shard1_replica2] o.a.s.c.ZkController We are https://127.0.0.1:40404/solr/t

[...truncated too long message...]

:654)
   [junit4]   2> 	at org.eclipse.jetty.util.thread.QueuedThreadPool$3.run(QueuedThreadPool.java:572)
   [junit4]   2> 	at java.lang.Thread.run(Thread.java:745)
   [junit4]   2> 
   [junit4]   2> 2473881 INFO  (Thread-4816) [n:127.0.0.1:40404_solr c:testschemaapi s:shard1 r:core_node2 x:testschemaapi_shard1_replica2] o.a.s.c.CachingDirectoryFactory Closing directory, CoreContainer#isShutdown=true
   [junit4]   2> 2473881 INFO  (Thread-4816) [n:127.0.0.1:40404_solr c:testschemaapi s:shard1 r:core_node2 x:testschemaapi_shard1_replica2] o.a.s.c.CachingDirectoryFactory Closing directory: /home/jenkins/workspace/Lucene-Solr-master-Linux/solr/build/solr-core/test/J2/temp/solr.schema.TestManagedSchemaAPI_397ECD0448C550B7-001/tempDir-001/node1/./testschemaapi_shard1_replica2/data
   [junit4]   2> 2473882 WARN  (Thread-4816) [n:127.0.0.1:40404_solr c:testschemaapi s:shard1 r:core_node2 x:testschemaapi_shard1_replica2] o.a.s.c.ZkController listener throws error
   [junit4]   2> org.apache.solr.common.SolrException: Unable to reload core [testschemaapi_shard1_replica2]
   [junit4]   2> 	at org.apache.solr.core.CoreContainer.reload(CoreContainer.java:944)
   [junit4]   2> 	at org.apache.solr.core.SolrCore.lambda$getConfListener$6(SolrCore.java:2510)
   [junit4]   2> 	at org.apache.solr.cloud.ZkController$4.run(ZkController.java:2408)
   [junit4]   2> Caused by: org.apache.solr.common.SolrException: Error creating ZooKeeper watch for the managed schema
   [junit4]   2> 	at org.apache.solr.core.SolrCore.<init>(SolrCore.java:773)
   [junit4]   2> 	at org.apache.solr.core.SolrCore.reload(SolrCore.java:462)
   [junit4]   2> 	at org.apache.solr.core.CoreContainer.reload(CoreContainer.java:938)
   [junit4]   2> 	... 2 more
   [junit4]   2> Caused by: org.apache.solr.common.cloud.ZooKeeperException: Error creating ZooKeeper watch for the managed schema
   [junit4]   2> 	at org.apache.solr.schema.ZkIndexSchemaReader.createSchemaWatcher(ZkIndexSchemaReader.java:115)
   [junit4]   2> 	at org.apache.solr.schema.ZkIndexSchemaReader.<init>(ZkIndexSchemaReader.java:70)
   [junit4]   2> 	at org.apache.solr.schema.ManagedIndexSchemaFactory.inform(ManagedIndexSchemaFactory.java:378)
   [junit4]   2> 	at org.apache.solr.core.SolrResourceLoader.inform(SolrResourceLoader.java:675)
   [junit4]   2> 	at org.apache.solr.core.SolrCore.<init>(SolrCore.java:753)
   [junit4]   2> 	... 4 more
   [junit4]   2> Caused by: org.apache.zookeeper.KeeperException$SessionExpiredException: KeeperErrorCode = Session expired for /configs/conf1/managed-schema
   [junit4]   2> 	at org.apache.zookeeper.KeeperException.create(KeeperException.java:127)
   [junit4]   2> 	at org.apache.zookeeper.KeeperException.create(KeeperException.java:51)
   [junit4]   2> 	at org.apache.zookeeper.ZooKeeper.exists(ZooKeeper.java:1045)
   [junit4]   2> 	at org.apache.solr.common.cloud.SolrZkClient$4.execute(SolrZkClient.java:297)
   [junit4]   2> 	at org.apache.solr.common.cloud.SolrZkClient$4.execute(SolrZkClient.java:294)
   [junit4]   2> 	at org.apache.solr.common.cloud.ZkCmdExecutor.retryOperation(ZkCmdExecutor.java:60)
   [junit4]   2> 	at org.apache.solr.common.cloud.SolrZkClient.exists(SolrZkClient.java:294)
   [junit4]   2> 	at org.apache.solr.schema.ZkIndexSchemaReader.createSchemaWatcher(ZkIndexSchemaReader.java:83)
   [junit4]   2> 	... 8 more
   [junit4]   2> NOTE: test params are: codec=Asserting(Lucene62): {_version_=BlockTreeOrds(blocksize=128), id=FST50, myNewField1=FST50, myNewField=BlockTreeOrds(blocksize=128)}, docValues:{}, maxPointsInLeafNode=819, maxMBSortInHeap=7.636097853750389, sim=ClassicSimilarity, locale=nn-NO, timezone=Africa/Blantyre
   [junit4]   2> NOTE: Linux 4.4.0-21-generic amd64/Oracle Corporation 1.8.0_92 (64-bit)/cpus=12,threads=1,free=317204248,total=522715136
   [junit4]   2> NOTE: All tests run in this JVM: [TestWriterPerf, DateRangeFieldTest, HdfsRecoverLeaseTest, TestTolerantSearch, ShowFileRequestHandlerTest, TestSolrIndexConfig, DirectoryFactoryTest, ConnectionManagerTest, TestConfigSetsAPI, TestAnalyzeInfixSuggestions, TestSearchPerf, TestReplicationHandlerBackup, CloneFieldUpdateProcessorFactoryTest, TestDistribIDF, TestTestInjection, CoreAdminHandlerTest, TestSortingResponseWriter, DocValuesMultiTest, TestCloudInspectUtil, TestXmlQParser, SliceStateTest, TestRebalanceLeaders, DistributedFacetPivotLongTailTest, TestRecovery, TestSubQueryTransformerCrossCore, TestSolrQueryParserResource, CleanupOldIndexTest, SimpleCollectionCreateDeleteTest, DistribDocExpirationUpdateProcessorTest, ScriptEngineTest, TolerantUpdateProcessorTest, HardAutoCommitTest, SmileWriterTest, SolrTestCaseJ4Test, CoreAdminCreateDiscoverTest, AssignTest, TestFieldCacheSortRandom, AddSchemaFieldsUpdateProcessorFactoryTest, SuggesterTSTTest, TestAuthorizationFramework, TestSolrDeletionPolicy1, TestStressRecovery, TestZkChroot, TestGraphTermsQParserPlugin, TestFuzzyAnalyzedSuggestions, TestLRUStatsCache, LeaderElectionTest, TestSchemaVersionResource, AutoCommitTest, TestDynamicFieldCollectionResource, TestMiniSolrCloudCluster, FieldMutatingUpdateProcessorTest, TestElisionMultitermQuery, RequestLoggingTest, TestFastWriter, RecoveryZkTest, DirectUpdateHandlerOptimizeTest, UpdateParamsTest, HighlighterConfigTest, DeleteShardTest, SuggesterWFSTTest, CurrencyFieldXmlFileTest, TestOverriddenPrefixQueryForCustomFieldType, OverseerTest, RollingRestartTest, DateMathParserTest, TestSolrJ, TestPerFieldSimilarityWithDefaultOverride, WrapperMergePolicyFactoryTest, TestStandardQParsers, TestCryptoKeys, TestCustomDocTransformer, SpatialRPTFieldTypeTest, TestCustomSort, TestSQLHandler, StatelessScriptUpdateProcessorFactoryTest, TestJettySolrRunner, TestAuthenticationFramework, TestSizeLimitedDistributedMap, PluginInfoTest, RequestHandlersTest, TestStressReorder, TestPHPSerializedResponseWriter, ParsingFieldUpdateProcessorsTest, SuggesterTest, DebugComponentTest, HLLSerializationTest, TestSort, TestLegacyFieldCache, SimpleFacetsTest, DeleteInactiveReplicaTest, TestSolrQueryParser, SampleTest, HdfsBasicDistributedZk2Test, TestFieldResource, ZkCLITest, SolrCoreCheckLockOnStartupTest, TestPseudoReturnFields, TestAtomicUpdateErrorCases, SortByFunctionTest, SolrInfoMBeanTest, DisMaxRequestHandlerTest, StandardRequestHandlerTest, PrimitiveFieldTypeTest, XmlUpdateRequestHandlerTest, PathHierarchyTokenizerFactoryTest, MoreLikeThisHandlerTest, FastVectorHighlighterTest, RegexBoostProcessorTest, TestCollationField, ReturnFieldsTest, MBeansHandlerTest, JsonLoaderTest, TestQuerySenderListener, AlternateDirectoryTest, ResponseLogComponentTest, BadComponentTest, TestMergePolicyConfig, TestSolrDeletionPolicy2, MultiTermTest, OutputWriterTest, TestPostingsSolrHighlighter, DirectSolrConnectionTest, SpellPossibilityIteratorTest, TestCharFilters, TestCodecSupport, SynonymTokenizerTest, TestXIncludeConfig, TestSweetSpotSimilarityFactory, TestPerFieldSimilarity, TestLMJelinekMercerSimilarityFactory, TestIBSimilarityFactory, TestBM25SimilarityFactory, TestJmxMonitoredMap, TimeZoneUtilsTest, TestFastLRUCache, ChaosMonkeyNothingIsSafeTest, BaseCdcrDistributedZkTest, CdcrRequestHandlerTest, CloudExitableDirectoryReaderTest, CollectionStateFormat2Test, CollectionsAPIAsyncDistributedZkTest, CustomCollectionTest, LeaderInitiatedRecoveryOnCommitTest, LeaderInitiatedRecoveryOnShardRestartTest, MigrateRouteKeyTest, OverseerCollectionConfigSetProcessorTest, OverseerRolesTest, RemoteQueryErrorTest, TestCloudBackupRestore, TestCloudPivotFacet, TestConfigSetsAPIExclusivity, TestConfigSetsAPIZkFailure, TestDistribDocBasedVersion, TestLeaderElectionZkExpiry, TestLeaderInitiatedRecoveryThread, TestOnReconnectListenerSupport, TestShortCircuitedRequests, TestTolerantUpdateProcessorCloud, ExitableDirectoryReaderTest, QueryResultKeyTest, TestConfigOverlay, TestConfigSetProperties, TestDynamicLoading, TestRestoreCore, TestSolrConfigHandlerCloud, TestSubQueryTransformerDistrib, TestManagedSchema, TestManagedSchemaAPI]
   [junit4]   2> NOTE: reproduce with: ant test  -Dtestcase=TestManagedSchemaAPI -Dtests.seed=397ECD0448C550B7 -Dtests.multiplier=3 -Dtests.slow=true -Dtests.locale=nn-NO -Dtests.timezone=Africa/Blantyre -Dtests.asserts=true -Dtests.file.encoding=ISO-8859-1
   [junit4] ERROR   0.00s J2 | TestManagedSchemaAPI (suite) <<<
   [junit4]    > Throwable #1: java.lang.AssertionError: ObjectTracker found 1 object(s) that were not released!!! [MockDirectoryWrapper]
   [junit4]    > 	at __randomizedtesting.SeedInfo.seed([397ECD0448C550B7]:0)
   [junit4]    > 	at org.apache.solr.SolrTestCaseJ4.afterClass(SolrTestCaseJ4.java:255)
   [junit4]    > 	at java.lang.Thread.run(Thread.java:745)
   [junit4] Completed [549/611 (1!)] on J2 in 22.95s, 1 test, 1 failure <<< FAILURES!

[...truncated 228 lines...]
BUILD FAILED
/home/jenkins/workspace/Lucene-Solr-master-Linux/build.xml:740: The following error occurred while executing this line:
/home/jenkins/workspace/Lucene-Solr-master-Linux/build.xml:684: The following error occurred while executing this line:
/home/jenkins/workspace/Lucene-Solr-master-Linux/build.xml:59: The following error occurred while executing this line:
/home/jenkins/workspace/Lucene-Solr-master-Linux/solr/build.xml:233: The following error occurred while executing this line:
/home/jenkins/workspace/Lucene-Solr-master-Linux/solr/common-build.xml:531: The following error occurred while executing this line:
/home/jenkins/workspace/Lucene-Solr-master-Linux/lucene/common-build.xml:1427: The following error occurred while executing this line:
/home/jenkins/workspace/Lucene-Solr-master-Linux/lucene/common-build.xml:984: There were test failures: 611 suites (10 ignored), 2554 tests, 1 suite-level error, 116 ignored (72 assumptions) [seed: 397ECD0448C550B7]

Total time: 64 minutes 59 seconds
Build step 'Invoke Ant' marked build as failure
Archiving artifacts
[WARNINGS] Skipping publisher since build result is FAILURE
Recording test results
Email was triggered for: Failure - Any
Sending email for trigger: Failure - Any



Mime
View raw message