lucene-dev mailing list archives

Site index · List index
Message view « Date » · « Thread »
Top « Date » · « Thread »
From Policeman Jenkins Server <jenk...@thetaphi.de>
Subject [JENKINS] Lucene-Solr-6.x-MacOSX (64bit/jdk1.8.0) - Build # 127 - Failure!
Date Tue, 10 May 2016 10:01:37 GMT
Build: http://jenkins.thetaphi.de/job/Lucene-Solr-6.x-MacOSX/127/
Java: 64bit/jdk1.8.0 -XX:+UseCompressedOops -XX:+UseG1GC

1 tests failed.
FAILED:  org.apache.solr.cloud.DistribDocExpirationUpdateProcessorTest.test

Error Message:
There are still nodes recoverying - waited for 45 seconds

Stack Trace:
java.lang.AssertionError: There are still nodes recoverying - waited for 45 seconds
	at __randomizedtesting.SeedInfo.seed([5A72266DCE952006:D22619B760694DFE]:0)
	at org.junit.Assert.fail(Assert.java:93)
	at org.apache.solr.cloud.AbstractDistribZkTestBase.waitForRecoveriesToFinish(AbstractDistribZkTestBase.java:182)
	at org.apache.solr.cloud.AbstractFullDistribZkTestBase.waitForRecoveriesToFinish(AbstractFullDistribZkTestBase.java:858)
	at org.apache.solr.cloud.DistribDocExpirationUpdateProcessorTest.test(DistribDocExpirationUpdateProcessorTest.java:74)
	at sun.reflect.NativeMethodAccessorImpl.invoke0(Native Method)
	at sun.reflect.NativeMethodAccessorImpl.invoke(NativeMethodAccessorImpl.java:62)
	at sun.reflect.DelegatingMethodAccessorImpl.invoke(DelegatingMethodAccessorImpl.java:43)
	at java.lang.reflect.Method.invoke(Method.java:498)
	at com.carrotsearch.randomizedtesting.RandomizedRunner.invoke(RandomizedRunner.java:1764)
	at com.carrotsearch.randomizedtesting.RandomizedRunner$8.evaluate(RandomizedRunner.java:871)
	at com.carrotsearch.randomizedtesting.RandomizedRunner$9.evaluate(RandomizedRunner.java:907)
	at com.carrotsearch.randomizedtesting.RandomizedRunner$10.evaluate(RandomizedRunner.java:921)
	at org.apache.solr.BaseDistributedSearchTestCase$ShardsRepeatRule$ShardsFixedStatement.callStatement(BaseDistributedSearchTestCase.java:992)
	at org.apache.solr.BaseDistributedSearchTestCase$ShardsRepeatRule$ShardsStatement.evaluate(BaseDistributedSearchTestCase.java:967)
	at com.carrotsearch.randomizedtesting.rules.SystemPropertiesRestoreRule$1.evaluate(SystemPropertiesRestoreRule.java:57)
	at org.apache.lucene.util.TestRuleSetupTeardownChained$1.evaluate(TestRuleSetupTeardownChained.java:49)
	at org.apache.lucene.util.AbstractBeforeAfterRule$1.evaluate(AbstractBeforeAfterRule.java:45)
	at org.apache.lucene.util.TestRuleThreadAndTestName$1.evaluate(TestRuleThreadAndTestName.java:48)
	at org.apache.lucene.util.TestRuleIgnoreAfterMaxFailures$1.evaluate(TestRuleIgnoreAfterMaxFailures.java:64)
	at org.apache.lucene.util.TestRuleMarkFailure$1.evaluate(TestRuleMarkFailure.java:47)
	at com.carrotsearch.randomizedtesting.rules.StatementAdapter.evaluate(StatementAdapter.java:36)
	at com.carrotsearch.randomizedtesting.ThreadLeakControl$StatementRunner.run(ThreadLeakControl.java:367)
	at com.carrotsearch.randomizedtesting.ThreadLeakControl.forkTimeoutingTask(ThreadLeakControl.java:809)
	at com.carrotsearch.randomizedtesting.ThreadLeakControl$3.evaluate(ThreadLeakControl.java:460)
	at com.carrotsearch.randomizedtesting.RandomizedRunner.runSingleTest(RandomizedRunner.java:880)
	at com.carrotsearch.randomizedtesting.RandomizedRunner$5.evaluate(RandomizedRunner.java:781)
	at com.carrotsearch.randomizedtesting.RandomizedRunner$6.evaluate(RandomizedRunner.java:816)
	at com.carrotsearch.randomizedtesting.RandomizedRunner$7.evaluate(RandomizedRunner.java:827)
	at com.carrotsearch.randomizedtesting.rules.StatementAdapter.evaluate(StatementAdapter.java:36)
	at com.carrotsearch.randomizedtesting.rules.SystemPropertiesRestoreRule$1.evaluate(SystemPropertiesRestoreRule.java:57)
	at org.apache.lucene.util.AbstractBeforeAfterRule$1.evaluate(AbstractBeforeAfterRule.java:45)
	at com.carrotsearch.randomizedtesting.rules.StatementAdapter.evaluate(StatementAdapter.java:36)
	at org.apache.lucene.util.TestRuleStoreClassName$1.evaluate(TestRuleStoreClassName.java:41)
	at com.carrotsearch.randomizedtesting.rules.NoShadowingOrOverridesOnMethodsRule$1.evaluate(NoShadowingOrOverridesOnMethodsRule.java:40)
	at com.carrotsearch.randomizedtesting.rules.NoShadowingOrOverridesOnMethodsRule$1.evaluate(NoShadowingOrOverridesOnMethodsRule.java:40)
	at com.carrotsearch.randomizedtesting.rules.StatementAdapter.evaluate(StatementAdapter.java:36)
	at com.carrotsearch.randomizedtesting.rules.StatementAdapter.evaluate(StatementAdapter.java:36)
	at com.carrotsearch.randomizedtesting.rules.StatementAdapter.evaluate(StatementAdapter.java:36)
	at org.apache.lucene.util.TestRuleAssertionsRequired$1.evaluate(TestRuleAssertionsRequired.java:53)
	at org.apache.lucene.util.TestRuleMarkFailure$1.evaluate(TestRuleMarkFailure.java:47)
	at org.apache.lucene.util.TestRuleIgnoreAfterMaxFailures$1.evaluate(TestRuleIgnoreAfterMaxFailures.java:64)
	at org.apache.lucene.util.TestRuleIgnoreTestSuites$1.evaluate(TestRuleIgnoreTestSuites.java:54)
	at com.carrotsearch.randomizedtesting.rules.StatementAdapter.evaluate(StatementAdapter.java:36)
	at com.carrotsearch.randomizedtesting.ThreadLeakControl$StatementRunner.run(ThreadLeakControl.java:367)
	at java.lang.Thread.run(Thread.java:745)




Build Log:
[...truncated 11420 lines...]
   [junit4] Suite: org.apache.solr.cloud.DistribDocExpirationUpdateProcessorTest
   [junit4]   2> Creating dataDir: /Users/jenkins/workspace/Lucene-Solr-6.x-MacOSX/solr/build/solr-core/test/J1/temp/solr.cloud.DistribDocExpirationUpdateProcessorTest_5A72266DCE952006-001/init-core-data-001
   [junit4]   2> 1729339 INFO  (SUITE-DistribDocExpirationUpdateProcessorTest-seed#[5A72266DCE952006]-worker) [    ] o.a.s.SolrTestCaseJ4 Randomized ssl (false) and clientAuth (false)
   [junit4]   2> 1729340 INFO  (SUITE-DistribDocExpirationUpdateProcessorTest-seed#[5A72266DCE952006]-worker) [    ] o.a.s.BaseDistributedSearchTestCase Setting hostContext system property: /
   [junit4]   2> 1729341 INFO  (TEST-DistribDocExpirationUpdateProcessorTest.test-seed#[5A72266DCE952006]) [    ] o.a.s.c.ZkTestServer STARTING ZK TEST SERVER
   [junit4]   2> 1729342 INFO  (Thread-3392) [    ] o.a.s.c.ZkTestServer client port:0.0.0.0/0.0.0.0:0
   [junit4]   2> 1729342 INFO  (Thread-3392) [    ] o.a.s.c.ZkTestServer Starting server
   [junit4]   2> 1729442 INFO  (TEST-DistribDocExpirationUpdateProcessorTest.test-seed#[5A72266DCE952006]) [    ] o.a.s.c.ZkTestServer start zk server on port:57308
   [junit4]   2> 1729442 INFO  (TEST-DistribDocExpirationUpdateProcessorTest.test-seed#[5A72266DCE952006]) [    ] o.a.s.c.c.SolrZkClient Using default ZkCredentialsProvider
   [junit4]   2> 1729443 INFO  (TEST-DistribDocExpirationUpdateProcessorTest.test-seed#[5A72266DCE952006]) [    ] o.a.s.c.c.ConnectionManager Waiting for client to connect to ZooKeeper
   [junit4]   2> 1729451 INFO  (zkCallback-2013-thread-1) [    ] o.a.s.c.c.ConnectionManager Watcher org.apache.solr.common.cloud.ConnectionManager@4d604d8d name:ZooKeeperConnection Watcher:127.0.0.1:57308 got event WatchedEvent state:SyncConnected type:None path:null path:null type:None
   [junit4]   2> 1729451 INFO  (TEST-DistribDocExpirationUpdateProcessorTest.test-seed#[5A72266DCE952006]) [    ] o.a.s.c.c.ConnectionManager Client is connected to ZooKeeper
   [junit4]   2> 1729451 INFO  (TEST-DistribDocExpirationUpdateProcessorTest.test-seed#[5A72266DCE952006]) [    ] o.a.s.c.c.SolrZkClient Using default ZkACLProvider
   [junit4]   2> 1729451 INFO  (TEST-DistribDocExpirationUpdateProcessorTest.test-seed#[5A72266DCE952006]) [    ] o.a.s.c.c.SolrZkClient makePath: /solr
   [junit4]   2> 1729456 INFO  (TEST-DistribDocExpirationUpdateProcessorTest.test-seed#[5A72266DCE952006]) [    ] o.a.s.c.c.SolrZkClient Using default ZkCredentialsProvider
   [junit4]   2> 1729456 INFO  (TEST-DistribDocExpirationUpdateProcessorTest.test-seed#[5A72266DCE952006]) [    ] o.a.s.c.c.ConnectionManager Waiting for client to connect to ZooKeeper
   [junit4]   2> 1729457 INFO  (zkCallback-2014-thread-1) [    ] o.a.s.c.c.ConnectionManager Watcher org.apache.solr.common.cloud.ConnectionManager@61407a21 name:ZooKeeperConnection Watcher:127.0.0.1:57308/solr got event WatchedEvent state:SyncConnected type:None path:null path:null type:None
   [junit4]   2> 1729458 INFO  (TEST-DistribDocExpirationUpdateProcessorTest.test-seed#[5A72266DCE952006]) [    ] o.a.s.c.c.ConnectionManager Client is connected to ZooKeeper
   [junit4]   2> 1729458 INFO  (TEST-DistribDocExpirationUpdateProcessorTest.test-seed#[5A72266DCE952006]) [    ] o.a.s.c.c.SolrZkClient Using default ZkACLProvider
   [junit4]   2> 1729458 INFO  (TEST-DistribDocExpirationUpdateProcessorTest.test-seed#[5A72266DCE952006]) [    ] o.a.s.c.c.SolrZkClient makePath: /collections/collection1
   [junit4]   2> 1729461 INFO  (TEST-DistribDocExpirationUpdateProcessorTest.test-seed#[5A72266DCE952006]) [    ] o.a.s.c.c.SolrZkClient makePath: /collections/collection1/shards
   [junit4]   2> 1729463 INFO  (TEST-DistribDocExpirationUpdateProcessorTest.test-seed#[5A72266DCE952006]) [    ] o.a.s.c.c.SolrZkClient makePath: /collections/control_collection
   [junit4]   2> 1729466 INFO  (TEST-DistribDocExpirationUpdateProcessorTest.test-seed#[5A72266DCE952006]) [    ] o.a.s.c.c.SolrZkClient makePath: /collections/control_collection/shards
   [junit4]   2> 1729468 INFO  (TEST-DistribDocExpirationUpdateProcessorTest.test-seed#[5A72266DCE952006]) [    ] o.a.s.c.AbstractZkTestCase put /Users/jenkins/workspace/Lucene-Solr-6.x-MacOSX/solr/core/src/test-files/solr/collection1/conf/solrconfig-doc-expire-update-processor.xml to /configs/conf1/solrconfig.xml
   [junit4]   2> 1729469 INFO  (TEST-DistribDocExpirationUpdateProcessorTest.test-seed#[5A72266DCE952006]) [    ] o.a.s.c.c.SolrZkClient makePath: /configs/conf1/solrconfig.xml
   [junit4]   2> 1729473 INFO  (TEST-DistribDocExpirationUpdateProcessorTest.test-seed#[5A72266DCE952006]) [    ] o.a.s.c.AbstractZkTestCase put /Users/jenkins/workspace/Lucene-Solr-6.x-MacOSX/solr/core/src/test-files/solr/collection1/conf/schema15.xml to /configs/conf1/schema.xml
   [junit4]   2> 1729473 INFO  (TEST-DistribDocExpirationUpdateProcessorTest.test-seed#[5A72266DCE952006]) [    ] o.a.s.c.c.SolrZkClient makePath: /configs/conf1/schema.xml
   [junit4]   2> 1729475 INFO  (TEST-DistribDocExpirationUpdateProcessorTest.test-seed#[5A72266DCE952006]) [    ] o.a.s.c.AbstractZkTestCase put /Users/jenkins/workspace/Lucene-Solr-6.x-MacOSX/solr/core/src/test-files/solr/collection1/conf/solrconfig.snippet.randomindexconfig.xml to /configs/conf1/solrconfig.snippet.randomindexconfig.xml
   [junit4]   2> 1729476 INFO  (TEST-DistribDocExpirationUpdateProcessorTest.test-seed#[5A72266DCE952006]) [    ] o.a.s.c.c.SolrZkClient makePath: /configs/conf1/solrconfig.snippet.randomindexconfig.xml
   [junit4]   2> 1729479 INFO  (TEST-DistribDocExpirationUpdateProcessorTest.test-seed#[5A72266DCE952006]) [    ] o.a.s.c.AbstractZkTestCase put /Users/jenkins/workspace/Lucene-Solr-6.x-MacOSX/solr/core/src/test-files/solr/collection1/conf/stopwords.txt to /configs/conf1/stopwords.txt
   [junit4]   2> 1729479 INFO  (TEST-DistribDocExpirationUpdateProcessorTest.test-seed#[5A72266DCE952006]) [    ] o.a.s.c.c.SolrZkClient makePath: /configs/conf1/stopwords.txt
   [junit4]   2> 1729482 INFO  (TEST-DistribDocExpirationUpdateProcessorTest.test-seed#[5A72266DCE952006]) [    ] o.a.s.c.AbstractZkTestCase put /Users/jenkins/workspace/Lucene-Solr-6.x-MacOSX/solr/core/src/test-files/solr/collection1/conf/protwords.txt to /configs/conf1/protwords.txt
   [junit4]   2> 1729482 INFO  (TEST-DistribDocExpirationUpdateProcessorTest.test-seed#[5A72266DCE952006]) [    ] o.a.s.c.c.SolrZkClient makePath: /configs/conf1/protwords.txt
   [junit4]   2> 1729485 INFO  (TEST-DistribDocExpirationUpdateProcessorTest.test-seed#[5A72266DCE952006]) [    ] o.a.s.c.AbstractZkTestCase put /Users/jenkins/workspace/Lucene-Solr-6.x-MacOSX/solr/core/src/test-files/solr/collection1/conf/currency.xml to /configs/conf1/currency.xml
   [junit4]   2> 1729485 INFO  (TEST-DistribDocExpirationUpdateProcessorTest.test-seed#[5A72266DCE952006]) [    ] o.a.s.c.c.SolrZkClient makePath: /configs/conf1/currency.xml
   [junit4]   2> 1729488 INFO  (TEST-DistribDocExpirationUpdateProcessorTest.test-seed#[5A72266DCE952006]) [    ] o.a.s.c.AbstractZkTestCase put /Users/jenkins/workspace/Lucene-Solr-6.x-MacOSX/solr/core/src/test-files/solr/collection1/conf/enumsConfig.xml to /configs/conf1/enumsConfig.xml
   [junit4]   2> 1729488 INFO  (TEST-DistribDocExpirationUpdateProcessorTest.test-seed#[5A72266DCE952006]) [    ] o.a.s.c.c.SolrZkClient makePath: /configs/conf1/enumsConfig.xml
   [junit4]   2> 1729491 INFO  (TEST-DistribDocExpirationUpdateProcessorTest.test-seed#[5A72266DCE952006]) [    ] o.a.s.c.AbstractZkTestCase put /Users/jenkins/workspace/Lucene-Solr-6.x-MacOSX/solr/core/src/test-files/solr/collection1/conf/open-exchange-rates.json to /configs/conf1/open-exchange-rates.json
   [junit4]   2> 1729491 INFO  (TEST-DistribDocExpirationUpdateProcessorTest.test-seed#[5A72266DCE952006]) [    ] o.a.s.c.c.SolrZkClient makePath: /configs/conf1/open-exchange-rates.json
   [junit4]   2> 1729494 INFO  (TEST-DistribDocExpirationUpdateProcessorTest.test-seed#[5A72266DCE952006]) [    ] o.a.s.c.AbstractZkTestCase put /Users/jenkins/workspace/Lucene-Solr-6.x-MacOSX/solr/core/src/test-files/solr/collection1/conf/mapping-ISOLatin1Accent.txt to /configs/conf1/mapping-ISOLatin1Accent.txt
   [junit4]   2> 1729494 INFO  (TEST-DistribDocExpirationUpdateProcessorTest.test-seed#[5A72266DCE952006]) [    ] o.a.s.c.c.SolrZkClient makePath: /configs/conf1/mapping-ISOLatin1Accent.txt
   [junit4]   2> 1729497 INFO  (TEST-DistribDocExpirationUpdateProcessorTest.test-seed#[5A72266DCE952006]) [    ] o.a.s.c.AbstractZkTestCase put /Users/jenkins/workspace/Lucene-Solr-6.x-MacOSX/solr/core/src/test-files/solr/collection1/conf/old_synonyms.txt to /configs/conf1/old_synonyms.txt
   [junit4]   2> 1729497 INFO  (TEST-DistribDocExpirationUpdateProcessorTest.test-seed#[5A72266DCE952006]) [    ] o.a.s.c.c.SolrZkClient makePath: /configs/conf1/old_synonyms.txt
   [junit4]   2> 1729499 INFO  (TEST-DistribDocExpirationUpdateProcessorTest.test-seed#[5A72266DCE952006]) [    ] o.a.s.c.AbstractZkTestCase put /Users/jenkins/workspace/Lucene-Solr-6.x-MacOSX/solr/core/src/test-files/solr/collection1/conf/synonyms.txt to /configs/conf1/synonyms.txt
   [junit4]   2> 1729499 INFO  (TEST-DistribDocExpirationUpdateProcessorTest.test-seed#[5A72266DCE952006]) [    ] o.a.s.c.c.SolrZkClient makePath: /configs/conf1/synonyms.txt
   [junit4]   2> 1729789 INFO  (TEST-DistribDocExpirationUpdateProcessorTest.test-seed#[5A72266DCE952006]) [    ] o.a.s.SolrTestCaseJ4 Writing core.properties file to /Users/jenkins/workspace/Lucene-Solr-6.x-MacOSX/solr/build/solr-core/test/J1/temp/solr.cloud.DistribDocExpirationUpdateProcessorTest_5A72266DCE952006-001/control-001/cores/collection1
   [junit4]   2> 1729792 INFO  (TEST-DistribDocExpirationUpdateProcessorTest.test-seed#[5A72266DCE952006]) [    ] o.e.j.s.Server jetty-9.3.8.v20160314
   [junit4]   2> 1729794 INFO  (TEST-DistribDocExpirationUpdateProcessorTest.test-seed#[5A72266DCE952006]) [    ] o.e.j.s.h.ContextHandler Started o.e.j.s.ServletContextHandler@6a6e1a39{/,null,AVAILABLE}
   [junit4]   2> 1729799 INFO  (TEST-DistribDocExpirationUpdateProcessorTest.test-seed#[5A72266DCE952006]) [    ] o.e.j.s.ServerConnector Started ServerConnector@25c1be2d{HTTP/1.1,[http/1.1]}{127.0.0.1:57311}
   [junit4]   2> 1729799 INFO  (TEST-DistribDocExpirationUpdateProcessorTest.test-seed#[5A72266DCE952006]) [    ] o.e.j.s.Server Started @1735845ms
   [junit4]   2> 1729799 INFO  (TEST-DistribDocExpirationUpdateProcessorTest.test-seed#[5A72266DCE952006]) [    ] o.a.s.c.s.e.JettySolrRunner Jetty properties: {solr.data.dir=/Users/jenkins/workspace/Lucene-Solr-6.x-MacOSX/solr/build/solr-core/test/J1/temp/solr.cloud.DistribDocExpirationUpdateProcessorTest_5A72266DCE952006-001/tempDir-001/control/data, hostContext=/, hostPort=57311, coreRootDirectory=/Users/jenkins/workspace/Lucene-Solr-6.x-MacOSX/solr/build/solr-core/test/J1/../../../../../../../../../Users/jenkins/workspace/Lucene-Solr-6.x-MacOSX/solr/build/solr-core/test/J1/temp/solr.cloud.DistribDocExpirationUpdateProcessorTest_5A72266DCE952006-001/control-001/cores}
   [junit4]   2> 1729800 INFO  (TEST-DistribDocExpirationUpdateProcessorTest.test-seed#[5A72266DCE952006]) [    ] o.a.s.s.SolrDispatchFilter SolrDispatchFilter.init(): sun.misc.Launcher$AppClassLoader@4554617c
   [junit4]   2> 1729800 INFO  (TEST-DistribDocExpirationUpdateProcessorTest.test-seed#[5A72266DCE952006]) [    ] o.a.s.c.SolrResourceLoader new SolrResourceLoader for directory: '/Users/jenkins/workspace/Lucene-Solr-6.x-MacOSX/solr/build/solr-core/test/J1/temp/solr.cloud.DistribDocExpirationUpdateProcessorTest_5A72266DCE952006-001/control-001'
   [junit4]   2> 1729800 INFO  (TEST-DistribDocExpirationUpdateProcessorTest.test-seed#[5A72266DCE952006]) [    ] o.a.s.c.SolrResourceLoader JNDI not configured for solr (NoInitialContextEx)
   [junit4]   2> 1729800 INFO  (TEST-DistribDocExpirationUpdateProcessorTest.test-seed#[5A72266DCE952006]) [    ] o.a.s.c.SolrResourceLoader solr home defaulted to 'solr/' (could not find system property or JNDI)
   [junit4]   2> 1729801 INFO  (TEST-DistribDocExpirationUpdateProcessorTest.test-seed#[5A72266DCE952006]) [    ] o.a.s.c.c.SolrZkClient Using default ZkCredentialsProvider
   [junit4]   2> 1729801 INFO  (TEST-DistribDocExpirationUpdateProcessorTest.test-seed#[5A72266DCE952006]) [    ] o.a.s.c.c.ConnectionManager Waiting for client to connect to ZooKeeper
   [junit4]   2> 1729803 INFO  (zkCallback-2015-thread-1) [    ] o.a.s.c.c.ConnectionManager Watcher org.apache.solr.common.cloud.ConnectionManager@39ca12ae name:ZooKeeperConnection Watcher:127.0.0.1:57308/solr got event WatchedEvent state:SyncConnected type:None path:null path:null type:None
   [junit4]   2> 1729803 INFO  (TEST-DistribDocExpirationUpdateProcessorTest.test-seed#[5A72266DCE952006]) [    ] o.a.s.c.c.ConnectionManager Client is connected to ZooKeeper
   [junit4]   2> 1729803 INFO  (TEST-DistribDocExpirationUpdateProcessorTest.test-seed#[5A72266DCE952006]) [    ] o.a.s.c.c.SolrZkClient Using default ZkACLProvider
   [junit4]   2> 1729805 INFO  (TEST-DistribDocExpirationUpdateProcessorTest.test-seed#[5A72266DCE952006]) [    ] o.a.s.s.SolrDispatchFilter Loading solr.xml from SolrHome (not found in ZooKeeper)
   [junit4]   2> 1729805 INFO  (TEST-DistribDocExpirationUpdateProcessorTest.test-seed#[5A72266DCE952006]) [    ] o.a.s.c.SolrXmlConfig Loading container configuration from /Users/jenkins/workspace/Lucene-Solr-6.x-MacOSX/solr/build/solr-core/test/J1/temp/solr.cloud.DistribDocExpirationUpdateProcessorTest_5A72266DCE952006-001/control-001/solr.xml
   [junit4]   2> 1729811 INFO  (TEST-DistribDocExpirationUpdateProcessorTest.test-seed#[5A72266DCE952006]) [    ] o.a.s.c.CorePropertiesLocator Config-defined core root directory: /Users/jenkins/workspace/Lucene-Solr-6.x-MacOSX/solr/build/solr-core/test/J1/../../../../../../../../../Users/jenkins/workspace/Lucene-Solr-6.x-MacOSX/solr/build/solr-core/test/J1/temp/solr.cloud.DistribDocExpirationUpdateProcessorTest_5A72266DCE952006-001/control-001/cores
   [junit4]   2> 1729811 INFO  (TEST-DistribDocExpirationUpdateProcessorTest.test-seed#[5A72266DCE952006]) [    ] o.a.s.c.CoreContainer New CoreContainer 1967937516
   [junit4]   2> 1729811 INFO  (TEST-DistribDocExpirationUpdateProcessorTest.test-seed#[5A72266DCE952006]) [    ] o.a.s.c.CoreContainer Loading cores into CoreContainer [instanceDir=/Users/jenkins/workspace/Lucene-Solr-6.x-MacOSX/solr/build/solr-core/test/J1/temp/solr.cloud.DistribDocExpirationUpdateProcessorTest_5A72266DCE952006-001/control-001]
   [junit4]   2> 1729812 WARN  (TEST-DistribDocExpirationUpdateProcessorTest.test-seed#[5A72266DCE952006]) [    ] o.a.s.c.CoreContainer Couldn't add files from /Users/jenkins/workspace/Lucene-Solr-6.x-MacOSX/solr/build/solr-core/test/J1/temp/solr.cloud.DistribDocExpirationUpdateProcessorTest_5A72266DCE952006-001/control-001/lib to classpath: /Users/jenkins/workspace/Lucene-Solr-6.x-MacOSX/solr/build/solr-core/test/J1/temp/solr.cloud.DistribDocExpirationUpdateProcessorTest_5A72266DCE952006-001/control-001/lib
   [junit4]   2> 1729813 INFO  (TEST-DistribDocExpirationUpdateProcessorTest.test-seed#[5A72266DCE952006]) [    ] o.a.s.h.c.HttpShardHandlerFactory created with socketTimeout : 90000,urlScheme : ,connTimeout : 15000,maxConnectionsPerHost : 20,maxConnections : 10000,corePoolSize : 0,maximumPoolSize : 2147483647,maxThreadIdleTime : 5,sizeOfQueue : -1,fairnessPolicy : false,useRetries : false,
   [junit4]   2> 1729815 INFO  (TEST-DistribDocExpirationUpdateProcessorTest.test-seed#[5A72266DCE952006]) [    ] o.a.s.u.UpdateShardHandler Creating UpdateShardHandler HTTP client with params: socketTimeout=340000&connTimeout=45000&retry=true
   [junit4]   2> 1729816 INFO  (TEST-DistribDocExpirationUpdateProcessorTest.test-seed#[5A72266DCE952006]) [    ] o.a.s.l.LogWatcher SLF4J impl is org.slf4j.impl.Log4jLoggerFactory
   [junit4]   2> 1729816 INFO  (TEST-DistribDocExpirationUpdateProcessorTest.test-seed#[5A72266DCE952006]) [    ] o.a.s.l.LogWatcher Registering Log Listener [Log4j (org.slf4j.impl.Log4jLoggerFactory)]
   [junit4]   2> 1729816 INFO  (TEST-DistribDocExpirationUpdateProcessorTest.test-seed#[5A72266DCE952006]) [    ] o.a.s.c.ZkContainer Zookeeper client=127.0.0.1:57308/solr
   [junit4]   2> 1729816 INFO  (TEST-DistribDocExpirationUpdateProcessorTest.test-seed#[5A72266DCE952006]) [    ] o.a.s.c.ZkController zkHost includes chroot
   [junit4]   2> 1729816 INFO  (TEST-DistribDocExpirationUpdateProcessorTest.test-seed#[5A72266DCE952006]) [    ] o.a.s.c.c.SolrZkClient Using default ZkCredentialsProvider
   [junit4]   2> 1729817 INFO  (TEST-DistribDocExpirationUpdateProcessorTest.test-seed#[5A72266DCE952006]) [    ] o.a.s.c.c.ConnectionManager Waiting for client to connect to ZooKeeper
   [junit4]   2> 1729818 INFO  (zkCallback-2018-thread-1) [    ] o.a.s.c.c.ConnectionManager Watcher org.apache.solr.common.cloud.ConnectionManager@7b1c8c30 name:ZooKeeperConnection Watcher:127.0.0.1:57308 got event WatchedEvent state:SyncConnected type:None path:null path:null type:None
   [junit4]   2> 1729818 INFO  (TEST-DistribDocExpirationUpdateProcessorTest.test-seed#[5A72266DCE952006]) [    ] o.a.s.c.c.ConnectionManager Client is connected to ZooKeeper
   [junit4]   2> 1729819 INFO  (TEST-DistribDocExpirationUpdateProcessorTest.test-seed#[5A72266DCE952006]) [    ] o.a.s.c.c.SolrZkClient Using default ZkACLProvider
   [junit4]   2> 1729820 INFO  (TEST-DistribDocExpirationUpdateProcessorTest.test-seed#[5A72266DCE952006]) [n:127.0.0.1:57311_    ] o.a.s.c.ZkController Added new OnReconnect listener org.apache.solr.cloud.ZkController$$Lambda$37/1550231481@6bb0d549
   [junit4]   2> 1729821 INFO  (TEST-DistribDocExpirationUpdateProcessorTest.test-seed#[5A72266DCE952006]) [n:127.0.0.1:57311_    ] o.a.s.c.c.ConnectionManager Waiting for client to connect to ZooKeeper
   [junit4]   2> 1729822 INFO  (zkCallback-2019-thread-1-processing-n:127.0.0.1:57311_) [n:127.0.0.1:57311_    ] o.a.s.c.c.ConnectionManager Watcher org.apache.solr.common.cloud.ConnectionManager@7bdfea19 name:ZooKeeperConnection Watcher:127.0.0.1:57308/solr got event WatchedEvent state:SyncConnected type:None path:null path:null type:None
   [junit4]   2> 1729822 INFO  (TEST-DistribDocExpirationUpdateProcessorTest.test-seed#[5A72266DCE952006]) [n:127.0.0.1:57311_    ] o.a.s.c.c.ConnectionManager Client is connected to ZooKeeper
   [junit4]   2> 1729823 INFO  (TEST-DistribDocExpirationUpdateProcessorTest.test-seed#[5A72266DCE952006]) [n:127.0.0.1:57311_    ] o.a.s.c.c.SolrZkClient makePath: /overseer/queue
   [junit4]   2> 1729827 INFO  (TEST-DistribDocExpirationUpdateProcessorTest.test-seed#[5A72266DCE952006]) [n:127.0.0.1:57311_    ] o.a.s.c.c.SolrZkClient makePath: /overseer/collection-queue-work
   [junit4]   2> 1729832 INFO  (TEST-DistribDocExpirationUpdateProcessorTest.test-seed#[5A72266DCE952006]) [n:127.0.0.1:57311_    ] o.a.s.c.c.SolrZkClient makePath: /overseer/collection-map-running
   [junit4]   2> 1729835 INFO  (TEST-DistribDocExpirationUpdateProcessorTest.test-seed#[5A72266DCE952006]) [n:127.0.0.1:57311_    ] o.a.s.c.c.SolrZkClient makePath: /overseer/collection-map-completed
   [junit4]   2> 1729839 INFO  (TEST-DistribDocExpirationUpdateProcessorTest.test-seed#[5A72266DCE952006]) [n:127.0.0.1:57311_    ] o.a.s.c.c.SolrZkClient makePath: /overseer/collection-map-failure
   [junit4]   2> 1729842 INFO  (TEST-DistribDocExpirationUpdateProcessorTest.test-seed#[5A72266DCE952006]) [n:127.0.0.1:57311_    ] o.a.s.c.c.SolrZkClient makePath: /live_nodes
   [junit4]   2> 1729845 INFO  (TEST-DistribDocExpirationUpdateProcessorTest.test-seed#[5A72266DCE952006]) [n:127.0.0.1:57311_    ] o.a.s.c.c.SolrZkClient makePath: /aliases.json
   [junit4]   2> 1729847 INFO  (TEST-DistribDocExpirationUpdateProcessorTest.test-seed#[5A72266DCE952006]) [n:127.0.0.1:57311_    ] o.a.s.c.c.SolrZkClient makePath: /clusterstate.json
   [junit4]   2> 1729849 INFO  (TEST-DistribDocExpirationUpdateProcessorTest.test-seed#[5A72266DCE952006]) [n:127.0.0.1:57311_    ] o.a.s.c.c.SolrZkClient makePath: /security.json
   [junit4]   2> 1729851 INFO  (TEST-DistribDocExpirationUpdateProcessorTest.test-seed#[5A72266DCE952006]) [n:127.0.0.1:57311_    ] o.a.s.c.c.ZkStateReader Updating cluster state from ZooKeeper... 
   [junit4]   2> 1729853 INFO  (TEST-DistribDocExpirationUpdateProcessorTest.test-seed#[5A72266DCE952006]) [n:127.0.0.1:57311_    ] o.a.s.c.c.ZkStateReader Updated live nodes from ZooKeeper... (0) -> (0)
   [junit4]   2> 1729856 INFO  (TEST-DistribDocExpirationUpdateProcessorTest.test-seed#[5A72266DCE952006]) [n:127.0.0.1:57311_    ] o.a.s.c.c.SolrZkClient makePath: /overseer_elect
   [junit4]   2> 1729858 INFO  (TEST-DistribDocExpirationUpdateProcessorTest.test-seed#[5A72266DCE952006]) [n:127.0.0.1:57311_    ] o.a.s.c.c.SolrZkClient makePath: /overseer_elect/election
   [junit4]   2> 1729861 INFO  (TEST-DistribDocExpirationUpdateProcessorTest.test-seed#[5A72266DCE952006]) [n:127.0.0.1:57311_    ] o.a.s.c.Overseer Overseer (id=null) closing
   [junit4]   2> 1729861 INFO  (TEST-DistribDocExpirationUpdateProcessorTest.test-seed#[5A72266DCE952006]) [n:127.0.0.1:57311_    ] o.a.s.c.LeaderElector Joined leadership election with path: /overseer_elect/election/95870813019635716-127.0.0.1:57311_-n_0000000000
   [junit4]   2> 1729862 INFO  (TEST-DistribDocExpirationUpdateProcessorTest.test-seed#[5A72266DCE952006]) [n:127.0.0.1:57311_    ] o.a.s.c.OverseerElectionContext I am going to be the leader 127.0.0.1:57311_
   [junit4]   2> 1729862 INFO  (TEST-DistribDocExpirationUpdateProcessorTest.test-seed#[5A72266DCE952006]) [n:127.0.0.1:57311_    ] o.a.s.c.c.SolrZkClient makePath: /overseer_elect/leader
   [junit4]   2> 1729864 INFO  (TEST-DistribDocExpirationUpdateProcessorTest.test-seed#[5A72266DCE952006]) [n:127.0.0.1:57311_    ] o.a.s.c.Overseer Overseer (id=95870813019635716-127.0.0.1:57311_-n_0000000000) starting
   [junit4]   2> 1729867 INFO  (TEST-DistribDocExpirationUpdateProcessorTest.test-seed#[5A72266DCE952006]) [n:127.0.0.1:57311_    ] o.a.s.c.c.SolrZkClient makePath: /overseer/queue-work
   [junit4]   2> 1729877 INFO  (TEST-DistribDocExpirationUpdateProcessorTest.test-seed#[5A72266DCE952006]) [n:127.0.0.1:57311_    ] o.a.s.c.OverseerAutoReplicaFailoverThread Starting OverseerAutoReplicaFailoverThread autoReplicaFailoverWorkLoopDelay=10000 autoReplicaFailoverWaitAfterExpiration=30000 autoReplicaFailoverBadNodeExpiration=60000
   [junit4]   2> 1729877 INFO  (OverseerCollectionConfigSetProcessor-95870813019635716-127.0.0.1:57311_-n_0000000000) [n:127.0.0.1:57311_    ] o.a.s.c.OverseerTaskProcessor Process current queue of overseer operations
   [junit4]   2> 1729878 INFO  (OverseerStateUpdate-95870813019635716-127.0.0.1:57311_-n_0000000000) [n:127.0.0.1:57311_    ] o.a.s.c.Overseer Starting to work on the main queue
   [junit4]   2> 1729880 INFO  (TEST-DistribDocExpirationUpdateProcessorTest.test-seed#[5A72266DCE952006]) [n:127.0.0.1:57311_    ] o.a.s.c.ZkController Register node as live in ZooKeeper:/live_nodes/127.0.0.1:57311_
   [junit4]   2> 1729881 INFO  (TEST-DistribDocExpirationUpdateProcessorTest.test-seed#[5A72266DCE952006]) [n:127.0.0.1:57311_    ] o.a.s.c.c.SolrZkClient makePath: /live_nodes/127.0.0.1:57311_
   [junit4]   2> 1729882 INFO  (OverseerStateUpdate-95870813019635716-127.0.0.1:57311_-n_0000000000) [n:127.0.0.1:57311_    ] o.a.s.c.c.ZkStateReader Updated live nodes from ZooKeeper... (0) -> (0)
   [junit4]   2> 1729883 INFO  (zkCallback-2019-thread-1-processing-n:127.0.0.1:57311_) [n:127.0.0.1:57311_    ] o.a.s.c.c.ZkStateReader A live node change: [WatchedEvent state:SyncConnected type:NodeChildrenChanged path:/live_nodes], has occurred - updating... (live nodes size: [0])
   [junit4]   2> 1729884 INFO  (zkCallback-2019-thread-1-processing-n:127.0.0.1:57311_) [n:127.0.0.1:57311_    ] o.a.s.c.c.ZkStateReader Updated live nodes from ZooKeeper... (0) -> (1)
   [junit4]   2> 1729898 INFO  (TEST-DistribDocExpirationUpdateProcessorTest.test-seed#[5A72266DCE952006]) [n:127.0.0.1:57311_    ] o.a.s.c.CoreContainer Security conf doesn't exist. Skipping setup for authorization module.
   [junit4]   2> 1729898 INFO  (TEST-DistribDocExpirationUpdateProcessorTest.test-seed#[5A72266DCE952006]) [n:127.0.0.1:57311_    ] o.a.s.c.CoreContainer No authentication plugin used.
   [junit4]   2> 1729899 INFO  (TEST-DistribDocExpirationUpdateProcessorTest.test-seed#[5A72266DCE952006]) [n:127.0.0.1:57311_    ] o.a.s.c.CorePropertiesLocator Looking for core definitions underneath /Users/jenkins/workspace/Lucene-Solr-6.x-MacOSX/solr/build/solr-core/test/J1/../../../../../../../../../Users/jenkins/workspace/Lucene-Solr-6.x-MacOSX/solr/build/solr-core/test/J1/temp/solr.cloud.DistribDocExpirationUpdateProcessorTest_5A72266DCE952006-001/control-001/cores
   [junit4]   2> 1729901 INFO  (TEST-DistribDocExpirationUpdateProcessorTest.test-seed#[5A72266DCE952006]) [n:127.0.0.1:57311_    ] o.a.s.c.CoreDescriptor Created CoreDescriptor: {name=collection1, config=solrconfig.xml, transient=false, schema=schema.xml, loadOnStartup=true, configSetProperties=configsetprops.json, collection=control_collection, coreNodeName=, dataDir=data/, shard=}
   [junit4]   2> 1729901 INFO  (TEST-DistribDocExpirationUpdateProcessorTest.test-seed#[5A72266DCE952006]) [n:127.0.0.1:57311_    ] o.a.s.c.CorePropertiesLocator Found core collection1 in /Users/jenkins/workspace/Lucene-Solr-6.x-MacOSX/solr/build/solr-core/test/J1/../../../../../../../../../Users/jenkins/workspace/Lucene-Solr-6.x-MacOSX/solr/build/solr-core/test/J1/temp/solr.cloud.DistribDocExpirationUpdateProcessorTest_5A72266DCE952006-001/control-001/cores/collection1
   [junit4]   2> 1729901 INFO  (TEST-DistribDocExpirationUpdateProcessorTest.test-seed#[5A72266DCE952006]) [n:127.0.0.1:57311_    ] o.a.s.c.CorePropertiesLocator Found 1 core definitions
   [junit4]   2> 1729903 INFO  (TEST-DistribDocExpirationUpdateProcessorTest.test-seed#[5A72266DCE952006]) [n:127.0.0.1:57311_    ] o.a.s.s.SolrDispatchFilter user.dir=/Users/jenkins/workspace/Lucene-Solr-6.x-MacOSX/solr/build/solr-core/test/J1
   [junit4]   2> 1729903 INFO  (TEST-DistribDocExpirationUpdateProcessorTest.test-seed#[5A72266DCE952006]) [n:127.0.0.1:57311_    ] o.a.s.s.SolrDispatchFilter SolrDispatchFilter.init() done
   [junit4]   2> 1729903 INFO  (coreLoadExecutor-5226-thread-1-processing-n:127.0.0.1:57311_) [n:127.0.0.1:57311_ c:control_collection   x:collection1] o.a.s.c.ZkController publishing state=down
   [junit4]   2> 1729903 INFO  (coreLoadExecutor-5226-thread-1-processing-n:127.0.0.1:57311_) [n:127.0.0.1:57311_ c:control_collection   x:collection1] o.a.s.c.ZkController numShards not found on descriptor - reading it from system property
   [junit4]   2> 1729905 INFO  (coreLoadExecutor-5226-thread-1-processing-n:127.0.0.1:57311_) [n:127.0.0.1:57311_ c:control_collection   x:collection1] o.a.s.c.ZkController Collection control_collection not visible yet, but flagging it so a watch is registered when it becomes visible
   [junit4]   2> 1729905 INFO  (coreLoadExecutor-5226-thread-1-processing-n:127.0.0.1:57311_) [n:127.0.0.1:57311_ c:control_collection   x:collection1] o.a.s.c.c.ZkStateReader addZkWatch [control_collection]
   [junit4]   2> 1729906 INFO  (OverseerStateUpdate-95870813019635716-127.0.0.1:57311_-n_0000000000) [n:127.0.0.1:57311_    ] o.a.s.c.Overseer processMessage: queueSize: 1, message = {
   [junit4]   2>   "core":"collection1",
   [junit4]   2>   "roles":null,
   [junit4]   2>   "base_url":"http://127.0.0.1:57311",
   [junit4]   2>   "node_name":"127.0.0.1:57311_",
   [junit4]   2>   "numShards":"1",
   [junit4]   2>   "state":"down",
   [junit4]   2>   "shard":null,
   [junit4]   2>   "collection":"control_collection",
   [junit4]   2>   "operation":"state"} current state version: 0
   [junit4]   2> 1729906 INFO  (coreLoadExecutor-5226-thread-1-processing-n:127.0.0.1:57311_) [n:127.0.0.1:57311_ c:control_collection   x:collection1] o.a.s.c.c.ZkStateReader Deleting data for [control_collection]
   [junit4]   2> 1729906 INFO  (OverseerStateUpdate-95870813019635716-127.0.0.1:57311_-n_0000000000) [n:127.0.0.1:57311_    ] o.a.s.c.o.ReplicaMutator Update state numShards=1 message={
   [junit4]   2>   "core":"collection1",
   [junit4]   2>   "roles":null,
   [junit4]   2>   "base_url":"http://127.0.0.1:57311",
   [junit4]   2>   "node_name":"127.0.0.1:57311_",
   [junit4]   2>   "numShards":"1",
   [junit4]   2>   "state":"down",
   [junit4]   2>   "shard":null,
   [junit4]   2>   "collection":"control_collection",
   [junit4]   2>   "operation":"state"}
   [junit4]   2> 1729907 INFO  (OverseerStateUpdate-95870813019635716-127.0.0.1:57311_-n_0000000000) [n:127.0.0.1:57311_    ] o.a.s.c.o.ClusterStateMutator building a new cName: control_collection
   [junit4]   2> 1729907 INFO  (coreLoadExecutor-5226-thread-1-processing-n:127.0.0.1:57311_) [n:127.0.0.1:57311_ c:control_collection   x:collection1] o.a.s.c.ZkController look for our core node name
   [junit4]   2> 1729907 INFO  (OverseerStateUpdate-95870813019635716-127.0.0.1:57311_-n_0000000000) [n:127.0.0.1:57311_    ] o.a.s.c.o.ReplicaMutator Assigning new node to shard shard=shard1
   [junit4]   2> 1729910 INFO  (zkCallback-2019-thread-1-processing-n:127.0.0.1:57311_) [n:127.0.0.1:57311_    ] o.a.s.c.c.ZkStateReader A cluster state change: [WatchedEvent state:SyncConnected type:NodeDataChanged path:/clusterstate.json], has occurred - updating... (live nodes size: [1])
   [junit4]   2> 1730908 INFO  (coreLoadExecutor-5226-thread-1-processing-n:127.0.0.1:57311_) [n:127.0.0.1:57311_ c:control_collection   x:collection1] o.a.s.c.ZkController waiting to find shard id in clusterstate for collection1
   [junit4]   2> 1730908 INFO  (coreLoadExecutor-5226-thread-1-processing-n:127.0.0.1:57311_) [n:127.0.0.1:57311_ c:control_collection   x:collection1] o.a.s.c.ZkController Check for collection zkNode:control_collection
   [junit4]   2> 1730909 INFO  (coreLoadExecutor-5226-thread-1-processing-n:127.0.0.1:57311_) [n:127.0.0.1:57311_ c:control_collection   x:collection1] o.a.s.c.ZkController Collection zkNode exists
   [junit4]   2> 1730909 INFO  (coreLoadExecutor-5226-thread-1-processing-n:127.0.0.1:57311_) [n:127.0.0.1:57311_ c:control_collection   x:collection1] o.a.s.c.c.ZkStateReader Load collection config from: [/collections/control_collection]
   [junit4]   2> 1730910 INFO  (coreLoadExecutor-5226-thread-1-processing-n:127.0.0.1:57311_) [n:127.0.0.1:57311_ c:control_collection   x:collection1] o.a.s.c.c.ZkStateReader path=[/collections/control_collection] [configName]=[conf1] specified config exists in ZooKeeper
   [junit4]   2> 1730910 INFO  (coreLoadExecutor-5226-thread-1-processing-n:127.0.0.1:57311_) [n:127.0.0.1:57311_ c:control_collection   x:collection1] o.a.s.c.SolrResourceLoader new SolrResourceLoader for directory: '/Users/jenkins/workspace/Lucene-Solr-6.x-MacOSX/solr/build/solr-core/test/J1/temp/solr.cloud.DistribDocExpirationUpdateProcessorTest_5A72266DCE952006-001/control-001/cores/collection1'
   [junit4]   2> 1730910 INFO  (coreLoadExecutor-5226-thread-1-processing-n:127.0.0.1:57311_) [n:127.0.0.1:57311_ c:control_collection   x:collection1] o.a.s.c.SolrResourceLoader JNDI not configured for solr (NoInitialContextEx)
   [junit4]   2> 1730910 INFO  (coreLoadExecutor-5226-thread-1-processing-n:127.0.0.1:57311_) [n:127.0.0.1:57311_ c:control_collection   x:collection1] o.a.s.c.SolrResourceLoader solr home defaulted to 'solr/' (could not find system property or JNDI)
   [junit4]   2> 1730912 INFO  (coreLoadExecutor-5226-thread-1-processing-n:127.0.0.1:57311_) [n:127.0.0.1:57311_ c:control_collection   x:collection1] o.a.s.c.Config loaded config solrconfig.xml with version 0 
   [junit4]   2> 1730919 INFO  (coreLoadExecutor-5226-thread-1-processing-n:127.0.0.1:57311_) [n:127.0.0.1:57311_ c:control_collection   x:collection1] o.a.s.c.SolrConfig current version of requestparams : -1
   [junit4]   2> 1730921 WARN  (coreLoadExecutor-5226-thread-1-processing-n:127.0.0.1:57311_) [n:127.0.0.1:57311_ c:control_collection   x:collection1] o.a.s.c.Config Beginning with Solr 5.5, <mergePolicy> is deprecated, use <mergePolicyFactory> instead.
   [junit4]   2> 1730922 INFO  (coreLoadExecutor-5226-thread-1-processing-n:127.0.0.1:57311_) [n:127.0.0.1:57311_ c:control_collection   x:collection1] o.a.s.c.SolrConfig Using Lucene MatchVersion: 6.1.0
   [junit4]   2> 1730926 INFO  (coreLoadExecutor-5226-thread-1-processing-n:127.0.0.1:57311_) [n:127.0.0.1:57311_ c:control_collection   x:collection1] o.a.s.c.SolrConfig Loaded SolrConfig: solrconfig.xml
   [junit4]   2> 1730931 INFO  (coreLoadExecutor-5226-thread-1-processing-n:127.0.0.1:57311_) [n:127.0.0.1:57311_ c:control_collection   x:collection1] o.a.s.s.IndexSchema [collection1] Schema name=test
   [junit4]   2> 1731003 INFO  (coreLoadExecutor-5226-thread-1-processing-n:127.0.0.1:57311_) [n:127.0.0.1:57311_ c:control_collection   x:collection1] o.a.s.s.IndexSchema default search field in schema is text
   [junit4]   2> 1731004 INFO  (coreLoadExecutor-5226-thread-1-processing-n:127.0.0.1:57311_) [n:127.0.0.1:57311_ c:control_collection   x:collection1] o.a.s.s.IndexSchema unique key field: id
   [junit4]   2> 1731005 INFO  (coreLoadExecutor-5226-thread-1-processing-n:127.0.0.1:57311_) [n:127.0.0.1:57311_ c:control_collection   x:collection1] o.a.s.s.FileExchangeRateProvider Reloading exchange rates from file currency.xml
   [junit4]   2> 1731007 INFO  (coreLoadExecutor-5226-thread-1-processing-n:127.0.0.1:57311_) [n:127.0.0.1:57311_ c:control_collection   x:collection1] o.a.s.s.FileExchangeRateProvider Reloading exchange rates from file currency.xml
   [junit4]   2> 1731035 INFO  (coreLoadExecutor-5226-thread-1-processing-n:127.0.0.1:57311_) [n:127.0.0.1:57311_ c:control_collection   x:collection1] o.a.s.c.ConfigSetProperties Did not find ConfigSet properties, assuming default properties: Can't find resource 'configsetprops.json' in classpath or '/configs/conf1', cwd=/Users/jenkins/workspace/Lucene-Solr-6.x-MacOSX/solr/build/solr-core/test/J1
   [junit4]   2> 1731035 INFO  (coreLoadExecutor-5226-thread-1-processing-n:127.0.0.1:57311_) [n:127.0.0.1:57311_ c:control_collection   x:collection1] o.a.s.c.CoreContainer Creating SolrCore 'collection1' using configuration from collection control_collection
   [junit4]   2> 1731035 INFO  (coreLoadExecutor-5226-thread-1-processing-n:127.0.0.1:57311_) [n:127.0.0.1:57311_ c:control_collection s:shard1 r:core_node1 x:collection1] o.a.s.c.SolrCore org.apache.solr.core.MockDirectoryFactory
   [junit4]   2> 1731035 INFO  (coreLoadExecutor-5226-thread-1-processing-n:127.0.0.1:57311_) [n:127.0.0.1:57311_ c:control_collection s:shard1 r:core_node1 x:collection1] o.a.s.c.SolrCore [[collection1] ] Opening new SolrCore at [/Users/jenkins/workspace/Lucene-Solr-6.x-MacOSX/solr/build/solr-core/test/J1/temp/solr.cloud.DistribDocExpirationUpdateProcessorTest_5A72266DCE952006-001/control-001/cores/collection1], dataDir=[/Users/jenkins/workspace/Lucene-Solr-6.x-MacOSX/solr/build/solr-core/test/J1/../../../../../../../../../Users/jenkins/workspace/Lucene-Solr-6.x-MacOSX/solr/build/solr-core/test/J1/temp/solr.cloud.DistribDocExpirationUpdateProcessorTest_5A72266DCE952006-001/control-001/cores/collection1/data/]
   [junit4]   2> 1731035 INFO  (coreLoadExecutor-5226-thread-1-processing-n:127.0.0.1:57311_) [n:127.0.0.1:57311_ c:control_collection s:shard1 r:core_node1 x:collection1] o.a.s.c.SolrCore JMX monitoring not detected for core: collection1
   [junit4]   2> 1731036 INFO  (coreLoadExecutor-5226-thread-1-processing-n:127.0.0.1:57311_) [n:127.0.0.1:57311_ c:control_collection s:shard1 r:core_node1 x:collection1] o.a.s.c.CachingDirectoryFactory return new directory for /Users/jenkins/workspace/Lucene-Solr-6.x-MacOSX/solr/build/solr-core/test/J1/../../../../../../../../../Users/jenkins/workspace/Lucene-Solr-6.x-MacOSX/solr/build/solr-core/test/J1/temp/solr.cloud.DistribDocExpirationUpdateProcessorTest_5A72266DCE952006-001/control-001/cores/collection1/data
   [junit4]   2> 1731036 INFO  (coreLoadExecutor-5226-thread-1-processing-n:127.0.0.1:57311_) [n:127.0.0.1:57311_ c:control_collection s:shard1 r:core_node1 x:collection1] o.a.s.c.SolrCore New index directory detected: old=null new=/Users/jenkins/workspace/Lucene-Solr-6.x-MacOSX/solr/build/solr-core/test/J1/../../../../../../../../../Users/jenkins/workspace/Lucene-Solr-6.x-MacOSX/solr/build/solr-core/test/J1/temp/solr.cloud.DistribDocExpirationUpdateProcessorTest_5A72266DCE952006-001/control-001/cores/collection1/data/index/
   [junit4]   2> 1731036 WARN  (coreLoadExecutor-5226-thread-1-processing-n:127.0.0.1:57311_) [n:127.0.0.1:57311_ c:control_collection s:shard1 r:core_node1 x:collection1] o.a.s.c.SolrCore [collection1] Solr index directory '/Users/jenkins/workspace/Lucene-Solr-6.x-MacOSX/solr/build/solr-core/test/J1/../../../../../../../../../Users/jenkins/workspace/Lucene-Solr-6.x-MacOSX/solr/build/solr-core/test/J1/temp/solr.cloud.DistribDocExpirationUpdateProcessorTest_5A72266DCE952006-001/control-001/cores/collection1/data/index' doesn't exist. Creating new index...
   [junit4]   2> 1731036 INFO  (coreLoadExecutor-5226-thread-1-processing-n:127.0.0.1:57311_) [n:127.0.0.1:57311_ c:control_collection s:shard1 r:core_node1 x:collection1] o.a.s.c.CachingDirectoryFactory return new directory for /Users/jenkins/workspace/Lucene-Solr-6.x-MacOSX/solr/build/solr-core/test/J1/../../../../../../../../../Users/jenkins/workspace/Lucene-Solr-6.x-MacOSX/solr/build/solr-core/test/J1/temp/solr.cloud.DistribDocExpirationUpdateProcessorTest_5A72266DCE952006-001/control-001/cores/collection1/data/index
   [junit4]   2> 1731036 INFO  (coreLoadExecutor-5226-thread-1-processing-n:127.0.0.1:57311_) [n:127.0.0.1:57311_ c:control_collection s:shard1 r:core_node1 x:collection1] o.a.s.u.RandomMergePolicy RandomMergePolicy wrapping class org.apache.lucene.index.TieredMergePolicy: [TieredMergePolicy: maxMergeAtOnce=35, maxMergeAtOnceExplicit=50, maxMergedSegmentMB=56.6005859375, floorSegmentMB=1.5205078125, forceMergeDeletesPctAllowed=5.227705027355681, segmentsPerTier=40.0, maxCFSSegmentSizeMB=8.796093022207999E12, noCFSRatio=0.6689789404458131
   [junit4]   2> 1731039 INFO  (coreLoadExecutor-5226-thread-1-processing-n:127.0.0.1:57311_) [n:127.0.0.1:57311_ c:control_collection s:shard1 r:core_node1 x:collection1] o.a.s.c.SolrDeletionPolicy SolrDeletionPolicy.onCommit: commits: num=1
   [junit4]   2> 	commit{dir=MockDirectoryWrapper(RAMDirectory@63e342cd lockFactory=org.apache.lucene.store.SingleInstanceLockFactory@25975183),segFN=segments_1,generation=1}
   [junit4]   2> 1731039 INFO  (coreLoadExecutor-5226-thread-1-processing-n:127.0.0.1:57311_) [n:127.0.0.1:57311_ c:control_collection s:shard1 r:core_node1 x:collection1] o.a.s.c.SolrDeletionPolicy newest commit generation = 1
   [junit4]   2> 1731039 INFO  (OldIndexDirectoryCleanupThreadForCore-collection1) [n:127.0.0.1:57311_ c:control_collection s:shard1 r:core_node1 x:collection1] o.a.s.c.SolrCore Looking for old index directories to cleanup for core collection1 in /Users/jenkins/workspace/Lucene-Solr-6.x-MacOSX/solr/build/solr-core/test/J1/../../../../../../../../../Users/jenkins/workspace/Lucene-Solr-6.x-MacOSX/solr/build/solr-core/test/J1/temp/solr.cloud.DistribDocExpirationUpdateProcessorTest_5A72266DCE952006-001/control-001/cores/collection1/data/
   [junit4]   2> 1731040 WARN  (OldIndexDirectoryCleanupThreadForCore-collection1) [n:127.0.0.1:57311_ c:control_collection s:shard1 r:core_node1 x:collection1] o.a.s.c.DirectoryFactory /Users/jenkins/workspace/Lucene-Solr-6.x-MacOSX/solr/build/solr-core/test/J1/../../../../../../../../../Users/jenkins/workspace/Lucene-Solr-6.x-MacOSX/solr/build/solr-core/test/J1/temp/solr.cloud.DistribDocExpirationUpdateProcessorTest_5A72266DCE952006-001/control-001/cores/collection1/data/ does not point to a valid data directory; skipping clean-up of old index directories.
   [junit4]   2> 1731041 INFO  (coreLoadExecutor-5226-thread-1-processing-n:127.0.0.1:57311_) [n:127.0.0.1:57311_ c:control_collection s:shard1 r:core_node1 x:collection1] o.a.s.u.p.UpdateRequestProcessorChain creating updateRequestProcessorChain "convert-ttl-defaults"
   [junit4]   2> 1731098 INFO  (coreLoadExecutor-5226-thread-1-processing-n:127.0.0.1:57311_) [n:127.0.0.1:57311_ c:control_collection s:shard1 r:core_node1 x:collection1] o.a.s.u.p.UpdateRequestProcessorChain creating updateRequestProcessorChain "convert-ttl-field"
   [junit4]   2> 1731098 INFO  (coreLoadExecutor-5226-thread-1-processing-n:127.0.0.1:57311_) [n:127.0.0.1:57311_ c:control_collection s:shard1 r:core_node1 x:collection1] o.a.s.u.p.UpdateRequestProcessorChain creating updateRequestProcessorChain "convert-ttl-param"
   [junit4]   2> 1731098 INFO  (coreLoadExecutor-5226-thread-1-processing-n:127.0.0.1:57311_) [n:127.0.0.1:57311_ c:control_collection s:shard1 r:core_node1 x:collection1] o.a.s.u.p.UpdateRequestProcessorChain creating updateRequestProcessorChain "convert-ttl-field-with-param-default"
   [junit4]   2> 1731098 INFO  (coreLoadExecutor-5226-thread-1-processing-n:127.0.0.1:57311_) [n:127.0.0.1:57311_ c:control_collection s:shard1 r:core_node1 x:collection1] o.a.s.u.p.UpdateRequestProcessorChain creating updateRequestProcessorChain "scheduled-delete" (default)
   [junit4]   2> 1731152 INFO  (coreLoadExecutor-5226-thread-1-processing-n:127.0.0.1:57311_) [n:127.0.0.1:57311_ c:control_collection s:shard1 r:core_node1 x:collection1] o.a.s.u.p.UpdateRequestProcessorChain inserting DistributedUpdateProcessorFactory into updateRequestProcessorChain "scheduled-delete" (default)
   [junit4]   2> 1731158 INFO  (coreLoadExecutor-5226-thread-1-processing-n:127.0.0.1:57311_) [n:127.0.0.1:57311_ c:control_collection s:shard1 r:core_node1 x:collection1] o.a.s.h.l.XMLLoader xsltCacheLifetimeSeconds=60
   [junit4]   2> 1731159 INFO  (coreLoadExecutor-5226-thread-1-processing-n:127.0.0.1:57311_) [n:127.0.0.1:57311_ c:control_collection s:shard1 r:core_node1 x:collection1] o.a.s.h.l.XMLLoader xsltCacheLifetimeSeconds=60
   [junit4]   2> 1731159 INFO  (coreLoadExecutor-5226-thread-1-processing-n:127.0.0.1:57311_) [n:127.0.0.1:57311_ c:control_collection s:shard1 r:core_node1 x:collection1] o.a.s.h.l.XMLLoader xsltCacheLifetimeSeconds=60
   [junit4]   2> 1731160 INFO  (coreLoadExecutor-5226-thread-1-processing-n:127.0.0.1:57311_) [n:127.0.0.1:57311_ c:control_collection s:shard1 r:core_node1 x:collection1] o.a.s.h.l.XMLLoader xsltCacheLifetimeSeconds=60
   [junit4]   2> 1731606 INFO  (coreLoadExecutor-5226-thread-1-processing-n:127.0.0.1:57311_) [n:127.0.0.1:57311_ c:control_collection s:shard1 r:core_node1 x:collection1] o.a.s.c.RequestHandlers Registered paths: /admin/mbeans,,/update/json/docs,/admin/luke,/export,/get,/admin/properties,/update/json,/admin/threads,/update/csv,/sql,/graph,/select,/admin/segments,/admin/system,/replication,/config,/stream,/schema,/admin/plugins,/admin/logging,/admin/ping,/update,/admin/file
   [junit4]   2> 1731606 INFO  (coreLoadExecutor-5226-thread-1-processing-n:127.0.0.1:57311_) [n:127.0.0.1:57311_ c:control_collection s:shard1 r:core_node1 x:collection1] o.a.s.c.SolrCore Using default statsCache cache: org.apache.solr.search.stats.LocalStatsCache
   [junit4]   2> 1731607 INFO  (coreLoadExecutor-5226-thread-1-processing-n:127.0.0.1:57311_) [n:127.0.0.1:57311_ c:control_collection s:shard1 r:core_node1 x:collection1] o.a.s.u.UpdateHandler Using UpdateLog implementation: org.apache.solr.update.UpdateLog
   [junit4]   2> 1731607 INFO  (coreLoadExecutor-5226-thread-1-processing-n:127.0.0.1:57311_) [n:127.0.0.1:57311_ c:control_collection s:shard1 r:core_node1 x:collection1] o.a.s.u.UpdateLog Initializing UpdateLog: dataDir= defaultSyncLevel=FLUSH numRecordsToKeep=100 maxNumLogsToKeep=10 numVersionBuckets=65536
   [junit4]   2> 1731608 INFO  (coreLoadExecutor-5226-thread-1-processing-n:127.0.0.1:57311_) [n:127.0.0.1:57311_ c:control_collection s:shard1 r:core_node1 x:collection1] o.a.s.u.CommitTracker Hard AutoCommit: disabled
   [junit4]   2> 1731608 INFO  (coreLoadExecutor-5226-thread-1-processing-n:127.0.0.1:57311_) [n:127.0.0.1:57311_ c:control_collection s:shard1 r:core_node1 x:collection1] o.a.s.u.CommitTracker Soft AutoCommit: disabled
   [junit4]   2> 1731608 INFO  (coreLoadExecutor-5226-thread-1-processing-n:127.0.0.1:57311_) [n:127.0.0.1:57311_ c:control_collection s:shard1 r:core_node1 x:collection1] o.a.s.u.RandomMergePolicy RandomMergePolicy wrapping class org.apache.lucene.index.LogDocMergePolicy: [LogDocMergePolicy: minMergeSize=1000, mergeFactor=41, maxMergeSize=9223372036854775807, maxMergeSizeForForcedMerge=9223372036854775807, calibrateSizeByDeletes=false, maxMergeDocs=2147483647, maxCFSSegmentSizeMB=8.796093022207999E12, noCFSRatio=0.5816209111693084]
   [junit4]   2> 1731608 INFO  (coreLoadExecutor-5226-thread-1-processing-n:127.0.0.1:57311_) [n:127.0.0.1:57311_ c:control_collection s:shard1 r:core_node1 x:collection1] o.a.s.c.SolrDeletionPolicy SolrDeletionPolicy.onInit: commits: num=1
   [junit4]   2> 	commit{dir=MockDirectoryWrapper(RAMDirectory@63e342cd lockFactory=org.apache.lucene.store.SingleInstanceLockFactory@25975183),segFN=segments_1,generation=1}
   [junit4]   2> 1731608 INFO  (coreLoadExecutor-5226-thread-1-processing-n:127.0.0.1:57311_) [n:127.0.0.1:57311_ c:control_collection s:shard1 r:core_node1 x:collection1] o.a.s.c.SolrDeletionPolicy newest commit generation = 1
   [junit4]   2> 1731608 INFO  (coreLoadExecutor-5226-thread-1-processing-n:127.0.0.1:57311_) [n:127.0.0.1:57311_ c:control_collection s:shard1 r:core_node1 x:collection1] o.a.s.s.SolrIndexSearcher Opening [Searcher@2cb484ed[collection1] main]
   [junit4]   2> 1731608 INFO  (coreLoadExecutor-5226-thread-1-processing-n:127.0.0.1:57311_) [n:127.0.0.1:57311_ c:control_collection s:shard1 r:core_node1 x:collection1] o.a.s.c.c.ZkStateReader Load collection config from: [/collections/control_collection]
   [junit4]   2> 1731608 INFO  (coreLoadExecutor-5226-thread-1-processing-n:127.0.0.1:57311_) [n:127.0.0.1:57311_ c:control_collection s:shard1 r:core_node1 x:collection1] o.a.s.c.c.ZkStateReader path=[/collections/control_collection] [configName]=[conf1] specified config exists in ZooKeeper
   [junit4]   2> 1731608 INFO  (coreLoadExecutor-5226-thread-1-processing-n:127.0.0.1:57311_) [n:127.0.0.1:57311_ c:control_collection s:shard1 r:core_node1 x:collection1] o.a.s.r.ManagedResourceStorage Setting up ZooKeeper-based storage for the RestManager with znodeBase: /configs/conf1
   [junit4]   2> 1731608 INFO  (coreLoadExecutor-5226-thread-1-processing-n:127.0.0.1:57311_) [n:127.0.0.1:57311_ c:control_collection s:shard1 r:core_node1 x:collection1] o.a.s.r.ManagedResourceStorage Configured ZooKeeperStorageIO with znodeBase: /configs/conf1
   [junit4]   2> 1731608 INFO  (coreLoadExecutor-5226-thread-1-processing-n:127.0.0.1:57311_) [n:127.0.0.1:57311_ c:control_collection s:shard1 r:core_node1 x:collection1] o.a.s.r.RestManager Initializing RestManager with initArgs: {}
   [junit4]   2> 1731611 INFO  (coreLoadExecutor-5226-thread-1-processing-n:127.0.0.1:57311_) [n:127.0.0.1:57311_ c:control_collection s:shard1 r:core_node1 x:collection1] o.a.s.r.ManagedResourceStorage Reading _rest_managed.json using ZooKeeperStorageIO:path=/configs/conf1
   [junit4]   2> 1731613 INFO  (coreLoadExecutor-5226-thread-1-processing-n:127.0.0.1:57311_) [n:127.0.0.1:57311_ c:control_collection s:shard1 r:core_node1 x:collection1] o.a.s.r.ManagedResourceStorage No data found for znode /configs/conf1/_rest_managed.json
   [junit4]   2> 1731613 INFO  (coreLoadExecutor-5226-thread-1-processing-n:127.0.0.1:57311_) [n:127.0.0.1:57311_ c:control_collection s:shard1 r:core_node1 x:collection1] o.a.s.r.ManagedResourceStorage Loaded null at path _rest_managed.json using ZooKeeperStorageIO:path=/configs/conf1
   [junit4]   2> 1731614 INFO  (coreLoadExecutor-5226-thread-1-processing-n:127.0.0.1:57311_) [n:127.0.0.1:57311_ c:control_collection s:shard1 r:core_node1 x:collection1] o.a.s.r.RestManager Initializing 0 registered ManagedResources
   [junit4]   2> 1731626 INFO  (coreLoadExecutor-5226-thread-1-processing-n:127.0.0.1:57311_) [n:127.0.0.1:57311_ c:control_collection s:shard1 r:core_node1 x:collection1] o.a.s.h.ReplicationHandler Commits will be reserved for  10000
   [junit4]   2> 1731626 INFO  (coreLoadExecutor-5226-thread-1-processing-n:127.0.0.1:57311_) [n:127.0.0.1:57311_ c:control_collection s:shard1 r:core_node1 x:collection1] o.a.s.u.UpdateLog Looking up max value of version field to seed version buckets
   [junit4]   2> 1731626 INFO  (searcherExecutor-5227-thread-1-processing-n:127.0.0.1:57311_ x:collection1 s:shard1 c:control_collection r:core_node1) [n:127.0.0.1:57311_ c:control_collection s:shard1 r:core_node1 x:collection1] o.a.s.c.SolrCore [collection1] Registered new searcher Searcher@2cb484ed[collection1] main{ExitableDirectoryReader(UninvertingDirectoryReader())}
   [junit4]   2> 1731626 INFO  (coreLoadExecutor-5226-thread-1-processing-n:127.0.0.1:57311_) [n:127.0.0.1:57311_ c:control_collection s:shard1 r:core_node1 x:collection1] o.a.s.u.VersionInfo Refreshing highest value of _version_ for 65536 version buckets from index
   [junit4]   2> 1731626 INFO  (coreLoadExecutor-5226-thread-1-processing-n:127.0.0.1:57311_) [n:127.0.0.1:57311_ c:control_collection s:shard1 r:core_node1 x:collection1] o.a.s.u.VersionInfo No terms found for _version_, cannot seed version bucket highest value from index
   [junit4]   2> 1731626 INFO  (coreLoadExecutor-5226-thread-1-processing-n:127.0.0.1:57311_) [n:127.0.0.1:57311_ c:control_collection s:shard1 r:core_node1 x:collection1] o.a.s.u.UpdateLog Could not find max version in index or recent updates, using new clock 1533933010705973248
   [junit4]   2> 1731628 INFO  (coreLoadExecutor-5226-thread-1-processing-n:127.0.0.1:57311_) [n:127.0.0.1:57311_ c:control_collection s:shard1 r:core_node1 x:collection1] o.a.s.u.UpdateLog Took 1.0ms to seed version buckets with highest version 1533933010705973248
   [junit4]   2> 1731628 INFO  (coreLoadExecutor-5226-thread-1-processing-n:127.0.0.1:57311_) [n:127.0.0.1:57311_ c:control_collection s:shard1 r:core_node1 x:collection1] o.a.s.c.ZkController watch zkdir /configs/conf1
   [junit4]   2> 1731629 INFO  (coreLoadExecutor-5226-thread-1-processing-n:127.0.0.1:57311_) [n:127.0.0.1:57311_ c:control_collection s:shard1 r:core_node1 x:collection1] o.a.s.c.CoreContainer registering core: collection1
   [junit4]   2> 1731629 INFO  (coreZkRegister-5220-thread-1-processing-n:127.0.0.1:57311_ x:collection1 s:shard1 c:control_collection r:core_node1) [n:127.0.0.1:57311_ c:control_collection s:shard1 r:core_node1 x:collection1] o.a.s.c.ZkController Register replica - core:collection1 address:http://127.0.0.1:57311 collection:control_collection shard:shard1
   [junit4]   2> 1731631 INFO  (coreZkRegister-5220-thread-1-processing-n:127.0.0.1:57311_ x:collection1 s:shard1 c:control_collection r:core_node1) [n:127.0.0.1:57311_ c:control_collection s:shard1 r:core_node1 x:collection1] o.a.s.c.c.SolrZkClient makePath: /collections/control_collection/leader_elect/shard1/election
   [junit4]   2> 1731637 INFO  (coreZkRegister-5220-thread-1-processing-n:127.0.0.1:57311_ x:collection1 s:shard1 c:control_collection r:core_node1) [n:127.0.0.1:57311_ c:control_collection s:shard1 r:core_node1 x:collection1] o.a.s.c.LeaderElector Joined leadership election with path: /collections/control_collection/leader_elect/shard1/election/95870813019635716-core_node1-n_0000000000
   [junit4]   2> 1731638 INFO  (coreZkRegister-5220-thread-1-processing-n:127.0.0.1:57311_ x:collection1 s:shard1 c:control_collection r:core_node1) [n:127.0.0.1:57311_ c:control_collection s:shard1 r:core_node1 x:collection1] o.a.s.c.ShardLeaderElectionContext Running the leader process for shard=shard1 and weAreReplacement=false and leaderVoteWait=10000
   [junit4]   2> 1731640 INFO  (coreZkRegister-5220-thread-1-processing-n:127.0.0.1:57311_ x:collection1 s:shard1 c:control_collection r:core_node1) [n:127.0.0.1:57311_ c:control_collection s:shard1 r:core_node1 x:collection1] o.a.s.c.ShardLeaderElectionContext Enough replicas found to continue.
   [junit4]   2> 1731640 INFO  (coreZkRegister-5220-thread-1-processing-n:127.0.0.1:57311_ x:collection1 s:shard1 c:control_collection r:core_node1) [n:127.0.0.1:57311_ c:control_collection s:shard1 r:core_node1 x:collection1] o.a.s.c.ShardLeaderElectionContext I may be the new leader - try and sync
   [junit4]   2> 1731641 INFO  (coreZkRegister-5220-thread-1-processing-n:127.0.0.1:57311_ x:collection1 s:shard1 c:control_collection r:core_node1) [n:127.0.0.1:57311_ c:control_collection s:shard1 r:core_node1 x:collection1] o.a.s.c.SyncStrategy Sync replicas to http://127.0.0.1:57311/collection1/
   [junit4]   2> 1731641 INFO  (coreZkRegister-5220-thread-1-processing-n:127.0.0.1:57311_ x:collection1 s:shard1 c:control_collection r:core_node1) [n:127.0.0.1:57311_ c:control_collection s:shard1 r:core_node1 x:collection1] o.a.s.c.SyncStrategy Sync Success - now sync replicas to me
   [junit4]   2> 1731641 INFO  (coreZkRegister-5220-thread-1-processing-n:127.0.0.1:57311_ x:collection1 s:shard1 c:control_collection r:core_node1) [n:127.0.0.1:57311_ c:control_collection s:shard1 r:core_node1 x:collection1] o.a.s.c.SyncStrategy http://127.0.0.1:57311/collection1/ has no replicas
   [junit4]   2> 1731641 INFO  (OverseerStateUpdate-95870813019635716-127.0.0.1:57311_-n_0000000000) [n:127.0.0.1:57311_    ] o.a.s.c.Overseer processMessage: queueSize: 1, message = {
   [junit4]   2>   "operation":"leader",
   [junit4]   2>   "shard":"shard1",
   [junit4]   2>   "collection":"control_collection"} current state version: 1
   [junit4]   2> 1731642 INFO  (coreZkRegister-5220-thread-1-processing-n:127.0.0.1:57311_ x:collection1 s:shard1 c:control_collection r:core_node1) [n:127.0.0.1:57311_ c:control_collection s:shard1 r:core_node1 x:collection1] o.a.s.c.c.SolrZkClient makePath: /collections/control_collection/leaders/shard1
   [junit4]   2> 1731643 INFO  (zkCallback-2019-thread-1-processing-n:127.0.0.1:57311_) [n:127.0.0.1:57311_    ] o.a.s.c.c.ZkStateReader A cluster state change: [WatchedEvent state:SyncConnected type:NodeDataChanged path:/clusterstate.json], has occurred - updating... (live nodes size: [1])
   [junit4]   2> 1731648 INFO  (coreZkRegister-5220-thread-1-processing-n:127.0.0.1:57311_ x:collection1 s:shard1 c:control_collection r:core_node1) [n:127.0.0.1:57311_ c:control_collection s:shard1 r:core_node1 x:collection1] o.a.s.c.ShardLeaderElectionContextBase Creating leader registration node /collections/control_collection/leaders/shard1/leader after winning as /collections/control_collection/leader_elect/shard1/election/95870813019635716-core_node1-n_0000000000
   [junit4]   2> 1731651 INFO  (coreZkRegister-5220-thread-1-processing-n:127.0.0.1:57311_ x:collection1 s:shard1 c:control_collection r:core_node1) [n:127.0.0.1:57311_ c:control_collection s:shard1 r:core_node1 x:collection1] o.a.s.c.ShardLeaderElectionContext I am the new leader: http://127.0.0.1:57311/collection1/ shard1
   [junit4]   2> 1731652 INFO  (OverseerStateUpdate-95870813019635716-127.0.0.1:57311_-n_0000000000) [n:127.0.0.1:57311_    ] o.a.s.c.Overseer processMessage: queueSize: 1, message = {
   [junit4]   2>   "operation":"leader",
   [junit4]   2>   "shard":"shard1",
   [junit4]   2>   "collection":"control_collection",
   [junit4]   2>   "base_url":"http://127.0.0.1:57311",
   [junit4]   2>   "core":"collection1",
   [junit4]   2>   "state":"active"} current state version: 2
   [junit4]   2> 1731758 INFO  (zkCallback-2019-thread-1-processing-n:127.0.0.1:57311_) [n:127.0.0.1:57311_    ] o.a.s.c.c.ZkStateReader A cluster state change: [WatchedEvent state:SyncConnected type:NodeDataChanged path:/clusterstate.json], has occurred - updating... (live nodes size: [1])
   [junit4]   2> 1731770 INFO  (coreZkRegister-5220-thread-1-processing-n:127.0.0.1:57311_ x:collection1 s:shard1 c:control_collection r:core_node1) [n:127.0.0.1:57311_ c:control_collection s:shard1 r:core_node1 x:collection1] o.a.s.c.ZkController We are http://127.0.0.1:57311/collection1/ and leader is http://127.0.0.1:57311/collection1/
   [junit4]   2> 1731770 INFO  (coreZkRegister-5220-thread-1-processing-n:127.0.0.1:57311_ x:collection1 s:shard1 c:control_collection r:core_node1) [n:127.0.0.1:57311_ c:control_collection s:shard1 r:core_node1 x:collection1] o.a.s.c.ZkController No LogReplay needed for core=collection1 baseURL=http://127.0.0.1:57311
   [junit4]   2> 1731770 INFO  (coreZkRegister-5220-thread-1-processing-n:127.0.0.1:57311_ x:collection1 s:shard1 c:control_collection r:core_node1) [n:127.0.0.1:57311_ c:control_collection s:shard1 r:core_node1 x:collection1] o.a.s.c.ZkController I am the leader, no recovery necessary
   [junit4]   2> 1731770 INFO  (coreZkRegister-5220-thread-1-processing-n:127.0.0.1:57311_ x:collection1 s:shard1 c:control_collection r:core_node1) [n:127.0.0.1:57311_ c:control_collection s:shard1 r:core_node1 x:collection1] o.a.s.c.ZkController publishing state=active
   [junit4]   2> 1731770 INFO  (coreZkRegister-5220-thread-1-processing-n:127.0.0.1:57311_ x:collection1 s:shard1 c:control_collection r:core_node1) [n:127.0.0.1:57311_ c:control_collection s:shard1 r:core_node1 x:collection1] o.a.s.c.ZkController numShards not found on descriptor - reading it from system property
   [junit4]   2> 1731772 INFO  (OverseerStateUpdate-95870813019635716-127.0.0.1:57311_-n_0000000000) [n:127.0.0.1:57311_    ] o.a.s.c.Overseer processMessage: queueSize: 1, message = {
   [junit4]   2>   "core":"collection1",
   [junit4]   2>   "core_node_name":"core_node1",
   [junit4]   2>   "roles":null,
   [junit4]   2>   "base_url":"http://127.0.0.1:57311",
   [junit4]   2>   "node_name":"127.0.0.1:57311_",
   [junit4]   2>   "numShards":"1",
   [junit4]   2>   "state":"active",
   [junit4]   2>   "shard":"shard1",
   [junit4]   2>   "collection":"control_collection",
   [junit4]   2>   "operation":"state"} current state version: 3
   [junit4]   2> 1731773 INFO  (OverseerStateUpdate-95870813019635716-127.0.0.1:57311_-n_0000000000) [n:127.0.0.1:57311_    ] o.a.s.c.o.ReplicaMutator Update state numShards=1 message={
   [junit4]   2>   "core":"collection1",
   [junit4]   2>   "core_node_name":"core_node1",
   [junit4]   2>   "roles":null,
   [junit4]   2>   "base_url":"http://127.0.0.1:57311",
   [junit4]   2>   "node_name":"127.0.0.1:57311_",
   [junit4]   2>   "numShards":"1",
   [junit4]   2>   "state":"active",
   [junit4]   2>   "shard":"shard1",
   [junit4]   2>   "collection":"control_collection",
   [junit4]   2>   "operation":"state"}
   [junit4]   2> 1731884 INFO  (zkCallback-2019-thread-1-processing-n:127.0.0.1:57311_) [n:127.0.0.1:57311_    ] o.a.s.c.c.ZkStateReader A cluster state change: [WatchedEvent state:SyncConnected type:NodeDataChanged path:/clusterstate.json], has occurred - updating... (live nodes size: [1])
   [junit4]   2> 1731925 INFO  (TEST-DistribDocExpirationUpdateProcessorTest.test-seed#[5A72266DCE952006]) [    ] o.a.s.c.s.i.CloudSolrClient Final constructed zkHost string: 127.0.0.1:57308/solr
   [junit4]   2> 1731926 INFO  (TEST-DistribDocExpirationUpdateProcessorTest.test-seed#[5A72266DCE952006]) [    ] o.a.s.c.c.SolrZkClient Using default ZkCredentialsProvider
   [junit4]   2> 1731926 INFO  (TEST-DistribDocExpirationUpdateProcessorTest.test-seed#[5A72266DCE952006]) [    ] o.a.s.c.c.ConnectionManager Waiting for client to connect to ZooKeeper
   [junit4]   2> 1731928 INFO  (zkCallback-2021-thread-1) [    ] o.a.s.c.c.ConnectionManager Watcher org.apache.solr.common.cloud.ConnectionManager@57ba5ed0 name:ZooKeeperConnection Watcher:127.0.0.1:57308/solr got event WatchedEvent state:SyncConnected type:None path:null path:null type:None
   [junit4]   2> 1731928 INFO  (TEST-DistribDocExpirationUpdateProcessorTest.test-seed#[5A72266DCE952006]) [    ] o.a.s.c.c.ConnectionManager Client is connected to ZooKeeper
   [junit4]   2> 1731928 INFO  (TEST-DistribDocExpirationUpdateProcessorTest.test-seed#[5A72266DCE952006]) [    ] o.a.s.c.c.SolrZkClient Using default ZkACLProvider
   [junit4]   2> 1731928 INFO  (TEST-DistribDocExpirationUpdateProcessorTest.test-seed#[5A72266DCE952006]) [    ] o.a.s.c.c.ZkStateReader Updating cluster state from ZooKeeper... 
   [junit4]   2> 1731931 INFO  (TEST-DistribDocExpirationUpdateProcessorTest.test-seed#[5A72266DCE952006]) [    ] o.a.s.c.c.ZkStateReader Updated live nodes from ZooKeeper... (0) -> (1)
   [junit4]   2> 1731932 INFO  (TEST-DistribDocExpirationUpdateProcessorTest.test-seed#[5A72266DCE952006]) [    ] o.a.s.c.ChaosMonkey monkey: init - expire sessions:false cause connection loss:false
   [junit4]   2> 1732262 INFO  (TEST-DistribDocExpirationUpdateProcessorTest.test-seed#[5A72266DCE952006]) [    ] o.a.s.SolrTestCaseJ4 Writing core.properties file to /Users/jenkins/workspace/Lucene-Solr-6.x-MacOSX/solr/build/solr-core/test/J1/temp/solr.cloud.DistribDocExpirationUpdateProcessorTest_5A72266DCE952006-001/shard-1-001/cores/collection1
   [junit4]   2> 1732264 INFO  (TEST-DistribDocExpirationUpdateProcessorTest.test-seed#[5A72266DCE952006]) [    ] o.a.s.c.AbstractFullDistribZkTestBase create jetty 1 in directory /Users/jenkins/workspace/Lucene-Solr-6.x-MacOSX/solr/build/solr-core/test/J1/temp/solr.cloud.DistribDocExpirationUpdateProcessorTest_5A72266DCE952006-001/shard-1-001
   [junit4]   2> 1732265 INFO  (TEST-DistribDocExpirationUpdateProcessorTest.test-seed#[5A72266DCE952006]) [    ] o.e.j.s.Server jetty-9.3.8.v20160314
   [junit4]   2> 1732268 INFO  (TEST-DistribDocExpirationUpdateProcessorTest.test-seed#[5A72266DCE952006]) [    ] o.e.j.s.h.ContextHandler Started o.e.j.s.ServletContextHandler@395462b{/,null,AVAILABLE}
   [junit4]   2> 1732268 INFO  (TEST-DistribDocExpirationUpdateProcessorTest.test-seed#[5A72266DCE952006]) [    ] o.e.j.s.ServerConnector Started ServerConnector@3222041c{HTTP/1.1,[http/1.1]}{127.0.0.1:57316}
   [junit4]   2> 1732269 INFO  (TEST-DistribDocExpirationUpdateProcessorTest.test-seed#[5A72266DCE952006]) [    ] o.e.j.s.Server Started @1738315ms
   [junit4]   2> 1732269 INFO  (TEST-DistribDocExpirationUpdateProcessorTest.test-seed#[5A72266DCE952006]) [    ] o.a.s.c.s.e.JettySolrRunner Jetty properties: {solr.data.dir=/Users/jenkins/workspace/Lucene-Solr-6.x-MacOSX/solr/build/solr-core/test/J1/temp/solr.cloud.DistribDocExpirationUpdateProcessorTest_5A72266DCE952006-001/tempDir-001/jetty1, solrconfig=solrconfig.xml, hostContext=/, hostPort=57316, coreRootDirectory=/Users/jenkins/workspace/Lucene-Solr-6.x-MacOSX/solr/build/solr-core/test/J1/temp/solr.cloud.DistribDocExpirationUpdateProcessorTest_5A72266DCE952006-001/shard-1-001/cores}
   [junit4]   2> 1732269 INFO  (TEST-DistribDocExpirationUpdateProcessorTest.test-seed#[5A72266DCE952006]) [    ] o.a.s.s.SolrDispatchFilter SolrDispatchFilter.init(): sun.misc.Launcher$AppClassLoader@4554617c
   [junit4]   2> 1732269 INFO  (TEST-DistribDocExpirationUpdateProcessorTest.test-seed#[5A72266DCE952006]) [    ] o.a.s.c.SolrResourceLoader new SolrResourceLoader for directory: '/Users/jenkins/workspace/Lucene-Solr-6.x-MacOSX/solr/build/solr-core/test/J1/temp/solr.cloud.DistribDocExpirationUpdateProcessorTest_5A72266DCE952006-001/shard-1-001'
   [junit4]   2> 1732270 INFO  (TEST-DistribDocExpirationUpdateProcessorTest.test-seed#[5A72266DCE952006]) [    ] o.a.s.c.SolrResourceLoader JNDI not configured for solr (NoInitialContextEx)
   [junit4]   2> 1732270 INFO  (TEST-DistribDocExpirationUpdateProcessorTest.test-seed#[5A72266DCE952006]) [    ] o.a.s.c.SolrResourceLoader solr home defaulted to 'solr/' (could not find system property or JNDI)
   [junit4]   2> 1732270 INFO  (TEST-DistribDocExpirationUpdateProcessorTest.test-seed#[5A72266DCE952006]) [    ] o.a.s.c.c.SolrZkClient Using default ZkCredentialsProvider
   [junit4]   2> 1732271 INFO  (TEST-DistribDocExpirationUpdateProcessorTest.test-seed#[5A72266DCE952006]) [    ] o.a.s.c.c.ConnectionManager Waiting for client to connect to ZooKeeper
   [junit4]   2> 1732273 INFO  (zkCallback-2022-thread-1) [    ] o.a.s.c.c.ConnectionManager Watcher org.apache.solr.common.cloud.ConnectionManager@16ae791 name:ZooKeeperConnection Watcher:127.0.0.1:57308/solr got event WatchedEvent state:SyncConnected type:None path:null path:null type:None
   [junit4]   2> 1732273 INFO  (TEST-DistribDocExpirationUpdateProcessorTest.test-seed#[5A72266DCE952006]) [    ] o.a.s.c.c.ConnectionManager Client is connected to ZooKeeper
   [junit4]   2> 1732273 INFO  (TEST-DistribDocExpirationUpdateProcessorTest.test-seed#[5A72266DCE952006]) [    ] o.a.s.c.c.SolrZkClient Using default ZkACLProvider
   [junit4]   2> 1732275 INFO  (TEST-DistribDocExpirationUpdateProcessorTest.test-seed#[5A72266DCE952006]) [    ] o.a.s.s.SolrDispatchFilter Loading solr.xml from SolrHome (not found in ZooKeeper)
   [junit4]   2> 1732275 INFO  (TEST-DistribDocExpirationUpdateProcessorTest.test-seed#[5A72266DCE952006]) [    ] o.a.s.c.SolrXmlConfig Loading container configuration from /Users/jenkins/workspace/Lucene-Solr-6.x-MacOSX/solr/build/solr-core/test/J1/temp/solr.cloud.DistribDocExpirationUpdateProcessorTest_5A72266DCE952006-001/shard-1-001/solr.xml
   [junit4]   2> 1732294 INFO  (TEST-DistribDocExpirationUpdateProcessorTest.test-seed#[5A72266DCE952006]) [    ] o.a.s.c.CorePropertiesLocator Config-defined core root directory: /Users/jenkins/workspace/Lucene-Solr-6.x-MacOSX/solr/build/solr-core/test/J1/temp/solr.cloud.DistribDocExpirationUpdateProcessorTest_5A72266DCE952006-001/shard-1-001/cores
   [junit4]   2> 1732294 INFO  (TEST-DistribDocExpirationUpdateProcessorTest.test-seed#[5A72266DCE952006]) [    ] o.a.s.c.CoreContainer New CoreContainer 848180519
   [junit4]   2> 1732294 INFO  (TEST-DistribDocExpirationUpdateProcessorTest.test-seed#[5A72266DCE952006]) [    ] o.a.s.c.CoreContainer Loading cores into CoreContainer [instanceDir=/Users/jenkins/workspace/Lucene-Solr-6.x-MacOSX/solr/build/solr-core/test/J1/temp/solr.cloud.DistribDocExpirationUpdateProcessorTest_5A72266DCE952006-001/shard-1-001]
   [junit4]   2> 1732294 WARN  (TEST-DistribDocExpirationUpdateProcessorTest.test-seed#[5A72266DCE952006]) [    ] o.a.s.c.CoreContainer Couldn't add files from /Users/jenkins/workspace/Lucene-Solr-6.x-MacOSX/solr/build/solr-core/test/J1/temp/solr.cloud.DistribDocExpirationUpdateProcessorTest_5A72266DCE952006-001/shard-1-001/lib to classpath: /Users/jenkins/workspace/Lucene-Solr-6.x-MacOSX/solr/build/solr-core/test/J1/temp/solr.cloud.DistribDocExpirationUpdateProcessorTest_5A72266DCE952006-001/shard-1-001/lib
   [junit4]   2> 1732294 INFO  (TEST-DistribDocExpirationUpdateProcessorTest.test-seed#[5A72266DCE952006]) [    ] o.a.s.h.c.HttpShardHandlerFactory created with socketTimeout : 90000,urlScheme : ,connTimeout : 15000,maxConnectionsPerHost : 20,maxConnections : 10000,corePoolSize : 0,maximumPoolSize : 2147483647,maxThreadIdleTime : 5,sizeOfQueue : -1,fairnessPolicy : false,useRetries : false,
   [junit4]   2> 1732298 INFO  (TEST-DistribDocExpirationUpdateProcessorTest.test-seed#[5A72266DCE952006]) [    ] o.a.s.u.UpdateShardHandler Creating UpdateShardHandler HTTP client with params: socketTimeout=340000&connTimeout=45000&retry=true
   [junit4]   2> 1732298 INFO  (TEST-DistribDocExpirationUpdateProcessorTest.test-seed#[5A72266DCE952006]) [    ] o.a.s.l.LogWatcher SLF4J impl is org.slf4j.impl.Log4jLoggerFactory
   [junit4]   2> 1732299 INFO  (TEST-DistribDocExpirationUpdateProcessorTest.test-seed#[5A72266DCE952006]) [    ] o.a.s.l.LogWatcher Registering Log Listener [Log4j (org.slf4j.impl.Log4jLoggerFactory)]
   [junit4]   2> 1732299 INFO  (TEST-DistribDocExpirationUpdateProcessorTest.test-seed#[5A72266DCE952006]) [    ] o.a.s.c.ZkContainer Zookeeper client=127.0.0.1:57308/solr
   [junit4]   2> 1732299 INFO  (TEST-DistribDocExpirationUpdateProcessorTest.test-seed#[5A72266DCE952006]) [    ] o.a.s.c.ZkController zkHost includes chroot
   [junit4]   2> 1732299 INFO  (TEST-DistribDocExpirationUpdateProcessorTest.test-seed#[5A72266DCE952006]) [    ] o.a.s.c.c.SolrZkClient Using default ZkCredentialsProvider
   [junit4]   2> 1732299 INFO  (TEST-DistribDocExpirationUpdateProcessorTest.test-seed#[5A72266DCE952006]) [    ] o.a.s.c.c.ConnectionManager Waiting for client to connect to ZooKeeper
   [junit4]   2> 1732301 INFO  (zkCallback-2025-thread-1) [    ] o.a.s.c.c.ConnectionManager Watcher org.apache.solr.common.cloud.ConnectionManager@13908c25 name:ZooKeeperConnection Watcher:127.0.0.1:57308 got event WatchedEvent state:SyncConnected type:None path:null path:null type:None
   [junit4]   2> 1732302 INFO  (TEST-DistribDocExpirationUpdateProcessorTest.test-seed#[5A72266DCE952006]) [    ] o.a.s.c.c.ConnectionManager Client is connected to ZooKeeper
   [junit4]   2> 1732303 INFO  (TEST-DistribDocExpirationUpdateProcessorTest.test-seed#[5A72266DCE952006]) [    ] o.a.s.c.c.SolrZkClient Using default ZkACLProvider
   [junit4]   2> 1732304 INFO  (TEST-DistribDocExpirationUpdateProcessorTest.test-seed#[5A72266DCE952006]) [n:127.0.0.1:57316_    ] o.a.s.c.ZkController Added new OnReconnect listener org.apache.solr.cloud.ZkController$$Lambda$37/1550231481@fdfa278
   [junit4]   2> 1732305 INFO  (TEST-DistribDocExpirationUpdateProcessorTest.test-seed#[5A72266DCE952006]) [n:127.0.0.1:57316_    ] o.a.s.c.c.ConnectionManager Waiting for client to connect to ZooKeeper
   [junit4]   2> 1732307 INFO  (zkCallback-2026-thread-1-processing-n:127.0.0.1:57316_) [n:127.0.0.1:57316_    ] o.a.s.c.c.ConnectionManager Watcher org.apache.solr.common.cloud.ConnectionManager@72af9ffb name:ZooKeeperConnection Watcher:127.0.0.1:57308/solr got event WatchedEvent state:SyncConnected type:None path:null path:null type:None
   [junit4]   2> 1732308 INFO  (TEST-DistribDocExpirationUpdateProcessorTest.test-seed#[5A72266DCE952006]) [n:127.0.0.1:57316_    ] o.a.s.c.c.ConnectionManager Client is connected to ZooKeeper
   [junit4]   2> 1732321 INFO  (TEST-DistribDocExpirationUpdateProcessorTest.test-seed#[5A72266DCE952006]) [n:127.0.0.1:57316_    ] o.a.s.c.c.ZkStateReader Updating cluster state from ZooKeeper... 
   [junit4]   2> 1732323 INFO  (TEST-DistribDocExpirationUpdateProcessorTest.test-seed#[5A72266DCE952006]) [n:127.0.0.1:57316_    ] o.a.s.c.c.ZkStateReader Updated live nodes from ZooKeeper... (0) -> (1)
   [junit4]   2> 1732327 INFO  (TEST-DistribDocExpirationUpdateProcessorTest.test-seed#[5A72266DCE952006]) [n:127.0.0.1:57316_    ] o.a.s.c.Overseer Overseer (id=null) closing
   [junit4]   2> 1732328 INFO  (TEST-DistribDocExpirationUpdateProcessorTest.test-seed#[5A72266DCE952006]) [n:127.0.0.1:57316_    ] o.a.s.c.LeaderElector Joined leadership election with path: /overseer_elect/election/95870813019635720-127.0.0.1:57316_-n_0000000001
   [junit4]   2> 1732329 INFO  (TEST-DistribDocExpirationUpdateProcessorTest.test-seed#[5A72266DCE952006]) [n:127.0.0.1:57316_    ] o.a.s.c.LeaderElector Watching path /overseer_elect/election/95870813019635716-127.0.0.1:57311_-n_0000000000 to know if I could be the leader
   [junit4]   2> 1732330 INFO  (TEST-DistribDocExpirationUpdateProcessorTest.test-seed#[5A72266DCE952006]) [n:127.0.0.1:57316_    ] o.a.s.c.ZkController Publish node=127.0.0.1:57316_ as DOWN
   [junit4]   2> 1732334 INFO  (OverseerStateUpdate-95870813019635716-127.0.0.1:57311_-n_0000000000) [n:127.0.0.1:57311_    ] o.a.s.c.Overseer processMessage: queueSize: 1, message = {
   [junit4]   2>   "operation":"downnode",
   [junit4]   2>   "node_name":"127.0.0.1:57316_"} current state version: 4
   [junit4]   2> 1732334 INFO  (OverseerStateUpdate-95870813019635716-127.0.0.1:57311_-n_0000000000) [n:127.0.0.1:57311_    ] o.a.s.c.o.NodeMutator DownNode state invoked for node: 127.0.0.1:57316_
   [junit4]   2> 1732438 INFO  (zkCallback-2021-thread-1) [    ] o.a.s.c.c.ZkStateReader A cluster state change: [WatchedEvent state:SyncConnected type:NodeDataChanged path:/clusterstate.json], has occurred - updating... (live nodes size: [1])
   [junit4]   2> 1732438 INFO  (zkCallback-2019-thread-1-processing-n:127.0.0.1:57311_) [n:127.0.0.1:57311_    ] o.a.s.c.c.ZkStateReader A cluster state change: [WatchedEvent state:SyncConnected type:NodeDataChanged path:/clusterstate.json], has occurred - updating... (live nodes size: [1])
   [junit4]   2> 1732438 INFO  (zkCallback-2026-thread-1-processing-n:127.0.0.1:57316_) [n:127.0.0.1:57316_    ] o.a.s.c.c.ZkStateReader A cluster state change: [WatchedEvent state:SyncConnected type:NodeDataChanged path:/clusterstate.json], has occurred - updating... (live nodes size: [1])
   [junit4]   2> 1733334 INFO  (TEST-DistribDocExpirationUpdateProcessorTest.test-seed#[5A72266DCE952006]) [n:127.0.0.1:57316_    ] o.a.s.c.ZkController Register node as live in ZooKeeper:/live_nodes/127.0.0.1:57316_
   [junit4]   2> 1733335 INFO  (TEST-DistribDocExpirationUpdateProcessorTest.test-seed#[5A72266DCE952006]) [n:127.0.0.1:57316_    ] o.a.s.c.c.SolrZkClient makePath: /live_nodes/127.0.0.1:57316_
   [junit4]   2> 1733337 INFO  (zkCallback-2021-thread-1) [    ] o.a.s.c.c.ZkStateReader A live node change: [WatchedEvent state:SyncConnected type:NodeChildrenChanged path:/live_nodes], has occurred - updating... (live nodes size: [1])
   [junit4]   2> 1733337 INFO  (zkCallback-2019-thread-1-processing-n:127.0.0.1:57311_) [n:127.0.0.1:57311_    ] o.a.s.c.c.ZkStateReader A live node change: [WatchedEvent state:SyncConnected type:NodeChildrenChanged path:/live_nodes], has occurred - updating... (live nodes size: [1])
   [junit4]   2> 1733338 INFO  (zkCallback-2026-thread-1-processing-n:127.0.0.1:57316_) [n:127.0.0.1:57316_    ] o.a.s.c.c.ZkStateReader A live node change: [WatchedEvent state:SyncConnected type:NodeChildrenChanged path:/live_nodes], has occurred - updating... (live nodes size: [1])
   [junit4]   2> 1733338 INFO  (zkCallback-2021-thread-1) [    ] o.a.s.c.c.ZkStateReader Updated live nodes from ZooKeeper... (1) -> (2)
   [junit4]   2> 1733339 INFO  (zkCallback-2019-thread-1-processing-n:127.0.0.1:57311_) [n:127.0.0.1:57311_    ] o.a.s.c.c.ZkStateReader Updated live nodes from ZooKeeper... (1) -> (2)
   [junit4]   2> 1733339 INFO  (zkCallback-2026-thread-1-processing-n:127.0.0.1:57316_) [n:127.0.0.1:57316_    ] o.a.s.c.c.ZkStateReader Updated live nodes from ZooKeeper... (1) -> (2)
   [junit4]   2> 1733354 INFO  (TEST-DistribDocExpirationUpdateProcessorTest.test-seed#[5A72266DCE952006]) [n:127.0.0.1:57316_    ] o.a.s.c.CoreContainer Security conf doesn't exist. Skipping setup for authorization module.
   [junit4]   2> 1733354 INFO  (TEST-DistribDocExpirationUpdateProcessorTest.test-seed#[5A72266DCE952006]) [n:127.0.0.1:57316_    ] o.a.s.c.CoreContainer No authentication plugin used.
   [junit4]   2> 1733356 INFO  (TEST-DistribDocExpirationUpdateProcessorTest.test-seed#[5A72266DCE952006]) [n:127.0.0.1:57316_    ] o.a.s.c.CorePropertiesLocator Looking for core definitions underneath /Users/jenkins/workspace/Lucene-Solr-6.x-MacOSX/solr/build/solr-core/test/J1/temp/solr.cloud.DistribDocExpirationUpdateProcessorTest_5A72266DCE952006-001/shard-1-001/cores
   [junit4]   2> 1733357 INFO  (TEST-DistribDocExpirationUpdateProcessorTest.test-seed#[5A72266DCE952006]) [n:127.0.0.1:57316_    ] o.a.s.c.CoreDescriptor Created CoreDescriptor: {name=collection1, config=solrconfig.xml, transient=false, schema=schema.xml, loadOnStartup=true, configSetProperties=configsetprops.json, collection=collection1, coreNodeName=, dataDir=data/, shard=}
   [junit4]   2> 1733357 INFO  (TEST-DistribDocExpirationUpdateProcessorTest.test-seed#[5A72266DCE952006]) [n:127.0.0.1:57316_    ] o.a.s.c.CorePropertiesLocator Found core collection1 in /Users/jenkins/workspace/Lucene-Solr-6.x-MacOSX/solr/build/solr-core/test/J1/temp/solr.cloud.DistribDocExpirationUpdateProcessorTest_5A72266DCE952006-001/shard-1-001/cores/collection1
   [junit4]   2> 1733357 INFO  (TEST-DistribDocExpirationUpdateProcessorTest.test-seed#[5A72266DCE952006]) [n:127.0.0.1:57316_    ] o.a.s.c.CorePropertiesLocator Found 1 core definitions
   [junit4]   2> 1733359 INFO  (TEST-DistribDocExpirationUpdateProcessorTest.test-seed#[5A72266DCE952006]) [n:127.0.0.1:57316_    ] o.a.s.s.SolrDispatchFilter user.dir=/Users/jenkins/workspace/Lucene-Solr-6.x-MacOSX/solr/build/solr-core/test/J1
   [junit4]   2> 1733359 INFO  (TEST-DistribDocExpirationUpdateProcessorTest.test-seed#[5A72266DCE952006]) [n:127.0.0.1:57316_    ] o.a.s.s.SolrDispatchFilter SolrDispatchFilter.init() done
   [junit4]   2> 1733359 INFO  (coreLoadExecutor-5238-thread-1-processing-n:127.0.0.1:57316_) [n:127.0.0.1:57316_ c:collection1   x:collection1] o.a.s.c.ZkController publishing state=down
   [junit4]   2> 1733360 INFO  (coreLoadExecutor-5238-thread-1-processing-n:127.0.0.1:57316_) [n:127.0.0.1:57316_ c:collection1   x:collection1] o.a.s.c.ZkController numShards not found on descriptor - reading it from system property
   [junit4]   2> 1733361 INFO  (coreLoadExecutor-5238-thread-1-processing-n:127.0.0.1:57316_) [n:127.0.0.1:57316_ c:collection1   x:collection1] o.a.s.c.ZkController Collection collection1 not visible yet, but flagging it so a watch is registered when it becomes visible
   [junit4]   2> 1733362 INFO  (coreLoadExecutor-5238-thread-1-processing-n:127.0.0.1:57316_) [n:127.0.0.1:57316_ c:collection1   x:collection1] o.a.s.c.c.ZkStateReader addZkWatch [collection1]
   [junit4]   2> 1733363 INFO  (coreLoadExecutor-5238-thread-1-processing-n:127.0.0.1:57316_) [n:127.0.0.1:57316_ c:collection1   x:collection1] o.a.s.c.c.ZkStateReader Deleting data for [collection1]
   [junit4]   2> 1733363 INFO  (OverseerStateUpdate-95870813019635716-127.0.0.1:57311_-n_0000000000) [n:127.0.0.1:57311_    ] o.a.s.c.Overseer processMessage: queueSize: 1, message = {
   [junit4]   2>   "core":"collection1",
   [junit4]   2>   "roles":null,
   [junit4]   2>   "base_url":"http://127.0.0.1:57316",
   [junit4]   2>   "node_name":"127.0.0.1:57316_",
   [junit4]   2>   "numShards":"2",
   [junit4]   2>   "state":"down",
   [junit4]   2>   "shard":null,
   [junit4]   2>   "collection":"collection1",
   [junit4]   2>   "operation":"state"} current state version: 5
   [junit4]   2> 1733364 INFO  (coreLoadExecutor-5238-thread-1-processing-n:127.0.0.1:57316_) [n:127.0.0.1:57316_ c:collection1   x:collection1] o.a.s.c.ZkController look for our core node name
   [junit4]   2> 1733364 INFO  (OverseerStateUpdate-95870813019635716-127.0.0.1:57311_-n_0000000000) [n:127.0.0.1:57311_    ] o.a.s.c.o.ReplicaMutator Update state numShards=2 message={
   [junit4]   2>   "core":"collection1",
   [junit4]   2>   "roles":null,
   [junit4]   2>   "base_url":"http://127.0.0.1:57316",
   [junit4]   2>   "node_name":"127.0.0.1:57316_",
   [junit4]   2>   "numShards":"2",
   [junit4]   2>   "state":"down",
   [junit4]   2>   "shard":null,
   [junit4]   2>   "collection":"collection1",
   [junit4]   2>   "operation":"state"}
   [junit4]   2> 1733364 INFO  (OverseerStateUpdate-95870813019635716-127.0.0.1:57311_-n_0000000000) [n:127.0.0.1:57311_    ] o.a.s.c.o.ClusterStateMutator building a new cName: collection1
   [junit4]   2> 1733364 INFO  (OverseerStateUpdate-95870813019635716-127.0.0.1:57311_-n_0000000000) [n:127.0.0.1:57311_    ] o.a.s.c.o.ReplicaMutator Assigning new node to shard shard=shard2
   [junit4]   2> 1733468 INFO  (zkCallback-2021-thread-1) [    ] o.a.s.c.c.ZkStateReader A cluster state change: [WatchedEvent state:SyncConnected type:NodeDataChanged path:/clusterstate.json], has occurred - updating... (live nodes size: [2])
   [junit4]   2> 1733469 INFO  (zkCallback-2026-thread-1-processing-n:127.0.0.1:57316_) [n:127.0.0.1:57316_    ] o.a.s.c.c.ZkStateReader A cluster state change: [WatchedEvent state:SyncConnected type:NodeDataChanged path:/clusterstate.json], has occurred - updating... (live nodes size: [2])
   [junit4]   2> 1733468 INFO  (zkCallback-2019-thread-1-processing-n:127.0.0.1:57311_) [n:127.0.0.1:57311_    ] o.a.s.c.c.ZkStateReader A cluster state change: [WatchedEvent state:SyncConnected type:NodeDataChanged path:/clusterstate.json], has occurred - updating... (live nodes size: [2])
   [junit4]   2> 1734367 INFO  (coreLoadExecutor-5238-thread-1-processing-n:127.0.0.1:57316_) [n:127.0.0.1:57316_ c:collection1   x:collection1] o.a.s.c.ZkController waiting to find shard id in clusterstate for collection1
   [junit4]   2> 1734367 INFO  (coreLoadExecutor-5238-thread-1-processing-n:127.0.0.1:57316_) [n:127.0.0.1:57316_ c:collection1   x:collection1] o.a.s.c.ZkController Check for collection zkNode:collection1
   [junit4]   2> 1734368 INFO  (coreLoadExecutor-5238-thread-1-processing-n:127.0.0.1:57316_) [n:127.0.0.1:57316_ c:collection1   x:collection1] o.a.s.c.ZkController Collection zkNode exists
   [junit4]   2> 1734368 INFO  (coreLoadExecutor-5238-thread-1-processing-n:127.0.0.1:57316_) [n:127.0.0.1:57316_ c:collection1   x:collection1] o.a.s.c.c.ZkStateReader Load collection config from: [/collections/collection1]
   [junit4]   2> 1734370 INFO  (coreLoadExecutor-5238-thread-1-processing-n:127.0.0.1:57316_) [n:127.0.0.1:57316_ c:collection1   x:collection1] o.a.s.c.c.ZkStateReader path=[/collections/collection1] [configName]=[conf1] specified config exists in ZooKeeper
   [junit4]   2> 1734370 INFO  (coreLoadExecutor-5238-thread-1-processing-n:127.0.0.1:57316_) [n:127.0.0.1:57316_ c:collection1   x:collection1] o.a.s.c.SolrResourceLoader new SolrResourceLoader for directory: '/Users/jenkins/workspace/Lucene-Solr-6.x-MacOSX/solr/build/solr-core/test/J1/temp/solr.cloud.DistribDocExpirationUpdateProcessorTest_5A72266DCE952006-001/shard-1-001/cores/collection1'
   [junit4]   2> 1734370 INFO  (coreLoadExecutor-5238-thread-1-processing-n:127.0.0.1:57316_) [n:127.0.0.1:57316_ c:collection1   x:collection1] o.a.s.c.SolrResourceLoader JNDI not configured for solr (NoInitialContextEx)
   [junit4]   2> 1734370 INFO  (coreLoadExecutor-5238-thread-1-processing-n:127.0.0.1:57316_) [n:127.0.0.1:57316_ c:collection1   x:collection1] o.a.s.c.SolrResourceLoader solr home defaulted to 'solr/' (could not find system property or JNDI)
   [junit4]   2> 1734373 INFO  (coreLoadExecutor-5238-thread-1-processing-n:127.0.0.1:57316_) [n:127.0.0.1:57316_ c:collection1   x:collection1] o.a.s.c.Config loaded config solrconfig.xml with version 0 
   [junit4]   2> 1734383 INFO  (coreLoadExecutor-5238-thread-1-processing-n:127.0.0.1:57316_) [n:127.0.0.1:57316_ c:collection1   x:collection1] o.a.s.c.SolrConfig current version of requestparams : -1
   [junit4]   2> 1734386 WARN  (coreLoadExecutor-5238-thread-1-processing-n:127.0.0.1:57316_) [n:127.0.0.1:57316_ c:collection1   x:collection1] o.a.s.c.Config Beginning with Solr 5.5, <mergePolicy> is deprecated, use <mergePolicyFactory> instead.
   [junit4]   2> 1734387 INFO  (coreLoadExecutor-5238-thread-1-processing-n:127.0.0.1:57316_) [n:127.0.0.1:57316_ c:collection1   x:collection1] o.a.s.c.SolrConfig Using Lucene MatchVersion: 6.1.0
   [junit4]   2> 1734393 INFO  (coreLoadExecutor-5238-thread-1-processing-n:127.0.0.1:57316_) [n:127.0.0.1:57316_ c:collection1   x:collection1] o.a.s.c.SolrConfig Loaded SolrConfig: solrconfig.xml
   [junit4]   2> 1734402 INFO  (coreLoadExecutor-5238-thread-1-processing-n:127.0.0.1:57316_) [n:127.0.0.1:57316_ c:collection1   x:collection1] o.a.s.s.IndexSchema [collection1] Schema name=test
   [junit4]   2> 1734492 INFO  (coreLoadExecutor-5238-thread-1-processing-n:127.0.0.1:57316_) [n:127.0.0.1:57316_ c:collection1   x:collection1] o.a.s.s.IndexSchema default search field in schema is text
   [junit4]   2> 1734494 INFO  (coreLoadExecutor-5238-thread-1-processing-n:127.0.0.1:57316_) [n:127.0.0.1:57316_ c:collection1   x:collection1] o.a.s.s.IndexSchema unique key field: id
   [junit4]   2> 1734495 INFO  (coreLoadExecutor-5238-thread-1-processing-n:127.0.0.1:57316_) [n:127.0.0.1:57316_ c:collection1   x:collection1] o.a.s.s.FileExchangeRateProvider Reloading exchange rates from file currency.xml
   [junit4]   2> 1734498 INFO  (coreLoadExecutor-5238-thread-1-processing-n:127.0.0.1:57316_) [n:127.0.0.1:57316_ c:collection1   x:collection1] o.a.s.s.FileExchangeRateProvider Reloading exchange rates from file currency.xml
   [junit4]   2> 1734574 INFO  (coreLoadExecutor-5238-thread-1-processing-n:127.0.0.1:57316_) [n:127.0.0.1:57316_ c:collection1   x:collection1] o.a.s.c.ConfigSetProperties Did not find ConfigSet properties, assuming default properties: Can't find resource 'configsetprops.json' in classpath or '/configs/conf1', cwd=/Users/jenkins/workspace/Lucene-Solr-6.x-MacOSX/solr/build/solr-core/test/J1
   [junit4]   2> 1734575 INFO  (coreLoadExecutor-5238-thread-1-processing-n:127.0.0.1:57316_) [n:127.0.0.1:57316_ c:collection1   x:collection1] o.a.s.c.CoreContainer Creating SolrCore 'collection1' using configuration from collection collection1
   [junit4]   2> 1734575 INFO  (coreLoadExecutor-5238-thread-1-processing-n:127.0.0.1:57316_) [n:127.0.0.1:57316_ c:collection1 s:shard2 r:core_node1 x:collection1] o.a.s.c.SolrCore org.apache.solr.core.MockDirectoryFactory
   [junit4]   2> 1734575 INFO  (coreLoadExecu

[...truncated too long message...]

tureTask.java:308)
   [junit4]   2> 	at java.util.concurrent.ScheduledThreadPoolExecutor$ScheduledFutureTask.access$301(ScheduledThreadPoolExecutor.java:180)
   [junit4]   2> 	at java.util.concurrent.ScheduledThreadPoolExecutor$ScheduledFutureTask.run(ScheduledThreadPoolExecutor.java:294)
   [junit4]   2> 	at java.util.concurrent.ThreadPoolExecutor.runWorker(ThreadPoolExecutor.java:1142)
   [junit4]   2> 	at java.util.concurrent.ThreadPoolExecutor$Worker.run(ThreadPoolExecutor.java:617)
   [junit4]   2> 	at java.lang.Thread.run(Thread.java:745)
   [junit4]   2> 1798358 INFO  (TEST-DistribDocExpirationUpdateProcessorTest.test-seed#[5A72266DCE952006]) [    ] o.a.s.c.Overseer Overseer (id=95870813019635729-127.0.0.1:57339_-n_0000000004) closing
   [junit4]   2> 1798358 INFO  (OverseerStateUpdate-95870813019635729-127.0.0.1:57339_-n_0000000004) [n:127.0.0.1:57339_    ] o.a.s.c.Overseer Overseer Loop exiting : 127.0.0.1:57339_
   [junit4]   2> 1798361 INFO  (zkCallback-2042-thread-1-processing-n:127.0.0.1:57339_) [n:127.0.0.1:57339_    ] o.a.s.c.c.ZkStateReader A live node change: [WatchedEvent state:SyncConnected type:NodeChildrenChanged path:/live_nodes], has occurred - updating... (live nodes size: [1])
   [junit4]   2> 1798361 WARN  (zkCallback-2042-thread-1-processing-n:127.0.0.1:57339_) [n:127.0.0.1:57339_    ] o.a.s.c.c.ZkStateReader ZooKeeper watch triggered, but Solr cannot talk to ZK: [KeeperErrorCode = Session expired for /live_nodes]
   [junit4]   2> 1798363 INFO  (TEST-DistribDocExpirationUpdateProcessorTest.test-seed#[5A72266DCE952006]) [    ] o.e.j.s.ServerConnector Stopped ServerConnector@6b47477f{HTTP/1.1,[http/1.1]}{127.0.0.1:0}
   [junit4]   2> 1798363 INFO  (TEST-DistribDocExpirationUpdateProcessorTest.test-seed#[5A72266DCE952006]) [    ] o.e.j.s.h.ContextHandler Stopped o.e.j.s.ServletContextHandler@2f27c4e9{/,null,UNAVAILABLE}
   [junit4]   2> 1798365 INFO  (TEST-DistribDocExpirationUpdateProcessorTest.test-seed#[5A72266DCE952006]) [    ] o.a.s.c.ZkTestServer connecting to 127.0.0.1:57308 57308
   [junit4]   2> 1798485 INFO  (Thread-3392) [    ] o.a.s.c.ZkTestServer connecting to 127.0.0.1:57308 57308
   [junit4]   2> 1799881 WARN  (Thread-3392) [    ] o.a.s.c.ZkTestServer Watch limit violations: 
   [junit4]   2> Maximum concurrent create/delete watches above limit:
   [junit4]   2> 
   [junit4]   2> 	6	/solr/aliases.json
   [junit4]   2> 	5	/solr/security.json
   [junit4]   2> 	5	/solr/configs/conf1
   [junit4]   2> 	4	/solr/collections/collection1/state.json
   [junit4]   2> 
   [junit4]   2> Maximum concurrent data watches above limit:
   [junit4]   2> 
   [junit4]   2> 	6	/solr/clusterstate.json
   [junit4]   2> 
   [junit4]   2> Maximum concurrent children watches above limit:
   [junit4]   2> 
   [junit4]   2> 	6	/solr/live_nodes
   [junit4]   2> 	6	/solr/collections
   [junit4]   2> 	5	/solr/overseer/queue
   [junit4]   2> 	5	/solr/overseer/collection-queue-work
   [junit4]   2> 	2	/solr/overseer/queue-work
   [junit4]   2> 
   [junit4]   2> NOTE: reproduce with: ant test  -Dtestcase=DistribDocExpirationUpdateProcessorTest -Dtests.method=test -Dtests.seed=5A72266DCE952006 -Dtests.slow=true -Dtests.locale=it-CH -Dtests.timezone=Asia/Novokuznetsk -Dtests.asserts=true -Dtests.file.encoding=US-ASCII
   [junit4] FAILURE 70.5s J1 | DistribDocExpirationUpdateProcessorTest.test <<<
   [junit4]    > Throwable #1: java.lang.AssertionError: There are still nodes recoverying - waited for 45 seconds
   [junit4]    > 	at __randomizedtesting.SeedInfo.seed([5A72266DCE952006:D22619B760694DFE]:0)
   [junit4]    > 	at org.apache.solr.cloud.AbstractDistribZkTestBase.waitForRecoveriesToFinish(AbstractDistribZkTestBase.java:182)
   [junit4]    > 	at org.apache.solr.cloud.AbstractFullDistribZkTestBase.waitForRecoveriesToFinish(AbstractFullDistribZkTestBase.java:858)
   [junit4]    > 	at org.apache.solr.cloud.DistribDocExpirationUpdateProcessorTest.test(DistribDocExpirationUpdateProcessorTest.java:74)
   [junit4]    > 	at org.apache.solr.BaseDistributedSearchTestCase$ShardsRepeatRule$ShardsFixedStatement.callStatement(BaseDistributedSearchTestCase.java:992)
   [junit4]    > 	at org.apache.solr.BaseDistributedSearchTestCase$ShardsRepeatRule$ShardsStatement.evaluate(BaseDistributedSearchTestCase.java:967)
   [junit4]    > 	at java.lang.Thread.run(Thread.java:745)
   [junit4]   2> 1799886 INFO  (SUITE-DistribDocExpirationUpdateProcessorTest-seed#[5A72266DCE952006]-worker) [    ] o.a.s.SolrTestCaseJ4 ###deleteCore
   [junit4]   2> NOTE: leaving temporary files on disk at: /Users/jenkins/workspace/Lucene-Solr-6.x-MacOSX/solr/build/solr-core/test/J1/temp/solr.cloud.DistribDocExpirationUpdateProcessorTest_5A72266DCE952006-001
   [junit4]   2> NOTE: test params are: codec=Asserting(Lucene60): {_version_=PostingsFormat(name=Direct), id=FSTOrd50}, docValues:{}, maxPointsInLeafNode=1797, maxMBSortInHeap=7.927250888373486, sim=RandomSimilarity(queryNorm=true,coord=yes): {}, locale=it-CH, timezone=Asia/Novokuznetsk
   [junit4]   2> NOTE: Mac OS X 10.11.4 x86_64/Oracle Corporation 1.8.0_72 (64-bit)/cpus=3,threads=1,free=253702888,total=533725184
   [junit4]   2> NOTE: All tests run in this JVM: [TestDFISimilarityFactory, TermVectorComponentTest, TestInitParams, CurrencyFieldOpenExchangeTest, CollectionsAPISolrJTest, CopyFieldTest, TestSubQueryTransformerDistrib, UUIDUpdateProcessorFallbackTest, CursorMarkTest, TestDistributedGrouping, SpellingQueryConverterTest, TestBulkSchemaAPI, TestConfigSetImmutable, TestConfigSetsAPIZkFailure, TestSolrQueryParser, TestFoldingMultitermQuery, TestCloudDeleteByQuery, TestSolrIndexConfig, BaseCdcrDistributedZkTest, SharedFSAutoReplicaFailoverUtilsTest, DateFieldTest, ConfigSetsAPITest, UniqFieldsUpdateProcessorFactoryTest, TestMaxScoreQueryParser, TestFuzzyAnalyzedSuggestions, SuggesterTSTTest, TestWriterPerf, SecurityConfHandlerTest, HLLUtilTest, TestIndexingPerformance, TestSchemaNameResource, SolrIndexSplitterTest, TestObjectReleaseTracker, TestReplicaProperties, TestFastWriter, TestAnalyzeInfixSuggestions, CoreMergeIndexesAdminHandlerTest, TestLeaderInitiatedRecoveryThread, TestManagedResourceStorage, CdcrVersionReplicationTest, WrapperMergePolicyFactoryTest, TestRecovery, HdfsWriteToMultipleCollectionsTest, CreateCollectionCleanupTest, TestMiniSolrCloudClusterBase, TestRangeQuery, TestHashQParserPlugin, SpellCheckCollatorTest, TestRandomFaceting, MinimalSchemaTest, TestXmlQParser, DistributedFacetPivotSmallAdvancedTest, TestSolr4Spatial, TestQueryTypes, ForceLeaderTest, AsyncCallRequestStatusResponseTest, SuggesterTest, TestCharFilters, TestTolerantUpdateProcessorCloud, TestSortByMinMaxFunction, BasicFunctionalityTest, TestCollationField, TestSolrCLIRunExample, OverriddenZkACLAndCredentialsProvidersTest, FileUtilsTest, FieldMutatingUpdateProcessorTest, TestFileDictionaryLookup, TestIntervalFaceting, SynonymTokenizerTest, StatsComponentTest, TestJsonRequest, DirectUpdateHandlerOptimizeTest, BasicDistributedZk2Test, TestSolrConfigHandlerCloud, BasicZkTest, SolrInfoMBeanTest, DistributedIntervalFacetingTest, TestRecoveryHdfs, SolrCloudExampleTest, TestReload, ResourceLoaderTest, TestUtils, TestCustomSort, VMParamsZkACLAndCredentialsProvidersTest, DistanceFunctionTest, DistributedQueryComponentOptimizationTest, TestDistribIDF, MultiThreadedOCPTest, ResponseLogComponentTest, RequestHandlersTest, TestUseDocValuesAsStored, TestSolrFieldCacheMBean, TestOmitPositions, TestGraphMLResponseWriter, TestFieldCollectionResource, HighlighterConfigTest, HdfsSyncSliceTest, TestHighFrequencyDictionaryFactory, TestCustomDocTransformer, ZkStateWriterTest, QueryResultKeyTest, RestartWhileUpdatingTest, TestScoreJoinQPNoScore, TestShortCircuitedRequests, AnalyticsMergeStrategyTest, ResponseHeaderTest, BinaryUpdateRequestHandlerTest, PluginInfoTest, HdfsChaosMonkeySafeLeaderTest, SpellCheckComponentTest, TestTrie, IndexSchemaRuntimeFieldTest, TestExclusionRuleCollectionAccess, TestCollationFieldDocValues, TestExactStatsCache, TestRuleBasedAuthorizationPlugin, TestRealTimeGet, TestSolrConfigHandler, TestBM25SimilarityFactory, FileBasedSpellCheckerTest, TestRandomRequestDistribution, TestSimpleTrackingShardHandler, DebugComponentTest, TestMinMaxOnMultiValuedField, FullHLLTest, TestQueryWrapperFilter, TestDynamicFieldCollectionResource, TestReloadAndDeleteDocs, HdfsNNFailoverTest, AddBlockUpdateTest, TestSolrCloudWithKerberosAlt, DeleteInactiveReplicaTest, JavabinLoaderTest, TestHdfsUpdateLog, DistributedQueueTest, CollectionsAPIDistributedZkTest, ParsingFieldUpdateProcessorsTest, BadCopyFieldTest, BadIndexSchemaTest, SolrCoreCheckLockOnStartupTest, DistribDocExpirationUpdateProcessorTest]
   [junit4] Completed [295/598 (1!)] on J1 in 70.57s, 1 test, 1 failure <<< FAILURES!

[...truncated 990 lines...]
BUILD FAILED
/Users/jenkins/workspace/Lucene-Solr-6.x-MacOSX/build.xml:740: The following error occurred while executing this line:
/Users/jenkins/workspace/Lucene-Solr-6.x-MacOSX/build.xml:684: The following error occurred while executing this line:
/Users/jenkins/workspace/Lucene-Solr-6.x-MacOSX/build.xml:59: The following error occurred while executing this line:
/Users/jenkins/workspace/Lucene-Solr-6.x-MacOSX/solr/build.xml:233: The following error occurred while executing this line:
/Users/jenkins/workspace/Lucene-Solr-6.x-MacOSX/solr/common-build.xml:529: The following error occurred while executing this line:
/Users/jenkins/workspace/Lucene-Solr-6.x-MacOSX/lucene/common-build.xml:1457: The following error occurred while executing this line:
/Users/jenkins/workspace/Lucene-Solr-6.x-MacOSX/lucene/common-build.xml:1014: There were test failures: 598 suites (10 ignored), 2419 tests, 1 failure, 121 ignored (71 assumptions) [seed: 5A72266DCE952006]

Total time: 88 minutes 45 seconds
Build step 'Invoke Ant' marked build as failure
Archiving artifacts
[WARNINGS] Skipping publisher since build result is FAILURE
Recording test results
Email was triggered for: Failure - Any
Sending email for trigger: Failure - Any



Mime
View raw message