lucene-dev mailing list archives

Site index · List index
Message view « Date » · « Thread »
Top « Date » · « Thread »
From Policeman Jenkins Server <jenk...@thetaphi.de>
Subject [JENKINS] Lucene-Solr-master-Linux (32bit/jdk1.8.0_92) - Build # 16739 - Failure!
Date Sat, 14 May 2016 10:35:30 GMT
Build: http://jenkins.thetaphi.de/job/Lucene-Solr-master-Linux/16739/
Java: 32bit/jdk1.8.0_92 -client -XX:+UseG1GC

1 tests failed.
FAILED:  junit.framework.TestSuite.org.apache.solr.schema.TestManagedSchemaAPI

Error Message:
ObjectTracker found 1 object(s) that were not released!!! [MockDirectoryWrapper, MockDirectoryWrapper]

Stack Trace:
java.lang.AssertionError: ObjectTracker found 1 object(s) that were not released!!! [MockDirectoryWrapper, MockDirectoryWrapper]
	at __randomizedtesting.SeedInfo.seed([B898787F8948CB0D]:0)
	at org.junit.Assert.fail(Assert.java:93)
	at org.junit.Assert.assertTrue(Assert.java:43)
	at org.junit.Assert.assertNull(Assert.java:551)
	at org.apache.solr.SolrTestCaseJ4.afterClass(SolrTestCaseJ4.java:255)
	at sun.reflect.NativeMethodAccessorImpl.invoke0(Native Method)
	at sun.reflect.NativeMethodAccessorImpl.invoke(NativeMethodAccessorImpl.java:62)
	at sun.reflect.DelegatingMethodAccessorImpl.invoke(DelegatingMethodAccessorImpl.java:43)
	at java.lang.reflect.Method.invoke(Method.java:498)
	at com.carrotsearch.randomizedtesting.RandomizedRunner.invoke(RandomizedRunner.java:1764)
	at com.carrotsearch.randomizedtesting.RandomizedRunner$7.evaluate(RandomizedRunner.java:834)
	at com.carrotsearch.randomizedtesting.rules.StatementAdapter.evaluate(StatementAdapter.java:36)
	at com.carrotsearch.randomizedtesting.rules.SystemPropertiesRestoreRule$1.evaluate(SystemPropertiesRestoreRule.java:57)
	at org.apache.lucene.util.AbstractBeforeAfterRule$1.evaluate(AbstractBeforeAfterRule.java:45)
	at com.carrotsearch.randomizedtesting.rules.StatementAdapter.evaluate(StatementAdapter.java:36)
	at org.apache.lucene.util.TestRuleStoreClassName$1.evaluate(TestRuleStoreClassName.java:41)
	at com.carrotsearch.randomizedtesting.rules.NoShadowingOrOverridesOnMethodsRule$1.evaluate(NoShadowingOrOverridesOnMethodsRule.java:40)
	at com.carrotsearch.randomizedtesting.rules.NoShadowingOrOverridesOnMethodsRule$1.evaluate(NoShadowingOrOverridesOnMethodsRule.java:40)
	at com.carrotsearch.randomizedtesting.rules.StatementAdapter.evaluate(StatementAdapter.java:36)
	at com.carrotsearch.randomizedtesting.rules.StatementAdapter.evaluate(StatementAdapter.java:36)
	at com.carrotsearch.randomizedtesting.rules.StatementAdapter.evaluate(StatementAdapter.java:36)
	at org.apache.lucene.util.TestRuleAssertionsRequired$1.evaluate(TestRuleAssertionsRequired.java:53)
	at org.apache.lucene.util.TestRuleMarkFailure$1.evaluate(TestRuleMarkFailure.java:47)
	at org.apache.lucene.util.TestRuleIgnoreAfterMaxFailures$1.evaluate(TestRuleIgnoreAfterMaxFailures.java:64)
	at org.apache.lucene.util.TestRuleIgnoreTestSuites$1.evaluate(TestRuleIgnoreTestSuites.java:54)
	at com.carrotsearch.randomizedtesting.rules.StatementAdapter.evaluate(StatementAdapter.java:36)
	at com.carrotsearch.randomizedtesting.ThreadLeakControl$StatementRunner.run(ThreadLeakControl.java:367)
	at java.lang.Thread.run(Thread.java:745)




Build Log:
[...truncated 10720 lines...]
   [junit4] Suite: org.apache.solr.schema.TestManagedSchemaAPI
   [junit4]   2> Creating dataDir: /home/jenkins/workspace/Lucene-Solr-master-Linux/solr/build/solr-core/test/J1/temp/solr.schema.TestManagedSchemaAPI_B898787F8948CB0D-001/init-core-data-001
   [junit4]   2> 184901 INFO  (SUITE-TestManagedSchemaAPI-seed#[B898787F8948CB0D]-worker) [    ] o.a.s.SolrTestCaseJ4 Randomized ssl (true) and clientAuth (false)
   [junit4]   2> 184906 INFO  (SUITE-TestManagedSchemaAPI-seed#[B898787F8948CB0D]-worker) [    ] o.a.s.c.ZkTestServer STARTING ZK TEST SERVER
   [junit4]   2> 184906 INFO  (Thread-447) [    ] o.a.s.c.ZkTestServer client port:0.0.0.0/0.0.0.0:0
   [junit4]   2> 184906 INFO  (Thread-447) [    ] o.a.s.c.ZkTestServer Starting server
   [junit4]   2> 185006 INFO  (SUITE-TestManagedSchemaAPI-seed#[B898787F8948CB0D]-worker) [    ] o.a.s.c.ZkTestServer start zk server on port:33720
   [junit4]   2> 185006 INFO  (SUITE-TestManagedSchemaAPI-seed#[B898787F8948CB0D]-worker) [    ] o.a.s.c.c.SolrZkClient Using default ZkCredentialsProvider
   [junit4]   2> 185007 INFO  (SUITE-TestManagedSchemaAPI-seed#[B898787F8948CB0D]-worker) [    ] o.a.s.c.c.ConnectionManager Waiting for client to connect to ZooKeeper
   [junit4]   2> 185009 INFO  (zkCallback-278-thread-1) [    ] o.a.s.c.c.ConnectionManager Watcher org.apache.solr.common.cloud.ConnectionManager@8041ee name:ZooKeeperConnection Watcher:127.0.0.1:33720 got event WatchedEvent state:SyncConnected type:None path:null path:null type:None
   [junit4]   2> 185009 INFO  (SUITE-TestManagedSchemaAPI-seed#[B898787F8948CB0D]-worker) [    ] o.a.s.c.c.ConnectionManager Client is connected to ZooKeeper
   [junit4]   2> 185009 INFO  (SUITE-TestManagedSchemaAPI-seed#[B898787F8948CB0D]-worker) [    ] o.a.s.c.c.SolrZkClient Using default ZkACLProvider
   [junit4]   2> 185009 INFO  (SUITE-TestManagedSchemaAPI-seed#[B898787F8948CB0D]-worker) [    ] o.a.s.c.c.SolrZkClient makePath: /solr/solr.xml
   [junit4]   2> 185012 INFO  (SUITE-TestManagedSchemaAPI-seed#[B898787F8948CB0D]-worker) [    ] o.a.s.c.c.SolrZkClient makePath: /solr/clusterprops.json
   [junit4]   2> 185075 INFO  (jetty-launcher-277-thread-2) [    ] o.e.j.s.Server jetty-9.3.8.v20160314
   [junit4]   2> 185075 INFO  (jetty-launcher-277-thread-1) [    ] o.e.j.s.Server jetty-9.3.8.v20160314
   [junit4]   2> 185077 INFO  (jetty-launcher-277-thread-2) [    ] o.e.j.s.h.ContextHandler Started o.e.j.s.ServletContextHandler@974d3a{/solr,null,AVAILABLE}
   [junit4]   2> 185077 INFO  (jetty-launcher-277-thread-1) [    ] o.e.j.s.h.ContextHandler Started o.e.j.s.ServletContextHandler@1c15f7d{/solr,null,AVAILABLE}
   [junit4]   2> 185209 INFO  (jetty-launcher-277-thread-1) [    ] o.e.j.s.ServerConnector Started ServerConnector@1601369{SSL,[ssl, http/1.1]}{127.0.0.1:44945}
   [junit4]   2> 185209 INFO  (jetty-launcher-277-thread-2) [    ] o.e.j.s.ServerConnector Started ServerConnector@13a0f22{SSL,[ssl, http/1.1]}{127.0.0.1:46402}
   [junit4]   2> 185210 INFO  (jetty-launcher-277-thread-1) [    ] o.e.j.s.Server Started @186489ms
   [junit4]   2> 185210 INFO  (jetty-launcher-277-thread-2) [    ] o.e.j.s.Server Started @186489ms
   [junit4]   2> 185210 INFO  (jetty-launcher-277-thread-1) [    ] o.a.s.c.s.e.JettySolrRunner Jetty properties: {hostContext=/solr, hostPort=44945}
   [junit4]   2> 185210 INFO  (jetty-launcher-277-thread-2) [    ] o.a.s.c.s.e.JettySolrRunner Jetty properties: {hostContext=/solr, hostPort=46402}
   [junit4]   2> 185210 INFO  (jetty-launcher-277-thread-2) [    ] o.a.s.s.SolrDispatchFilter SolrDispatchFilter.init(): sun.misc.Launcher$AppClassLoader@1d16e93
   [junit4]   2> 185210 INFO  (jetty-launcher-277-thread-1) [    ] o.a.s.s.SolrDispatchFilter SolrDispatchFilter.init(): sun.misc.Launcher$AppClassLoader@1d16e93
   [junit4]   2> 185210 INFO  (jetty-launcher-277-thread-2) [    ] o.a.s.c.SolrResourceLoader new SolrResourceLoader for directory: '/home/jenkins/workspace/Lucene-Solr-master-Linux/solr/build/solr-core/test/J1/temp/solr.schema.TestManagedSchemaAPI_B898787F8948CB0D-001/tempDir-001/node2'
   [junit4]   2> 185210 INFO  (jetty-launcher-277-thread-1) [    ] o.a.s.c.SolrResourceLoader new SolrResourceLoader for directory: '/home/jenkins/workspace/Lucene-Solr-master-Linux/solr/build/solr-core/test/J1/temp/solr.schema.TestManagedSchemaAPI_B898787F8948CB0D-001/tempDir-001/node1'
   [junit4]   2> 185210 INFO  (jetty-launcher-277-thread-2) [    ] o.a.s.c.SolrResourceLoader JNDI not configured for solr (NoInitialContextEx)
   [junit4]   2> 185210 INFO  (jetty-launcher-277-thread-2) [    ] o.a.s.c.SolrResourceLoader solr home defaulted to 'solr/' (could not find system property or JNDI)
   [junit4]   2> 185210 INFO  (jetty-launcher-277-thread-1) [    ] o.a.s.c.SolrResourceLoader JNDI not configured for solr (NoInitialContextEx)
   [junit4]   2> 185210 INFO  (jetty-launcher-277-thread-1) [    ] o.a.s.c.SolrResourceLoader solr home defaulted to 'solr/' (could not find system property or JNDI)
   [junit4]   2> 185210 INFO  (jetty-launcher-277-thread-2) [    ] o.a.s.c.c.SolrZkClient Using default ZkCredentialsProvider
   [junit4]   2> 185210 INFO  (jetty-launcher-277-thread-1) [    ] o.a.s.c.c.SolrZkClient Using default ZkCredentialsProvider
   [junit4]   2> 185211 INFO  (jetty-launcher-277-thread-2) [    ] o.a.s.c.c.ConnectionManager Waiting for client to connect to ZooKeeper
   [junit4]   2> 185211 INFO  (jetty-launcher-277-thread-1) [    ] o.a.s.c.c.ConnectionManager Waiting for client to connect to ZooKeeper
   [junit4]   2> 185217 INFO  (zkCallback-279-thread-1) [    ] o.a.s.c.c.ConnectionManager Watcher org.apache.solr.common.cloud.ConnectionManager@95bb6b name:ZooKeeperConnection Watcher:127.0.0.1:33720/solr got event WatchedEvent state:SyncConnected type:None path:null path:null type:None
   [junit4]   2> 185217 INFO  (jetty-launcher-277-thread-2) [    ] o.a.s.c.c.ConnectionManager Client is connected to ZooKeeper
   [junit4]   2> 185217 INFO  (zkCallback-280-thread-1) [    ] o.a.s.c.c.ConnectionManager Watcher org.apache.solr.common.cloud.ConnectionManager@e03287 name:ZooKeeperConnection Watcher:127.0.0.1:33720/solr got event WatchedEvent state:SyncConnected type:None path:null path:null type:None
   [junit4]   2> 185217 INFO  (jetty-launcher-277-thread-1) [    ] o.a.s.c.c.ConnectionManager Client is connected to ZooKeeper
   [junit4]   2> 185217 INFO  (jetty-launcher-277-thread-2) [    ] o.a.s.c.c.SolrZkClient Using default ZkACLProvider
   [junit4]   2> 185217 INFO  (jetty-launcher-277-thread-1) [    ] o.a.s.c.c.SolrZkClient Using default ZkACLProvider
   [junit4]   2> 185218 INFO  (jetty-launcher-277-thread-2) [    ] o.a.s.s.SolrDispatchFilter solr.xml found in ZooKeeper. Loading...
   [junit4]   2> 185218 INFO  (jetty-launcher-277-thread-1) [    ] o.a.s.s.SolrDispatchFilter solr.xml found in ZooKeeper. Loading...
   [junit4]   2> 185231 INFO  (jetty-launcher-277-thread-1) [    ] o.a.s.c.CorePropertiesLocator Config-defined core root directory: /home/jenkins/workspace/Lucene-Solr-master-Linux/solr/build/solr-core/test/J1/temp/solr.schema.TestManagedSchemaAPI_B898787F8948CB0D-001/tempDir-001/node1/.
   [junit4]   2> 185231 INFO  (jetty-launcher-277-thread-1) [    ] o.a.s.c.CoreContainer New CoreContainer 2812562
   [junit4]   2> 185231 INFO  (jetty-launcher-277-thread-2) [    ] o.a.s.c.CorePropertiesLocator Config-defined core root directory: /home/jenkins/workspace/Lucene-Solr-master-Linux/solr/build/solr-core/test/J1/temp/solr.schema.TestManagedSchemaAPI_B898787F8948CB0D-001/tempDir-001/node2/.
   [junit4]   2> 185232 INFO  (jetty-launcher-277-thread-1) [    ] o.a.s.c.CoreContainer Loading cores into CoreContainer [instanceDir=/home/jenkins/workspace/Lucene-Solr-master-Linux/solr/build/solr-core/test/J1/temp/solr.schema.TestManagedSchemaAPI_B898787F8948CB0D-001/tempDir-001/node1]
   [junit4]   2> 185232 INFO  (jetty-launcher-277-thread-2) [    ] o.a.s.c.CoreContainer New CoreContainer 15139055
   [junit4]   2> 185232 INFO  (jetty-launcher-277-thread-2) [    ] o.a.s.c.CoreContainer Loading cores into CoreContainer [instanceDir=/home/jenkins/workspace/Lucene-Solr-master-Linux/solr/build/solr-core/test/J1/temp/solr.schema.TestManagedSchemaAPI_B898787F8948CB0D-001/tempDir-001/node2]
   [junit4]   2> 185232 WARN  (jetty-launcher-277-thread-1) [    ] o.a.s.c.CoreContainer Couldn't add files from /home/jenkins/workspace/Lucene-Solr-master-Linux/solr/build/solr-core/test/J1/temp/solr.schema.TestManagedSchemaAPI_B898787F8948CB0D-001/tempDir-001/node1/lib to classpath: /home/jenkins/workspace/Lucene-Solr-master-Linux/solr/build/solr-core/test/J1/temp/solr.schema.TestManagedSchemaAPI_B898787F8948CB0D-001/tempDir-001/node1/lib
   [junit4]   2> 185232 WARN  (jetty-launcher-277-thread-2) [    ] o.a.s.c.CoreContainer Couldn't add files from /home/jenkins/workspace/Lucene-Solr-master-Linux/solr/build/solr-core/test/J1/temp/solr.schema.TestManagedSchemaAPI_B898787F8948CB0D-001/tempDir-001/node2/lib to classpath: /home/jenkins/workspace/Lucene-Solr-master-Linux/solr/build/solr-core/test/J1/temp/solr.schema.TestManagedSchemaAPI_B898787F8948CB0D-001/tempDir-001/node2/lib
   [junit4]   2> 185232 INFO  (jetty-launcher-277-thread-2) [    ] o.a.s.h.c.HttpShardHandlerFactory created with socketTimeout : 90000,urlScheme : https,connTimeout : 15000,maxConnectionsPerHost : 20,maxConnections : 10000,corePoolSize : 0,maximumPoolSize : 2147483647,maxThreadIdleTime : 5,sizeOfQueue : -1,fairnessPolicy : false,
   [junit4]   2> 185232 INFO  (jetty-launcher-277-thread-1) [    ] o.a.s.h.c.HttpShardHandlerFactory created with socketTimeout : 90000,urlScheme : https,connTimeout : 15000,maxConnectionsPerHost : 20,maxConnections : 10000,corePoolSize : 0,maximumPoolSize : 2147483647,maxThreadIdleTime : 5,sizeOfQueue : -1,fairnessPolicy : false,
   [junit4]   2> 185234 INFO  (jetty-launcher-277-thread-1) [    ] o.a.s.u.UpdateShardHandler Creating UpdateShardHandler HTTP client with params: 
   [junit4]   2> 185234 INFO  (jetty-launcher-277-thread-2) [    ] o.a.s.u.UpdateShardHandler Creating UpdateShardHandler HTTP client with params: 
   [junit4]   2> 185235 INFO  (jetty-launcher-277-thread-2) [    ] o.a.s.l.LogWatcher SLF4J impl is org.slf4j.impl.Log4jLoggerFactory
   [junit4]   2> 185235 INFO  (jetty-launcher-277-thread-2) [    ] o.a.s.l.LogWatcher Registering Log Listener [Log4j (org.slf4j.impl.Log4jLoggerFactory)]
   [junit4]   2> 185235 INFO  (jetty-launcher-277-thread-2) [    ] o.a.s.c.ZkContainer Zookeeper client=127.0.0.1:33720/solr
   [junit4]   2> 185235 INFO  (jetty-launcher-277-thread-2) [    ] o.a.s.c.ZkController zkHost includes chroot
   [junit4]   2> 185235 INFO  (jetty-launcher-277-thread-1) [    ] o.a.s.l.LogWatcher SLF4J impl is org.slf4j.impl.Log4jLoggerFactory
   [junit4]   2> 185235 INFO  (jetty-launcher-277-thread-2) [    ] o.a.s.c.c.SolrZkClient Using default ZkCredentialsProvider
   [junit4]   2> 185235 INFO  (jetty-launcher-277-thread-1) [    ] o.a.s.l.LogWatcher Registering Log Listener [Log4j (org.slf4j.impl.Log4jLoggerFactory)]
   [junit4]   2> 185235 INFO  (jetty-launcher-277-thread-1) [    ] o.a.s.c.ZkContainer Zookeeper client=127.0.0.1:33720/solr
   [junit4]   2> 185235 INFO  (jetty-launcher-277-thread-1) [    ] o.a.s.c.ZkController zkHost includes chroot
   [junit4]   2> 185236 INFO  (jetty-launcher-277-thread-1) [    ] o.a.s.c.c.SolrZkClient Using default ZkCredentialsProvider
   [junit4]   2> 185236 INFO  (jetty-launcher-277-thread-2) [    ] o.a.s.c.c.ConnectionManager Waiting for client to connect to ZooKeeper
   [junit4]   2> 185242 INFO  (jetty-launcher-277-thread-1) [    ] o.a.s.c.c.ConnectionManager Waiting for client to connect to ZooKeeper
   [junit4]   2> 185243 INFO  (zkCallback-285-thread-1) [    ] o.a.s.c.c.ConnectionManager Watcher org.apache.solr.common.cloud.ConnectionManager@1b3fb5a name:ZooKeeperConnection Watcher:127.0.0.1:33720 got event WatchedEvent state:SyncConnected type:None path:null path:null type:None
   [junit4]   2> 185243 INFO  (jetty-launcher-277-thread-2) [    ] o.a.s.c.c.ConnectionManager Client is connected to ZooKeeper
   [junit4]   2> 185243 INFO  (jetty-launcher-277-thread-2) [    ] o.a.s.c.c.SolrZkClient Using default ZkACLProvider
   [junit4]   2> 185243 INFO  (zkCallback-286-thread-1) [    ] o.a.s.c.c.ConnectionManager Watcher org.apache.solr.common.cloud.ConnectionManager@1b8774b name:ZooKeeperConnection Watcher:127.0.0.1:33720 got event WatchedEvent state:SyncConnected type:None path:null path:null type:None
   [junit4]   2> 185244 INFO  (jetty-launcher-277-thread-1) [    ] o.a.s.c.c.ConnectionManager Client is connected to ZooKeeper
   [junit4]   2> 185244 INFO  (jetty-launcher-277-thread-1) [    ] o.a.s.c.c.SolrZkClient Using default ZkACLProvider
   [junit4]   2> 185244 WARN  (NIOServerCxn.Factory:0.0.0.0/0.0.0.0:0) [    ] o.a.z.s.NIOServerCnxn caught end of stream exception
   [junit4]   2> EndOfStreamException: Unable to read additional data from client sessionid 0x154aeb419700003, likely client has closed socket
   [junit4]   2> 	at org.apache.zookeeper.server.NIOServerCnxn.doIO(NIOServerCnxn.java:228)
   [junit4]   2> 	at org.apache.zookeeper.server.NIOServerCnxnFactory.run(NIOServerCnxnFactory.java:208)
   [junit4]   2> 	at java.lang.Thread.run(Thread.java:745)
   [junit4]   2> 185244 INFO  (jetty-launcher-277-thread-2) [n:127.0.0.1:46402_solr    ] o.a.s.c.ZkController Added new OnReconnect listener org.apache.solr.cloud.ZkController$$Lambda$9/11240484@1031df6
   [junit4]   2> 185245 WARN  (NIOServerCxn.Factory:0.0.0.0/0.0.0.0:0) [    ] o.a.z.s.NIOServerCnxn caught end of stream exception
   [junit4]   2> EndOfStreamException: Unable to read additional data from client sessionid 0x154aeb419700004, likely client has closed socket
   [junit4]   2> 	at org.apache.zookeeper.server.NIOServerCnxn.doIO(NIOServerCnxn.java:228)
   [junit4]   2> 	at org.apache.zookeeper.server.NIOServerCnxnFactory.run(NIOServerCnxnFactory.java:208)
   [junit4]   2> 	at java.lang.Thread.run(Thread.java:745)
   [junit4]   2> 185245 INFO  (jetty-launcher-277-thread-2) [n:127.0.0.1:46402_solr    ] o.a.s.c.c.ConnectionManager Waiting for client to connect to ZooKeeper
   [junit4]   2> 185246 INFO  (jetty-launcher-277-thread-1) [n:127.0.0.1:44945_solr    ] o.a.s.c.ZkController Added new OnReconnect listener org.apache.solr.cloud.ZkController$$Lambda$9/11240484@1dc2bbf
   [junit4]   2> 185246 INFO  (zkCallback-287-thread-1-processing-n:127.0.0.1:46402_solr) [n:127.0.0.1:46402_solr    ] o.a.s.c.c.ConnectionManager Watcher org.apache.solr.common.cloud.ConnectionManager@79df84 name:ZooKeeperConnection Watcher:127.0.0.1:33720/solr got event WatchedEvent state:SyncConnected type:None path:null path:null type:None
   [junit4]   2> 185246 INFO  (jetty-launcher-277-thread-2) [n:127.0.0.1:46402_solr    ] o.a.s.c.c.ConnectionManager Client is connected to ZooKeeper
   [junit4]   2> 185246 INFO  (jetty-launcher-277-thread-1) [n:127.0.0.1:44945_solr    ] o.a.s.c.c.ConnectionManager Waiting for client to connect to ZooKeeper
   [junit4]   2> 185247 INFO  (jetty-launcher-277-thread-2) [n:127.0.0.1:46402_solr    ] o.a.s.c.c.SolrZkClient makePath: /overseer/queue
   [junit4]   2> 185248 INFO  (zkCallback-288-thread-1-processing-n:127.0.0.1:44945_solr) [n:127.0.0.1:44945_solr    ] o.a.s.c.c.ConnectionManager Watcher org.apache.solr.common.cloud.ConnectionManager@4675b3 name:ZooKeeperConnection Watcher:127.0.0.1:33720/solr got event WatchedEvent state:SyncConnected type:None path:null path:null type:None
   [junit4]   2> 185248 INFO  (jetty-launcher-277-thread-1) [n:127.0.0.1:44945_solr    ] o.a.s.c.c.ConnectionManager Client is connected to ZooKeeper
   [junit4]   2> 185249 INFO  (jetty-launcher-277-thread-2) [n:127.0.0.1:46402_solr    ] o.a.s.c.c.SolrZkClient makePath: /overseer/collection-queue-work
   [junit4]   2> 185249 INFO  (jetty-launcher-277-thread-1) [n:127.0.0.1:44945_solr    ] o.a.s.c.c.SolrZkClient makePath: /overseer/collection-queue-work
   [junit4]   2> 185252 INFO  (jetty-launcher-277-thread-2) [n:127.0.0.1:46402_solr    ] o.a.s.c.c.SolrZkClient makePath: /overseer/collection-map-running
   [junit4]   2> 185253 INFO  (jetty-launcher-277-thread-1) [n:127.0.0.1:44945_solr    ] o.a.s.c.c.SolrZkClient makePath: /overseer/collection-map-running
   [junit4]   2> 185254 INFO  (jetty-launcher-277-thread-2) [n:127.0.0.1:46402_solr    ] o.a.s.c.c.SolrZkClient makePath: /overseer/collection-map-completed
   [junit4]   2> 185254 INFO  (jetty-launcher-277-thread-1) [n:127.0.0.1:44945_solr    ] o.a.s.c.c.SolrZkClient makePath: /overseer/collection-map-completed
   [junit4]   2> 185255 INFO  (jetty-launcher-277-thread-2) [n:127.0.0.1:46402_solr    ] o.a.s.c.c.SolrZkClient makePath: /overseer/collection-map-failure
   [junit4]   2> 185256 INFO  (jetty-launcher-277-thread-1) [n:127.0.0.1:44945_solr    ] o.a.s.c.c.SolrZkClient makePath: /overseer/collection-map-failure
   [junit4]   2> 185256 INFO  (jetty-launcher-277-thread-2) [n:127.0.0.1:46402_solr    ] o.a.s.c.c.SolrZkClient makePath: /live_nodes
   [junit4]   2> 185257 INFO  (jetty-launcher-277-thread-1) [n:127.0.0.1:44945_solr    ] o.a.s.c.c.SolrZkClient makePath: /live_nodes
   [junit4]   2> 185257 INFO  (jetty-launcher-277-thread-2) [n:127.0.0.1:46402_solr    ] o.a.s.c.c.SolrZkClient makePath: /collections
   [junit4]   2> 185257 INFO  (jetty-launcher-277-thread-1) [n:127.0.0.1:44945_solr    ] o.a.s.c.c.SolrZkClient makePath: /collections
   [junit4]   2> 185258 INFO  (jetty-launcher-277-thread-1) [n:127.0.0.1:44945_solr    ] o.a.s.c.c.SolrZkClient makePath: /aliases.json
   [junit4]   2> 185258 INFO  (jetty-launcher-277-thread-2) [n:127.0.0.1:46402_solr    ] o.a.s.c.c.SolrZkClient makePath: /aliases.json
   [junit4]   2> 185259 INFO  (jetty-launcher-277-thread-2) [n:127.0.0.1:46402_solr    ] o.a.s.c.c.SolrZkClient makePath: /clusterstate.json
   [junit4]   2> 185259 INFO  (jetty-launcher-277-thread-1) [n:127.0.0.1:44945_solr    ] o.a.s.c.c.SolrZkClient makePath: /clusterstate.json
   [junit4]   2> 185260 INFO  (jetty-launcher-277-thread-2) [n:127.0.0.1:46402_solr    ] o.a.s.c.c.SolrZkClient makePath: /security.json
   [junit4]   2> 185260 INFO  (jetty-launcher-277-thread-1) [n:127.0.0.1:44945_solr    ] o.a.s.c.c.SolrZkClient makePath: /security.json
   [junit4]   2> 185260 INFO  (jetty-launcher-277-thread-1) [n:127.0.0.1:44945_solr    ] o.a.s.c.c.ZkStateReader Updating cluster state from ZooKeeper... 
   [junit4]   2> 185261 INFO  (jetty-launcher-277-thread-2) [n:127.0.0.1:46402_solr    ] o.a.s.c.c.ZkStateReader Updating cluster state from ZooKeeper... 
   [junit4]   2> 185261 INFO  (jetty-launcher-277-thread-1) [n:127.0.0.1:44945_solr    ] o.a.s.c.c.ZkStateReader Loaded cluster properties: {urlScheme=https}
   [junit4]   2> 185261 INFO  (jetty-launcher-277-thread-2) [n:127.0.0.1:46402_solr    ] o.a.s.c.c.ZkStateReader Loaded cluster properties: {urlScheme=https}
   [junit4]   2> 185261 INFO  (jetty-launcher-277-thread-1) [n:127.0.0.1:44945_solr    ] o.a.s.c.c.ZkStateReader Updated live nodes from ZooKeeper... (0) -> (0)
   [junit4]   2> 185261 INFO  (jetty-launcher-277-thread-2) [n:127.0.0.1:46402_solr    ] o.a.s.c.c.ZkStateReader Updated live nodes from ZooKeeper... (0) -> (0)
   [junit4]   2> 185264 INFO  (jetty-launcher-277-thread-2) [n:127.0.0.1:46402_solr    ] o.a.s.c.c.SolrZkClient makePath: /overseer_elect
   [junit4]   2> 185264 INFO  (jetty-launcher-277-thread-1) [n:127.0.0.1:44945_solr    ] o.a.s.c.c.SolrZkClient makePath: /overseer_elect
   [junit4]   2> 185286 INFO  (jetty-launcher-277-thread-1) [n:127.0.0.1:44945_solr    ] o.a.s.c.c.SolrZkClient makePath: /overseer_elect/election
   [junit4]   2> 185286 INFO  (jetty-launcher-277-thread-2) [n:127.0.0.1:46402_solr    ] o.a.s.c.c.SolrZkClient makePath: /overseer_elect/election
   [junit4]   2> 185287 INFO  (jetty-launcher-277-thread-2) [n:127.0.0.1:46402_solr    ] o.a.s.c.Overseer Overseer (id=null) closing
   [junit4]   2> 185287 INFO  (jetty-launcher-277-thread-1) [n:127.0.0.1:44945_solr    ] o.a.s.c.Overseer Overseer (id=null) closing
   [junit4]   2> 185288 INFO  (jetty-launcher-277-thread-2) [n:127.0.0.1:46402_solr    ] o.a.s.c.LeaderElector Joined leadership election with path: /overseer_elect/election/95893580625739781-127.0.0.1:46402_solr-n_0000000000
   [junit4]   2> 185288 INFO  (jetty-launcher-277-thread-1) [n:127.0.0.1:44945_solr    ] o.a.s.c.LeaderElector Joined leadership election with path: /overseer_elect/election/95893580625739782-127.0.0.1:44945_solr-n_0000000001
   [junit4]   2> 185288 INFO  (jetty-launcher-277-thread-2) [n:127.0.0.1:46402_solr    ] o.a.s.c.OverseerElectionContext I am going to be the leader 127.0.0.1:46402_solr
   [junit4]   2> 185288 INFO  (jetty-launcher-277-thread-2) [n:127.0.0.1:46402_solr    ] o.a.s.c.c.SolrZkClient makePath: /overseer_elect/leader
   [junit4]   2> 185288 INFO  (jetty-launcher-277-thread-1) [n:127.0.0.1:44945_solr    ] o.a.s.c.LeaderElector Watching path /overseer_elect/election/95893580625739781-127.0.0.1:46402_solr-n_0000000000 to know if I could be the leader
   [junit4]   2> 185288 INFO  (jetty-launcher-277-thread-1) [n:127.0.0.1:44945_solr    ] o.a.s.c.ZkController Register node as live in ZooKeeper:/live_nodes/127.0.0.1:44945_solr
   [junit4]   2> 185289 INFO  (jetty-launcher-277-thread-1) [n:127.0.0.1:44945_solr    ] o.a.s.c.c.SolrZkClient makePath: /live_nodes/127.0.0.1:44945_solr
   [junit4]   2> 185289 INFO  (jetty-launcher-277-thread-2) [n:127.0.0.1:46402_solr    ] o.a.s.c.Overseer Overseer (id=95893580625739781-127.0.0.1:46402_solr-n_0000000000) starting
   [junit4]   2> 185290 INFO  (zkCallback-287-thread-1-processing-n:127.0.0.1:46402_solr) [n:127.0.0.1:46402_solr    ] o.a.s.c.c.ZkStateReader A live node change: [WatchedEvent state:SyncConnected type:NodeChildrenChanged path:/live_nodes], has occurred - updating... (live nodes size: [0])
   [junit4]   2> 185290 INFO  (zkCallback-288-thread-1-processing-n:127.0.0.1:44945_solr) [n:127.0.0.1:44945_solr    ] o.a.s.c.c.ZkStateReader A live node change: [WatchedEvent state:SyncConnected type:NodeChildrenChanged path:/live_nodes], has occurred - updating... (live nodes size: [0])
   [junit4]   2> 185290 INFO  (zkCallback-288-thread-1-processing-n:127.0.0.1:44945_solr) [n:127.0.0.1:44945_solr    ] o.a.s.c.c.ZkStateReader Updated live nodes from ZooKeeper... (0) -> (1)
   [junit4]   2> 185291 INFO  (zkCallback-287-thread-1-processing-n:127.0.0.1:46402_solr) [n:127.0.0.1:46402_solr    ] o.a.s.c.c.ZkStateReader Updated live nodes from ZooKeeper... (0) -> (1)
   [junit4]   2> 185291 INFO  (jetty-launcher-277-thread-2) [n:127.0.0.1:46402_solr    ] o.a.s.c.c.SolrZkClient makePath: /overseer/queue-work
   [junit4]   2> 185295 INFO  (jetty-launcher-277-thread-2) [n:127.0.0.1:46402_solr    ] o.a.s.c.OverseerAutoReplicaFailoverThread Starting OverseerAutoReplicaFailoverThread autoReplicaFailoverWorkLoopDelay=10000 autoReplicaFailoverWaitAfterExpiration=30000 autoReplicaFailoverBadNodeExpiration=60000
   [junit4]   2> 185295 INFO  (OverseerCollectionConfigSetProcessor-95893580625739781-127.0.0.1:46402_solr-n_0000000000) [n:127.0.0.1:46402_solr    ] o.a.s.c.OverseerTaskProcessor Process current queue of overseer operations
   [junit4]   2> 185296 INFO  (OverseerStateUpdate-95893580625739781-127.0.0.1:46402_solr-n_0000000000) [n:127.0.0.1:46402_solr    ] o.a.s.c.Overseer Starting to work on the main queue
   [junit4]   2> 185296 INFO  (jetty-launcher-277-thread-2) [n:127.0.0.1:46402_solr    ] o.a.s.c.ZkController Publish node=127.0.0.1:46402_solr as DOWN
   [junit4]   2> 185298 INFO  (OverseerStateUpdate-95893580625739781-127.0.0.1:46402_solr-n_0000000000) [n:127.0.0.1:46402_solr    ] o.a.s.c.c.ZkStateReader Updated live nodes from ZooKeeper... (1) -> (1)
   [junit4]   2> 185299 INFO  (OverseerStateUpdate-95893580625739781-127.0.0.1:46402_solr-n_0000000000) [n:127.0.0.1:46402_solr    ] o.a.s.c.Overseer processMessage: queueSize: 1, message = {
   [junit4]   2>   "operation":"downnode",
   [junit4]   2>   "node_name":"127.0.0.1:46402_solr"} current state version: 0
   [junit4]   2> 185299 INFO  (OverseerStateUpdate-95893580625739781-127.0.0.1:46402_solr-n_0000000000) [n:127.0.0.1:46402_solr    ] o.a.s.c.o.NodeMutator DownNode state invoked for node: 127.0.0.1:46402_solr
   [junit4]   2> 185345 INFO  (jetty-launcher-277-thread-1) [n:127.0.0.1:44945_solr    ] o.a.s.c.CoreContainer Security conf doesn't exist. Skipping setup for authorization module.
   [junit4]   2> 185345 INFO  (jetty-launcher-277-thread-1) [n:127.0.0.1:44945_solr    ] o.a.s.c.CoreContainer No authentication plugin used.
   [junit4]   2> 185346 INFO  (jetty-launcher-277-thread-1) [n:127.0.0.1:44945_solr    ] o.a.s.c.CorePropertiesLocator Looking for core definitions underneath /home/jenkins/workspace/Lucene-Solr-master-Linux/solr/build/solr-core/test/J1/temp/solr.schema.TestManagedSchemaAPI_B898787F8948CB0D-001/tempDir-001/node1/.
   [junit4]   2> 185347 INFO  (jetty-launcher-277-thread-1) [n:127.0.0.1:44945_solr    ] o.a.s.c.CorePropertiesLocator Found 0 core definitions
   [junit4]   2> 185347 INFO  (jetty-launcher-277-thread-1) [n:127.0.0.1:44945_solr    ] o.a.s.s.SolrDispatchFilter user.dir=/home/jenkins/workspace/Lucene-Solr-master-Linux/solr/build/solr-core/test/J1
   [junit4]   2> 185347 INFO  (jetty-launcher-277-thread-1) [n:127.0.0.1:44945_solr    ] o.a.s.s.SolrDispatchFilter SolrDispatchFilter.init() done
   [junit4]   2> 186298 INFO  (jetty-launcher-277-thread-2) [n:127.0.0.1:46402_solr    ] o.a.s.c.ZkController Register node as live in ZooKeeper:/live_nodes/127.0.0.1:46402_solr
   [junit4]   2> 186299 INFO  (jetty-launcher-277-thread-2) [n:127.0.0.1:46402_solr    ] o.a.s.c.c.SolrZkClient makePath: /live_nodes/127.0.0.1:46402_solr
   [junit4]   2> 186299 INFO  (zkCallback-288-thread-1-processing-n:127.0.0.1:44945_solr) [n:127.0.0.1:44945_solr    ] o.a.s.c.c.ZkStateReader A live node change: [WatchedEvent state:SyncConnected type:NodeChildrenChanged path:/live_nodes], has occurred - updating... (live nodes size: [1])
   [junit4]   2> 186299 INFO  (zkCallback-287-thread-1-processing-n:127.0.0.1:46402_solr) [n:127.0.0.1:46402_solr    ] o.a.s.c.c.ZkStateReader A live node change: [WatchedEvent state:SyncConnected type:NodeChildrenChanged path:/live_nodes], has occurred - updating... (live nodes size: [1])
   [junit4]   2> 186300 INFO  (zkCallback-288-thread-1-processing-n:127.0.0.1:44945_solr) [n:127.0.0.1:44945_solr    ] o.a.s.c.c.ZkStateReader Updated live nodes from ZooKeeper... (1) -> (2)
   [junit4]   2> 186300 INFO  (zkCallback-287-thread-1-processing-n:127.0.0.1:46402_solr) [n:127.0.0.1:46402_solr    ] o.a.s.c.c.ZkStateReader Updated live nodes from ZooKeeper... (1) -> (2)
   [junit4]   2> 186339 INFO  (jetty-launcher-277-thread-2) [n:127.0.0.1:46402_solr    ] o.a.s.c.CoreContainer Security conf doesn't exist. Skipping setup for authorization module.
   [junit4]   2> 186340 INFO  (jetty-launcher-277-thread-2) [n:127.0.0.1:46402_solr    ] o.a.s.c.CoreContainer No authentication plugin used.
   [junit4]   2> 186340 INFO  (jetty-launcher-277-thread-2) [n:127.0.0.1:46402_solr    ] o.a.s.c.CorePropertiesLocator Looking for core definitions underneath /home/jenkins/workspace/Lucene-Solr-master-Linux/solr/build/solr-core/test/J1/temp/solr.schema.TestManagedSchemaAPI_B898787F8948CB0D-001/tempDir-001/node2/.
   [junit4]   2> 186340 INFO  (jetty-launcher-277-thread-2) [n:127.0.0.1:46402_solr    ] o.a.s.c.CorePropertiesLocator Found 0 core definitions
   [junit4]   2> 186341 INFO  (jetty-launcher-277-thread-2) [n:127.0.0.1:46402_solr    ] o.a.s.s.SolrDispatchFilter user.dir=/home/jenkins/workspace/Lucene-Solr-master-Linux/solr/build/solr-core/test/J1
   [junit4]   2> 186341 INFO  (jetty-launcher-277-thread-2) [n:127.0.0.1:46402_solr    ] o.a.s.s.SolrDispatchFilter SolrDispatchFilter.init() done
   [junit4]   2> 186341 INFO  (SUITE-TestManagedSchemaAPI-seed#[B898787F8948CB0D]-worker) [    ] o.a.s.c.c.SolrZkClient Using default ZkCredentialsProvider
   [junit4]   2> 186342 INFO  (SUITE-TestManagedSchemaAPI-seed#[B898787F8948CB0D]-worker) [    ] o.a.s.c.c.ConnectionManager Waiting for client to connect to ZooKeeper
   [junit4]   2> 186345 INFO  (zkCallback-291-thread-1) [    ] o.a.s.c.c.ConnectionManager Watcher org.apache.solr.common.cloud.ConnectionManager@14b36e2 name:ZooKeeperConnection Watcher:127.0.0.1:33720 got event WatchedEvent state:SyncConnected type:None path:null path:null type:None
   [junit4]   2> 186345 INFO  (SUITE-TestManagedSchemaAPI-seed#[B898787F8948CB0D]-worker) [    ] o.a.s.c.c.ConnectionManager Client is connected to ZooKeeper
   [junit4]   2> 186346 INFO  (SUITE-TestManagedSchemaAPI-seed#[B898787F8948CB0D]-worker) [    ] o.a.s.c.c.SolrZkClient Using default ZkACLProvider
   [junit4]   2> 186347 INFO  (SUITE-TestManagedSchemaAPI-seed#[B898787F8948CB0D]-worker) [    ] o.a.s.c.s.i.CloudSolrClient Final constructed zkHost string: 127.0.0.1:33720/solr
   [junit4]   2> 186348 INFO  (SUITE-TestManagedSchemaAPI-seed#[B898787F8948CB0D]-worker) [    ] o.a.s.c.c.SolrZkClient Using default ZkCredentialsProvider
   [junit4]   2> 186348 INFO  (SUITE-TestManagedSchemaAPI-seed#[B898787F8948CB0D]-worker) [    ] o.a.s.c.c.ConnectionManager Waiting for client to connect to ZooKeeper
   [junit4]   2> 186349 INFO  (zkCallback-294-thread-1) [    ] o.a.s.c.c.ConnectionManager Watcher org.apache.solr.common.cloud.ConnectionManager@1bd2b0f name:ZooKeeperConnection Watcher:127.0.0.1:33720/solr got event WatchedEvent state:SyncConnected type:None path:null path:null type:None
   [junit4]   2> 186349 INFO  (SUITE-TestManagedSchemaAPI-seed#[B898787F8948CB0D]-worker) [    ] o.a.s.c.c.ConnectionManager Client is connected to ZooKeeper
   [junit4]   2> 186349 INFO  (SUITE-TestManagedSchemaAPI-seed#[B898787F8948CB0D]-worker) [    ] o.a.s.c.c.SolrZkClient Using default ZkACLProvider
   [junit4]   2> 186349 INFO  (SUITE-TestManagedSchemaAPI-seed#[B898787F8948CB0D]-worker) [    ] o.a.s.c.c.ZkStateReader Updating cluster state from ZooKeeper... 
   [junit4]   2> 186349 INFO  (SUITE-TestManagedSchemaAPI-seed#[B898787F8948CB0D]-worker) [    ] o.a.s.c.c.ZkStateReader Loaded cluster properties: {urlScheme=https}
   [junit4]   2> 186350 INFO  (SUITE-TestManagedSchemaAPI-seed#[B898787F8948CB0D]-worker) [    ] o.a.s.c.c.ZkStateReader Updated live nodes from ZooKeeper... (0) -> (2)
   [junit4]   2> 186351 INFO  (SUITE-TestManagedSchemaAPI-seed#[B898787F8948CB0D]-worker) [    ] o.a.s.c.c.SolrZkClient makePath: /configs/conf1/solrconfig.xml
   [junit4]   2> 186352 INFO  (SUITE-TestManagedSchemaAPI-seed#[B898787F8948CB0D]-worker) [    ] o.a.s.c.c.SolrZkClient makePath: /configs/conf1/managed-schema
   [junit4]   2> 186366 INFO  (TEST-TestManagedSchemaAPI.test-seed#[B898787F8948CB0D]) [    ] o.a.s.SolrTestCaseJ4 ###Starting test
   [junit4]   2> 186467 INFO  (qtp26030903-1623) [n:127.0.0.1:44945_solr    ] o.a.s.h.a.CollectionsHandler Invoked Collection Action :create with params replicationFactor=2&collection.configName=conf1&name=testschemaapi&action=CREATE&numShards=1&wt=javabin&version=2 and sendToOCPQueue=true
   [junit4]   2> 186470 INFO  (OverseerCollectionConfigSetProcessor-95893580625739781-127.0.0.1:46402_solr-n_0000000000) [n:127.0.0.1:46402_solr    ] o.a.s.c.OverseerTaskProcessor Overseer Collection Message Handler: Get the message id:/overseer/collection-queue-work/qn-0000000000 message:{
   [junit4]   2>   "name":"testschemaapi",
   [junit4]   2>   "fromApi":"true",
   [junit4]   2>   "replicationFactor":"2",
   [junit4]   2>   "collection.configName":"conf1",
   [junit4]   2>   "numShards":"1",
   [junit4]   2>   "stateFormat":"2",
   [junit4]   2>   "operation":"create"}
   [junit4]   2> 186470 INFO  (OverseerThreadFactory-564-thread-1-processing-n:127.0.0.1:46402_solr) [n:127.0.0.1:46402_solr    ] o.a.s.c.OverseerCollectionMessageHandler OverseerCollectionMessageHandler.processMessage : create , {
   [junit4]   2>   "name":"testschemaapi",
   [junit4]   2>   "fromApi":"true",
   [junit4]   2>   "replicationFactor":"2",
   [junit4]   2>   "collection.configName":"conf1",
   [junit4]   2>   "numShards":"1",
   [junit4]   2>   "stateFormat":"2",
   [junit4]   2>   "operation":"create"}
   [junit4]   2> 186471 INFO  (OverseerThreadFactory-564-thread-1-processing-n:127.0.0.1:46402_solr) [n:127.0.0.1:46402_solr    ] o.a.s.c.OverseerCollectionMessageHandler Create collection testschemaapi
   [junit4]   2> 186471 INFO  (OverseerThreadFactory-564-thread-1-processing-n:127.0.0.1:46402_solr) [n:127.0.0.1:46402_solr    ] o.a.s.c.OverseerCollectionMessageHandler creating collections conf node /collections/testschemaapi 
   [junit4]   2> 186471 INFO  (OverseerThreadFactory-564-thread-1-processing-n:127.0.0.1:46402_solr) [n:127.0.0.1:46402_solr    ] o.a.s.c.c.SolrZkClient makePath: /collections/testschemaapi
   [junit4]   2> 186472 INFO  (zkCallback-287-thread-1-processing-n:127.0.0.1:46402_solr) [n:127.0.0.1:46402_solr    ] o.a.s.c.c.ZkStateReader A collections change: [WatchedEvent state:SyncConnected type:NodeChildrenChanged path:/collections], has occurred - updating...
   [junit4]   2> 186472 INFO  (zkCallback-288-thread-1-processing-n:127.0.0.1:44945_solr) [n:127.0.0.1:44945_solr    ] o.a.s.c.c.ZkStateReader A collections change: [WatchedEvent state:SyncConnected type:NodeChildrenChanged path:/collections], has occurred - updating...
   [junit4]   2> 186472 INFO  (zkCallback-294-thread-1) [    ] o.a.s.c.c.ZkStateReader A collections change: [WatchedEvent state:SyncConnected type:NodeChildrenChanged path:/collections], has occurred - updating...
   [junit4]   2> 186475 INFO  (OverseerStateUpdate-95893580625739781-127.0.0.1:46402_solr-n_0000000000) [n:127.0.0.1:46402_solr    ] o.a.s.c.Overseer processMessage: queueSize: 1, message = {
   [junit4]   2>   "name":"testschemaapi",
   [junit4]   2>   "fromApi":"true",
   [junit4]   2>   "replicationFactor":"2",
   [junit4]   2>   "collection.configName":"conf1",
   [junit4]   2>   "numShards":"1",
   [junit4]   2>   "stateFormat":"2",
   [junit4]   2>   "operation":"create"} current state version: 0
   [junit4]   2> 186476 INFO  (OverseerStateUpdate-95893580625739781-127.0.0.1:46402_solr-n_0000000000) [n:127.0.0.1:46402_solr    ] o.a.s.c.o.ClusterStateMutator building a new cName: testschemaapi
   [junit4]   2> 186476 INFO  (OverseerStateUpdate-95893580625739781-127.0.0.1:46402_solr-n_0000000000) [n:127.0.0.1:46402_solr    ] o.a.s.c.o.ZkStateWriter going to create_collection /collections/testschemaapi/state.json
   [junit4]   2> 186574 INFO  (OverseerThreadFactory-564-thread-1-processing-n:127.0.0.1:46402_solr) [n:127.0.0.1:46402_solr    ] o.a.s.c.OverseerCollectionMessageHandler Creating SolrCores for new collection testschemaapi, shardNames [shard1] , replicationFactor : 2
   [junit4]   2> 186575 INFO  (OverseerThreadFactory-564-thread-1-processing-n:127.0.0.1:46402_solr) [n:127.0.0.1:46402_solr    ] o.a.s.c.OverseerCollectionMessageHandler Creating core testschemaapi_shard1_replica2 as part of shard shard1 of collection testschemaapi on 127.0.0.1:46402_solr
   [junit4]   2> 186575 INFO  (OverseerThreadFactory-564-thread-1-processing-n:127.0.0.1:46402_solr) [n:127.0.0.1:46402_solr    ] o.a.s.c.OverseerCollectionMessageHandler Creating core testschemaapi_shard1_replica1 as part of shard shard1 of collection testschemaapi on 127.0.0.1:44945_solr
   [junit4]   2> 186590 INFO  (qtp26030903-1615) [n:127.0.0.1:44945_solr    ] o.a.s.h.a.CoreAdminOperation core create command qt=/admin/cores&collection.configName=conf1&name=testschemaapi_shard1_replica1&action=CREATE&numShards=1&collection=testschemaapi&shard=shard1&wt=javabin&version=2
   [junit4]   2> 186590 INFO  (qtp26030903-1615) [n:127.0.0.1:44945_solr    ] o.a.s.c.CoreDescriptor Created CoreDescriptor: {name=testschemaapi_shard1_replica1, collection.configName=conf1, config=solrconfig.xml, transient=false, schema=schema.xml, loadOnStartup=true, configSetProperties=configsetprops.json, collection=testschemaapi, numShards=1, dataDir=data/, shard=shard1}
   [junit4]   2> 186591 INFO  (qtp26030903-1615) [n:127.0.0.1:44945_solr c:testschemaapi s:shard1  x:testschemaapi_shard1_replica1] o.a.s.c.ZkController publishing state=down
   [junit4]   2> 186592 INFO  (qtp26030903-1615) [n:127.0.0.1:44945_solr c:testschemaapi s:shard1  x:testschemaapi_shard1_replica1] o.a.s.c.ZkController Registering watch for collection testschemaapi
   [junit4]   2> 186592 INFO  (OverseerStateUpdate-95893580625739781-127.0.0.1:46402_solr-n_0000000000) [n:127.0.0.1:46402_solr    ] o.a.s.c.Overseer processMessage: queueSize: 1, message = {
   [junit4]   2>   "core":"testschemaapi_shard1_replica1",
   [junit4]   2>   "roles":null,
   [junit4]   2>   "base_url":"https://127.0.0.1:44945/solr",
   [junit4]   2>   "node_name":"127.0.0.1:44945_solr",
   [junit4]   2>   "numShards":"1",
   [junit4]   2>   "state":"down",
   [junit4]   2>   "shard":"shard1",
   [junit4]   2>   "collection":"testschemaapi",
   [junit4]   2>   "operation":"state"} current state version: 0
   [junit4]   2> 186592 INFO  (OverseerStateUpdate-95893580625739781-127.0.0.1:46402_solr-n_0000000000) [n:127.0.0.1:46402_solr    ] o.a.s.c.o.ReplicaMutator Update state numShards=1 message={
   [junit4]   2>   "core":"testschemaapi_shard1_replica1",
   [junit4]   2>   "roles":null,
   [junit4]   2>   "base_url":"https://127.0.0.1:44945/solr",
   [junit4]   2>   "node_name":"127.0.0.1:44945_solr",
   [junit4]   2>   "numShards":"1",
   [junit4]   2>   "state":"down",
   [junit4]   2>   "shard":"shard1",
   [junit4]   2>   "collection":"testschemaapi",
   [junit4]   2>   "operation":"state"}
   [junit4]   2> 186592 INFO  (qtp26030903-1615) [n:127.0.0.1:44945_solr c:testschemaapi s:shard1  x:testschemaapi_shard1_replica1] o.a.s.c.c.ZkStateReader Add data for [testschemaapi] ver [0]
   [junit4]   2> 186593 INFO  (qtp26030903-1615) [n:127.0.0.1:44945_solr c:testschemaapi s:shard1  x:testschemaapi_shard1_replica1] o.a.s.c.ZkController look for our core node name
   [junit4]   2> 186675 INFO  (qtp5885367-1626) [n:127.0.0.1:46402_solr    ] o.a.s.h.a.CoreAdminOperation core create command qt=/admin/cores&collection.configName=conf1&name=testschemaapi_shard1_replica2&action=CREATE&numShards=1&collection=testschemaapi&shard=shard1&wt=javabin&version=2
   [junit4]   2> 186676 INFO  (qtp5885367-1626) [n:127.0.0.1:46402_solr    ] o.a.s.c.CoreDescriptor Created CoreDescriptor: {name=testschemaapi_shard1_replica2, collection.configName=conf1, config=solrconfig.xml, transient=false, schema=schema.xml, loadOnStartup=true, configSetProperties=configsetprops.json, collection=testschemaapi, numShards=1, dataDir=data/, shard=shard1}
   [junit4]   2> 186679 INFO  (qtp5885367-1626) [n:127.0.0.1:46402_solr c:testschemaapi s:shard1  x:testschemaapi_shard1_replica2] o.a.s.c.ZkController publishing state=down
   [junit4]   2> 186680 INFO  (qtp5885367-1626) [n:127.0.0.1:46402_solr c:testschemaapi s:shard1  x:testschemaapi_shard1_replica2] o.a.s.c.ZkController Registering watch for collection testschemaapi
   [junit4]   2> 186680 INFO  (OverseerStateUpdate-95893580625739781-127.0.0.1:46402_solr-n_0000000000) [n:127.0.0.1:46402_solr    ] o.a.s.c.Overseer processMessage: queueSize: 1, message = {
   [junit4]   2>   "core":"testschemaapi_shard1_replica2",
   [junit4]   2>   "roles":null,
   [junit4]   2>   "base_url":"https://127.0.0.1:46402/solr",
   [junit4]   2>   "node_name":"127.0.0.1:46402_solr",
   [junit4]   2>   "numShards":"1",
   [junit4]   2>   "state":"down",
   [junit4]   2>   "shard":"shard1",
   [junit4]   2>   "collection":"testschemaapi",
   [junit4]   2>   "operation":"state"} current state version: 0
   [junit4]   2> 186680 INFO  (OverseerStateUpdate-95893580625739781-127.0.0.1:46402_solr-n_0000000000) [n:127.0.0.1:46402_solr    ] o.a.s.c.o.ReplicaMutator Update state numShards=1 message={
   [junit4]   2>   "core":"testschemaapi_shard1_replica2",
   [junit4]   2>   "roles":null,
   [junit4]   2>   "base_url":"https://127.0.0.1:46402/solr",
   [junit4]   2>   "node_name":"127.0.0.1:46402_solr",
   [junit4]   2>   "numShards":"1",
   [junit4]   2>   "state":"down",
   [junit4]   2>   "shard":"shard1",
   [junit4]   2>   "collection":"testschemaapi",
   [junit4]   2>   "operation":"state"}
   [junit4]   2> 186681 INFO  (qtp5885367-1626) [n:127.0.0.1:46402_solr c:testschemaapi s:shard1  x:testschemaapi_shard1_replica2] o.a.s.c.c.ZkStateReader Add data for [testschemaapi] ver [0]
   [junit4]   2> 186681 INFO  (qtp5885367-1626) [n:127.0.0.1:46402_solr c:testschemaapi s:shard1  x:testschemaapi_shard1_replica2] o.a.s.c.ZkController look for our core node name
   [junit4]   2> 186782 INFO  (OverseerStateUpdate-95893580625739781-127.0.0.1:46402_solr-n_0000000000) [n:127.0.0.1:46402_solr    ] o.a.s.c.o.ZkStateWriter going to update_collection /collections/testschemaapi/state.json version: 0
   [junit4]   2> 186783 INFO  (zkCallback-287-thread-1-processing-n:127.0.0.1:46402_solr) [n:127.0.0.1:46402_solr    ] o.a.s.c.c.ZkStateReader A cluster state change: [WatchedEvent state:SyncConnected type:NodeDataChanged path:/collections/testschemaapi/state.json] for collection [testschemaapi] has occurred - updating... (live nodes size: [2])
   [junit4]   2> 186783 INFO  (zkCallback-288-thread-1-processing-n:127.0.0.1:44945_solr) [n:127.0.0.1:44945_solr    ] o.a.s.c.c.ZkStateReader A cluster state change: [WatchedEvent state:SyncConnected type:NodeDataChanged path:/collections/testschemaapi/state.json] for collection [testschemaapi] has occurred - updating... (live nodes size: [2])
   [junit4]   2> 186783 INFO  (zkCallback-288-thread-1-processing-n:127.0.0.1:44945_solr) [n:127.0.0.1:44945_solr    ] o.a.s.c.c.ZkStateReader Updating data for [testschemaapi] from [0] to [1]
   [junit4]   2> 186783 INFO  (zkCallback-287-thread-1-processing-n:127.0.0.1:46402_solr) [n:127.0.0.1:46402_solr    ] o.a.s.c.c.ZkStateReader Updating data for [testschemaapi] from [0] to [1]
   [junit4]   2> 187594 INFO  (qtp26030903-1615) [n:127.0.0.1:44945_solr c:testschemaapi s:shard1  x:testschemaapi_shard1_replica1] o.a.s.c.ZkController waiting to find shard id in clusterstate for testschemaapi_shard1_replica1
   [junit4]   2> 187594 INFO  (qtp26030903-1615) [n:127.0.0.1:44945_solr c:testschemaapi s:shard1  x:testschemaapi_shard1_replica1] o.a.s.c.ZkController Check for collection zkNode:testschemaapi
   [junit4]   2> 187594 INFO  (qtp26030903-1615) [n:127.0.0.1:44945_solr c:testschemaapi s:shard1  x:testschemaapi_shard1_replica1] o.a.s.c.ZkController Collection zkNode exists
   [junit4]   2> 187594 INFO  (qtp26030903-1615) [n:127.0.0.1:44945_solr c:testschemaapi s:shard1  x:testschemaapi_shard1_replica1] o.a.s.c.c.ZkStateReader Load collection config from: [/collections/testschemaapi]
   [junit4]   2> 187594 INFO  (qtp26030903-1615) [n:127.0.0.1:44945_solr c:testschemaapi s:shard1  x:testschemaapi_shard1_replica1] o.a.s.c.c.ZkStateReader path=[/collections/testschemaapi] [configName]=[conf1] specified config exists in ZooKeeper
   [junit4]   2> 187594 INFO  (qtp26030903-1615) [n:127.0.0.1:44945_solr c:testschemaapi s:shard1  x:testschemaapi_shard1_replica1] o.a.s.c.SolrResourceLoader new SolrResourceLoader for directory: '/home/jenkins/workspace/Lucene-Solr-master-Linux/solr/build/solr-core/test/J1/temp/solr.schema.TestManagedSchemaAPI_B898787F8948CB0D-001/tempDir-001/node1/testschemaapi_shard1_replica1'
   [junit4]   2> 187595 INFO  (qtp26030903-1615) [n:127.0.0.1:44945_solr c:testschemaapi s:shard1  x:testschemaapi_shard1_replica1] o.a.s.c.SolrResourceLoader JNDI not configured for solr (NoInitialContextEx)
   [junit4]   2> 187595 INFO  (qtp26030903-1615) [n:127.0.0.1:44945_solr c:testschemaapi s:shard1  x:testschemaapi_shard1_replica1] o.a.s.c.SolrResourceLoader solr home defaulted to 'solr/' (could not find system property or JNDI)
   [junit4]   2> 187596 INFO  (qtp26030903-1615) [n:127.0.0.1:44945_solr c:testschemaapi s:shard1  x:testschemaapi_shard1_replica1] o.a.s.c.Config loaded config solrconfig.xml with version 0 
   [junit4]   2> 187601 INFO  (qtp26030903-1615) [n:127.0.0.1:44945_solr c:testschemaapi s:shard1  x:testschemaapi_shard1_replica1] o.a.s.c.SolrConfig current version of requestparams : -1
   [junit4]   2> 187608 INFO  (qtp26030903-1615) [n:127.0.0.1:44945_solr c:testschemaapi s:shard1  x:testschemaapi_shard1_replica1] o.a.s.c.SolrConfig Using Lucene MatchVersion: 7.0.0
   [junit4]   2> 187619 INFO  (qtp26030903-1615) [n:127.0.0.1:44945_solr c:testschemaapi s:shard1  x:testschemaapi_shard1_replica1] o.a.s.c.SolrConfig Loaded SolrConfig: solrconfig.xml
   [junit4]   2> 187623 INFO  (qtp26030903-1615) [n:127.0.0.1:44945_solr c:testschemaapi s:shard1  x:testschemaapi_shard1_replica1] o.a.s.s.IndexSchema [testschemaapi_shard1_replica1] Schema name=minimal
   [junit4]   2> 187628 INFO  (qtp26030903-1615) [n:127.0.0.1:44945_solr c:testschemaapi s:shard1  x:testschemaapi_shard1_replica1] o.a.s.s.IndexSchema unique key field: id
   [junit4]   2> 187629 INFO  (qtp26030903-1615) [n:127.0.0.1:44945_solr c:testschemaapi s:shard1  x:testschemaapi_shard1_replica1] o.a.s.c.ConfigSetProperties Did not find ConfigSet properties, assuming default properties: Can't find resource 'configsetprops.json' in classpath or '/configs/conf1', cwd=/home/jenkins/workspace/Lucene-Solr-master-Linux/solr/build/solr-core/test/J1
   [junit4]   2> 187629 INFO  (qtp26030903-1615) [n:127.0.0.1:44945_solr c:testschemaapi s:shard1  x:testschemaapi_shard1_replica1] o.a.s.c.CoreContainer Creating SolrCore 'testschemaapi_shard1_replica1' using configuration from collection testschemaapi
   [junit4]   2> 187629 INFO  (qtp26030903-1615) [n:127.0.0.1:44945_solr c:testschemaapi s:shard1 r:core_node1 x:testschemaapi_shard1_replica1] o.a.s.c.SolrCore org.apache.solr.core.MockDirectoryFactory
   [junit4]   2> 187630 INFO  (qtp26030903-1615) [n:127.0.0.1:44945_solr c:testschemaapi s:shard1 r:core_node1 x:testschemaapi_shard1_replica1] o.a.s.c.SolrCore [[testschemaapi_shard1_replica1] ] Opening new SolrCore at [/home/jenkins/workspace/Lucene-Solr-master-Linux/solr/build/solr-core/test/J1/temp/solr.schema.TestManagedSchemaAPI_B898787F8948CB0D-001/tempDir-001/node1/testschemaapi_shard1_replica1], dataDir=[/home/jenkins/workspace/Lucene-Solr-master-Linux/solr/build/solr-core/test/J1/temp/solr.schema.TestManagedSchemaAPI_B898787F8948CB0D-001/tempDir-001/node1/./testschemaapi_shard1_replica1/data/]
   [junit4]   2> 187630 INFO  (qtp26030903-1615) [n:127.0.0.1:44945_solr c:testschemaapi s:shard1 r:core_node1 x:testschemaapi_shard1_replica1] o.a.s.c.SolrCore JMX monitoring not detected for core: testschemaapi_shard1_replica1
   [junit4]   2> 187631 INFO  (qtp26030903-1615) [n:127.0.0.1:44945_solr c:testschemaapi s:shard1 r:core_node1 x:testschemaapi_shard1_replica1] o.a.s.c.CachingDirectoryFactory return new directory for /home/jenkins/workspace/Lucene-Solr-master-Linux/solr/build/solr-core/test/J1/temp/solr.schema.TestManagedSchemaAPI_B898787F8948CB0D-001/tempDir-001/node1/./testschemaapi_shard1_replica1/data
   [junit4]   2> 187631 INFO  (qtp26030903-1615) [n:127.0.0.1:44945_solr c:testschemaapi s:shard1 r:core_node1 x:testschemaapi_shard1_replica1] o.a.s.c.SolrCore New index directory detected: old=null new=/home/jenkins/workspace/Lucene-Solr-master-Linux/solr/build/solr-core/test/J1/temp/solr.schema.TestManagedSchemaAPI_B898787F8948CB0D-001/tempDir-001/node1/./testschemaapi_shard1_replica1/data/index/
   [junit4]   2> 187631 WARN  (qtp26030903-1615) [n:127.0.0.1:44945_solr c:testschemaapi s:shard1 r:core_node1 x:testschemaapi_shard1_replica1] o.a.s.c.SolrCore [testschemaapi_shard1_replica1] Solr index directory '/home/jenkins/workspace/Lucene-Solr-master-Linux/solr/build/solr-core/test/J1/temp/solr.schema.TestManagedSchemaAPI_B898787F8948CB0D-001/tempDir-001/node1/./testschemaapi_shard1_replica1/data/index' doesn't exist. Creating new index...
   [junit4]   2> 187632 INFO  (qtp26030903-1615) [n:127.0.0.1:44945_solr c:testschemaapi s:shard1 r:core_node1 x:testschemaapi_shard1_replica1] o.a.s.c.CachingDirectoryFactory return new directory for /home/jenkins/workspace/Lucene-Solr-master-Linux/solr/build/solr-core/test/J1/temp/solr.schema.TestManagedSchemaAPI_B898787F8948CB0D-001/tempDir-001/node1/./testschemaapi_shard1_replica1/data/index
   [junit4]   2> 187633 INFO  (qtp26030903-1615) [n:127.0.0.1:44945_solr c:testschemaapi s:shard1 r:core_node1 x:testschemaapi_shard1_replica1] o.a.s.c.SolrDeletionPolicy SolrDeletionPolicy.onCommit: commits: num=1
   [junit4]   2> 	commit{dir=MockDirectoryWrapper(RAMDirectory@188a5ff lockFactory=org.apache.lucene.store.SingleInstanceLockFactory@16790c),segFN=segments_1,generation=1}
   [junit4]   2> 187633 INFO  (qtp26030903-1615) [n:127.0.0.1:44945_solr c:testschemaapi s:shard1 r:core_node1 x:testschemaapi_shard1_replica1] o.a.s.c.SolrDeletionPolicy newest commit generation = 1
   [junit4]   2> 187633 INFO  (OldIndexDirectoryCleanupThreadForCore-testschemaapi_shard1_replica1) [n:127.0.0.1:44945_solr c:testschemaapi s:shard1 r:core_node1 x:testschemaapi_shard1_replica1] o.a.s.c.SolrCore Looking for old index directories to cleanup for core testschemaapi_shard1_replica1 in /home/jenkins/workspace/Lucene-Solr-master-Linux/solr/build/solr-core/test/J1/temp/solr.schema.TestManagedSchemaAPI_B898787F8948CB0D-001/tempDir-001/node1/./testschemaapi_shard1_replica1/data/
   [junit4]   2> 187633 WARN  (OldIndexDirectoryCleanupThreadForCore-testschemaapi_shard1_replica1) [n:127.0.0.1:44945_solr c:testschemaapi s:shard1 r:core_node1 x:testschemaapi_shard1_replica1] o.a.s.c.DirectoryFactory /home/jenkins/workspace/Lucene-Solr-master-Linux/solr/build/solr-core/test/J1/temp/solr.schema.TestManagedSchemaAPI_B898787F8948CB0D-001/tempDir-001/node1/./testschemaapi_shard1_replica1/data/ does not point to a valid data directory; skipping clean-up of old index directories.
   [junit4]   2> 187635 INFO  (qtp26030903-1615) [n:127.0.0.1:44945_solr c:testschemaapi s:shard1 r:core_node1 x:testschemaapi_shard1_replica1] o.a.s.c.SolrCore no updateRequestProcessorChain defined as default, creating implicit default
   [junit4]   2> 187637 INFO  (qtp26030903-1615) [n:127.0.0.1:44945_solr c:testschemaapi s:shard1 r:core_node1 x:testschemaapi_shard1_replica1] o.a.s.h.l.XMLLoader xsltCacheLifetimeSeconds=60
   [junit4]   2> 187639 INFO  (qtp26030903-1615) [n:127.0.0.1:44945_solr c:testschemaapi s:shard1 r:core_node1 x:testschemaapi_shard1_replica1] o.a.s.h.l.XMLLoader xsltCacheLifetimeSeconds=60
   [junit4]   2> 187640 INFO  (qtp26030903-1615) [n:127.0.0.1:44945_solr c:testschemaapi s:shard1 r:core_node1 x:testschemaapi_shard1_replica1] o.a.s.h.l.XMLLoader xsltCacheLifetimeSeconds=60
   [junit4]   2> 187641 INFO  (qtp26030903-1615) [n:127.0.0.1:44945_solr c:testschemaapi s:shard1 r:core_node1 x:testschemaapi_shard1_replica1] o.a.s.h.l.XMLLoader xsltCacheLifetimeSeconds=60
   [junit4]   2> 187643 INFO  (qtp26030903-1615) [n:127.0.0.1:44945_solr c:testschemaapi s:shard1 r:core_node1 x:testschemaapi_shard1_replica1] o.a.s.c.RequestHandlers Registered paths: /admin/mbeans,/update/csv,/sql,/update/json/docs,/admin/luke,/graph,/export,/select,/admin/segments,/get,/admin/system,/replication,/admin/properties,/config,/stream,/schema,/admin/plugins,/admin/logging,/update/json,/admin/ping,/admin/threads,/update,/admin/file
   [junit4]   2> 187643 INFO  (qtp26030903-1615) [n:127.0.0.1:44945_solr c:testschemaapi s:shard1 r:core_node1 x:testschemaapi_shard1_replica1] o.a.s.c.SolrCore Using default statsCache cache: org.apache.solr.search.stats.LocalStatsCache
   [junit4]   2> 187643 INFO  (qtp26030903-1615) [n:127.0.0.1:44945_solr c:testschemaapi s:shard1 r:core_node1 x:testschemaapi_shard1_replica1] o.a.s.u.UpdateHandler Using UpdateLog implementation: org.apache.solr.update.UpdateLog
   [junit4]   2> 187643 INFO  (qtp26030903-1615) [n:127.0.0.1:44945_solr c:testschemaapi s:shard1 r:core_node1 x:testschemaapi_shard1_replica1] o.a.s.u.UpdateLog Initializing UpdateLog: dataDir=null defaultSyncLevel=FLUSH numRecordsToKeep=100 maxNumLogsToKeep=10 numVersionBuckets=65536
   [junit4]   2> 187645 INFO  (qtp26030903-1615) [n:127.0.0.1:44945_solr c:testschemaapi s:shard1 r:core_node1 x:testschemaapi_shard1_replica1] o.a.s.u.CommitTracker Hard AutoCommit: disabled
   [junit4]   2> 187645 INFO  (qtp26030903-1615) [n:127.0.0.1:44945_solr c:testschemaapi s:shard1 r:core_node1 x:testschemaapi_shard1_replica1] o.a.s.u.CommitTracker Soft AutoCommit: disabled
   [junit4]   2> 187646 INFO  (qtp26030903-1615) [n:127.0.0.1:44945_solr c:testschemaapi s:shard1 r:core_node1 x:testschemaapi_shard1_replica1] o.a.s.c.SolrDeletionPolicy SolrDeletionPolicy.onInit: commits: num=1
   [junit4]   2> 	commit{dir=MockDirectoryWrapper(RAMDirectory@188a5ff lockFactory=org.apache.lucene.store.SingleInstanceLockFactory@16790c),segFN=segments_1,generation=1}
   [junit4]   2> 187646 INFO  (qtp26030903-1615) [n:127.0.0.1:44945_solr c:testschemaapi s:shard1 r:core_node1 x:testschemaapi_shard1_replica1] o.a.s.c.SolrDeletionPolicy newest commit generation = 1
   [junit4]   2> 187646 INFO  (qtp26030903-1615) [n:127.0.0.1:44945_solr c:testschemaapi s:shard1 r:core_node1 x:testschemaapi_shard1_replica1] o.a.s.s.SolrIndexSearcher Opening [Searcher@1c566a5[testschemaapi_shard1_replica1] main]
   [junit4]   2> 187646 INFO  (qtp26030903-1615) [n:127.0.0.1:44945_solr c:testschemaapi s:shard1 r:core_node1 x:testschemaapi_shard1_replica1] o.a.s.c.c.ZkStateReader Load collection config from: [/collections/testschemaapi]
   [junit4]   2> 187646 INFO  (qtp26030903-1615) [n:127.0.0.1:44945_solr c:testschemaapi s:shard1 r:core_node1 x:testschemaapi_shard1_replica1] o.a.s.c.c.ZkStateReader path=[/collections/testschemaapi] [configName]=[conf1] specified config exists in ZooKeeper
   [junit4]   2> 187647 INFO  (qtp26030903-1615) [n:127.0.0.1:44945_solr c:testschemaapi s:shard1 r:core_node1 x:testschemaapi_shard1_replica1] o.a.s.r.ManagedResourceStorage Setting up ZooKeeper-based storage for the RestManager with znodeBase: /configs/conf1
   [junit4]   2> 187647 INFO  (qtp26030903-1615) [n:127.0.0.1:44945_solr c:testschemaapi s:shard1 r:core_node1 x:testschemaapi_shard1_replica1] o.a.s.r.ManagedResourceStorage Configured ZooKeeperStorageIO with znodeBase: /configs/conf1
   [junit4]   2> 187647 INFO  (qtp26030903-1615) [n:127.0.0.1:44945_solr c:testschemaapi s:shard1 r:core_node1 x:testschemaapi_shard1_replica1] o.a.s.r.RestManager Initializing RestManager with initArgs: {}
   [junit4]   2> 187647 INFO  (qtp26030903-1615) [n:127.0.0.1:44945_solr c:testschemaapi s:shard1 r:core_node1 x:testschemaapi_shard1_replica1] o.a.s.r.ManagedResourceStorage Reading _rest_managed.json using ZooKeeperStorageIO:path=/configs/conf1
   [junit4]   2> 187647 INFO  (qtp26030903-1615) [n:127.0.0.1:44945_solr c:testschemaapi s:shard1 r:core_node1 x:testschemaapi_shard1_replica1] o.a.s.r.ManagedResourceStorage No data found for znode /configs/conf1/_rest_managed.json
   [junit4]   2> 187647 INFO  (qtp26030903-1615) [n:127.0.0.1:44945_solr c:testschemaapi s:shard1 r:core_node1 x:testschemaapi_shard1_replica1] o.a.s.r.ManagedResourceStorage Loaded null at path _rest_managed.json using ZooKeeperStorageIO:path=/configs/conf1
   [junit4]   2> 187647 INFO  (qtp26030903-1615) [n:127.0.0.1:44945_solr c:testschemaapi s:shard1 r:core_node1 x:testschemaapi_shard1_replica1] o.a.s.r.RestManager Initializing 0 registered ManagedResources
   [junit4]   2> 187650 INFO  (qtp26030903-1615) [n:127.0.0.1:44945_solr c:testschemaapi s:shard1 r:core_node1 x:testschemaapi_shard1_replica1] o.a.s.s.ZkIndexSchemaReader Creating ZooKeeper watch for the managed schema at /configs/conf1/managed-schema
   [junit4]   2> 187652 INFO  (qtp26030903-1615) [n:127.0.0.1:44945_solr c:testschemaapi s:shard1 r:core_node1 x:testschemaapi_shard1_replica1] o.a.s.c.ZkController Added new OnReconnect listener ZkIndexSchemaReader: /configs/conf1/managed-schema, uniqueCoreId: testschemaapi_shard1_replica1:678081907015588
   [junit4]   2> 187652 INFO  (qtp26030903-1615) [n:127.0.0.1:44945_solr c:testschemaapi s:shard1 r:core_node1 x:testschemaapi_shard1_replica1] o.a.s.h.ReplicationHandler Commits will be reserved for  10000
   [junit4]   2> 187652 INFO  (searcherExecutor-569-thread-1-processing-n:127.0.0.1:44945_solr x:testschemaapi_shard1_replica1 s:shard1 c:testschemaapi r:core_node1) [n:127.0.0.1:44945_solr c:testschemaapi s:shard1 r:core_node1 x:testschemaapi_shard1_replica1] o.a.s.c.SolrCore [testschemaapi_shard1_replica1] Registered new searcher Searcher@1c566a5[testschemaapi_shard1_replica1] main{ExitableDirectoryReader(UninvertingDirectoryReader())}
   [junit4]   2> 187653 INFO  (qtp26030903-1615) [n:127.0.0.1:44945_solr c:testschemaapi s:shard1 r:core_node1 x:testschemaapi_shard1_replica1] o.a.s.u.UpdateLog Looking up max value of version field to seed version buckets
   [junit4]   2> 187653 INFO  (qtp26030903-1615) [n:127.0.0.1:44945_solr c:testschemaapi s:shard1 r:core_node1 x:testschemaapi_shard1_replica1] o.a.s.u.VersionInfo Refreshing highest value of _version_ for 65536 version buckets from index
   [junit4]   2> 187653 INFO  (qtp26030903-1615) [n:127.0.0.1:44945_solr c:testschemaapi s:shard1 r:core_node1 x:testschemaapi_shard1_replica1] o.a.s.u.VersionInfo No terms found for _version_, cannot seed version bucket highest value from index
   [junit4]   2> 187653 INFO  (qtp26030903-1615) [n:127.0.0.1:44945_solr c:testschemaapi s:shard1 r:core_node1 x:testschemaapi_shard1_replica1] o.a.s.u.UpdateLog Could not find max version in index or recent updates, using new clock 1534297292891226112
   [junit4]   2> 187655 INFO  (qtp26030903-1615) [n:127.0.0.1:44945_solr c:testschemaapi s:shard1 r:core_node1 x:testschemaapi_shard1_replica1] o.a.s.u.UpdateLog Took 1.0ms to seed version buckets with highest version 1534297292891226112
   [junit4]   2> 187655 INFO  (qtp26030903-1615) [n:127.0.0.1:44945_solr c:testschemaapi s:shard1 r:core_node1 x:testschemaapi_shard1_replica1] o.a.s.c.ZkController watch zkdir /configs/conf1
   [junit4]   2> 187656 INFO  (qtp26030903-1615) [n:127.0.0.1:44945_solr c:testschemaapi s:shard1 r:core_node1 x:testschemaapi_shard1_replica1] o.a.s.c.CoreContainer registering core: testschemaapi_shard1_replica1
   [junit4]   2> 187656 INFO  (qtp26030903-1615) [n:127.0.0.1:44945_solr c:testschemaapi s:shard1 r:core_node1 x:testschemaapi_shard1_replica1] o.a.s.c.ZkController Register replica - core:testschemaapi_shard1_replica1 address:https://127.0.0.1:44945/solr collection:testschemaapi shard:shard1
   [junit4]   2> 187656 INFO  (qtp26030903-1615) [n:127.0.0.1:44945_solr c:testschemaapi s:shard1 r:core_node1 x:testschemaapi_shard1_replica1] o.a.s.c.c.SolrZkClient makePath: /collections/testschemaapi/leader_elect/shard1/election
   [junit4]   2> 187659 INFO  (qtp26030903-1615) [n:127.0.0.1:44945_solr c:testschemaapi s:shard1 r:core_node1 x:testschemaapi_shard1_replica1] o.a.s.c.LeaderElector Joined leadership election with path: /collections/testschemaapi/leader_elect/shard1/election/95893580625739782-core_node1-n_0000000000
   [junit4]   2> 187659 INFO  (qtp26030903-1615) [n:127.0.0.1:44945_solr c:testschemaapi s:shard1 r:core_node1 x:testschemaapi_shard1_replica1] o.a.s.c.ShardLeaderElectionContext Running the leader process for shard=shard1 and weAreReplacement=false and leaderVoteWait=10000
   [junit4]   2> 187661 INFO  (OverseerStateUpdate-95893580625739781-127.0.0.1:46402_solr-n_0000000000) [n:127.0.0.1:46402_solr    ] o.a.s.c.Overseer processMessage: queueSize: 1, message = {
   [junit4]   2>   "operation":"leader",
   [junit4]   2>   "shard":"shard1",
   [junit4]   2>   "collection":"testschemaapi"} current state version: 0
   [junit4]   2> 187661 INFO  (qtp26030903-1615) [n:127.0.0.1:44945_solr c:testschemaapi s:shard1 r:core_node1 x:testschemaapi_shard1_replica1] o.a.s.c.ShardLeaderElectionContext Waiting until we see more replicas up for shard shard1: total=2 found=1 timeoutin=9999ms
   [junit4]   2> 187681 INFO  (qtp5885367-1626) [n:127.0.0.1:46402_solr c:testschemaapi s:shard1  x:testschemaapi_shard1_replica2] o.a.s.c.ZkController waiting to find shard id in clusterstate for testschemaapi_shard1_replica2
   [junit4]   2> 187681 INFO  (qtp5885367-1626) [n:127.0.0.1:46402_solr c:testschemaapi s:shard1  x:testschemaapi_shard1_replica2] o.a.s.c.ZkController Check for collection zkNode:testschemaapi
   [junit4]   2> 187681 INFO  (qtp5885367-1626) [n:127.0.0.1:46402_solr c:testschemaapi s:shard1  x:testschemaapi_shard1_replica2] o.a.s.c.ZkController Collection zkNode exists
   [junit4]   2> 187681 INFO  (qtp5885367-1626) [n:127.0.0.1:46402_solr c:testschemaapi s:shard1  x:testschemaapi_shard1_replica2] o.a.s.c.c.ZkStateReader Load collection config from: [/collections/testschemaapi]
   [junit4]   2> 187682 INFO  (qtp5885367-1626) [n:127.0.0.1:46402_solr c:testschemaapi s:shard1  x:testschemaapi_shard1_replica2] o.a.s.c.c.ZkStateReader path=[/collections/testschemaapi] [configName]=[conf1] specified config exists in ZooKeeper
   [junit4]   2> 187682 INFO  (qtp5885367-1626) [n:127.0.0.1:46402_solr c:testschemaapi s:shard1  x:testschemaapi_shard1_replica2] o.a.s.c.SolrResourceLoader new SolrResourceLoader for directory: '/home/jenkins/workspace/Lucene-Solr-master-Linux/solr/build/solr-core/test/J1/temp/solr.schema.TestManagedSchemaAPI_B898787F8948CB0D-001/tempDir-001/node2/testschemaapi_shard1_replica2'
   [junit4]   2> 187683 INFO  (qtp5885367-1626) [n:127.0.0.1:46402_solr c:testschemaapi s:shard1  x:testschemaapi_shard1_replica2] o.a.s.c.SolrResourceLoader JNDI not configured for solr (NoInitialContextEx)
   [junit4]   2> 187683 INFO  (qtp5885367-1626) [n:127.0.0.1:46402_solr c:testschemaapi s:shard1  x:testschemaapi_shard1_replica2] o.a.s.c.SolrResourceLoader solr home defaulted to 'solr/' (could not find system property or JNDI)
   [junit4]   2> 187684 INFO  (qtp5885367-1626) [n:127.0.0.1:46402_solr c:testschemaapi s:shard1  x:testschemaapi_shard1_replica2] o.a.s.c.Config loaded config solrconfig.xml with version 0 
   [junit4]   2> 187690 INFO  (qtp5885367-1626) [n:127.0.0.1:46402_solr c:testschemaapi s:shard1  x:testschemaapi_shard1_replica2] o.a.s.c.SolrConfig current version of requestparams : -1
   [junit4]   2> 187697 INFO  (qtp5885367-1626) [n:127.0.0.1:46402_solr c:testschemaapi s:shard1  x:testschemaapi_shard1_replica2] o.a.s.c.SolrConfig Using Lucene MatchVersion: 7.0.0
   [junit4]   2> 187709 INFO  (qtp5885367-1626) [n:127.0.0.1:46402_solr c:testschemaapi s:shard1  x:testschemaapi_shard1_replica2] o.a.s.c.SolrConfig Loaded SolrConfig: solrconfig.xml
   [junit4]   2> 187715 INFO  (qtp5885367-1626) [n:127.0.0.1:46402_solr c:testschemaapi s:shard1  x:testschemaapi_shard1_replica2] o.a.s.s.IndexSchema [testschemaapi_shard1_replica2] Schema name=minimal
   [junit4]   2> 187744 INFO  (qtp5885367-1626) [n:127.0.0.1:46402_solr c:testschemaapi s:shard1  x:testschemaapi_shard1_replica2] o.a.s.s.IndexSchema unique key field: id
   [junit4]   2> 187745 INFO  (qtp5885367-1626) [n:127.0.0.1:46402_solr c:testschemaapi s:shard1  x:testschemaapi_shard1_replica2] o.a.s.c.ConfigSetProperties Did not find ConfigSet properties, assuming default properties: Can't find resource 'configsetprops.json' in classpath or '/configs/conf1', cwd=/home/jenkins/workspace/Lucene-Solr-master-Linux/solr/build/solr-core/test/J1
   [junit4]   2> 187745 INFO  (qtp5885367-1626) [n:127.0.0.1:46402_solr c:testschemaapi s:shard1  x:testschemaapi_shard1_replica2] o.a.s.c.CoreContainer Creating SolrCore 'testschemaapi_shard1_replica2' using configuration from collection testschemaapi
   [junit4]   2> 187745 INFO  (qtp5885367-1626) [n:127.0.0.1:46402_solr c:testschemaapi s:shard1 r:core_node2 x:testschemaapi_shard1_replica2] o.a.s.c.SolrCore org.apache.solr.core.MockDirectoryFactory
   [junit4]   2> 187745 INFO  (qtp5885367-1626) [n:127.0.0.1:46402_solr c:testschemaapi s:shard1 r:core_node2 x:testschemaapi_shard1_replica2] o.a.s.c.SolrCore [[testschemaapi_shard1_replica2] ] Opening new SolrCore at [/home/jenkins/workspace/Lucene-Solr-master-Linux/solr/build/solr-core/test/J1/temp/solr.schema.TestManagedSchemaAPI_B898787F8948CB0D-001/tempDir-001/node2/testschemaapi_shard1_replica2], dataDir=[/home/jenkins/workspace/Lucene-Solr-master-Linux/solr/build/solr-core/test/J1/temp/solr.schema.TestManagedSchemaAPI_B898787F8948CB0D-001/tempDir-001/node2/./testschemaapi_shard1_replica2/data/]
   [junit4]   2> 187746 INFO  (qtp5885367-1626) [n:127.0.0.1:46402_solr c:testschemaapi s:shard1 r:core_node2 x:testschemaapi_shard1_replica2] o.a.s.c.SolrCore JMX monitoring not detected for core: testschemaapi_shard1_replica2
   [junit4]   2> 187747 INFO  (qtp5885367-1626) [n:127.0.0.1:46402_solr c:testschemaapi s:shard1 r:core_node2 x:testschemaapi_shard1_replica2] o.a.s.c.CachingDirectoryFactory return new directory for /home/jenkins/workspace/Lucene-Solr-master-Linux/solr/build/solr-core/test/J1/temp/solr.schema.TestManagedSchemaAPI_B898787F8948CB0D-001/tempDir-001/node2/./testschemaapi_shard1_replica2/data
   [junit4]   2> 187747 INFO  (qtp5885367-1626) [n:127.0.0.1:46402_solr c:testschemaapi s:shard1 r:core_node2 x:testschemaapi_shard1_replica2] o.a.s.c.SolrCore New index directory detected: old=null new=/home/jenkins/workspace/Lucene-Solr-master-Linux/solr/build/solr-core/test/J1/temp/solr.schema.TestManagedSchemaAPI_B898787F8948CB0D-001/tempDir-001/node2/./testschemaapi_shard1_replica2/data/index/
   [junit4]   2> 187747 WARN  (qtp5885367-1626) [n:127.0.0.1:46402_solr c:testschemaapi s:shard1 r:core_node2 x:testschemaapi_shard1_replica2] o.a.s.c.SolrCore [testschemaapi_shard1_replica2] Solr index directory '/home/jenkins/workspace/Lucene-Solr-master-Linux/solr/build/solr-core/test/J1/temp/solr.schema.TestManagedSchemaAPI_B898787F8948CB0D-001/tempDir-001/node2/./testschemaapi_shard1_replica2/data/index' doesn't exist. Creating new index...
   [junit4]   2> 187748 INFO  (qtp5885367-1626) [n:127.0.0.1:46402_solr c:testschemaapi s:shard1 r:core_node2 x:testschemaapi_shard1_replica2] o.a.s.c.CachingDirectoryFactory return new directory for /home/jenkins/workspace/Lucene-Solr-master-Linux/solr/build/solr-core/test/J1/temp/solr.schema.TestManagedSchemaAPI_B898787F8948CB0D-001/tempDir-001/node2/./testschemaapi_shard1_replica2/data/index
   [junit4]   2> 187748 INFO  (qtp5885367-1626) [n:127.0.0.1:46402_solr c:testschemaapi s:shard1 r:core_node2 x:testschemaapi_shard1_replica2] o.a.s.c.SolrDeletionPolicy SolrDeletionPolicy.onCommit: commits: num=1
   [junit4]   2> 	commit{dir=MockDirectoryWrapper(RAMDirectory@111b24f lockFactory=org.apache.lucene.store.SingleInstanceLockFactory@18a38e1),segFN=segments_1,generation=1}
   [junit4]   2> 187748 INFO  (qtp5885367-1626) [n:127.0.0.1:46402_solr c:testschemaapi s:shard1 r:core_node2 x:testschemaapi_shard1_replica2] o.a.s.c.SolrDeletionPolicy newest commit generation = 1
   [junit4]   2> 187749 INFO  (OldIndexDirectoryCleanupThreadForCore-testschemaapi_shard1_replica2) [n:127.0.0.1:46402_solr c:testschemaapi s:shard1 r:core_node2 x:testschemaapi_shard1_replica2] o.a.s.c.SolrCore Looking for old index directories to cleanup for core testschemaapi_shard1_replica2 in /home/jenkins/workspace/Lucene-Solr-master-Linux/solr/build/solr-core/test/J1/temp/solr.schema.TestManagedSchemaAPI_B898787F8948CB0D-001/tempDir-001/node2/./testschemaapi_shard1_replica2/data/
   [junit4]   2> 187750 WARN  (OldIndexDirectoryCleanupThreadForCore-testschemaapi_shard1_replica2) [n:127.0.0.1:46402_solr c:testschemaapi s:shard1 r:core_node2 x:testschemaapi_shard1_replica2] o.a.s.c.DirectoryFactory /home/jenkins/workspace/Lucene-Solr-master-Linux/solr/build/solr-core/test/J1/temp/solr.schema.TestManagedSchemaAPI_B898787F8948CB0D-001/tempDir-001/node2/./testschemaapi_shard1_replica2/data/ does not point to a valid data directory; skipping clean-up of old index directories.
   [junit4]   2> 187751 INFO  (qtp5885367-1626) [n:127.0.0.1:46402_solr c:testschemaapi s:shard1 r:core_node2 x:testschemaapi_shard1_replica2] o.a.s.c.SolrCore no updateRequestProcessorChain defined as default, creating implicit default
   [junit4]   2> 187752 INFO  (qtp5885367-1626) [n:127.0.0.1:46402_solr c:testschemaapi s:shard1 r:core_node2 x:testschemaapi_shard1_replica2] o.a.s.h.l.XMLLoader xsltCacheLifetimeSeconds=60
   [junit4]   2> 187754 INFO  (qtp5885367-1626) [n:127.0.0.1:46402_solr c:testschemaapi s:shard1 r:core_node2 x:testschemaapi_shard1_replica2] o.a.s.h.l.XMLLoader xsltCacheLifetimeSeconds=60
   [junit4]   2> 187755 INFO  (qtp5885367-1626) [n:127.0.0.1:46402_solr c:testschemaapi s:shard1 r:core_node2 x:testschemaapi_shard1_replica2] o.a.s.h.l.XMLLoader xsltCacheLifetimeSeconds=60
   [junit4]   2> 187756 INFO  (qtp5885367-1626) [n:127.0.0.1:46402_solr c:testschemaapi s:shard1 r:core_node2 x:testschemaapi_shard1_replica2] o.a.s.h.l.XMLLoader xsltCacheLifetimeSeconds=60
   [junit4]   2> 187758 INFO  (qtp5885367-1626) [n:127.0.0.1:46402_solr c:testschemaapi s:shard1 r:core_node2 x:testschemaapi_shard1_replica2] o.a.s.c.RequestHandlers Registered paths: /admin/mbeans,/update/csv,/sql,/update/json/docs,/admin/luke,/graph,/export,/select,/admin/segments,/get,/admin/system,/replication,/admin/properties,/config,/stream,/schema,/admin/plugins,/admin/logging,/update/json,/admin/ping,/admin/threads,/update,/admin/file
   [junit4]   2> 187758 INFO  (qtp5885367-1626) [n:127.0.0.1:46402_solr c:testschemaapi s:shard1 r:core_node2 x:testschemaapi_shard1_replica2] o.a.s.c.SolrCore Using default statsCache cache: org.apache.solr.search.stats.LocalStatsCache
   [junit4]   2> 187759 INFO  (qtp5885367-1626) [n:127.0.0.1:46402_solr c:testschemaapi s:shard1 r:core_node2 x:testschemaapi_shard1_replica2] o.a.s.u.UpdateHandler Using UpdateLog implementation: org.apache.solr.update.UpdateLog
   [junit4]   2> 187759 INFO  (qtp5885367-1626) [n:127.0.0.1:46402_solr c:testschemaapi s:shard1 r:core_node2 x:testschemaapi_shard1_replica2] o.a.s.u.UpdateLog Initializing UpdateLog: dataDir=null defaultSyncLevel=FLUSH numRecordsToKeep=100 maxNumLogsToKeep=10 numVersionBuckets=65536
   [junit4]   2> 187760 INFO  (qtp5885367-1626) [n:127.0.0.1:46402_solr c:testschemaapi s:shard1 r:core_node2 x:testschemaapi_shard1_replica2] o.a.s.u.CommitTracker Hard AutoCommit: disabled
   [junit4]   2> 187760 INFO  (qtp5885367-1626) [n:127.0.0.1:46402_solr c:testschemaapi s:shard1 r:core_node2 x:testschemaapi_shard1_replica2] o.a.s.u.CommitTracker Soft AutoCommit: disabled
   [junit4]   2> 187761 INFO  (qtp5885367-1626) [n:127.0.0.1:46402_solr c:testschemaapi s:shard1 r:core_node2 x:testschemaapi_shard1_replica2] o.a.s.c.SolrDeletionPolicy SolrDeletionPolicy.onInit: commits: num=1
   [junit4]   2> 	commit{dir=MockDirectoryWrapper(RAMDirectory@111b24f lockFactory=org.apache.lucene.store.SingleInstanceLockFactory@18a38e1),segFN=segments_1,generation=1}
   [junit4]   2> 187761 INFO  (qtp5885367-1626) [n:127.0.0.1:46402_solr c:testschemaapi s:shard1 r:core_node2 x:testschemaapi_shard1_replica2] o.a.s.c.SolrDeletionPolicy newest commit generation = 1
   [junit4]   2> 187761 INFO  (qtp5885367-1626) [n:127.0.0.1:46402_solr c:testschemaapi s:shard1 r:core_node2 x:testschemaapi_shard1_replica2] o.a.s.s.SolrIndexSearcher Opening [Searcher@13fbcde[testschemaapi_shard1_replica2] main]
   [junit4]   2> 187761 INFO  (qtp5885367-1626) [n:127.0.0.1:46402_solr c:testschemaapi s:shard1 r:core_node2 x:testschemaapi_shard1_replica2] o.a.s.c.c.ZkStateReader Load collection config from: [/collections/testschemaapi]
   [junit4]   2> 187761 INFO  (qtp5885367-1626) [n:127.0.0.1:46402_solr c:testschemaapi s:shard1 r:core_node2 x:testschemaapi_shard1_replica2] o.a.s.c.c.ZkStateReader path=[/collections/testschemaapi] [configName]=[conf1] specified config exists in ZooKeeper
   [junit4]   2> 187761 INFO  (qtp5885367-1626) [n:127.0.0.1:46402_solr c:testschemaapi s:shard1 r:core_node2 x:testschemaapi_shard1_replica2] o.a.s.r.ManagedResourceStorage Setting up ZooKeeper-based storage for the RestManager with znodeBase: /configs/conf1
   [junit4]   2> 187762 INFO  (qtp5885367-1626) [n:127.0.0.1:46402_solr c:testschemaapi s:shard1 r:core_node2 x:testschemaapi_shard1_replica2] o.a.s.r.ManagedResourceStorage Configured ZooKeeperStorageIO with znodeBase: /configs/conf1
   [junit4]   2> 187762 INFO  (qtp5885367-1626) [n:127.0.0.1:46402_solr c:testschemaapi s:shard1 r:core_node2 x:testschemaapi_shard1_replica2] o.a.s.r.RestManager Initializing RestManager with initArgs: {}
   [junit4]   2> 187762 INFO  (qtp5885367-1626) [n:127.0.0.1:46402_solr c:testschemaapi s:shard1 r:core_node2 x:testschemaapi_shard1_replica2] o.a.s.r.ManagedResourceStorage Reading _rest_managed.json using ZooKeeperStorageIO:path=/configs/conf1
   [junit4]   2> 187762 INFO  (qtp5885367-1626) [n:127.0.0.1:46402_solr c:testschemaapi s:shard1 r:core_node2 x:testschemaapi_shard1_replica2] o.a.s.r.ManagedResourceStorage No data found for znode /configs/conf1/_rest_managed.json
   [junit4]   2> 187762 INFO  (qtp5885367-1626) [n:127.0.0.1:46402_solr c:testschemaapi s:shard1 r:core_node2 x:testschemaapi_shard1_replica2] o.a.s.r.ManagedResourceStorage Loaded null at path _rest_managed.json using ZooKeeperStorageIO:path=/configs/conf1
   [junit4]   2> 187762 INFO  (qtp5885367-1626) [n:127.0.0.1:46402_solr c:testschemaapi s:shard1 r:core_node2 x:testschemaapi_shard1_replica2] o.a.s.r.RestManager Initializing 0 registered ManagedResources
   [junit4]   2> 187762 INFO  (qtp5885367-1626) [n:127.0.0.1:46402_solr c:testschemaapi s:shard1 r:core_node2 x:testschemaapi_shard1_replica2] o.a.s.s.ZkIndexSchemaReader Creating ZooKeeper watch for the managed schema at /configs/conf1/managed-schema
   [junit4]   2> 187763 INFO  (qtp5885367-1626) [n:127.0.0.1:46402_solr c:testschemaapi s:shard1 r:core_node2 x:testschemaapi_shard1_replica2] o.a.s.c.ZkController Added new OnReconnect listener ZkIndexSchemaReader: /configs/conf1/managed-schema, uniqueCoreId: testschemaapi_shard1_replica2:678082022754644
   [junit4]   2> 187763 INFO  (qtp5885367-1626) [n:127.0.0.1:46402_solr c:testschemaapi s:shard1 r:core_node2 x:testschemaapi_shard1_replica2] o.a.s.h.ReplicationHandler Commits will be reserved for  10000
   [junit4]   2> 187764 INFO  (searcherExecutor-574-thread-1-processing-n:127.0.0.1:46402_solr x:testschemaapi_shard1_replica2 s:shard1 c:testschemaapi r:core_node2) [n:127.0.0.1:46402_solr c:testschemaapi s:shard1 r:core_node2 x:testschemaapi_shard1_replica2] o.a.s.c.SolrCore [testschemaapi_shard1_replica2] Registered new searcher Searcher@13fbcde[testschemaapi_shard1_replica2] main{ExitableDirectoryReader(UninvertingDirectoryReader())}
   [junit4]   2> 187764 INFO  (OverseerStateUpdate-95893580625739781-127.0.0.1:46402_solr-n_0000000000) [n:127.0.0.1:46402_solr    ] o.a.s.c.o.ZkStateWriter going to update_collection /collections/testschemaapi/state.json version: 1
   [junit4]   2> 187764 INFO  (qtp5885367-1626) [n:127.0.0.1:46402_solr c:testschemaapi s:shard1 r:core_node2 x:testschemaapi_shard1_replica2] o.a.s.u.UpdateLog Looking up max value of version field to seed version buckets
   [junit4]   2> 187764 INFO  (qtp5885367-1626) [n:127.0.0.1:46402_solr c:testschemaapi s:shard1 r:core_node2 x:testschemaapi_shard1_replica2] o.a.s.u.VersionInfo Refreshing highest value of _version_ for 65536 version buckets from index
   [junit4]   2> 187764 INFO  (qtp5885367-1626) [n:127.0.0.1:46402_solr c:testschemaapi s:shard1 r:core_node2 x:testschemaapi_shard1_replica2] o.a.s.u.VersionInfo No terms found for _version_, cannot seed version bucket highest value from index
   [junit4]   2> 187764 INFO  (qtp5885367-1626) [n:127.0.0.1:46402_solr c:testschemaapi s:shard1 r:core_node2 x:testschemaapi_shard1_replica2] o.a.s.u.UpdateLog Could not find max version in index or recent updates, using new clock 1534297293007618048
   [junit4]   2> 187764 INFO  (zkCallback-288-thread-1-processing-n:127.0.0.1:44945_solr) [n:127.0.0.1:44945_solr    ] o.a.s.c.c.ZkStateReader A cluster state change: [WatchedEvent state:SyncConnected type:NodeDataChanged path:/collections/testschemaapi/state.json] for collection [testschemaapi] has occurred - updating... (live nodes size: [2])
   [junit4]   2> 187764 INFO  (zkCallback-287-thread-1-processing-n:127.0.0.1:46402_solr) [n:127.0.0.1:46402_solr    ] o.a.s.c.c.ZkStateReader A cluster state change: [WatchedEvent state:SyncConnected type:NodeDataChanged path:/collections/testschemaapi/state.json] for collection [testschemaapi] has occurred - updating... (live nodes size: [2])
   [junit4]   2> 187765 INFO  (zkCallback-288-thread-1-processing-n:127.0.0.1:44945_solr) [n:127.0.0.1:44945_solr    ] o.a.s.c.c.ZkStateReader Updating data for [testschemaapi] from [1] to [2]
   [junit4]   2> 187765 INFO  (zkCallback-287-thread-1-processing-n:127.0.0.1:46402_solr) [n:127.0.0.1:46402_solr    ] o.a.s.c.c.ZkStateReader Updating data for [testschemaapi] from [1] to [2]
   [junit4]   2> 187766 INFO  (qtp5885367-1626) [n:127.0.0.1:46402_solr c:testschemaapi s:shard1 r:core_node2 x:testschemaapi_shard1_replica2] o.a.s.u.UpdateLog Took 1.0ms to seed version buckets with highest version 1534297293007618048
   [junit4]   2> 187766 INFO  (qtp5885367-1626) [n:127.0.0.1:46402_solr c:testschemaapi s:shard1 r:core_node2 x:testschemaapi_shard1_replica2] o.a.s.c.ZkController watch zkdir /configs/conf1
   [junit4]   2> 187767 INFO  (qtp5885367-1626) [n:127.0.0.1:46402_solr c:testschemaapi s:shard1 r:core_node2 x:testschemaapi_shard1_replica2] o.a.s.c.CoreContainer registering core: testschemaapi_shard1_replica2
   [junit4]   2> 187767 INFO  (qtp5885367-1626) [n:127.0.0.1:46402_solr c:testschemaapi s:shard1 r:core_node2 x:testschemaapi_shard1_replica2] o.a.s.c.ZkController Register replica - core:testschemaapi_shard1_replica2 address:https://127.0.0.1:46402/solr collection:testschemaapi shard:shard1
   [junit4]   2> 187767 INFO  (qtp5885367-1626) [n:127.0.0.1:46402_solr c:testschemaapi s:shard1 r:core_node2 x:testschemaapi_shard1_replica2] o.a.s.c.LeaderElector Joined leadership election with path: /collections/testschemaapi/leader_elect/shard1/election/95893580625739781-core_node2-n_0000000001
   [junit4]   2> 187768 INFO  (qtp5885367-1626) [n:127.0.0.1:46402_solr c:testschemaapi s:shard1 r:core_node2 x:testschemaapi_shard1_replica2] o.a.s.c.LeaderElector Watching path /collections/testschemaapi/leader_elect/shard1/election/95893580625739782-core_node1-n_0000000000 to know if I could be the leader
   [junit4]   2> 188162 INFO  (qtp26030903-1615) [n:127.0.0.1:44945_solr c:testschemaapi s:shard1 r:core_node1 x:testschemaapi_shard1_replica1] o.a.s.c.ShardLeaderElectionContext Enough replicas found to continue.
   [junit4]   2> 188162 INFO  (qtp26030903-1615) [n:127.0.0.1:44945_solr c:testschemaapi s:shard1 r:core_node1 x:testschemaapi_shard1_replica1] o.a.s.c.ShardLeaderElectionContext I may be the new leader - try and sync
   [junit4]   2> 188162 INFO  (qtp26030903-1615) [n:127.0.0.1:44945_solr c:testschemaapi s:shard1 r:core_node1 x:testschemaapi_shard1_replica1] o.a.s.c.SyncStrategy Sync replicas to https://127.0.0.1:44945/solr/testschemaapi_shard1_replica1/
   [junit4]   2> 188162 INFO  (qtp26030903-1615) [n:127.0.0.1:44945_solr c:testschemaapi s:shard1 r:core_node1 x:testschemaapi_shard1_replica1] o.a.s.u.PeerSync PeerSync: core=testschemaapi_shard1_replica1 url=https://127.0.0.1:44945/solr START replicas=[https://127.0.0.1:46402/solr/testschemaapi_shard1_replica2/] nUpdates=100
   [junit4]   2> 188163 INFO  (qtp26030903-1615) [n:127.0.0.1:44945_solr c:testschemaapi s:shard1 r:core_node1 x:testschemaapi_shard1_replica1] o.a.s.u.PeerSync PeerSync: core=testschemaapi_shard1_replica1 url=https://127.0.0.1:44945/solr DONE.  We have no versions.  sync failed.
   [junit4]   2> 188163 INFO  (qtp26030903-1615) [n:127.0.0.1:44945_solr c:testschemaapi s:shard1 r:core_node1 x:testschemaapi_shard1_replica1] o.a.s.c.SyncStrategy Leader's attempt to sync with shard failed, moving to the next candidate
   [junit4]   2> 188163 INFO  (qtp26030903-1615) [n:127.0.0.1:44945_solr c:testschemaapi s:shard1 r:core_node1 x:testschemaapi_shard1_replica1] o.a.s.c.ShardLeaderElectionContext We failed sync, but we have no versions - we can't sync in that case - we were active before, so become leader anyway
   [junit4]   2> 188163 INFO  (qtp26030903-1615) [n:127.0.0.1:44945_solr c:testschemaapi s:shard1 r:core_node1 x:testschemaapi_shard1_replica1] o.a.s.c.c.SolrZkClient makePath: /collections/testschemaapi/leaders/shard1
   [junit4]   2> 188167 INFO  (qtp26030903-1615) [n:127.0.0.1:44945_solr c:testschemaapi s:shard1 r:core_node1 x:testschemaapi_shard1_replica1] o.a.s.c.ShardLeaderElectionContextBase Creating leader registration node /collections/testschemaapi/leaders/shard1/leader after winning as /collections/testschemaapi/leader_elect/shard1/election/95893580625739782-core_node1-n_0000000000
   [junit4]   2> 188170 INFO  (qtp26030903-1615) [n:127.0.0.1:44945_solr c:testschemaapi s:shard1 r:core_node1 x:testschemaapi_shard1_replica1] o.a.s.c.ShardLeaderElectionContext I am the new leader: https://127.0.0.1:44945/solr/testschemaapi_shard1_replica1/ shard1
   [junit4]   2> 188170 INFO  (OverseerStateUpdate-95893580625739781-127.0.0.1:46402_solr-n_0000000000) [n:127.0.0.1:46402_solr    ] o.a.s.c.Overseer processMessage: queueSize: 1, message = {
   [junit4]   2>   "operation":"leader",
   [junit4]   2>   "shard":"shard1",
   [junit4]   2>   "collection":"testschemaapi",
   [junit4]   2>   "base_url":"https://127.0.0.1:44945/solr",
   [junit4]   2>   "core":"testschemaapi_shard1_replica1",
   [junit4]   2>   "state":"active"} current state version: 0
   [junit4]   2> 188171 INFO  (qtp5885367-1614) [n:127.0.0.1:46402_solr c:testschemaapi s:shard1 r:core_node2 x:testschemaapi_shard1_replica2] o.a.s.c.S.Request [testschemaapi_shard1_replica2]  webapp=/solr path=/get params={distrib=false&qt=/get&fingerprint=false&getVersions=100&wt=javabin&version=2} status=0 QTime=0
   [junit4]   2> 188272 INFO  (OverseerStateUpdate-95893580625739781-127.0.0.1:46402_solr-n_0000000000) [n:127.0.0.1:46402_solr    ] o.a.s.c.o.ZkStateWriter going to update_collection /collections/testschemaapi/state.json version: 2
   [junit4]   2> 188273 INFO  (zkCallback-288-thread-1-processing-n:127.0.0.1:44945_solr) [n:127.0.0.1:44945_solr    ] o.a.s.c.c.ZkStateReader A cluster state change: [WatchedEvent state:SyncConnected type:NodeDataChanged path:/collections/testschemaapi/state.json] for collection [testschemaapi] has occurred - updating... (live nodes size: [2])
   [junit4]   2> 188273 INFO  (zkCallback-287-thread-1-processing-n:127.0.0.1:46402_solr) [n:127.0.0.1:46402_solr    ] o.a.s.c.c.ZkStateReader A cluster state change: [WatchedEvent state:SyncConnected type:NodeDataChanged path:/collections/testschemaapi/state.json] for collection [testschemaapi] has occurred - updating... (live nodes size: [2])
   [junit4]   2> 188273 INFO  (zkCallback-288-thread-1-processing-n:127.0.0.1:44945_solr) [n:127.0.0.1:44945_solr    ] o.a.s.c.c.ZkStateReader Updating data for [testschemaapi] from [2] to [3]
   [junit4]   2> 188273 INFO  (zkCallback-287-thread-1-processing-n:127.0.0.1:46402_solr) [n:127.0.0.1:46402_solr    ] o.a.s.c.c.ZkStateReader Updating data for [testschemaapi] from [2] to [3]
   [junit4]   2> 188321 INFO  (qtp26030903-1615) [n:127.0.0.1:44945_solr c:testschemaapi s:shard1 r:core_node1 x:testschemaapi_shard1_replica1] o.a.s.c.ZkController We are https://127.0.0.1:44945/solr/testschemaapi_shard1_replica1/ and leader is https://127.0.0.1:44945/solr/testschemaapi_shard1_replica1/
   [junit4]   2> 188321 INFO  (qtp26030903-1615) [n:127.0.0.1:44945_solr c:testschemaapi s:shard1 r:core_node1 x:testschemaapi_shard1_replica1] o.a.s.c.ZkController No LogReplay needed for core=testschemaapi_shard1_replica1 baseURL=https://127.0.0.1:44945/solr
   [junit4]   2> 188321 INFO  (qtp26030903-1615) [n:127.0.0.1:44945_solr c:testschemaapi s:shard1 r:core_node1 x:testschemaapi_shard1_replica1] o.a.s.c.ZkController I am the leader, no recovery necessary
   [junit4]   2> 188321 INFO  (qtp26030903-1615) [n:127.0.0.1:44945_solr c:testschemaapi s:shard1 r:core_node1 x:testschemaapi_shard1_replica1] o.a.s.c.ZkController publishing state=active
   [junit4]   2> 188323 INFO  (OverseerStateUpdate-95893580625739781-127.0.0.1:46402_solr-n_0000000000) [n:127.0.0.1:46402_solr    ] o.a.s.c.Overseer processMessage: queueSize: 1, message = {
   [junit4]   2>   "core":"testschemaapi_shard1_replica1",
   [junit4]   2>   "core_node_name":"core_node1",
   [junit4]   2>   "roles":null,
   [junit4]   2>   "base_url":"https://127.0.0.1:44945/solr",
   [junit4]   2>   "node_name":"127.0.0.1:44945_solr",
   [junit4]   2>   "numShards":"1",
   [junit4]   2>   "state":"active",
   [junit4]   2>   "shard":"shard1",
   [junit4]   2>   "collection":"testschemaapi",
   [junit4]   2>   "operation":"state"} current state version: 0
   [junit4]   2> 188323 INFO  (OverseerStateUpdate-95893580625739781-127.0.0.1:46402_solr-n_0000000000) [n:127.0.0.1:46402_solr    ] o.a.s.c.o.ReplicaMutator Update state numShards=1 message={
   [junit4]   2>   "core":"testschemaapi_shard1_replica1",
   [junit4]   2>   "core_node_name":"core_node1",
   [junit4]   2>   "roles":null,
   [junit4]   2>   "base_url":"https://127.0.0.1:44945/solr",
   [junit4]   2>   "node_name":"127.0.0.1:44945_solr",
   [junit4]   2>   "numShards":"1",
   [junit4]   2>   "state":"active",
   [junit4]   2>   "shard":"shard1",
   [junit4]   2>   "collection":"testschemaapi",
   [junit4]   2>   "operation":"state"}
   [junit4]   2> 188328 INFO  (qtp26030903-1615) [n:127.0.0.1:44945_solr c:testschemaapi s:shard1 r:core_node1 x:testschemaapi_shard1_replica1] o.a.s.s.HttpSolrCall [admin] webapp=null path=/admin/cores params={qt=/admin/cores&collection.configName=conf1&name=testschemaapi_shard1_replica1&action=CREATE&numShards=1&collection=testschemaapi&shard=shard1&wt=javabin&version=2} status=0 QTime=1738
   [junit4]   2> 188429 INFO  (OverseerStateUpdate-95893580625739781-127.0.0.1:46402_solr-n_0000000000) [n:127.0.0.1:46402_solr    ] o.a.s.c.o.ZkStateWriter going to update_collection /collections/testschemaapi/state.json version: 3
   [junit4]   2> 188430 INFO  (zkCallback-287-thread-1-processing-n:127.0.0.1:46402_solr) [n:127.0.0.1:46402_solr    ] o.a.s.c.c.ZkStateReader A cluster state change: [WatchedEvent state:SyncConnected type:NodeDataChanged path:/collections/testschemaapi/state.json] for collection [testschemaapi] has occurred - updating... (live nodes size: [2])
   [junit4]   2> 188430 INFO  (zkCallback-288-thread-1-processing-n:127.0.0.1:44945_solr) [n:127.0.0.1:44945_solr    ] o.a.s.c.c.ZkStateReader A cluster state change: [WatchedEvent state:SyncConnected type:NodeDataChanged path:/collections/testschemaapi/state.json] for collection [testschemaapi] has occurred - updating... (live nodes size: [2])
   [junit4]   2> 188430 INFO  (zkCallback-287-thread-1-processing-n:127.0.0.1:46402_solr) [n:127.0.0.1:46402_solr    ] o.a.s.c.c.ZkStateReader Updating data for [testschemaapi] from [3] to [4]
   [junit4]   2> 188430 INFO  

[...truncated too long message...]

2> 204665 INFO  (Thread-484) [n:127.0.0.1:44945_solr c:testschemaapi s:shard1 r:core_node1 x:testschemaapi_shard1_replica1] o.a.s.c.CachingDirectoryFactory looking to close /home/jenkins/workspace/Lucene-Solr-master-Linux/solr/build/solr-core/test/J1/temp/solr.schema.TestManagedSchemaAPI_B898787F8948CB0D-001/tempDir-001/node1/./testschemaapi_shard1_replica1/data [CachedDir<<refCount=0;path=/home/jenkins/workspace/Lucene-Solr-master-Linux/solr/build/solr-core/test/J1/temp/solr.schema.TestManagedSchemaAPI_B898787F8948CB0D-001/tempDir-001/node1/./testschemaapi_shard1_replica1/data;done=false>>]
   [junit4]   2> 204665 INFO  (Thread-484) [n:127.0.0.1:44945_solr c:testschemaapi s:shard1 r:core_node1 x:testschemaapi_shard1_replica1] o.a.s.c.CachingDirectoryFactory Closing directory, CoreContainer#isShutdown=true
   [junit4]   2> 204665 INFO  (Thread-484) [n:127.0.0.1:44945_solr c:testschemaapi s:shard1 r:core_node1 x:testschemaapi_shard1_replica1] o.a.s.c.CachingDirectoryFactory Closing directory: /home/jenkins/workspace/Lucene-Solr-master-Linux/solr/build/solr-core/test/J1/temp/solr.schema.TestManagedSchemaAPI_B898787F8948CB0D-001/tempDir-001/node1/./testschemaapi_shard1_replica1/data
   [junit4]   2> ObjectTracker found 1 object(s) that were not released!!! [MockDirectoryWrapper, MockDirectoryWrapper]
   [junit4]   2> org.apache.solr.common.util.ObjectReleaseTracker$ObjectTrackerException
   [junit4]   2> 	at org.apache.solr.common.util.ObjectReleaseTracker.track(ObjectReleaseTracker.java:42)
   [junit4]   2> 	at org.apache.solr.core.CachingDirectoryFactory.get(CachingDirectoryFactory.java:347)
   [junit4]   2> 	at org.apache.solr.core.SolrCore.getNewIndexDir(SolrCore.java:295)
   [junit4]   2> 	at org.apache.solr.core.SolrCore.initIndex(SolrCore.java:513)
   [junit4]   2> 	at org.apache.solr.core.SolrCore.<init>(SolrCore.java:720)
   [junit4]   2> 	at org.apache.solr.core.SolrCore.<init>(SolrCore.java:647)
   [junit4]   2> 	at org.apache.solr.core.CoreContainer.create(CoreContainer.java:836)
   [junit4]   2> 	at org.apache.solr.core.CoreContainer.create(CoreContainer.java:773)
   [junit4]   2> 	at org.apache.solr.handler.admin.CoreAdminOperation$1.call(CoreAdminOperation.java:119)
   [junit4]   2> 	at org.apache.solr.handler.admin.CoreAdminHandler$CallInfo.call(CoreAdminHandler.java:367)
   [junit4]   2> 	at org.apache.solr.handler.admin.CoreAdminHandler.handleRequestBody(CoreAdminHandler.java:158)
   [junit4]   2> 	at org.apache.solr.handler.RequestHandlerBase.handleRequest(RequestHandlerBase.java:155)
   [junit4]   2> 	at org.apache.solr.servlet.HttpSolrCall.handleAdminRequest(HttpSolrCall.java:664)
   [junit4]   2> 	at org.apache.solr.servlet.HttpSolrCall.call(HttpSolrCall.java:446)
   [junit4]   2> 	at org.apache.solr.servlet.SolrDispatchFilter.doFilter(SolrDispatchFilter.java:257)
   [junit4]   2> 	at org.apache.solr.servlet.SolrDispatchFilter.doFilter(SolrDispatchFilter.java:208)
   [junit4]   2> 	at org.eclipse.jetty.servlet.ServletHandler$CachedChain.doFilter(ServletHandler.java:1676)
   [junit4]   2> 	at org.apache.solr.client.solrj.embedded.JettySolrRunner$DebugFilter.doFilter(JettySolrRunner.java:111)
   [junit4]   2> 	at org.eclipse.jetty.servlet.ServletHandler$CachedChain.doFilter(ServletHandler.java:1676)
   [junit4]   2> 	at org.eclipse.jetty.servlet.ServletHandler.doHandle(ServletHandler.java:581)
   [junit4]   2> 	at org.eclipse.jetty.server.session.SessionHandler.doHandle(SessionHandler.java:224)
   [junit4]   2> 	at org.eclipse.jetty.server.handler.ContextHandler.doHandle(ContextHandler.java:1160)
   [junit4]   2> 	at org.eclipse.jetty.servlet.ServletHandler.doScope(ServletHandler.java:511)
   [junit4]   2> 	at org.eclipse.jetty.server.session.SessionHandler.doScope(SessionHandler.java:185)
   [junit4]   2> 	at org.eclipse.jetty.server.handler.ContextHandler.doScope(ContextHandler.java:1092)
   [junit4]   2> 	at org.eclipse.jetty.server.handler.ScopedHandler.handle(ScopedHandler.java:141)
   [junit4]   2> 	at org.eclipse.jetty.server.handler.gzip.GzipHandler.handle(GzipHandler.java:399)
   [junit4]   2> 	at org.eclipse.jetty.server.handler.HandlerWrapper.handle(HandlerWrapper.java:134)
   [junit4]   2> 	at org.eclipse.jetty.server.Server.handle(Server.java:518)
   [junit4]   2> 	at org.eclipse.jetty.server.HttpChannel.handle(HttpChannel.java:308)
   [junit4]   2> 	at org.eclipse.jetty.server.HttpConnection.onFillable(HttpConnection.java:244)
   [junit4]   2> 	at org.eclipse.jetty.io.AbstractConnection$ReadCallback.succeeded(AbstractConnection.java:273)
   [junit4]   2> 	at org.eclipse.jetty.io.FillInterest.fillable(FillInterest.java:95)
   [junit4]   2> 	at org.eclipse.jetty.io.ssl.SslConnection.onFillable(SslConnection.java:186)
   [junit4]   2> 	at org.eclipse.jetty.io.AbstractConnection$ReadCallback.succeeded(AbstractConnection.java:273)
   [junit4]   2> 	at org.eclipse.jetty.io.FillInterest.fillable(FillInterest.java:95)
   [junit4]   2> 	at org.eclipse.jetty.io.SelectChannelEndPoint$2.run(SelectChannelEndPoint.java:93)
   [junit4]   2> 	at org.eclipse.jetty.util.thread.strategy.ExecuteProduceConsume.produceAndRun(ExecuteProduceConsume.java:246)
   [junit4]   2> 	at org.eclipse.jetty.util.thread.strategy.ExecuteProduceConsume.run(ExecuteProduceConsume.java:156)
   [junit4]   2> 	at org.eclipse.jetty.util.thread.QueuedThreadPool.runJob(QueuedThreadPool.java:654)
   [junit4]   2> 	at org.eclipse.jetty.util.thread.QueuedThreadPool$3.run(QueuedThreadPool.java:572)
   [junit4]   2> 	at java.lang.Thread.run(Thread.java:745)
   [junit4]   2> 
   [junit4]   2> 204665 WARN  (Thread-484) [n:127.0.0.1:44945_solr c:testschemaapi s:shard1 r:core_node1 x:testschemaapi_shard1_replica1] o.a.s.c.ZkController listener throws error
   [junit4]   2> org.apache.solr.common.SolrException: Unable to reload core [testschemaapi_shard1_replica1]
   [junit4]   2> 	at org.apache.solr.core.CoreContainer.reload(CoreContainer.java:945)
   [junit4]   2> 	at org.apache.solr.core.SolrCore.lambda$getConfListener$6(SolrCore.java:2490)
   [junit4]   2> 	at org.apache.solr.cloud.ZkController$4.run(ZkController.java:2409)
   [junit4]   2> Caused by: org.apache.solr.common.SolrException: Could not find config name for collection:testschemaapi
   [junit4]   2> 	at org.apache.solr.core.SolrCore.<init>(SolrCore.java:773)
   [junit4]   2> 	at org.apache.solr.core.SolrCore.reload(SolrCore.java:462)
   [junit4]   2> 	at org.apache.solr.core.CoreContainer.reload(CoreContainer.java:939)
   [junit4]   2> 	... 2 more
   [junit4]   2> Caused by: org.apache.solr.common.SolrException: Could not find config name for collection:testschemaapi
   [junit4]   2> 	at org.apache.solr.rest.ManagedResourceStorage.newStorageIO(ManagedResourceStorage.java:101)
   [junit4]   2> 	at org.apache.solr.core.SolrCore.initRestManager(SolrCore.java:2285)
   [junit4]   2> 	at org.apache.solr.core.SolrCore.<init>(SolrCore.java:749)
   [junit4]   2> 	... 4 more
   [junit4]   2> NOTE: test params are: codec=Asserting(Lucene62): {_version_=BlockTreeOrds(blocksize=128), id=PostingsFormat(name=LuceneFixedGap), myNewField1=PostingsFormat(name=LuceneFixedGap), myNewField=FST50}, docValues:{}, maxPointsInLeafNode=2033, maxMBSortInHeap=5.131847383027146, sim=ClassicSimilarity, locale=en-IE, timezone=America/North_Dakota/Center
   [junit4]   2> NOTE: Linux 4.4.0-21-generic i386/Oracle Corporation 1.8.0_92 (32-bit)/cpus=12,threads=1,free=42171488,total=185597952
   [junit4]   2> NOTE: All tests run in this JVM: [ClusterStateUpdateTest, CloudMLTQParserTest, TestClusterStateMutator, ZkCLITest, SimplePostToolTest, ChaosMonkeySafeLeaderTest, TestBM25SimilarityFactory, TestUseDocValuesAsStored2, TestSimpleTrackingShardHandler, MinimalSchemaTest, SolrPluginUtilsTest, ResponseHeaderTest, AtomicUpdatesTest, ConvertedLegacyTest, TestMissingGroups, TestConfigSetsAPIZkFailure, TestFieldSortValues, AsyncMigrateRouteKeyTest, TestManagedSchemaAPI]
   [junit4]   2> NOTE: reproduce with: ant test  -Dtestcase=TestManagedSchemaAPI -Dtests.seed=B898787F8948CB0D -Dtests.multiplier=3 -Dtests.slow=true -Dtests.locale=en-IE -Dtests.timezone=America/North_Dakota/Center -Dtests.asserts=true -Dtests.file.encoding=ISO-8859-1
   [junit4] ERROR   0.00s J1 | TestManagedSchemaAPI (suite) <<<
   [junit4]    > Throwable #1: java.lang.AssertionError: ObjectTracker found 1 object(s) that were not released!!! [MockDirectoryWrapper, MockDirectoryWrapper]
   [junit4]    > 	at __randomizedtesting.SeedInfo.seed([B898787F8948CB0D]:0)
   [junit4]    > 	at org.apache.solr.SolrTestCaseJ4.afterClass(SolrTestCaseJ4.java:255)
   [junit4]    > 	at java.lang.Thread.run(Thread.java:745)
   [junit4] Completed [56/597 (1!)] on J1 in 19.82s, 1 test, 1 failure <<< FAILURES!

[...truncated 1723 lines...]
BUILD FAILED
/home/jenkins/workspace/Lucene-Solr-master-Linux/build.xml:740: The following error occurred while executing this line:
/home/jenkins/workspace/Lucene-Solr-master-Linux/build.xml:684: The following error occurred while executing this line:
/home/jenkins/workspace/Lucene-Solr-master-Linux/build.xml:59: The following error occurred while executing this line:
/home/jenkins/workspace/Lucene-Solr-master-Linux/solr/build.xml:233: The following error occurred while executing this line:
/home/jenkins/workspace/Lucene-Solr-master-Linux/solr/common-build.xml:529: The following error occurred while executing this line:
/home/jenkins/workspace/Lucene-Solr-master-Linux/lucene/common-build.xml:1457: The following error occurred while executing this line:
/home/jenkins/workspace/Lucene-Solr-master-Linux/lucene/common-build.xml:1014: There were test failures: 597 suites (10 ignored), 2413 tests, 1 suite-level error, 115 ignored (71 assumptions) [seed: B898787F8948CB0D]

Total time: 64 minutes 23 seconds
Build step 'Invoke Ant' marked build as failure
Archiving artifacts
[WARNINGS] Skipping publisher since build result is FAILURE
Recording test results
Email was triggered for: Failure - Any
Sending email for trigger: Failure - Any



Mime
View raw message