lucene-dev mailing list archives

Site index · List index
Message view « Date » · « Thread »
Top « Date » · « Thread »
From Policeman Jenkins Server <jenk...@thetaphi.de>
Subject [JENKINS] Lucene-Solr-5.5-Solaris (multiarch/jdk1.7.0) - Build # 37 - Failure!
Date Sun, 01 May 2016 09:50:23 GMT
Build: http://jenkins.thetaphi.de/job/Lucene-Solr-5.5-Solaris/37/
Java: multiarch/jdk1.7.0 -d64 -XX:-UseCompressedOops -XX:+UseParallelGC

1 tests failed.
FAILED:  org.apache.solr.schema.TestManagedSchemaAPI.test

Error Message:
Error from server at http://127.0.0.1:45441/solr/testschemaapi_shard1_replica1: ERROR: [doc=2] unknown field 'myNewField1'

Stack Trace:
org.apache.solr.client.solrj.impl.CloudSolrClient$RouteException: Error from server at http://127.0.0.1:45441/solr/testschemaapi_shard1_replica1: ERROR: [doc=2] unknown field 'myNewField1'
	at __randomizedtesting.SeedInfo.seed([FEF80C51808248CF:76AC338B2E7E2537]:0)
	at org.apache.solr.client.solrj.impl.CloudSolrClient.directUpdate(CloudSolrClient.java:632)
	at org.apache.solr.client.solrj.impl.CloudSolrClient.sendRequest(CloudSolrClient.java:981)
	at org.apache.solr.client.solrj.impl.CloudSolrClient.requestWithRetryOnStaleState(CloudSolrClient.java:870)
	at org.apache.solr.client.solrj.impl.CloudSolrClient.request(CloudSolrClient.java:806)
	at org.apache.solr.schema.TestManagedSchemaAPI.testAddFieldAndDocument(TestManagedSchemaAPI.java:101)
	at org.apache.solr.schema.TestManagedSchemaAPI.test(TestManagedSchemaAPI.java:69)
	at sun.reflect.NativeMethodAccessorImpl.invoke0(Native Method)
	at sun.reflect.NativeMethodAccessorImpl.invoke(NativeMethodAccessorImpl.java:57)
	at sun.reflect.DelegatingMethodAccessorImpl.invoke(DelegatingMethodAccessorImpl.java:43)
	at java.lang.reflect.Method.invoke(Method.java:606)
	at com.carrotsearch.randomizedtesting.RandomizedRunner.invoke(RandomizedRunner.java:1764)
	at com.carrotsearch.randomizedtesting.RandomizedRunner$8.evaluate(RandomizedRunner.java:871)
	at com.carrotsearch.randomizedtesting.RandomizedRunner$9.evaluate(RandomizedRunner.java:907)
	at com.carrotsearch.randomizedtesting.RandomizedRunner$10.evaluate(RandomizedRunner.java:921)
	at com.carrotsearch.randomizedtesting.rules.SystemPropertiesRestoreRule$1.evaluate(SystemPropertiesRestoreRule.java:57)
	at org.apache.lucene.util.TestRuleSetupTeardownChained$1.evaluate(TestRuleSetupTeardownChained.java:49)
	at org.apache.lucene.util.AbstractBeforeAfterRule$1.evaluate(AbstractBeforeAfterRule.java:45)
	at org.apache.lucene.util.TestRuleThreadAndTestName$1.evaluate(TestRuleThreadAndTestName.java:48)
	at org.apache.lucene.util.TestRuleIgnoreAfterMaxFailures$1.evaluate(TestRuleIgnoreAfterMaxFailures.java:64)
	at org.apache.lucene.util.TestRuleMarkFailure$1.evaluate(TestRuleMarkFailure.java:47)
	at com.carrotsearch.randomizedtesting.rules.StatementAdapter.evaluate(StatementAdapter.java:36)
	at com.carrotsearch.randomizedtesting.ThreadLeakControl$StatementRunner.run(ThreadLeakControl.java:367)
	at com.carrotsearch.randomizedtesting.ThreadLeakControl.forkTimeoutingTask(ThreadLeakControl.java:809)
	at com.carrotsearch.randomizedtesting.ThreadLeakControl$3.evaluate(ThreadLeakControl.java:460)
	at com.carrotsearch.randomizedtesting.RandomizedRunner.runSingleTest(RandomizedRunner.java:880)
	at com.carrotsearch.randomizedtesting.RandomizedRunner$5.evaluate(RandomizedRunner.java:781)
	at com.carrotsearch.randomizedtesting.RandomizedRunner$6.evaluate(RandomizedRunner.java:816)
	at com.carrotsearch.randomizedtesting.RandomizedRunner$7.evaluate(RandomizedRunner.java:827)
	at com.carrotsearch.randomizedtesting.rules.StatementAdapter.evaluate(StatementAdapter.java:36)
	at com.carrotsearch.randomizedtesting.rules.SystemPropertiesRestoreRule$1.evaluate(SystemPropertiesRestoreRule.java:57)
	at org.apache.lucene.util.AbstractBeforeAfterRule$1.evaluate(AbstractBeforeAfterRule.java:45)
	at com.carrotsearch.randomizedtesting.rules.StatementAdapter.evaluate(StatementAdapter.java:36)
	at org.apache.lucene.util.TestRuleStoreClassName$1.evaluate(TestRuleStoreClassName.java:41)
	at com.carrotsearch.randomizedtesting.rules.NoShadowingOrOverridesOnMethodsRule$1.evaluate(NoShadowingOrOverridesOnMethodsRule.java:40)
	at com.carrotsearch.randomizedtesting.rules.NoShadowingOrOverridesOnMethodsRule$1.evaluate(NoShadowingOrOverridesOnMethodsRule.java:40)
	at com.carrotsearch.randomizedtesting.rules.StatementAdapter.evaluate(StatementAdapter.java:36)
	at com.carrotsearch.randomizedtesting.rules.StatementAdapter.evaluate(StatementAdapter.java:36)
	at com.carrotsearch.randomizedtesting.rules.StatementAdapter.evaluate(StatementAdapter.java:36)
	at org.apache.lucene.util.TestRuleAssertionsRequired$1.evaluate(TestRuleAssertionsRequired.java:53)
	at org.apache.lucene.util.TestRuleMarkFailure$1.evaluate(TestRuleMarkFailure.java:47)
	at org.apache.lucene.util.TestRuleIgnoreAfterMaxFailures$1.evaluate(TestRuleIgnoreAfterMaxFailures.java:64)
	at org.apache.lucene.util.TestRuleIgnoreTestSuites$1.evaluate(TestRuleIgnoreTestSuites.java:54)
	at com.carrotsearch.randomizedtesting.rules.StatementAdapter.evaluate(StatementAdapter.java:36)
	at com.carrotsearch.randomizedtesting.ThreadLeakControl$StatementRunner.run(ThreadLeakControl.java:367)
	at java.lang.Thread.run(Thread.java:745)
Caused by: org.apache.solr.client.solrj.impl.HttpSolrClient$RemoteSolrException: Error from server at http://127.0.0.1:45441/solr/testschemaapi_shard1_replica1: ERROR: [doc=2] unknown field 'myNewField1'
	at org.apache.solr.client.solrj.impl.HttpSolrClient.executeMethod(HttpSolrClient.java:577)
	at org.apache.solr.client.solrj.impl.HttpSolrClient.request(HttpSolrClient.java:241)
	at org.apache.solr.client.solrj.impl.HttpSolrClient.request(HttpSolrClient.java:230)
	at org.apache.solr.client.solrj.impl.LBHttpSolrClient.doRequest(LBHttpSolrClient.java:372)
	at org.apache.solr.client.solrj.impl.LBHttpSolrClient.request(LBHttpSolrClient.java:325)
	at org.apache.solr.client.solrj.impl.CloudSolrClient$2.call(CloudSolrClient.java:607)
	at org.apache.solr.client.solrj.impl.CloudSolrClient$2.call(CloudSolrClient.java:604)
	at java.util.concurrent.FutureTask.run(FutureTask.java:262)
	at org.apache.solr.common.util.ExecutorUtil$MDCAwareThreadPoolExecutor$1.run(ExecutorUtil.java:231)
	at java.util.concurrent.ThreadPoolExecutor.runWorker(ThreadPoolExecutor.java:1145)
	at java.util.concurrent.ThreadPoolExecutor$Worker.run(ThreadPoolExecutor.java:615)
	... 1 more




Build Log:
[...truncated 11363 lines...]
   [junit4] Suite: org.apache.solr.schema.TestManagedSchemaAPI
   [junit4]   2> Creating dataDir: /export/home/jenkins/workspace/Lucene-Solr-5.5-Solaris/solr/build/solr-core/test/J0/temp/solr.schema.TestManagedSchemaAPI_FEF80C51808248CF-001/init-core-data-001
   [junit4]   2> 1532936 INFO  (SUITE-TestManagedSchemaAPI-seed#[FEF80C51808248CF]-worker) [    ] o.a.s.SolrTestCaseJ4 Randomized ssl (false) and clientAuth (true)
   [junit4]   2> 1532939 INFO  (TEST-TestManagedSchemaAPI.test-seed#[FEF80C51808248CF]) [    ] o.a.s.SolrTestCaseJ4 ###Starting test
   [junit4]   2> 1532939 INFO  (TEST-TestManagedSchemaAPI.test-seed#[FEF80C51808248CF]) [    ] o.a.s.c.ZkTestServer STARTING ZK TEST SERVER
   [junit4]   2> 1532939 INFO  (Thread-3397) [    ] o.a.s.c.ZkTestServer client port:0.0.0.0/0.0.0.0:0
   [junit4]   2> 1532939 INFO  (Thread-3397) [    ] o.a.s.c.ZkTestServer Starting server
   [junit4]   2> 1533040 INFO  (TEST-TestManagedSchemaAPI.test-seed#[FEF80C51808248CF]) [    ] o.a.s.c.ZkTestServer start zk server on port:51948
   [junit4]   2> 1533040 INFO  (TEST-TestManagedSchemaAPI.test-seed#[FEF80C51808248CF]) [    ] o.a.s.c.c.SolrZkClient Using default ZkCredentialsProvider
   [junit4]   2> 1533040 INFO  (TEST-TestManagedSchemaAPI.test-seed#[FEF80C51808248CF]) [    ] o.a.s.c.c.ConnectionManager Waiting for client to connect to ZooKeeper
   [junit4]   2> 1533049 INFO  (zkCallback-2107-thread-1) [    ] o.a.s.c.c.ConnectionManager Watcher org.apache.solr.common.cloud.ConnectionManager@614a8656 name:ZooKeeperConnection Watcher:127.0.0.1:51948 got event WatchedEvent state:SyncConnected type:None path:null path:null type:None
   [junit4]   2> 1533050 INFO  (TEST-TestManagedSchemaAPI.test-seed#[FEF80C51808248CF]) [    ] o.a.s.c.c.ConnectionManager Client is connected to ZooKeeper
   [junit4]   2> 1533050 INFO  (TEST-TestManagedSchemaAPI.test-seed#[FEF80C51808248CF]) [    ] o.a.s.c.c.SolrZkClient Using default ZkACLProvider
   [junit4]   2> 1533050 INFO  (TEST-TestManagedSchemaAPI.test-seed#[FEF80C51808248CF]) [    ] o.a.s.c.c.SolrZkClient makePath: /solr/solr.xml
   [junit4]   2> 1533060 INFO  (jetty-launcher-2106-thread-2) [    ] o.e.j.s.Server jetty-9.2.13.v20150730
   [junit4]   2> 1533060 INFO  (jetty-launcher-2106-thread-1) [    ] o.e.j.s.Server jetty-9.2.13.v20150730
   [junit4]   2> 1533069 INFO  (jetty-launcher-2106-thread-1) [    ] o.e.j.s.h.ContextHandler Started o.e.j.s.ServletContextHandler@6dc734ab{/solr,null,AVAILABLE}
   [junit4]   2> 1533069 INFO  (jetty-launcher-2106-thread-1) [    ] o.e.j.s.ServerConnector Started ServerConnector@3152fedb{HTTP/1.1}{127.0.0.1:45441}
   [junit4]   2> 1533069 INFO  (jetty-launcher-2106-thread-1) [    ] o.e.j.s.Server Started @1535985ms
   [junit4]   2> 1533069 INFO  (jetty-launcher-2106-thread-1) [    ] o.a.s.c.s.e.JettySolrRunner Jetty properties: {hostContext=/solr, hostPort=45441}
   [junit4]   2> 1533070 INFO  (jetty-launcher-2106-thread-1) [    ] o.a.s.s.SolrDispatchFilter SolrDispatchFilter.init(): sun.misc.Launcher$AppClassLoader@5f57402b
   [junit4]   2> 1533070 INFO  (jetty-launcher-2106-thread-1) [    ] o.a.s.c.SolrResourceLoader new SolrResourceLoader for directory: '/export/home/jenkins/workspace/Lucene-Solr-5.5-Solaris/solr/build/solr-core/test/J0/temp/solr.schema.TestManagedSchemaAPI_FEF80C51808248CF-001/tempDir-001/node1'
   [junit4]   2> 1533070 INFO  (jetty-launcher-2106-thread-2) [    ] o.e.j.s.h.ContextHandler Started o.e.j.s.ServletContextHandler@42e56152{/solr,null,AVAILABLE}
   [junit4]   2> 1533070 INFO  (jetty-launcher-2106-thread-1) [    ] o.a.s.c.SolrResourceLoader JNDI not configured for solr (NoInitialContextEx)
   [junit4]   2> 1533070 INFO  (jetty-launcher-2106-thread-1) [    ] o.a.s.c.SolrResourceLoader solr home defaulted to 'solr/' (could not find system property or JNDI)
   [junit4]   2> 1533070 INFO  (jetty-launcher-2106-thread-2) [    ] o.e.j.s.ServerConnector Started ServerConnector@615870cd{HTTP/1.1}{127.0.0.1:57906}
   [junit4]   2> 1533070 INFO  (jetty-launcher-2106-thread-2) [    ] o.e.j.s.Server Started @1535986ms
   [junit4]   2> 1533070 INFO  (jetty-launcher-2106-thread-2) [    ] o.a.s.c.s.e.JettySolrRunner Jetty properties: {hostPort=57906, hostContext=/solr}
   [junit4]   2> 1533070 INFO  (jetty-launcher-2106-thread-1) [    ] o.a.s.c.c.SolrZkClient Using default ZkCredentialsProvider
   [junit4]   2> 1533071 INFO  (jetty-launcher-2106-thread-2) [    ] o.a.s.s.SolrDispatchFilter SolrDispatchFilter.init(): sun.misc.Launcher$AppClassLoader@5f57402b
   [junit4]   2> 1533071 INFO  (jetty-launcher-2106-thread-2) [    ] o.a.s.c.SolrResourceLoader new SolrResourceLoader for directory: '/export/home/jenkins/workspace/Lucene-Solr-5.5-Solaris/solr/build/solr-core/test/J0/temp/solr.schema.TestManagedSchemaAPI_FEF80C51808248CF-001/tempDir-001/node2'
   [junit4]   2> 1533071 INFO  (jetty-launcher-2106-thread-2) [    ] o.a.s.c.SolrResourceLoader JNDI not configured for solr (NoInitialContextEx)
   [junit4]   2> 1533071 INFO  (jetty-launcher-2106-thread-2) [    ] o.a.s.c.SolrResourceLoader solr home defaulted to 'solr/' (could not find system property or JNDI)
   [junit4]   2> 1533071 INFO  (jetty-launcher-2106-thread-2) [    ] o.a.s.c.c.SolrZkClient Using default ZkCredentialsProvider
   [junit4]   2> 1533071 INFO  (jetty-launcher-2106-thread-1) [    ] o.a.s.c.c.ConnectionManager Waiting for client to connect to ZooKeeper
   [junit4]   2> 1533071 INFO  (jetty-launcher-2106-thread-2) [    ] o.a.s.c.c.ConnectionManager Waiting for client to connect to ZooKeeper
   [junit4]   2> 1533074 INFO  (zkCallback-2108-thread-1) [    ] o.a.s.c.c.ConnectionManager Watcher org.apache.solr.common.cloud.ConnectionManager@5a10aa84 name:ZooKeeperConnection Watcher:127.0.0.1:51948/solr got event WatchedEvent state:SyncConnected type:None path:null path:null type:None
   [junit4]   2> 1533075 INFO  (jetty-launcher-2106-thread-1) [    ] o.a.s.c.c.ConnectionManager Client is connected to ZooKeeper
   [junit4]   2> 1533075 INFO  (zkCallback-2109-thread-1) [    ] o.a.s.c.c.ConnectionManager Watcher org.apache.solr.common.cloud.ConnectionManager@7c2aee4d name:ZooKeeperConnection Watcher:127.0.0.1:51948/solr got event WatchedEvent state:SyncConnected type:None path:null path:null type:None
   [junit4]   2> 1533075 INFO  (jetty-launcher-2106-thread-1) [    ] o.a.s.c.c.SolrZkClient Using default ZkACLProvider
   [junit4]   2> 1533075 INFO  (jetty-launcher-2106-thread-2) [    ] o.a.s.c.c.ConnectionManager Client is connected to ZooKeeper
   [junit4]   2> 1533075 INFO  (jetty-launcher-2106-thread-2) [    ] o.a.s.c.c.SolrZkClient Using default ZkACLProvider
   [junit4]   2> 1533075 INFO  (jetty-launcher-2106-thread-1) [    ] o.a.s.s.SolrDispatchFilter solr.xml found in ZooKeeper. Loading...
   [junit4]   2> 1533076 INFO  (jetty-launcher-2106-thread-2) [    ] o.a.s.s.SolrDispatchFilter solr.xml found in ZooKeeper. Loading...
   [junit4]   2> 1533098 INFO  (jetty-launcher-2106-thread-1) [    ] o.a.s.c.CorePropertiesLocator Config-defined core root directory: /export/home/jenkins/workspace/Lucene-Solr-5.5-Solaris/solr/build/solr-core/test/J0/temp/solr.schema.TestManagedSchemaAPI_FEF80C51808248CF-001/tempDir-001/node1/.
   [junit4]   2> 1533098 INFO  (jetty-launcher-2106-thread-1) [    ] o.a.s.c.CoreContainer New CoreContainer 2065024012
   [junit4]   2> 1533098 INFO  (jetty-launcher-2106-thread-1) [    ] o.a.s.c.CoreContainer Loading cores into CoreContainer [instanceDir=/export/home/jenkins/workspace/Lucene-Solr-5.5-Solaris/solr/build/solr-core/test/J0/temp/solr.schema.TestManagedSchemaAPI_FEF80C51808248CF-001/tempDir-001/node1]
   [junit4]   2> 1533098 INFO  (jetty-launcher-2106-thread-2) [    ] o.a.s.c.CorePropertiesLocator Config-defined core root directory: /export/home/jenkins/workspace/Lucene-Solr-5.5-Solaris/solr/build/solr-core/test/J0/temp/solr.schema.TestManagedSchemaAPI_FEF80C51808248CF-001/tempDir-001/node2/.
   [junit4]   2> 1533098 INFO  (jetty-launcher-2106-thread-2) [    ] o.a.s.c.CoreContainer New CoreContainer 1375350517
   [junit4]   2> 1533098 WARN  (jetty-launcher-2106-thread-1) [    ] o.a.s.c.CoreContainer Couldn't add files from /export/home/jenkins/workspace/Lucene-Solr-5.5-Solaris/solr/build/solr-core/test/J0/temp/solr.schema.TestManagedSchemaAPI_FEF80C51808248CF-001/tempDir-001/node1/lib to classpath: /export/home/jenkins/workspace/Lucene-Solr-5.5-Solaris/solr/build/solr-core/test/J0/temp/solr.schema.TestManagedSchemaAPI_FEF80C51808248CF-001/tempDir-001/node1/lib
   [junit4]   2> 1533098 INFO  (jetty-launcher-2106-thread-2) [    ] o.a.s.c.CoreContainer Loading cores into CoreContainer [instanceDir=/export/home/jenkins/workspace/Lucene-Solr-5.5-Solaris/solr/build/solr-core/test/J0/temp/solr.schema.TestManagedSchemaAPI_FEF80C51808248CF-001/tempDir-001/node2]
   [junit4]   2> 1533098 WARN  (jetty-launcher-2106-thread-2) [    ] o.a.s.c.CoreContainer Couldn't add files from /export/home/jenkins/workspace/Lucene-Solr-5.5-Solaris/solr/build/solr-core/test/J0/temp/solr.schema.TestManagedSchemaAPI_FEF80C51808248CF-001/tempDir-001/node2/lib to classpath: /export/home/jenkins/workspace/Lucene-Solr-5.5-Solaris/solr/build/solr-core/test/J0/temp/solr.schema.TestManagedSchemaAPI_FEF80C51808248CF-001/tempDir-001/node2/lib
   [junit4]   2> 1533098 INFO  (jetty-launcher-2106-thread-1) [    ] o.a.s.h.c.HttpShardHandlerFactory created with socketTimeout : 90000,urlScheme : ,connTimeout : 15000,maxConnectionsPerHost : 20,maxConnections : 10000,corePoolSize : 0,maximumPoolSize : 2147483647,maxThreadIdleTime : 5,sizeOfQueue : -1,fairnessPolicy : false,useRetries : false,
   [junit4]   2> 1533098 INFO  (jetty-launcher-2106-thread-2) [    ] o.a.s.h.c.HttpShardHandlerFactory created with socketTimeout : 90000,urlScheme : ,connTimeout : 15000,maxConnectionsPerHost : 20,maxConnections : 10000,corePoolSize : 0,maximumPoolSize : 2147483647,maxThreadIdleTime : 5,sizeOfQueue : -1,fairnessPolicy : false,useRetries : false,
   [junit4]   2> 1533100 INFO  (jetty-launcher-2106-thread-2) [    ] o.a.s.u.UpdateShardHandler Creating UpdateShardHandler HTTP client with params: socketTimeout=340000&connTimeout=45000&retry=true
   [junit4]   2> 1533100 INFO  (jetty-launcher-2106-thread-1) [    ] o.a.s.u.UpdateShardHandler Creating UpdateShardHandler HTTP client with params: socketTimeout=340000&connTimeout=45000&retry=true
   [junit4]   2> 1533101 INFO  (jetty-launcher-2106-thread-2) [    ] o.a.s.l.LogWatcher SLF4J impl is org.slf4j.impl.Log4jLoggerFactory
   [junit4]   2> 1533101 INFO  (jetty-launcher-2106-thread-2) [    ] o.a.s.l.LogWatcher Registering Log Listener [Log4j (org.slf4j.impl.Log4jLoggerFactory)]
   [junit4]   2> 1533101 INFO  (jetty-launcher-2106-thread-2) [    ] o.a.s.c.ZkContainer Zookeeper client=127.0.0.1:51948/solr
   [junit4]   2> 1533101 INFO  (jetty-launcher-2106-thread-1) [    ] o.a.s.l.LogWatcher SLF4J impl is org.slf4j.impl.Log4jLoggerFactory
   [junit4]   2> 1533101 INFO  (jetty-launcher-2106-thread-1) [    ] o.a.s.l.LogWatcher Registering Log Listener [Log4j (org.slf4j.impl.Log4jLoggerFactory)]
   [junit4]   2> 1533101 INFO  (jetty-launcher-2106-thread-2) [    ] o.a.s.c.ZkController zkHost includes chroot
   [junit4]   2> 1533101 INFO  (jetty-launcher-2106-thread-2) [    ] o.a.s.c.c.SolrZkClient Using default ZkCredentialsProvider
   [junit4]   2> 1533101 INFO  (jetty-launcher-2106-thread-1) [    ] o.a.s.c.ZkContainer Zookeeper client=127.0.0.1:51948/solr
   [junit4]   2> 1533101 INFO  (jetty-launcher-2106-thread-1) [    ] o.a.s.c.ZkController zkHost includes chroot
   [junit4]   2> 1533101 INFO  (jetty-launcher-2106-thread-1) [    ] o.a.s.c.c.SolrZkClient Using default ZkCredentialsProvider
   [junit4]   2> 1533102 INFO  (jetty-launcher-2106-thread-2) [    ] o.a.s.c.c.ConnectionManager Waiting for client to connect to ZooKeeper
   [junit4]   2> 1533102 INFO  (jetty-launcher-2106-thread-1) [    ] o.a.s.c.c.ConnectionManager Waiting for client to connect to ZooKeeper
   [junit4]   2> 1533105 INFO  (zkCallback-2114-thread-1) [    ] o.a.s.c.c.ConnectionManager Watcher org.apache.solr.common.cloud.ConnectionManager@4222124a name:ZooKeeperConnection Watcher:127.0.0.1:51948 got event WatchedEvent state:SyncConnected type:None path:null path:null type:None
   [junit4]   2> 1533106 INFO  (jetty-launcher-2106-thread-2) [    ] o.a.s.c.c.ConnectionManager Client is connected to ZooKeeper
   [junit4]   2> 1533106 INFO  (jetty-launcher-2106-thread-2) [    ] o.a.s.c.c.SolrZkClient Using default ZkACLProvider
   [junit4]   2> 1533106 INFO  (zkCallback-2115-thread-1) [    ] o.a.s.c.c.ConnectionManager Watcher org.apache.solr.common.cloud.ConnectionManager@3bc5f926 name:ZooKeeperConnection Watcher:127.0.0.1:51948 got event WatchedEvent state:SyncConnected type:None path:null path:null type:None
   [junit4]   2> 1533106 INFO  (jetty-launcher-2106-thread-1) [    ] o.a.s.c.c.ConnectionManager Client is connected to ZooKeeper
   [junit4]   2> 1533107 INFO  (jetty-launcher-2106-thread-1) [    ] o.a.s.c.c.SolrZkClient Using default ZkACLProvider
   [junit4]   2> 1533108 INFO  (jetty-launcher-2106-thread-2) [n:127.0.0.1:57906_solr    ] o.a.s.c.ZkController Added new OnReconnect listener org.apache.solr.cloud.ZkController$6@3589f9d4
   [junit4]   2> 1533109 INFO  (jetty-launcher-2106-thread-2) [n:127.0.0.1:57906_solr    ] o.a.s.c.c.ConnectionManager Waiting for client to connect to ZooKeeper
   [junit4]   2> 1533109 INFO  (jetty-launcher-2106-thread-1) [n:127.0.0.1:45441_solr    ] o.a.s.c.ZkController Added new OnReconnect listener org.apache.solr.cloud.ZkController$6@3cb2c2e
   [junit4]   2> 1533109 INFO  (jetty-launcher-2106-thread-1) [n:127.0.0.1:45441_solr    ] o.a.s.c.c.ConnectionManager Waiting for client to connect to ZooKeeper
   [junit4]   2> 1533112 INFO  (zkCallback-2117-thread-1-processing-n:127.0.0.1:45441_solr) [n:127.0.0.1:45441_solr    ] o.a.s.c.c.ConnectionManager Watcher org.apache.solr.common.cloud.ConnectionManager@540516fa name:ZooKeeperConnection Watcher:127.0.0.1:51948/solr got event WatchedEvent state:SyncConnected type:None path:null path:null type:None
   [junit4]   2> 1533112 INFO  (jetty-launcher-2106-thread-1) [n:127.0.0.1:45441_solr    ] o.a.s.c.c.ConnectionManager Client is connected to ZooKeeper
   [junit4]   2> 1533112 INFO  (zkCallback-2116-thread-1-processing-n:127.0.0.1:57906_solr) [n:127.0.0.1:57906_solr    ] o.a.s.c.c.ConnectionManager Watcher org.apache.solr.common.cloud.ConnectionManager@ff2d3e2 name:ZooKeeperConnection Watcher:127.0.0.1:51948/solr got event WatchedEvent state:SyncConnected type:None path:null path:null type:None
   [junit4]   2> 1533113 INFO  (jetty-launcher-2106-thread-2) [n:127.0.0.1:57906_solr    ] o.a.s.c.c.ConnectionManager Client is connected to ZooKeeper
   [junit4]   2> 1533114 INFO  (jetty-launcher-2106-thread-1) [n:127.0.0.1:45441_solr    ] o.a.s.c.c.SolrZkClient makePath: /overseer/queue
   [junit4]   2> 1533117 INFO  (jetty-launcher-2106-thread-2) [n:127.0.0.1:57906_solr    ] o.a.s.c.c.SolrZkClient makePath: /overseer/collection-queue-work
   [junit4]   2> 1533118 INFO  (jetty-launcher-2106-thread-1) [n:127.0.0.1:45441_solr    ] o.a.s.c.c.SolrZkClient makePath: /overseer/collection-queue-work
   [junit4]   2> 1533122 INFO  (jetty-launcher-2106-thread-2) [n:127.0.0.1:57906_solr    ] o.a.s.c.c.SolrZkClient makePath: /overseer/collection-map-running
   [junit4]   2> 1533123 INFO  (jetty-launcher-2106-thread-1) [n:127.0.0.1:45441_solr    ] o.a.s.c.c.SolrZkClient makePath: /overseer/collection-map-running
   [junit4]   2> 1533125 INFO  (jetty-launcher-2106-thread-2) [n:127.0.0.1:57906_solr    ] o.a.s.c.c.SolrZkClient makePath: /overseer/collection-map-completed
   [junit4]   2> 1533129 INFO  (jetty-launcher-2106-thread-1) [n:127.0.0.1:45441_solr    ] o.a.s.c.c.SolrZkClient makePath: /overseer/collection-map-failure
   [junit4]   2> 1533129 INFO  (jetty-launcher-2106-thread-2) [n:127.0.0.1:57906_solr    ] o.a.s.c.c.SolrZkClient makePath: /overseer/collection-map-failure
   [junit4]   2> 1533133 INFO  (jetty-launcher-2106-thread-2) [n:127.0.0.1:57906_solr    ] o.a.s.c.c.SolrZkClient makePath: /live_nodes
   [junit4]   2> 1533135 INFO  (jetty-launcher-2106-thread-2) [n:127.0.0.1:57906_solr    ] o.a.s.c.c.SolrZkClient makePath: /collections
   [junit4]   2> 1533136 INFO  (jetty-launcher-2106-thread-1) [n:127.0.0.1:45441_solr    ] o.a.s.c.c.SolrZkClient makePath: /collections
   [junit4]   2> 1533138 INFO  (jetty-launcher-2106-thread-1) [n:127.0.0.1:45441_solr    ] o.a.s.c.c.SolrZkClient makePath: /aliases.json
   [junit4]   2> 1533140 INFO  (jetty-launcher-2106-thread-2) [n:127.0.0.1:57906_solr    ] o.a.s.c.c.SolrZkClient makePath: /aliases.json
   [junit4]   2> 1533141 INFO  (jetty-launcher-2106-thread-1) [n:127.0.0.1:45441_solr    ] o.a.s.c.c.SolrZkClient makePath: /clusterstate.json
   [junit4]   2> 1533143 INFO  (jetty-launcher-2106-thread-1) [n:127.0.0.1:45441_solr    ] o.a.s.c.c.SolrZkClient makePath: /security.json
   [junit4]   2> 1533144 INFO  (jetty-launcher-2106-thread-1) [n:127.0.0.1:45441_solr    ] o.a.s.c.ZkController Register node as live in ZooKeeper:/live_nodes/127.0.0.1:45441_solr
   [junit4]   2> 1533145 INFO  (jetty-launcher-2106-thread-1) [n:127.0.0.1:45441_solr    ] o.a.s.c.c.SolrZkClient makePath: /live_nodes/127.0.0.1:45441_solr
   [junit4]   2> 1533146 INFO  (jetty-launcher-2106-thread-2) [n:127.0.0.1:57906_solr    ] o.a.s.c.ZkController Register node as live in ZooKeeper:/live_nodes/127.0.0.1:57906_solr
   [junit4]   2> 1533147 INFO  (jetty-launcher-2106-thread-2) [n:127.0.0.1:57906_solr    ] o.a.s.c.c.SolrZkClient makePath: /live_nodes/127.0.0.1:57906_solr
   [junit4]   2> 1533148 INFO  (jetty-launcher-2106-thread-1) [n:127.0.0.1:45441_solr    ] o.a.s.c.c.SolrZkClient makePath: /overseer_elect
   [junit4]   2> 1533150 INFO  (jetty-launcher-2106-thread-2) [n:127.0.0.1:57906_solr    ] o.a.s.c.c.SolrZkClient makePath: /overseer_elect/election
   [junit4]   2> 1533152 INFO  (jetty-launcher-2106-thread-1) [n:127.0.0.1:45441_solr    ] o.a.s.c.c.SolrZkClient makePath: /overseer_elect/election
   [junit4]   2> 1533153 INFO  (jetty-launcher-2106-thread-2) [n:127.0.0.1:57906_solr    ] o.a.s.c.Overseer Overseer (id=null) closing
   [junit4]   2> 1533154 INFO  (jetty-launcher-2106-thread-2) [n:127.0.0.1:57906_solr    ] o.a.s.c.LeaderElector Joined leadership election with path: /overseer_elect/election/95819802542931974-127.0.0.1:57906_solr-n_0000000000
   [junit4]   2> 1533154 INFO  (jetty-launcher-2106-thread-2) [n:127.0.0.1:57906_solr    ] o.a.s.c.OverseerElectionContext I am going to be the leader 127.0.0.1:57906_solr
   [junit4]   2> 1533154 INFO  (jetty-launcher-2106-thread-2) [n:127.0.0.1:57906_solr    ] o.a.s.c.c.SolrZkClient makePath: /overseer_elect/leader
   [junit4]   2> 1533155 INFO  (jetty-launcher-2106-thread-1) [n:127.0.0.1:45441_solr    ] o.a.s.c.Overseer Overseer (id=null) closing
   [junit4]   2> 1533157 INFO  (jetty-launcher-2106-thread-2) [n:127.0.0.1:57906_solr    ] o.a.s.c.Overseer Overseer (id=95819802542931974-127.0.0.1:57906_solr-n_0000000000) starting
   [junit4]   2> 1533157 INFO  (jetty-launcher-2106-thread-1) [n:127.0.0.1:45441_solr    ] o.a.s.c.LeaderElector Joined leadership election with path: /overseer_elect/election/95819802542931973-127.0.0.1:45441_solr-n_0000000001
   [junit4]   2> 1533159 INFO  (jetty-launcher-2106-thread-1) [n:127.0.0.1:45441_solr    ] o.a.s.c.LeaderElector Watching path /overseer_elect/election/95819802542931974-127.0.0.1:57906_solr-n_0000000000 to know if I could be the leader
   [junit4]   2> 1533159 INFO  (jetty-launcher-2106-thread-1) [n:127.0.0.1:45441_solr    ] o.a.s.c.c.ZkStateReader Updating cluster state from ZooKeeper... 
   [junit4]   2> 1533160 INFO  (jetty-launcher-2106-thread-2) [n:127.0.0.1:57906_solr    ] o.a.s.c.c.SolrZkClient makePath: /overseer/queue-work
   [junit4]   2> 1533171 INFO  (jetty-launcher-2106-thread-2) [n:127.0.0.1:57906_solr    ] o.a.s.c.OverseerAutoReplicaFailoverThread Starting OverseerAutoReplicaFailoverThread autoReplicaFailoverWorkLoopDelay=10000 autoReplicaFailoverWaitAfterExpiration=30000 autoReplicaFailoverBadNodeExpiration=60000
   [junit4]   2> 1533171 INFO  (jetty-launcher-2106-thread-2) [n:127.0.0.1:57906_solr    ] o.a.s.c.c.ZkStateReader Updating cluster state from ZooKeeper... 
   [junit4]   2> 1533172 INFO  (OverseerCollectionConfigSetProcessor-95819802542931974-127.0.0.1:57906_solr-n_0000000000) [n:127.0.0.1:57906_solr    ] o.a.s.c.OverseerTaskProcessor Process current queue of overseer operations
   [junit4]   2> 1533172 INFO  (OverseerStateUpdate-95819802542931974-127.0.0.1:57906_solr-n_0000000000) [n:127.0.0.1:57906_solr    ] o.a.s.c.Overseer Starting to work on the main queue
   [junit4]   2> 1533195 INFO  (jetty-launcher-2106-thread-1) [n:127.0.0.1:45441_solr    ] o.a.s.c.CoreContainer Security conf doesn't exist. Skipping setup for authorization module.
   [junit4]   2> 1533195 INFO  (jetty-launcher-2106-thread-1) [n:127.0.0.1:45441_solr    ] o.a.s.c.CoreContainer No authentication plugin used.
   [junit4]   2> 1533196 INFO  (jetty-launcher-2106-thread-1) [n:127.0.0.1:45441_solr    ] o.a.s.c.CorePropertiesLocator Looking for core definitions underneath /export/home/jenkins/workspace/Lucene-Solr-5.5-Solaris/solr/build/solr-core/test/J0/temp/solr.schema.TestManagedSchemaAPI_FEF80C51808248CF-001/tempDir-001/node1/.
   [junit4]   2> 1533196 INFO  (jetty-launcher-2106-thread-1) [n:127.0.0.1:45441_solr    ] o.a.s.c.CorePropertiesLocator Found 0 core definitions
   [junit4]   2> 1533198 INFO  (jetty-launcher-2106-thread-1) [n:127.0.0.1:45441_solr    ] o.a.s.s.SolrDispatchFilter user.dir=/export/home/jenkins/workspace/Lucene-Solr-5.5-Solaris/solr/build/solr-core/test/J0
   [junit4]   2> 1533198 INFO  (jetty-launcher-2106-thread-1) [n:127.0.0.1:45441_solr    ] o.a.s.s.SolrDispatchFilter SolrDispatchFilter.init() done
   [junit4]   2> 1533229 INFO  (jetty-launcher-2106-thread-2) [n:127.0.0.1:57906_solr    ] o.a.s.c.CoreContainer Security conf doesn't exist. Skipping setup for authorization module.
   [junit4]   2> 1533229 INFO  (jetty-launcher-2106-thread-2) [n:127.0.0.1:57906_solr    ] o.a.s.c.CoreContainer No authentication plugin used.
   [junit4]   2> 1533230 INFO  (jetty-launcher-2106-thread-2) [n:127.0.0.1:57906_solr    ] o.a.s.c.CorePropertiesLocator Looking for core definitions underneath /export/home/jenkins/workspace/Lucene-Solr-5.5-Solaris/solr/build/solr-core/test/J0/temp/solr.schema.TestManagedSchemaAPI_FEF80C51808248CF-001/tempDir-001/node2/.
   [junit4]   2> 1533230 INFO  (jetty-launcher-2106-thread-2) [n:127.0.0.1:57906_solr    ] o.a.s.c.CorePropertiesLocator Found 0 core definitions
   [junit4]   2> 1533231 INFO  (jetty-launcher-2106-thread-2) [n:127.0.0.1:57906_solr    ] o.a.s.s.SolrDispatchFilter user.dir=/export/home/jenkins/workspace/Lucene-Solr-5.5-Solaris/solr/build/solr-core/test/J0
   [junit4]   2> 1533231 INFO  (jetty-launcher-2106-thread-2) [n:127.0.0.1:57906_solr    ] o.a.s.s.SolrDispatchFilter SolrDispatchFilter.init() done
   [junit4]   2> 1533232 INFO  (TEST-TestManagedSchemaAPI.test-seed#[FEF80C51808248CF]) [    ] o.a.s.c.c.SolrZkClient Using default ZkCredentialsProvider
   [junit4]   2> 1533232 INFO  (TEST-TestManagedSchemaAPI.test-seed#[FEF80C51808248CF]) [    ] o.a.s.c.c.ConnectionManager Waiting for client to connect to ZooKeeper
   [junit4]   2> 1533235 INFO  (zkCallback-2118-thread-1) [    ] o.a.s.c.c.ConnectionManager Watcher org.apache.solr.common.cloud.ConnectionManager@25334ba7 name:ZooKeeperConnection Watcher:127.0.0.1:51948 got event WatchedEvent state:SyncConnected type:None path:null path:null type:None
   [junit4]   2> 1533235 INFO  (TEST-TestManagedSchemaAPI.test-seed#[FEF80C51808248CF]) [    ] o.a.s.c.c.ConnectionManager Client is connected to ZooKeeper
   [junit4]   2> 1533235 INFO  (TEST-TestManagedSchemaAPI.test-seed#[FEF80C51808248CF]) [    ] o.a.s.c.c.SolrZkClient Using default ZkACLProvider
   [junit4]   2> 1533238 INFO  (TEST-TestManagedSchemaAPI.test-seed#[FEF80C51808248CF]) [    ] o.a.s.c.c.SolrZkClient Using default ZkCredentialsProvider
   [junit4]   2> 1533239 INFO  (TEST-TestManagedSchemaAPI.test-seed#[FEF80C51808248CF]) [    ] o.a.s.c.c.ConnectionManager Waiting for client to connect to ZooKeeper
   [junit4]   2> 1533241 INFO  (zkCallback-2120-thread-1) [    ] o.a.s.c.c.ConnectionManager Watcher org.apache.solr.common.cloud.ConnectionManager@33f3a4a3 name:ZooKeeperConnection Watcher:127.0.0.1:51948/solr got event WatchedEvent state:SyncConnected type:None path:null path:null type:None
   [junit4]   2> 1533241 INFO  (TEST-TestManagedSchemaAPI.test-seed#[FEF80C51808248CF]) [    ] o.a.s.c.c.ConnectionManager Client is connected to ZooKeeper
   [junit4]   2> 1533241 INFO  (TEST-TestManagedSchemaAPI.test-seed#[FEF80C51808248CF]) [    ] o.a.s.c.c.SolrZkClient Using default ZkACLProvider
   [junit4]   2> 1533241 INFO  (TEST-TestManagedSchemaAPI.test-seed#[FEF80C51808248CF]) [    ] o.a.s.c.c.SolrZkClient makePath: /configs/conf1/solrconfig.xml
   [junit4]   2> 1533245 INFO  (TEST-TestManagedSchemaAPI.test-seed#[FEF80C51808248CF]) [    ] o.a.s.c.c.SolrZkClient makePath: /configs/conf1/managed-schema
   [junit4]   2> 1533251 INFO  (TEST-TestManagedSchemaAPI.test-seed#[FEF80C51808248CF]) [    ] o.a.s.c.c.SolrZkClient Using default ZkCredentialsProvider
   [junit4]   2> 1533251 INFO  (TEST-TestManagedSchemaAPI.test-seed#[FEF80C51808248CF]) [    ] o.a.s.c.c.ConnectionManager Waiting for client to connect to ZooKeeper
   [junit4]   2> 1533253 INFO  (zkCallback-2121-thread-1) [    ] o.a.s.c.c.ConnectionManager Watcher org.apache.solr.common.cloud.ConnectionManager@3340a08 name:ZooKeeperConnection Watcher:127.0.0.1:51948/solr got event WatchedEvent state:SyncConnected type:None path:null path:null type:None
   [junit4]   2> 1533253 INFO  (TEST-TestManagedSchemaAPI.test-seed#[FEF80C51808248CF]) [    ] o.a.s.c.c.ConnectionManager Client is connected to ZooKeeper
   [junit4]   2> 1533253 INFO  (TEST-TestManagedSchemaAPI.test-seed#[FEF80C51808248CF]) [    ] o.a.s.c.c.SolrZkClient Using default ZkACLProvider
   [junit4]   2> 1533253 INFO  (TEST-TestManagedSchemaAPI.test-seed#[FEF80C51808248CF]) [    ] o.a.s.c.c.ZkStateReader Updating cluster state from ZooKeeper... 
   [junit4]   2> 1533262 INFO  (qtp716605256-10683) [n:127.0.0.1:57906_solr    ] o.a.s.h.a.CollectionsHandler Invoked Collection Action :create with params replicationFactor=2&name=testschemaapi&action=CREATE&version=2&collection.configName=conf1&wt=javabin&numShards=1 and sendToOCPQueue=true
   [junit4]   2> 1533266 INFO  (OverseerCollectionConfigSetProcessor-95819802542931974-127.0.0.1:57906_solr-n_0000000000) [n:127.0.0.1:57906_solr    ] o.a.s.c.OverseerTaskProcessor Overseer Collection Message Handler: Get the message id:/overseer/collection-queue-work/qn-0000000000 message:{
   [junit4]   2>   "name":"testschemaapi",
   [junit4]   2>   "fromApi":"true",
   [junit4]   2>   "replicationFactor":"2",
   [junit4]   2>   "collection.configName":"conf1",
   [junit4]   2>   "numShards":"1",
   [junit4]   2>   "stateFormat":"2",
   [junit4]   2>   "operation":"create"}
   [junit4]   2> 1533269 INFO  (OverseerThreadFactory-4119-thread-1-processing-n:127.0.0.1:57906_solr) [n:127.0.0.1:57906_solr    ] o.a.s.c.OverseerCollectionMessageHandler OverseerCollectionMessageHandler.processMessage : create , {
   [junit4]   2>   "name":"testschemaapi",
   [junit4]   2>   "fromApi":"true",
   [junit4]   2>   "replicationFactor":"2",
   [junit4]   2>   "collection.configName":"conf1",
   [junit4]   2>   "numShards":"1",
   [junit4]   2>   "stateFormat":"2",
   [junit4]   2>   "operation":"create"}
   [junit4]   2> 1533272 INFO  (OverseerThreadFactory-4119-thread-1-processing-n:127.0.0.1:57906_solr) [n:127.0.0.1:57906_solr    ] o.a.s.c.OverseerCollectionMessageHandler Create collection testschemaapi
   [junit4]   2> 1533274 INFO  (OverseerThreadFactory-4119-thread-1-processing-n:127.0.0.1:57906_solr) [n:127.0.0.1:57906_solr    ] o.a.s.c.OverseerCollectionMessageHandler creating collections conf node /collections/testschemaapi 
   [junit4]   2> 1533275 INFO  (OverseerThreadFactory-4119-thread-1-processing-n:127.0.0.1:57906_solr) [n:127.0.0.1:57906_solr    ] o.a.s.c.c.SolrZkClient makePath: /collections/testschemaapi
   [junit4]   2> 1533276 INFO  (zkCallback-2121-thread-1) [    ] o.a.s.c.c.ZkStateReader A collections change: [WatchedEvent state:SyncConnected type:NodeChildrenChanged path:/collections], has occurred - updating...
   [junit4]   2> 1533276 INFO  (zkCallback-2117-thread-1-processing-n:127.0.0.1:45441_solr) [n:127.0.0.1:45441_solr    ] o.a.s.c.c.ZkStateReader A collections change: [WatchedEvent state:SyncConnected type:NodeChildrenChanged path:/collections], has occurred - updating...
   [junit4]   2> 1533276 INFO  (zkCallback-2116-thread-1-processing-n:127.0.0.1:57906_solr) [n:127.0.0.1:57906_solr    ] o.a.s.c.c.ZkStateReader A collections change: [WatchedEvent state:SyncConnected type:NodeChildrenChanged path:/collections], has occurred - updating...
   [junit4]   2> 1533286 INFO  (OverseerStateUpdate-95819802542931974-127.0.0.1:57906_solr-n_0000000000) [n:127.0.0.1:57906_solr    ] o.a.s.c.Overseer processMessage: queueSize: 1, message = {
   [junit4]   2>   "name":"testschemaapi",
   [junit4]   2>   "fromApi":"true",
   [junit4]   2>   "replicationFactor":"2",
   [junit4]   2>   "collection.configName":"conf1",
   [junit4]   2>   "numShards":"1",
   [junit4]   2>   "stateFormat":"2",
   [junit4]   2>   "operation":"create"} current state version: 0
   [junit4]   2> 1533286 INFO  (OverseerStateUpdate-95819802542931974-127.0.0.1:57906_solr-n_0000000000) [n:127.0.0.1:57906_solr    ] o.a.s.c.o.ClusterStateMutator building a new cName: testschemaapi
   [junit4]   2> 1533288 INFO  (OverseerStateUpdate-95819802542931974-127.0.0.1:57906_solr-n_0000000000) [n:127.0.0.1:57906_solr    ] o.a.s.c.o.ZkStateWriter going to create_collection /collections/testschemaapi/state.json
   [junit4]   2> 1533386 INFO  (OverseerThreadFactory-4119-thread-1-processing-n:127.0.0.1:57906_solr) [n:127.0.0.1:57906_solr    ] o.a.s.c.OverseerCollectionMessageHandler Creating SolrCores for new collection testschemaapi, shardNames [shard1] , replicationFactor : 2
   [junit4]   2> 1533386 INFO  (OverseerThreadFactory-4119-thread-1-processing-n:127.0.0.1:57906_solr) [n:127.0.0.1:57906_solr    ] o.a.s.c.OverseerCollectionMessageHandler Creating core testschemaapi_shard1_replica1 as part of shard shard1 of collection testschemaapi on 127.0.0.1:45441_solr
   [junit4]   2> 1533386 INFO  (OverseerThreadFactory-4119-thread-1-processing-n:127.0.0.1:57906_solr) [n:127.0.0.1:57906_solr    ] o.a.s.c.OverseerCollectionMessageHandler Creating core testschemaapi_shard1_replica2 as part of shard shard1 of collection testschemaapi on 127.0.0.1:57906_solr
   [junit4]   2> 1533390 INFO  (qtp1368109955-10691) [n:127.0.0.1:45441_solr    ] o.a.s.h.a.CoreAdminOperation core create command shard=shard1&name=testschemaapi_shard1_replica1&action=CREATE&collection=testschemaapi&version=2&collection.configName=conf1&qt=/admin/cores&wt=javabin&numShards=1
   [junit4]   2> 1533390 INFO  (qtp1368109955-10691) [n:127.0.0.1:45441_solr    ] o.a.s.c.CoreDescriptor Created CoreDescriptor: {dataDir=data/, numShards=1, schema=schema.xml, config=solrconfig.xml, collection=testschemaapi, collection.configName=conf1, configSetProperties=configsetprops.json, loadOnStartup=true, name=testschemaapi_shard1_replica1, transient=false, shard=shard1}
   [junit4]   2> 1533394 INFO  (qtp1368109955-10691) [n:127.0.0.1:45441_solr c:testschemaapi s:shard1  x:testschemaapi_shard1_replica1] o.a.s.c.ZkController publishing state=down
   [junit4]   2> 1533396 INFO  (qtp716605256-10684) [n:127.0.0.1:57906_solr    ] o.a.s.h.a.CoreAdminOperation core create command shard=shard1&name=testschemaapi_shard1_replica2&action=CREATE&collection=testschemaapi&version=2&collection.configName=conf1&qt=/admin/cores&wt=javabin&numShards=1
   [junit4]   2> 1533397 INFO  (qtp1368109955-10691) [n:127.0.0.1:45441_solr c:testschemaapi s:shard1  x:testschemaapi_shard1_replica1] o.a.s.c.ZkController Registering watch for collection testschemaapi
   [junit4]   2> 1533397 INFO  (qtp1368109955-10691) [n:127.0.0.1:45441_solr c:testschemaapi s:shard1  x:testschemaapi_shard1_replica1] o.a.s.c.c.ZkStateReader addZkWatch [testschemaapi]
   [junit4]   2> 1533397 INFO  (qtp716605256-10684) [n:127.0.0.1:57906_solr    ] o.a.s.c.CoreDescriptor Created CoreDescriptor: {shard=shard1, collection.configName=conf1, transient=false, dataDir=data/, loadOnStartup=true, name=testschemaapi_shard1_replica2, config=solrconfig.xml, configSetProperties=configsetprops.json, collection=testschemaapi, numShards=1, schema=schema.xml}
   [junit4]   2> 1533397 INFO  (qtp1368109955-10691) [n:127.0.0.1:45441_solr c:testschemaapi s:shard1  x:testschemaapi_shard1_replica1] o.a.s.c.c.ZkStateReader Add data for [testschemaapi] ver [0]
   [junit4]   2> 1533397 INFO  (qtp1368109955-10691) [n:127.0.0.1:45441_solr c:testschemaapi s:shard1  x:testschemaapi_shard1_replica1] o.a.s.c.ZkController look for our core node name
   [junit4]   2> 1533398 INFO  (OverseerStateUpdate-95819802542931974-127.0.0.1:57906_solr-n_0000000000) [n:127.0.0.1:57906_solr    ] o.a.s.c.Overseer processMessage: queueSize: 1, message = {
   [junit4]   2>   "roles":null,
   [junit4]   2>   "shard":"shard1",
   [junit4]   2>   "operation":"state",
   [junit4]   2>   "state":"down",
   [junit4]   2>   "core":"testschemaapi_shard1_replica1",
   [junit4]   2>   "collection":"testschemaapi",
   [junit4]   2>   "base_url":"http://127.0.0.1:45441/solr",
   [junit4]   2>   "node_name":"127.0.0.1:45441_solr",
   [junit4]   2>   "numShards":"1"} current state version: 0
   [junit4]   2> 1533399 INFO  (OverseerStateUpdate-95819802542931974-127.0.0.1:57906_solr-n_0000000000) [n:127.0.0.1:57906_solr    ] o.a.s.c.o.ReplicaMutator Update state numShards=1 message={
   [junit4]   2>   "roles":null,
   [junit4]   2>   "shard":"shard1",
   [junit4]   2>   "operation":"state",
   [junit4]   2>   "state":"down",
   [junit4]   2>   "core":"testschemaapi_shard1_replica1",
   [junit4]   2>   "collection":"testschemaapi",
   [junit4]   2>   "base_url":"http://127.0.0.1:45441/solr",
   [junit4]   2>   "node_name":"127.0.0.1:45441_solr",
   [junit4]   2>   "numShards":"1"}
   [junit4]   2> 1533400 INFO  (qtp716605256-10684) [n:127.0.0.1:57906_solr c:testschemaapi s:shard1  x:testschemaapi_shard1_replica2] o.a.s.c.ZkController publishing state=down
   [junit4]   2> 1533403 INFO  (qtp716605256-10684) [n:127.0.0.1:57906_solr c:testschemaapi s:shard1  x:testschemaapi_shard1_replica2] o.a.s.c.ZkController Registering watch for collection testschemaapi
   [junit4]   2> 1533403 INFO  (qtp716605256-10684) [n:127.0.0.1:57906_solr c:testschemaapi s:shard1  x:testschemaapi_shard1_replica2] o.a.s.c.c.ZkStateReader addZkWatch [testschemaapi]
   [junit4]   2> 1533404 INFO  (qtp716605256-10684) [n:127.0.0.1:57906_solr c:testschemaapi s:shard1  x:testschemaapi_shard1_replica2] o.a.s.c.c.ZkStateReader Add data for [testschemaapi] ver [0]
   [junit4]   2> 1533404 INFO  (qtp716605256-10684) [n:127.0.0.1:57906_solr c:testschemaapi s:shard1  x:testschemaapi_shard1_replica2] o.a.s.c.ZkController look for our core node name
   [junit4]   2> 1533404 INFO  (OverseerStateUpdate-95819802542931974-127.0.0.1:57906_solr-n_0000000000) [n:127.0.0.1:57906_solr    ] o.a.s.c.Overseer processMessage: queueSize: 1, message = {
   [junit4]   2>   "roles":null,
   [junit4]   2>   "shard":"shard1",
   [junit4]   2>   "operation":"state",
   [junit4]   2>   "state":"down",
   [junit4]   2>   "core":"testschemaapi_shard1_replica2",
   [junit4]   2>   "collection":"testschemaapi",
   [junit4]   2>   "base_url":"http://127.0.0.1:57906/solr",
   [junit4]   2>   "node_name":"127.0.0.1:57906_solr",
   [junit4]   2>   "numShards":"1"} current state version: 0
   [junit4]   2> 1533405 INFO  (OverseerStateUpdate-95819802542931974-127.0.0.1:57906_solr-n_0000000000) [n:127.0.0.1:57906_solr    ] o.a.s.c.o.ReplicaMutator Update state numShards=1 message={
   [junit4]   2>   "roles":null,
   [junit4]   2>   "shard":"shard1",
   [junit4]   2>   "operation":"state",
   [junit4]   2>   "state":"down",
   [junit4]   2>   "core":"testschemaapi_shard1_replica2",
   [junit4]   2>   "collection":"testschemaapi",
   [junit4]   2>   "base_url":"http://127.0.0.1:57906/solr",
   [junit4]   2>   "node_name":"127.0.0.1:57906_solr",
   [junit4]   2>   "numShards":"1"}
   [junit4]   2> 1533510 INFO  (OverseerStateUpdate-95819802542931974-127.0.0.1:57906_solr-n_0000000000) [n:127.0.0.1:57906_solr    ] o.a.s.c.o.ZkStateWriter going to update_collection /collections/testschemaapi/state.json version: 0
   [junit4]   2> 1533512 INFO  (zkCallback-2117-thread-1-processing-n:127.0.0.1:45441_solr) [n:127.0.0.1:45441_solr    ] o.a.s.c.c.ZkStateReader A cluster state change: [WatchedEvent state:SyncConnected type:NodeDataChanged path:/collections/testschemaapi/state.json] for collection [testschemaapi] has occurred - updating... (live nodes size: [2])
   [junit4]   2> 1533512 INFO  (zkCallback-2116-thread-1-processing-n:127.0.0.1:57906_solr) [n:127.0.0.1:57906_solr    ] o.a.s.c.c.ZkStateReader A cluster state change: [WatchedEvent state:SyncConnected type:NodeDataChanged path:/collections/testschemaapi/state.json] for collection [testschemaapi] has occurred - updating... (live nodes size: [2])
   [junit4]   2> 1533513 INFO  (zkCallback-2117-thread-1-processing-n:127.0.0.1:45441_solr) [n:127.0.0.1:45441_solr    ] o.a.s.c.c.ZkStateReader Updating data for [testschemaapi] from [0] to [1]
   [junit4]   2> 1533513 INFO  (zkCallback-2116-thread-1-processing-n:127.0.0.1:57906_solr) [n:127.0.0.1:57906_solr    ] o.a.s.c.c.ZkStateReader Updating data for [testschemaapi] from [0] to [1]
   [junit4]   2> 1534398 INFO  (qtp1368109955-10691) [n:127.0.0.1:45441_solr c:testschemaapi s:shard1  x:testschemaapi_shard1_replica1] o.a.s.c.ZkController waiting to find shard id in clusterstate for testschemaapi_shard1_replica1
   [junit4]   2> 1534398 INFO  (qtp1368109955-10691) [n:127.0.0.1:45441_solr c:testschemaapi s:shard1  x:testschemaapi_shard1_replica1] o.a.s.c.ZkController Check for collection zkNode:testschemaapi
   [junit4]   2> 1534399 INFO  (qtp1368109955-10691) [n:127.0.0.1:45441_solr c:testschemaapi s:shard1  x:testschemaapi_shard1_replica1] o.a.s.c.ZkController Collection zkNode exists
   [junit4]   2> 1534399 INFO  (qtp1368109955-10691) [n:127.0.0.1:45441_solr c:testschemaapi s:shard1  x:testschemaapi_shard1_replica1] o.a.s.c.c.ZkStateReader Load collection config from: [/collections/testschemaapi]
   [junit4]   2> 1534401 INFO  (qtp1368109955-10691) [n:127.0.0.1:45441_solr c:testschemaapi s:shard1  x:testschemaapi_shard1_replica1] o.a.s.c.c.ZkStateReader path=[/collections/testschemaapi] [configName]=[conf1] specified config exists in ZooKeeper
   [junit4]   2> 1534401 INFO  (qtp1368109955-10691) [n:127.0.0.1:45441_solr c:testschemaapi s:shard1  x:testschemaapi_shard1_replica1] o.a.s.c.SolrResourceLoader new SolrResourceLoader for directory: '/export/home/jenkins/workspace/Lucene-Solr-5.5-Solaris/solr/build/solr-core/test/J0/temp/solr.schema.TestManagedSchemaAPI_FEF80C51808248CF-001/tempDir-001/node1/testschemaapi_shard1_replica1'
   [junit4]   2> 1534402 INFO  (qtp1368109955-10691) [n:127.0.0.1:45441_solr c:testschemaapi s:shard1  x:testschemaapi_shard1_replica1] o.a.s.c.SolrResourceLoader JNDI not configured for solr (NoInitialContextEx)
   [junit4]   2> 1534402 INFO  (qtp1368109955-10691) [n:127.0.0.1:45441_solr c:testschemaapi s:shard1  x:testschemaapi_shard1_replica1] o.a.s.c.SolrResourceLoader solr home defaulted to 'solr/' (could not find system property or JNDI)
   [junit4]   2> 1534404 INFO  (qtp1368109955-10691) [n:127.0.0.1:45441_solr c:testschemaapi s:shard1  x:testschemaapi_shard1_replica1] o.a.s.c.Config loaded config solrconfig.xml with version 0 
   [junit4]   2> 1534405 INFO  (qtp716605256-10684) [n:127.0.0.1:57906_solr c:testschemaapi s:shard1  x:testschemaapi_shard1_replica2] o.a.s.c.ZkController waiting to find shard id in clusterstate for testschemaapi_shard1_replica2
   [junit4]   2> 1534405 INFO  (qtp716605256-10684) [n:127.0.0.1:57906_solr c:testschemaapi s:shard1  x:testschemaapi_shard1_replica2] o.a.s.c.ZkController Check for collection zkNode:testschemaapi
   [junit4]   2> 1534405 INFO  (qtp716605256-10684) [n:127.0.0.1:57906_solr c:testschemaapi s:shard1  x:testschemaapi_shard1_replica2] o.a.s.c.ZkController Collection zkNode exists
   [junit4]   2> 1534405 INFO  (qtp716605256-10684) [n:127.0.0.1:57906_solr c:testschemaapi s:shard1  x:testschemaapi_shard1_replica2] o.a.s.c.c.ZkStateReader Load collection config from: [/collections/testschemaapi]
   [junit4]   2> 1534407 INFO  (qtp716605256-10684) [n:127.0.0.1:57906_solr c:testschemaapi s:shard1  x:testschemaapi_shard1_replica2] o.a.s.c.c.ZkStateReader path=[/collections/testschemaapi] [configName]=[conf1] specified config exists in ZooKeeper
   [junit4]   2> 1534407 INFO  (qtp716605256-10684) [n:127.0.0.1:57906_solr c:testschemaapi s:shard1  x:testschemaapi_shard1_replica2] o.a.s.c.SolrResourceLoader new SolrResourceLoader for directory: '/export/home/jenkins/workspace/Lucene-Solr-5.5-Solaris/solr/build/solr-core/test/J0/temp/solr.schema.TestManagedSchemaAPI_FEF80C51808248CF-001/tempDir-001/node2/testschemaapi_shard1_replica2'
   [junit4]   2> 1534407 INFO  (qtp716605256-10684) [n:127.0.0.1:57906_solr c:testschemaapi s:shard1  x:testschemaapi_shard1_replica2] o.a.s.c.SolrResourceLoader JNDI not configured for solr (NoInitialContextEx)
   [junit4]   2> 1534407 INFO  (qtp716605256-10684) [n:127.0.0.1:57906_solr c:testschemaapi s:shard1  x:testschemaapi_shard1_replica2] o.a.s.c.SolrResourceLoader solr home defaulted to 'solr/' (could not find system property or JNDI)
   [junit4]   2> 1534413 INFO  (qtp1368109955-10691) [n:127.0.0.1:45441_solr c:testschemaapi s:shard1  x:testschemaapi_shard1_replica1] o.a.s.c.SolrConfig current version of requestparams : -1
   [junit4]   2> 1534418 INFO  (qtp716605256-10684) [n:127.0.0.1:57906_solr c:testschemaapi s:shard1  x:testschemaapi_shard1_replica2] o.a.s.c.Config loaded config solrconfig.xml with version 0 
   [junit4]   2> 1534430 INFO  (qtp716605256-10684) [n:127.0.0.1:57906_solr c:testschemaapi s:shard1  x:testschemaapi_shard1_replica2] o.a.s.c.SolrConfig current version of requestparams : -1
   [junit4]   2> 1534439 INFO  (qtp1368109955-10691) [n:127.0.0.1:45441_solr c:testschemaapi s:shard1  x:testschemaapi_shard1_replica1] o.a.s.c.SolrConfig Using Lucene MatchVersion: 5.5.1
   [junit4]   2> 1534452 INFO  (qtp716605256-10684) [n:127.0.0.1:57906_solr c:testschemaapi s:shard1  x:testschemaapi_shard1_replica2] o.a.s.c.SolrConfig Using Lucene MatchVersion: 5.5.1
   [junit4]   2> 1534497 INFO  (qtp1368109955-10691) [n:127.0.0.1:45441_solr c:testschemaapi s:shard1  x:testschemaapi_shard1_replica1] o.a.s.c.SolrConfig Loaded SolrConfig: solrconfig.xml
   [junit4]   2> 1534510 INFO  (qtp1368109955-10691) [n:127.0.0.1:45441_solr c:testschemaapi s:shard1  x:testschemaapi_shard1_replica1] o.a.s.s.IndexSchema [testschemaapi_shard1_replica1] Schema name=minimal
   [junit4]   2> 1534511 INFO  (qtp716605256-10684) [n:127.0.0.1:57906_solr c:testschemaapi s:shard1  x:testschemaapi_shard1_replica2] o.a.s.c.SolrConfig Loaded SolrConfig: solrconfig.xml
   [junit4]   2> 1534543 INFO  (qtp716605256-10684) [n:127.0.0.1:57906_solr c:testschemaapi s:shard1  x:testschemaapi_shard1_replica2] o.a.s.s.IndexSchema [testschemaapi_shard1_replica2] Schema name=minimal
   [junit4]   2> 1534557 INFO  (qtp1368109955-10691) [n:127.0.0.1:45441_solr c:testschemaapi s:shard1  x:testschemaapi_shard1_replica1] o.a.s.s.IndexSchema unique key field: id
   [junit4]   2> 1534563 INFO  (qtp1368109955-10691) [n:127.0.0.1:45441_solr c:testschemaapi s:shard1  x:testschemaapi_shard1_replica1] o.a.s.c.ConfigSetProperties Did not find ConfigSet properties, assuming default properties: Can't find resource 'configsetprops.json' in classpath or '/configs/conf1', cwd=/export/home/jenkins/workspace/Lucene-Solr-5.5-Solaris/solr/build/solr-core/test/J0
   [junit4]   2> 1534563 INFO  (qtp1368109955-10691) [n:127.0.0.1:45441_solr c:testschemaapi s:shard1  x:testschemaapi_shard1_replica1] o.a.s.c.CoreContainer Creating SolrCore 'testschemaapi_shard1_replica1' using configuration from collection testschemaapi
   [junit4]   2> 1534563 INFO  (qtp1368109955-10691) [n:127.0.0.1:45441_solr c:testschemaapi s:shard1 r:core_node1 x:testschemaapi_shard1_replica1] o.a.s.c.SolrCore org.apache.solr.core.MockDirectoryFactory
   [junit4]   2> 1534564 INFO  (qtp1368109955-10691) [n:127.0.0.1:45441_solr c:testschemaapi s:shard1 r:core_node1 x:testschemaapi_shard1_replica1] o.a.s.c.SolrCore [[testschemaapi_shard1_replica1] ] Opening new SolrCore at [/export/home/jenkins/workspace/Lucene-Solr-5.5-Solaris/solr/build/solr-core/test/J0/temp/solr.schema.TestManagedSchemaAPI_FEF80C51808248CF-001/tempDir-001/node1/testschemaapi_shard1_replica1], dataDir=[/export/home/jenkins/workspace/Lucene-Solr-5.5-Solaris/solr/build/solr-core/test/J0/temp/solr.schema.TestManagedSchemaAPI_FEF80C51808248CF-001/tempDir-001/node1/./testschemaapi_shard1_replica1/data/]
   [junit4]   2> 1534564 INFO  (qtp1368109955-10691) [n:127.0.0.1:45441_solr c:testschemaapi s:shard1 r:core_node1 x:testschemaapi_shard1_replica1] o.a.s.c.SolrCore JMX monitoring not detected for core: testschemaapi_shard1_replica1
   [junit4]   2> 1534564 INFO  (qtp1368109955-10691) [n:127.0.0.1:45441_solr c:testschemaapi s:shard1 r:core_node1 x:testschemaapi_shard1_replica1] o.a.s.c.CachingDirectoryFactory return new directory for /export/home/jenkins/workspace/Lucene-Solr-5.5-Solaris/solr/build/solr-core/test/J0/temp/solr.schema.TestManagedSchemaAPI_FEF80C51808248CF-001/tempDir-001/node1/./testschemaapi_shard1_replica1/data
   [junit4]   2> 1534564 INFO  (qtp1368109955-10691) [n:127.0.0.1:45441_solr c:testschemaapi s:shard1 r:core_node1 x:testschemaapi_shard1_replica1] o.a.s.c.SolrCore New index directory detected: old=null new=/export/home/jenkins/workspace/Lucene-Solr-5.5-Solaris/solr/build/solr-core/test/J0/temp/solr.schema.TestManagedSchemaAPI_FEF80C51808248CF-001/tempDir-001/node1/./testschemaapi_shard1_replica1/data/index/
   [junit4]   2> 1534564 WARN  (qtp1368109955-10691) [n:127.0.0.1:45441_solr c:testschemaapi s:shard1 r:core_node1 x:testschemaapi_shard1_replica1] o.a.s.c.SolrCore [testschemaapi_shard1_replica1] Solr index directory '/export/home/jenkins/workspace/Lucene-Solr-5.5-Solaris/solr/build/solr-core/test/J0/temp/solr.schema.TestManagedSchemaAPI_FEF80C51808248CF-001/tempDir-001/node1/./testschemaapi_shard1_replica1/data/index' doesn't exist. Creating new index...
   [junit4]   2> 1534564 INFO  (qtp1368109955-10691) [n:127.0.0.1:45441_solr c:testschemaapi s:shard1 r:core_node1 x:testschemaapi_shard1_replica1] o.a.s.c.CachingDirectoryFactory return new directory for /export/home/jenkins/workspace/Lucene-Solr-5.5-Solaris/solr/build/solr-core/test/J0/temp/solr.schema.TestManagedSchemaAPI_FEF80C51808248CF-001/tempDir-001/node1/./testschemaapi_shard1_replica1/data/index
   [junit4]   2> 1534565 INFO  (qtp1368109955-10691) [n:127.0.0.1:45441_solr c:testschemaapi s:shard1 r:core_node1 x:testschemaapi_shard1_replica1] o.a.s.c.SolrDeletionPolicy SolrDeletionPolicy.onCommit: commits: num=1
   [junit4]   2> 	commit{dir=MockDirectoryWrapper(RAMDirectory@3e0f89ab lockFactory=org.apache.lucene.store.SingleInstanceLockFactory@6e175961),segFN=segments_1,generation=1}
   [junit4]   2> 1534565 INFO  (qtp1368109955-10691) [n:127.0.0.1:45441_solr c:testschemaapi s:shard1 r:core_node1 x:testschemaapi_shard1_replica1] o.a.s.c.SolrDeletionPolicy newest commit generation = 1
   [junit4]   2> 1534567 INFO  (qtp1368109955-10691) [n:127.0.0.1:45441_solr c:testschemaapi s:shard1 r:core_node1 x:testschemaapi_shard1_replica1] o.a.s.c.SolrCore no updateRequestProcessorChain defined as default, creating implicit default
   [junit4]   2> 1534569 INFO  (qtp1368109955-10691) [n:127.0.0.1:45441_solr c:testschemaapi s:shard1 r:core_node1 x:testschemaapi_shard1_replica1] o.a.s.h.l.XMLLoader xsltCacheLifetimeSeconds=60
   [junit4]   2> 1534571 INFO  (OldIndexDirectoryCleanupThreadForCore-testschemaapi_shard1_replica1) [n:127.0.0.1:45441_solr c:testschemaapi s:shard1 r:core_node1 x:testschemaapi_shard1_replica1] o.a.s.c.SolrCore Looking for old index directories to cleanup for core testschemaapi_shard1_replica1 in /export/home/jenkins/workspace/Lucene-Solr-5.5-Solaris/solr/build/solr-core/test/J0/temp/solr.schema.TestManagedSchemaAPI_FEF80C51808248CF-001/tempDir-001/node1/./testschemaapi_shard1_replica1/data/
   [junit4]   2> 1534571 WARN  (OldIndexDirectoryCleanupThreadForCore-testschemaapi_shard1_replica1) [n:127.0.0.1:45441_solr c:testschemaapi s:shard1 r:core_node1 x:testschemaapi_shard1_replica1] o.a.s.c.DirectoryFactory /export/home/jenkins/workspace/Lucene-Solr-5.5-Solaris/solr/build/solr-core/test/J0/temp/solr.schema.TestManagedSchemaAPI_FEF80C51808248CF-001/tempDir-001/node1/./testschemaapi_shard1_replica1/data/ does not point to a valid data directory; skipping clean-up of old index directories.
   [junit4]   2> 1534572 INFO  (qtp1368109955-10691) [n:127.0.0.1:45441_solr c:testschemaapi s:shard1 r:core_node1 x:testschemaapi_shard1_replica1] o.a.s.h.l.XMLLoader xsltCacheLifetimeSeconds=60
   [junit4]   2> 1534573 INFO  (qtp1368109955-10691) [n:127.0.0.1:45441_solr c:testschemaapi s:shard1 r:core_node1 x:testschemaapi_shard1_replica1] o.a.s.h.l.XMLLoader xsltCacheLifetimeSeconds=60
   [junit4]   2> 1534574 INFO  (qtp1368109955-10691) [n:127.0.0.1:45441_solr c:testschemaapi s:shard1 r:core_node1 x:testschemaapi_shard1_replica1] o.a.s.h.l.XMLLoader xsltCacheLifetimeSeconds=60
   [junit4]   2> 1534577 INFO  (qtp1368109955-10691) [n:127.0.0.1:45441_solr c:testschemaapi s:shard1 r:core_node1 x:testschemaapi_shard1_replica1] o.a.s.c.RequestHandlers Registered paths: /schema,/replication,/update/csv,/update/json/docs,/update,/select,/admin/mbeans,/admin/threads,/admin/ping,/admin/luke,/admin/file,/admin/system,/admin/segments,/admin/properties,/admin/plugins,/config,/update/json,/admin/logging,/get
   [junit4]   2> 1534579 INFO  (qtp1368109955-10691) [n:127.0.0.1:45441_solr c:testschemaapi s:shard1 r:core_node1 x:testschemaapi_shard1_replica1] o.a.s.c.SolrCore Using default statsCache cache: org.apache.solr.search.stats.LocalStatsCache
   [junit4]   2> 1534579 INFO  (qtp1368109955-10691) [n:127.0.0.1:45441_solr c:testschemaapi s:shard1 r:core_node1 x:testschemaapi_shard1_replica1] o.a.s.u.UpdateHandler Using UpdateLog implementation: org.apache.solr.update.UpdateLog
   [junit4]   2> 1534579 INFO  (qtp1368109955-10691) [n:127.0.0.1:45441_solr c:testschemaapi s:shard1 r:core_node1 x:testschemaapi_shard1_replica1] o.a.s.u.UpdateLog Initializing UpdateLog: dataDir=null defaultSyncLevel=FLUSH numRecordsToKeep=100 maxNumLogsToKeep=10 numVersionBuckets=65536
   [junit4]   2> 1534581 INFO  (qtp1368109955-10691) [n:127.0.0.1:45441_solr c:testschemaapi s:shard1 r:core_node1 x:testschemaapi_shard1_replica1] o.a.s.u.CommitTracker Hard AutoCommit: disabled
   [junit4]   2> 1534581 INFO  (qtp1368109955-10691) [n:127.0.0.1:45441_solr c:testschemaapi s:shard1 r:core_node1 x:testschemaapi_shard1_replica1] o.a.s.u.CommitTracker Soft AutoCommit: disabled
   [junit4]   2> 1534583 INFO  (qtp1368109955-10691) [n:127.0.0.1:45441_solr c:testschemaapi s:shard1 r:core_node1 x:testschemaapi_shard1_replica1] o.a.s.c.SolrDeletionPolicy SolrDeletionPolicy.onInit: commits: num=1
   [junit4]   2> 	commit{dir=MockDirectoryWrapper(RAMDirectory@3e0f89ab lockFactory=org.apache.lucene.store.SingleInstanceLockFactory@6e175961),segFN=segments_1,generation=1}
   [junit4]   2> 1534583 INFO  (qtp1368109955-10691) [n:127.0.0.1:45441_solr c:testschemaapi s:shard1 r:core_node1 x:testschemaapi_shard1_replica1] o.a.s.c.SolrDeletionPolicy newest commit generation = 1
   [junit4]   2> 1534583 INFO  (qtp1368109955-10691) [n:127.0.0.1:45441_solr c:testschemaapi s:shard1 r:core_node1 x:testschemaapi_shard1_replica1] o.a.s.s.SolrIndexSearcher Opening Searcher@6b4fd362[testschemaapi_shard1_replica1] main
   [junit4]   2> 1534583 INFO  (qtp1368109955-10691) [n:127.0.0.1:45441_solr c:testschemaapi s:shard1 r:core_node1 x:testschemaapi_shard1_replica1] o.a.s.c.c.ZkStateReader Load collection config from: [/collections/testschemaapi]
   [junit4]   2> 1534584 INFO  (qtp1368109955-10691) [n:127.0.0.1:45441_solr c:testschemaapi s:shard1 r:core_node1 x:testschemaapi_shard1_replica1] o.a.s.c.c.ZkStateReader path=[/collections/testschemaapi] [configName]=[conf1] specified config exists in ZooKeeper
   [junit4]   2> 1534584 INFO  (qtp1368109955-10691) [n:127.0.0.1:45441_solr c:testschemaapi s:shard1 r:core_node1 x:testschemaapi_shard1_replica1] o.a.s.r.ManagedResourceStorage Setting up ZooKeeper-based storage for the RestManager with znodeBase: /configs/conf1
   [junit4]   2> 1534585 INFO  (qtp1368109955-10691) [n:127.0.0.1:45441_solr c:testschemaapi s:shard1 r:core_node1 x:testschemaapi_shard1_replica1] o.a.s.r.ManagedResourceStorage Configured ZooKeeperStorageIO with znodeBase: /configs/conf1
   [junit4]   2> 1534585 INFO  (qtp1368109955-10691) [n:127.0.0.1:45441_solr c:testschemaapi s:shard1 r:core_node1 x:testschemaapi_shard1_replica1] o.a.s.r.RestManager Initializing RestManager with initArgs: {}
   [junit4]   2> 1534585 INFO  (qtp1368109955-10691) [n:127.0.0.1:45441_solr c:testschemaapi s:shard1 r:core_node1 x:testschemaapi_shard1_replica1] o.a.s.r.ManagedResourceStorage Reading _rest_managed.json using ZooKeeperStorageIO:path=/configs/conf1
   [junit4]   2> 1534585 INFO  (qtp1368109955-10691) [n:127.0.0.1:45441_solr c:testschemaapi s:shard1 r:core_node1 x:testschemaapi_shard1_replica1] o.a.s.r.ManagedResourceStorage No data found for znode /configs/conf1/_rest_managed.json
   [junit4]   2> 1534586 INFO  (qtp1368109955-10691) [n:127.0.0.1:45441_solr c:testschemaapi s:shard1 r:core_node1 x:testschemaapi_shard1_replica1] o.a.s.r.ManagedResourceStorage Loaded null at path _rest_managed.json using ZooKeeperStorageIO:path=/configs/conf1
   [junit4]   2> 1534586 INFO  (qtp1368109955-10691) [n:127.0.0.1:45441_solr c:testschemaapi s:shard1 r:core_node1 x:testschemaapi_shard1_replica1] o.a.s.r.RestManager Initializing 0 registered ManagedResources
   [junit4]   2> 1534586 INFO  (qtp1368109955-10691) [n:127.0.0.1:45441_solr c:testschemaapi s:shard1 r:core_node1 x:testschemaapi_shard1_replica1] o.a.s.s.ZkIndexSchemaReader Creating ZooKeeper watch for the managed schema at /configs/conf1/managed-schema
   [junit4]   2> 1534587 INFO  (qtp1368109955-10691) [n:127.0.0.1:45441_solr c:testschemaapi s:shard1 r:core_node1 x:testschemaapi_shard1_replica1] o.a.s.c.ZkController Added new OnReconnect listener ZkIndexSchemaReader: /configs/conf1/managed-schema, uniqueCoreId: testschemaapi_shard1_replica1:823659725916481
   [junit4]   2> 1534587 INFO  (qtp1368109955-10691) [n:127.0.0.1:45441_solr c:testschemaapi s:shard1 r:core_node1 x:testschemaapi_shard1_replica1] o.a.s.h.ReplicationHandler Commits will be reserved for  10000
   [junit4]   2> 1534587 INFO  (qtp1368109955-10691) [n:127.0.0.1:45441_solr c:testschemaapi s:shard1 r:core_node1 x:testschemaapi_shard1_replica1] o.a.s.u.UpdateLog Looking up max value of version field to seed version buckets
   [junit4]   2> 1534587 INFO  (qtp1368109955-10691) [n:127.0.0.1:45441_solr c:testschemaapi s:shard1 r:core_node1 x:testschemaapi_shard1_replica1] o.a.s.u.VersionInfo Refreshing highest value of _version_ for 65536 version buckets from index
   [junit4]   2> 1534588 INFO  (qtp1368109955-10691) [n:127.0.0.1:45441_solr c:testschemaapi s:shard1 r:core_node1 x:testschemaapi_shard1_replica1] o.a.s.u.VersionInfo No terms found for _version_, cannot seed version bucket highest value from index
   [junit4]   2> 1534588 INFO  (qtp1368109955-10691) [n:127.0.0.1:45441_solr c:testschemaapi s:shard1 r:core_node1 x:testschemaapi_shard1_replica1] o.a.s.u.UpdateLog Could not find max version in index or recent updates, using new clock 1533116842413916160
   [junit4]   2> 1534589 INFO  (qtp1368109955-10691) [n:127.0.0.1:45441_solr c:testschemaapi s:shard1 r:core_node1 x:testschemaapi_shard1_replica1] o.a.s.u.UpdateLog Took 1.0ms to seed version buckets with highest version 1533116842413916160
   [junit4]   2> 1534589 INFO  (qtp1368109955-10691) [n:127.0.0.1:45441_solr c:testschemaapi s:shard1 r:core_node1 x:testschemaapi_shard1_replica1] o.a.s.c.ZkController watch zkdir /configs/conf1
   [junit4]   2> 1534590 INFO  (searcherExecutor-4124-thread-1-processing-s:shard1 x:testschemaapi_shard1_replica1 r:core_node1 c:testschemaapi n:127.0.0.1:45441_solr) [n:127.0.0.1:45441_solr c:testschemaapi s:shard1 r:core_node1 x:testschemaapi_shard1_replica1] o.a.s.c.SolrCore [testschemaapi_shard1_replica1] Registered new searcher Searcher@6b4fd362[testschemaapi_shard1_replica1] main{ExitableDirectoryReader(UninvertingDirectoryReader())}
   [junit4]   2> 1534591 INFO  (qtp1368109955-10691) [n:127.0.0.1:45441_solr c:testschemaapi s:shard1 r:core_node1 x:testschemaapi_shard1_replica1] o.a.s.c.CoreContainer registering core: testschemaapi_shard1_replica1
   [junit4]   2> 1534591 INFO  (qtp1368109955-10691) [n:127.0.0.1:45441_solr c:testschemaapi s:shard1 r:core_node1 x:testschemaapi_shard1_replica1] o.a.s.c.ZkController Register replica - core:testschemaapi_shard1_replica1 address:http://127.0.0.1:45441/solr collection:testschemaapi shard:shard1
   [junit4]   2> 1534593 INFO  (qtp716605256-10684) [n:127.0.0.1:57906_solr c:testschemaapi s:shard1  x:testschemaapi_shard1_replica2] o.a.s.s.IndexSchema unique key field: id
   [junit4]   2> 1534593 INFO  (qtp1368109955-10691) [n:127.0.0.1:45441_solr c:testschemaapi s:shard1 r:core_node1 x:testschemaapi_shard1_replica1] o.a.s.c.c.SolrZkClient makePath: /collections/testschemaapi/leader_elect/shard1/election
   [junit4]   2> 1534595 INFO  (qtp716605256-10684) [n:127.0.0.1:57906_solr c:testschemaapi s:shard1  x:testschemaapi_shard1_replica2] o.a.s.c.ConfigSetProperties Did not find ConfigSet properties, assuming default properties: Can't find resource 'configsetprops.json' in classpath or '/configs/conf1', cwd=/export/home/jenkins/workspace/Lucene-Solr-5.5-Solaris/solr/build/solr-core/test/J0
   [junit4]   2> 1534595 INFO  (qtp716605256-10684) [n:127.0.0.1:57906_solr c:testschemaapi s:shard1  x:testschemaapi_shard1_replica2] o.a.s.c.CoreContainer Creating SolrCore 'testschemaapi_shard1_replica2' using configuration from collection testschemaapi
   [junit4]   2> 1534596 INFO  (qtp716605256-10684) [n:127.0.0.1:57906_solr c:testschemaapi s:shard1 r:core_node2 x:testschemaapi_shard1_replica2] o.a.s.c.SolrCore org.apache.solr.core.MockDirectoryFactory
   [junit4]   2> 1534596 INFO  (qtp716605256-10684) [n:127.0.0.1:57906_solr c:testschemaapi s:shard1 r:core_node2 x:testschemaapi_shard1_replica2] o.a.s.c.SolrCore [[testschemaapi_shard1_replica2] ] Opening new SolrCore at [/export/home/jenkins/workspace/Lucene-Solr-5.5-Solaris/solr/build/solr-core/test/J0/temp/solr.schema.TestManagedSchemaAPI_FEF80C51808248CF-001/tempDir-001/node2/testschemaapi_shard1_replica2], dataDir=[/export/home/jenkins/workspace/Lucene-Solr-5.5-Solaris/solr/build/solr-core/test/J0/temp/solr.schema.TestManagedSchemaAPI_FEF80C51808248CF-001/tempDir-001/node2/./testschemaapi_shard1_replica2/data/]
   [junit4]   2> 1534596 INFO  (qtp716605256-10684) [n:127.0.0.1:57906_solr c:testschemaapi s:shard1 r:core_node2 x:testschemaapi_shard1_replica2] o.a.s.c.SolrCore JMX monitoring not detected for core: testschemaapi_shard1_replica2
   [junit4]   2> 1534597 INFO  (qtp716605256-10684) [n:127.0.0.1:57906_solr c:testschemaapi s:shard1 r:core_node2 x:testschemaapi_shard1_replica2] o.a.s.c.CachingDirectoryFactory return new directory for /export/home/jenkins/workspace/Lucene-Solr-5.5-Solaris/solr/build/solr-core/test/J0/temp/solr.schema.TestManagedSchemaAPI_FEF80C51808248CF-001/tempDir-001/node2/./testschemaapi_shard1_replica2/data
   [junit4]   2> 1534597 INFO  (qtp716605256-10684) [n:127.0.0.1:57906_solr c:testschemaapi s:shard1 r:core_node2 x:testschemaapi_shard1_replica2] o.a.s.c.SolrCore New index directory detected: old=null new=/export/home/jenkins/workspace/Lucene-Solr-5.5-Solaris/solr/build/solr-core/test/J0/temp/solr.schema.TestManagedSchemaAPI_FEF80C51808248CF-001/tempDir-001/node2/./testschemaapi_shard1_replica2/data/index/
   [junit4]   2> 1534598 WARN  (qtp716605256-10684) [n:127.0.0.1:57906_solr c:testschemaapi s:shard1 r:core_node2 x:testschemaapi_shard1_replica2] o.a.s.c.SolrCore [testschemaapi_shard1_replica2] Solr index directory '/export/home/jenkins/workspace/Lucene-Solr-5.5-Solaris/solr/build/solr-core/test/J0/temp/solr.schema.TestManagedSchemaAPI_FEF80C51808248CF-001/tempDir-001/node2/./testschemaapi_shard1_replica2/data/index' doesn't exist. Creating new index...
   [junit4]   2> 1534599 INFO  (qtp716605256-10684) [n:127.0.0.1:57906_solr c:testschemaapi s:shard1 r:core_node2 x:testschemaapi_shard1_replica2] o.a.s.c.CachingDirectoryFactory return new directory for /export/home/jenkins/workspace/Lucene-Solr-5.5-Solaris/solr/build/solr-core/test/J0/temp/solr.schema.TestManagedSchemaAPI_FEF80C51808248CF-001/tempDir-001/node2/./testschemaapi_shard1_replica2/data/index
   [junit4]   2> 1534600 INFO  (qtp716605256-10684) [n:127.0.0.1:57906_solr c:testschemaapi s:shard1 r:core_node2 x:testschemaapi_shard1_replica2] o.a.s.c.SolrDeletionPolicy SolrDeletionPolicy.onCommit: commits: num=1
   [junit4]   2> 	commit{dir=MockDirectoryWrapper(RAMDirectory@4d1282b9 lockFactory=org.apache.lucene.store.SingleInstanceLockFactory@7a446736),segFN=segments_1,generation=1}
   [junit4]   2> 1534600 INFO  (qtp716605256-10684) [n:127.0.0.1:57906_solr c:testschemaapi s:shard1 r:core_node2 x:testschemaapi_shard1_replica2] o.a.s.c.SolrDeletionPolicy newest commit generation = 1
   [junit4]   2> 1534600 INFO  (qtp1368109955-10691) [n:127.0.0.1:45441_solr c:testschemaapi s:shard1 r:core_node1 x:testschemaapi_shard1_replica1] o.a.s.c.LeaderElector Joined leadership election with path: /collections/testschemaapi/leader_elect/shard1/election/95819802542931973-core_node1-n_0000000000
   [junit4]   2> 1534602 INFO  (qtp1368109955-10691) [n:127.0.0.1:45441_solr c:testschemaapi s:shard1 r:core_node1 x:testschemaapi_shard1_replica1] o.a.s.c.ShardLeaderElectionContext Running the leader process for shard=shard1 and weAreReplacement=false and leaderVoteWait=10000
   [junit4]   2> 1534603 INFO  (OldIndexDirectoryCleanupThreadForCore-testschemaapi_shard1_replica2) [n:127.0.0.1:57906_solr c:testschemaapi s:shard1 r:core_node2 x:testschemaapi_shard1_replica2] o.a.s.c.SolrCore Looking for old index directories to cleanup for core testschemaapi_shard1_replica2 in /export/home/jenkins/workspace/Lucene-Solr-5.5-Solaris/solr/build/solr-core/test/J0/temp/solr.schema.TestManagedSchemaAPI_FEF80C51808248CF-001/tempDir-001/node2/./testschemaapi_shard1_replica2/data/
   [junit4]   2> 1534604 INFO  (qtp716605256-10684) [n:127.0.0.1:57906_solr c:testschemaapi s:shard1 r:core_node2 x:testschemaapi_shard1_replica2] o.a.s.c.SolrCore no updateRequestProcessorChain defined as default, creating implicit default
   [junit4]   2> 1534604 WARN  (OldIndexDirectoryCleanupThreadForCore-testschemaapi_shard1_replica2) [n:127.0.0.1:57906_solr c:testschemaapi s:shard1 r:core_node2 x:testschemaapi_shard1_replica2] o.a.s.c.DirectoryFactory /export/home/jenkins/workspace/Lucene-Solr-5.5-Solaris/solr/build/solr-core/test/J0/temp/solr.schema.TestManagedSchemaAPI_FEF80C51808248CF-001/tempDir-001/node2/./testschemaapi_shard1_replica2/data/ does not point to a valid data directory; skipping clean-up of old index directories.
   [junit4]   2> 1534605 INFO  (qtp1368109955-10691) [n:127.0.0.1:45441_solr c:testschemaapi s:shard1 r:core_node1 x:testschemaapi_shard1_replica1] o.a.s.c.ShardLeaderElectionContext Waiting until we see more replicas up for shard shard1: total=2 found=1 timeoutin=9998ms
   [junit4]   2> 1534606 INFO  (OverseerStateUpdate-95819802542931974-127.0.0.1:57906_solr-n_0000000000) [n:127.0.0.1:57906_solr    ] o.a.s.c.Overseer processMessage: queueSize: 1, message = {
   [junit4]   2>   "operation":"leader",
   [junit4]   2>   "shard":"shard1",
   [junit4]   2>   "collection":"testschemaapi"} current state version: 0
   [junit4]   2> 1534607 INFO  (qtp716605256-10684) [n:127.0.0.1:57906_solr c:testschemaapi s:shard1 r:core_node2 x:testschemaapi_shard1_replica2] o.a.s.h.l.XMLLoader xsltCacheLifetimeSeconds=60
   [junit4]   2> 1534609 INFO  (qtp716605256-10684) [n:127.0.0.1:57906_solr c:testschemaapi s:shard1 r:core_node2 x:testschemaapi_shard1_replica2] o.a.s.h.l.XMLLoader xsltCacheLifetimeSeconds=60
   [junit4]   2> 1534611 INFO  (qtp716605256-10684) [n:127.0.0.1:57906_solr c:testschemaapi s:shard1 r:core_node2 x:testschemaapi_shard1_replica2] o.a.s.h.l.XMLLoader xsltCacheLifetimeSeconds=60
   [junit4]   2> 1534613 INFO  (qtp716605256-10684) [n:127.0.0.1:57906_solr c:testschemaapi s:shard1 r:core_node2 x:testschemaapi_shard1_replica2] o.a.s.h.l.XMLLoader xsltCacheLifetimeSeconds=60
   [junit4]   2> 1534615 INFO  (qtp716605256-10684) [n:127.0.0.1:57906_solr c:testschemaapi s:shard1 r:core_node2 x:testschemaapi_shard1_replica2] o.a.s.c.RequestHandlers Registered paths: /schema,/replication,/update/csv,/update/json/docs,/update,/select,/admin/mbeans,/admin/threads,/admin/ping,/admin/luke,/admin/file,/admin/system,/admin/segments,/admin/properties,/admin/plugins,/config,/update/json,/admin/logging,/get
   [junit4]   2> 1534616 INFO  (qtp716605256-10684) [n:127.0.0.1:57906_solr c:testschemaapi s:shard1 r:core_node2 x:testschemaapi_shard1_replica2] o.a.s.c.SolrCore Using default statsCache cache: org.apache.solr.search.stats.LocalStatsCache
   [junit4]   2> 1534617 INFO  (qtp716605256-10684) [n:127.0.0.1:57906_solr c:testschemaapi s:shard1 r:core_node2 x:testschemaapi_shard1_replica2] o.a.s.u.UpdateHandler Using UpdateLog implementation: org.apache.solr.update.UpdateLog
   [junit4]   2> 1534617 INFO  (qtp716605256-10684) [n:127.0.0.1:57906_solr c:testschemaapi s:shard1 r:core_node2 x:testschemaapi_shard1_replica2] o.a.s.u.UpdateLog Initializing UpdateLog: dataDir=null defaultSyncLevel=FLUSH numRecordsToKeep=100 maxNumLogsToKeep=10 numVersionBuckets=65536
   [junit4]   2> 1534618 INFO  (qtp716605256-10684) [n:127.0.0.1:57906_solr c:testschemaapi s:shard1 r:core_node2 x:testschemaapi_shard1_replica2] o.a.s.u.CommitTracker Hard AutoCommit: disabled
   [junit4]   2> 1534618 INFO  (qtp716605256-10684) [n:127.0.0.1:57906_solr c:testschemaapi s:shard1 r:core_node2 x:testschemaapi_shard1_replica2] o.a.s.u.CommitTracker Soft AutoCommit: disabled
   [junit4]   2> 1534619 INFO  (qtp716605256-10684) [n:127.0.0.1:57906_solr c:testschemaapi s:shard1 r:core_node2 x:testschemaapi_shard1_replica2] o.a.s.c.SolrDeletionPolicy SolrDeletionPolicy.onInit: commits: num=1
   [junit4]   2> 	commit{dir=MockDirectoryWrapper(RAMDirectory@4d1282b9 lockFactory=org.apache.lucene.store.SingleInstanceLockFactory@7a446736),segFN=segments_1,generation=1}
   [junit4]   2> 1534619 INFO  (qtp716605256-10684) [n:127.0.0.1:57906_solr c:testschemaapi s:shard1 r:core_node2 x:testschemaapi_shard1_replica2] o.a.s.c.SolrDeletionPolicy newest commit generation = 1
   [junit4]   2> 1534619 INFO  (qtp716605256-10684) [n:127.0.0.1:57906_solr c:testschemaapi s:shard1 r:core_node2 x:testschemaapi_shard1_replica2] o.a.s.s.SolrIndexSearcher Opening Searcher@52c92fdb[testschemaapi_shard1_replica2] main
   [junit4]   2> 1534619 INFO  (qtp716605256-10684) [n:127.0.0.1:57906_solr c:testschemaapi s:shard1 r:core_node2 x:testschemaapi_shard1_replica2] o.a.s.c.c.ZkStateReader Load collection config from: [/collections/testschemaapi]
   [junit4]   2> 1534621 INFO  (qtp716605256-10684) [n:127.0.0.1:57906_solr c:testschemaapi s:shard1 r:core_node2 x:testschemaapi_shard1_replica2] o.a.s.c.c.ZkStateReader path=[/collections/testschemaapi] [configName]=[conf1] specified config exists in ZooKeeper
   [junit4]   2> 1534621 INFO  (qtp716605256-10684) [n:127.0.0.1:57906_solr c:testschemaapi s:shard1 r:core_node2 x:testschemaapi_shard1_replica2] o.a.s.r.ManagedResourceStorage Setting up ZooKeeper-based storage for the RestManager with znodeBase: /configs/conf1
   [junit4]   2> 1534621 INFO  (qtp716605256-10684) [n:127.0.0.1:57906_solr c:testschemaapi s:shard1 r:core_node2 x:testschemaapi_shard1_replica2] o.a.s.r.ManagedResourceStorage Configured ZooKeeperStorageIO with znodeBase: /configs/conf1
   [junit4]   2> 1534621 INFO  (qtp716605256-10684) [n:127.0.0.1:57906_solr c:testschemaapi s:shard1 r:core_node2 x:testschemaapi_shard1_replica2] o.a.s.r.RestManager Initializing RestManager with initArgs: {}
   [junit4]   2> 1534622 INFO  (qtp716605256-10684) [n:127.0.0.1:57906_solr c:testschemaapi s:shard1 r:core_node2 x:testschemaapi_shard1_replica2] o.a.s.r.ManagedResourceStorage Reading _rest_managed.json using ZooKeeperStorageIO:path=/configs/conf1
   [junit4]   2> 1534623 INFO  (qtp716605256-10684) [n:127.0.0.1:57906_solr c:testschemaapi s:shard1 r:core_node2 x:testschemaapi_shard1_replica2] o.a.s.r.ManagedResourceStorage No data found for znode /configs/conf1/_rest_managed.json
   [junit4]   2> 1534623 INFO  (qtp716605256-10684) [n:127.0.0.1:57906_solr c:testschemaapi s:shard1 r:core_node2 x:testschemaapi_shard1_replica2] o.a.s.r.ManagedResourceStorage Loaded null at path _rest_managed.json using ZooKeeperStorageIO:path=/configs/conf1
   [junit4]   2> 1534623 INFO  (qtp716605256-10684) [n:127.0.0.1:57906_solr c:testschemaapi s:shard1 r:core_node2 x:testschemaapi_shard1_replica2] o.a.s.r.RestManager Initializing 0 registered ManagedResources
   [junit4]   2> 1534623 INFO  (qtp716605256-10684) [n:127.0.0.1:57906_solr c:testschemaapi s:shard1 r:core_node2 x:testschemaapi_shard1_replica2] o.a.s.s.ZkIndexSchemaReader Creating ZooKeeper watch for the managed schema at /configs/conf1/managed-schema
   [junit4]   2> 1534624 INFO  (qtp716605256-10684) [n:127.0.0.1:57906_solr c:testschemaapi s:shard1 r:core_node2 x:testschemaapi_shard1_replica2] o.a.s.c.ZkController Added new OnReconnect listener ZkIndexSchemaReader: /configs/conf1/managed-schema, uniqueCoreId: testschemaapi_shard1_replica2:823659758232256
   [junit4]   2> 1534624 INFO  (qtp716605256-10684) [n:127.0.0.1:57906_solr c:testschemaapi s:shard1 r:core_node2 x:testschemaapi_shard1_replica2] o.a.s.h.ReplicationHandler Commits will be reserved for  10000
   [junit4]   2> 1534624 INFO  (qtp716605256-10684) [n:127.0.0.1:57906_solr c:testschemaapi s:shard1 r:core_node2 x:testschemaapi_shard1_replica2] o.a.s.u.UpdateLog Looking up max value of version field to seed version buckets
   [junit4]   2> 1534624 INFO  (qtp716605256-10684) [n:127.0.0.1:57906_solr c:testschemaapi s:shard1 r:core_node2 x:testschemaapi_shard1_replica2] o.a.s.u.VersionInfo Refreshing highest value of _version_ for 65536 version buckets from index
   [junit4]   2> 1534624 INFO  (qtp716605256-10684) [n:127.0.0.1:57906_solr c:testschemaapi s:shard1 r:core_node2 x:testschemaapi_shard1_replica2] o.a.s.u.VersionInfo No terms found for _version_, cannot seed version bucket highest value from index
   [junit4]   2> 1534624 INFO  (qtp716605256-10684) [n:127.0.0.1:57906_solr c:testschemaapi s:shard1 r:core_node2 x:testschemaapi_shard1_replica2] o.a.s.u.UpdateLog Could not find max version in index or recent updates, using new clock 1533116842451664896
   [junit4]   2> 1534624 INFO  (searcherExecutor-4129-thread-1-processing-s:shard1 x:testschemaapi_shard1_replica2 r:core_node2 c:testschemaapi n:127.0.0.1:57906_solr) [n:127.0.0.1:57906_solr c:testschemaapi s:shard1 r:core_node2 x:testschemaapi_shard1_replica2] o.a.s.c.SolrCore [testschemaapi_shard1_replica2] Registered new searcher Searcher@52c92fdb[testschemaapi_shard1_replica2] main{ExitableDirectoryReader(UninvertingDirectoryReader())}
   [junit4]   2> 1534626 INFO  (qtp716605256-10684) [n:127.0.0.1:57906_solr c:testschemaapi s:shard1 r:core_node2 x:testschemaapi_shard1_replica2] o.a.s.u.UpdateLog Took 2.0ms to seed version buckets with highest version 1533116842451664896
   [junit4]   2> 1534626 INFO  (qtp716605256-10684) [n:127.0.0.1:57906_solr c:testschemaapi s:shard1 r:core_node2 x:testschemaapi_shard1_replica2] o.a.s.c.ZkController watch zkdir /configs/conf1
   [junit4]   2> 1534628 INFO  (qtp716605256-10684) [n:127.0.0.1:57906_solr c:testschemaapi s:shard1 r:core_node2 x:testschemaapi_shard1_replica2] o.a.s.c.CoreContainer registering core: testschemaapi_shard1_replica2
   [junit4]   2> 1534629 INFO  (qtp716605256-10684) [n:127.0.0.1:57906_solr c:testschemaapi s:shard1 r:core_node2 x:testschemaapi_shard1_replica2] o.a.s.c.ZkController Register replica - core:testschemaapi_shard1_replica2 address:http://127.0.0.1:57906/solr collection:testschemaapi shard:shard1
   [junit4]   2> 1534632 INFO  (qtp716605256-10684) [n:127.0.0.1:57906_solr c:testschemaapi s:shard1 r:core_node2 x:testschemaapi_shard1_replica2] o.a.s.c.LeaderElector Joined leadership election with path: /collections/testschemaapi/leader_elect/shard1/election/95819802542931974-core_node2-n_0000000001
   [junit4]   2> 1534634 INFO  (qtp716605256-10684) [n:127.0.0.1:57906_solr c:testschemaapi s:shard1 r:core_node2 x:testschemaapi_shard1_replica2] o.a.s.c.LeaderElector Watching path /collections/testschemaapi/leader_elect/shard1/election/95819802542931973-core_node1-n_0000000000 to know if I could be the leader
   [junit4]   2> 1534712 INFO  (OverseerStateUpdate-95819802542931974-127.0.0.1:57906_solr-n_0000000000) [n:127.0.0.1:57906_solr    ] o.a.s.c.o.ZkStateWriter going to update_collection /collections/testschemaapi/state.json version: 1
   [junit4]   2> 1534713 INFO  (zkCallback-2116-thread-1-processing-n:127.0.0.1:57906_solr) [n:127.0.0.1:57906_solr    ] o.a.s.c.c.ZkStateReader A cluster state change: [WatchedEvent state:SyncConnected type:NodeDataChanged path:/collections/testschemaapi/state.json] for collection [testschemaapi] has occurred - updating... (live nodes size: [2])
   [junit4]   2> 1534713 INFO  (zkCallback-2117-thread-1-processing-n:127.0.0.1:45441_solr) [n:127.0.0.1:45441_solr    ] o.a.s.c.c.ZkStateReader A cluster state change: [WatchedEvent state:SyncConnected type:NodeDataChanged path:/collections/testschemaapi/state.json] for collection [testschemaapi] has occurred - updating... (live nodes size: [2])
   [junit4]   2> 1534714 INFO  (zkCallback-2116-thread-1-processing-n:127.0.0.1:57906_solr) [n:127.0.0.1:57906_solr    ] o.a.s.c.c.ZkStateReader Updating data for [testschemaapi] from [1] to [2]
   [junit4]   2> 1534714 INFO  (zkCallback-2117-thread-1-processing-n:127.0.0.1:45441_solr) [n:127.0.0.1:45441_solr    ] o.a.s.c.c.ZkStateReader Updating data for [testschemaapi] from [1] to [2]
   [junit4]   2> 1535106 INFO  (qtp1368109955-10691) [n:127.0.0.1:45441_solr c:testschemaapi s:shard1 r:core_node1 x:testschemaapi_shard1_replica1] o.a.s.c.ShardLeaderElectionContext Enough replicas found to continue.
   [junit4]   2> 1535106 INFO  (qtp1368109955-10691) [n:127.0.0.1:45441_solr c:testschemaapi s:shard1 r:core_node1 x:testschemaapi_shard1_replica1] o.a.s.c.ShardLeaderElectionContext I may be the new leader - try and sync
   [junit4]   2> 1535106 INFO  (qtp1368109955-10691) [n:127.0.0.1:45441_solr c:testschemaapi s:shard1 r:core_node1 x:testschemaapi_shard1_replica1] o.a.s.c.SyncStrategy Sync replicas to http://127.0.0.1:45441/solr/testschemaapi_shard1_replica1/
   [junit4]   2> 1535107 INFO  (qtp1368109955-10691) [n:127.0.0.1:45441_solr c:testschemaapi s:shard1 r:core_node1 x:testschemaapi_shard1_replica1] o.a.s.u.PeerSync PeerSync: core=testschemaapi_shard1_replica1 url=http://127.0.0.1:45441/solr START replicas=[http://127.0.0.1:57906/solr/testschemaapi_shard1_replica2/] nUpdates=100
   [junit4]   2> 1535107 INFO  (qtp1368109955-10691) [n:127.0.0.1:45441_solr c:testschemaapi s:shard1 r:core_node1 x:testschemaapi_shard1_replica1] o.a.s.u.PeerSync PeerSync: core=testschemaapi_shard1_replica1 url=http://127.0.0.1:45441/solr DONE.  We have no versions.  sync failed.
   [junit4]   2> 1535107 INFO  (qtp1368109955-10691) [n:127.0.0.1:45441_solr c:testschemaapi s:shard1 r:core_node1 x:testschemaapi_shard1_replica1] o.a.s.c.SyncStrategy Leader's attempt to sync with shard failed, moving to the next candidate
   [junit4]   2> 1535108 INFO  (qtp1368109955-10691) [n:127.0.0.1:45441_solr c:testschemaapi s:shard1 r:core_node1 x:testschemaapi_shard1_replica1] o.a.s.c.ShardLeaderElectionContext We failed sync, but we have no versions - we can't sync in that case - we were active before, so become leader anyway
   [junit4]   2> 1535111 INFO  (qtp1368109955-10691) [n:127.0.0.1:45441_solr c:testschemaapi s:shard1 r:core_node1 x:testschemaapi_shard1_replica1] o.a.s.c.c.SolrZkClient makePath: /collections/testschemaapi/leaders/shard1
   [junit4]   2> 1535112 INFO  (qtp716605256-10685) [n:127.0.0.1:57906_solr c:testschemaapi s:shard1 r:core_node2 x:testschemaapi_shard1_replica2] o.a.s.c.S.Request [testschemaapi_shard1_replica2]  webapp=/solr path=/get params={distrib=false&version=2&getVersions=100&wt=javabin&qt=/get&fingerprint=false} status=0 QTime=0
   [junit4]   2> 1535117 INFO  (qtp1368109955-10691) [n:127.0.0.1:45441_solr c:testschemaapi s:shard1 r:core_node1 x:testschemaapi_shard1_replica1] o.a.s.c.ShardLeaderElectionContextBase Creating leader registration node /collections/testschemaapi/leaders/shard1/leader after winning as /collections/testschemaapi/leader_elect/shard1/election/95819802542931973-core_node1-n_0000000000
   [junit4]   2> 1535121 INFO  (qtp1368109955-10691) [n:127.0.0.1:45441_solr c:testschemaapi s:shard1 r:core_node1 x:testschemaapi_shard1_replica1] o.a.s.c.ShardLeaderElectionContext I am the new leader: http://127.0.0.1:45441/solr/testschemaapi_shard1_replica1/ shard1
   [junit4]   2> 1535122 INFO  (OverseerStateUpdate-95819802542931974-127.0.0.1:57906_solr-n_0000000000) [n:127.0.0.1:57906_solr    ] o.a.s.c.Overseer processMessage: queueSize: 1, message = {
   [junit4]   2>   "operation":"leader",
   [junit4]   2>   "shard":"shard1",
   [junit4]   2>   "collection":"testschemaapi",
   [junit4]   2>   "base_url":"http://127.0.0.1:45441/solr",
   [junit4]   2>   "core":"testschemaapi_shard1_replica1",
   [junit4]   2>   "state":"active"} current state version: 0
   [junit4]   2> 1535229 INFO  (OverseerStateUpdate-95819802542931974-127.0.0.1:57906_solr-n_0000000000) [n:127.0.0.1:57906_solr    ] o.a.s.c.o.ZkStateWriter going to update_collection /collections/testschemaapi/state.json version: 2
   [junit4]   2> 1535230 INFO  (zkCallback-2117-thread-1-processing-n:127.0.0.1:45441_solr) [n:127.0.0.1:45441_solr    ] o.a.s.c.c.ZkStateReader A cluster state change: [WatchedEvent state:SyncConnected type:NodeDataChanged path:/collections/testschemaapi/state.json] for collection [testschemaapi] has occurred - updating... (live nodes size: [2])
   [junit4]   2> 1535230 INFO  (zkCallback-2116-thread-1-processing-n:127.0.0.1:57906_solr) [n:127.0.0.1:57906_solr    ] o.a.s.c.c.ZkStateReader A cluster state change: [WatchedEvent state:SyncConnected type:NodeDataChanged path:/collections/testschemaapi/state.json] for collection [testschemaapi] has occurred - updating... (live nodes size: [2])
   [junit4]   2> 1535231 INFO  (zkCallback-2117-thread-1-processing-n:127.0.0.1:45441_solr) [n:127.0.0.1:45441_solr    ] o.a.s.c.c.ZkStateReader Updating data for [testschemaapi] from [2] to [3]
   [junit4]   2> 1535231 INFO  (zkCallback-2116-thread-1-processing-n:127.0.0.1:57906_solr) [n:127.0.0.1:57906_solr    ] o.a.s.c.c.ZkStateReader Updating data for [testschemaapi] from [2] to [3]
   [junit4]   2> 1535279 INFO  (qtp1368109955-10691) [n:127.0.0.1:45441_solr c:testschemaapi s:shard1 r:core_node1 x:testschemaapi_shard1_replica1] o.a.s.c.ZkController We are http://127.0.0.1:45441/solr/testschemaapi_shard1_replica1/ and leader is http://127.0.0.1:45441/solr/testschemaapi_shard1_replica1/
   [junit4]   2> 1535279 INFO  (qtp1368109955-10691) [n:127.0.0.1:45441_solr c:testschemaapi s:shard1 r:core_node1 x:testschemaapi_shard1_replica1] o.a.s.c.ZkController No LogReplay needed for core=testschemaapi_shard1_replica1 baseURL=http://127.0.0.1:45441/solr
   [junit4]   2> 1535279 INFO  (qtp1368109955-10691) [n:127.0.0.1:45441_solr c:testschemaapi s:shard1 r:core_node1 x:testschemaapi_shard1_replica1] o.a.s.c.ZkController I am the leader, no recovery necessary
   [junit4]   2> 1535280 INFO  (qtp1368109955-10691) [n:127.0.0.1:45441_solr c:testschemaapi s:shard1 r:core_node1 x:testschemaapi_shard1_replica1] o.a.s.c.ZkController publishing state=active
   [junit4]   2> 1535285 INFO  (OverseerStateUpdate-95819802542931974-127.0.0.1:57906_solr-n_0000000000) [n:127.0.0.1:57906_solr    ] o.a.s.c.Overseer processMessage: queueSize: 1, message = {
   [junit4]   2>   "roles":null,
   [junit4]   2>   "shard":"shard1",
   [junit4]   2>   "operation":"state",
   [junit4]   2>   "state":"active",
   [junit4]   2>   "core":"testschemaapi_shard1_replica1",
   [junit4]   2>   "collection":"testschemaapi",
   [junit4]   2>   "base_url":"http://127.0.0.1:45441/solr",
   [junit4]   2>   "core_node_name":"core_node1",
   [junit4]   2>   "node_name":"127.0.0.1:45441_solr",
   [junit4]   2>   "numShards":"1"} current state version: 0
   [junit4]   2> 1535286 INFO  (OverseerStateUpdate-95819802542931974-127.0.0.1:57906_solr-n_0000000000) [n:127.0.0.1:57906_solr    ] o.a.s.c.o.ReplicaMutator Update state numShards=1 message={
   [junit4]   2>   "roles":null,
   [junit4]   2>   "shard":"shard1",
   [junit4]   2>   "operation":"state",
   [junit4]   2>   "state":"active",
   [junit4]   2>   "core":"testschemaapi_shard1_replica1",
   [junit4]   2>   "collection":"testschemaapi",
   [junit4]   2>   "base_url":"http://127.0.0.1:45441/solr",
   [junit4]   2>   "core_node_name":"core_node1",
   [junit4]   2>   "node_name":"127.0.0.1:45441_solr",
   [junit4]   2>   "numShards":"1"}
   [junit4]   2> 1535287 INFO  (qtp1368109955-10691) [n:127.0.0.1:45441_solr c:testschemaapi s:shard1 r:core_node1 x:testschemaapi_shard1_replica1] o.a.s.s.HttpSolrCall [admin] webapp=null path=/admin/cores params={shard=shard1&name=testschemaapi_shard1_replica1&action=CREATE&collection=testschemaapi&version=2&collection.configName=conf1&wt=javabin&qt=/admin/cores&numShards=1} status=0 QTime=1898
   [junit4]   2> 1535394 INFO  (OverseerStateUpdate-95819802542931974-127.0.0.1:57906_solr-n_0000000000) [n:127.0.0.1:57906_solr    ] o.a.s.c.o.ZkStateWriter going to update_collection /collections/testschemaapi/state.json version: 3
   [junit4]   2> 1535394 INFO  (zkCallback-2116-thread-1-processing-n:127.0.0.1:57906_solr) [n:127.0.0.1:57906_solr    ] o.a.s.c.c.ZkStateReader A cluster state change: [WatchedEvent state:SyncConnected type:NodeDataChanged path:/collections/testschemaapi/state.json] for collection [testschemaapi] has occurred - updating... (live nodes size: [2])
   [junit4]   2> 1535394 INFO  (zkCallback-2117-thread-1-processing-n:127.0.0.1:45441_solr) [n:127.0.0.1:45441_solr    ] o.a.s.c.c.ZkStateReader A cluster state change: [WatchedEvent state:SyncConnected type:NodeDataChanged path:/collections/testschemaapi/state.json] for collection [testschemaapi] has occurred - updating... (live nodes size: [2])
   [junit4]   2> 1535395 INFO  (zkCallback-2117-thread-1-processing-n:127.0.0.1:45441_solr) [n:127.0.0.1:45441_solr    ] o.a.s.c.c.ZkStateReader Updating data for [testschemaapi] from [3] to [4]
   [junit4]   2> 1535395 INFO  (zkCallback-2116-thread-1-processing-n:127.0.0.1:57906_solr) [n:127.0.0.1:57906_solr    ] o.a.s.c.c.ZkStateReader Updating data for [testschemaapi] from [3] to [4]
   [junit4]   2> 1535641 INFO  (qtp716605256-10684) [n:127.0.0.1:57906_solr c:test

[...truncated too long message...]

dexSchemaFactory.create(ManagedIndexSchemaFactory.java:47)
   [junit4]   2> 	at org.apache.solr.schema.IndexSchemaFactory.buildIndexSchema(IndexSchemaFactory.java:70)
   [junit4]   2> 	at org.apache.solr.core.ConfigSetService.createIndexSchema(ConfigSetService.java:108)
   [junit4]   2> 	at org.apache.solr.core.ConfigSetService.getConfig(ConfigSetService.java:79)
   [junit4]   2> 	... 3 more
   [junit4]   2> Caused by: org.apache.zookeeper.KeeperException$SessionExpiredException: KeeperErrorCode = Session expired for /configs/conf1/managed-schema
   [junit4]   2> 	at org.apache.zookeeper.KeeperException.create(KeeperException.java:127)
   [junit4]   2> 	at org.apache.zookeeper.KeeperException.create(KeeperException.java:51)
   [junit4]   2> 	at org.apache.zookeeper.ZooKeeper.getData(ZooKeeper.java:1155)
   [junit4]   2> 	at org.apache.solr.common.cloud.SolrZkClient$7.execute(SolrZkClient.java:345)
   [junit4]   2> 	at org.apache.solr.common.cloud.SolrZkClient$7.execute(SolrZkClient.java:342)
   [junit4]   2> 	at org.apache.solr.common.cloud.ZkCmdExecutor.retryOperation(ZkCmdExecutor.java:60)
   [junit4]   2> 	at org.apache.solr.common.cloud.SolrZkClient.getData(SolrZkClient.java:342)
   [junit4]   2> 	at org.apache.solr.schema.ManagedIndexSchemaFactory.create(ManagedIndexSchemaFactory.java:128)
   [junit4]   2> 	... 7 more
   [junit4]   2> 1544285 INFO  (Thread-3397) [    ] o.a.s.c.ZkTestServer connecting to 127.0.0.1:51948 51948
   [junit4]   2> 1544288 WARN  (Thread-3397) [    ] o.a.s.c.ZkTestServer Watch limit violations: 
   [junit4]   2> Maximum concurrent create/delete watches above limit:
   [junit4]   2> 
   [junit4]   2> 	6	/solr/configs/conf1/managed-schema
   [junit4]   2> 	6	/solr/configs/conf1
   [junit4]   2> 	3	/solr/aliases.json
   [junit4]   2> 	2	/solr/security.json
   [junit4]   2> 
   [junit4]   2> Maximum concurrent data watches above limit:
   [junit4]   2> 
   [junit4]   2> 	3	/solr/clusterstate.json
   [junit4]   2> 	2	/solr/collections/testschemaapi/state.json
   [junit4]   2> 
   [junit4]   2> Maximum concurrent children watches above limit:
   [junit4]   2> 
   [junit4]   2> 	3	/solr/collections
   [junit4]   2> 	3	/solr/live_nodes
   [junit4]   2> 
   [junit4]   2> 1544288 INFO  (TEST-TestManagedSchemaAPI.test-seed#[FEF80C51808248CF]) [    ] o.a.s.SolrTestCaseJ4 ###Ending test
   [junit4]   2> NOTE: reproduce with: ant test  -Dtestcase=TestManagedSchemaAPI -Dtests.method=test -Dtests.seed=FEF80C51808248CF -Dtests.slow=true -Dtests.locale=ja-JP -Dtests.timezone=US/Arizona -Dtests.asserts=true -Dtests.file.encoding=UTF-8
   [junit4] ERROR   11.4s J0 | TestManagedSchemaAPI.test <<<
   [junit4]    > Throwable #1: org.apache.solr.client.solrj.impl.CloudSolrClient$RouteException: Error from server at http://127.0.0.1:45441/solr/testschemaapi_shard1_replica1: ERROR: [doc=2] unknown field 'myNewField1'
   [junit4]    > 	at __randomizedtesting.SeedInfo.seed([FEF80C51808248CF:76AC338B2E7E2537]:0)
   [junit4]    > 	at org.apache.solr.client.solrj.impl.CloudSolrClient.directUpdate(CloudSolrClient.java:632)
   [junit4]    > 	at org.apache.solr.client.solrj.impl.CloudSolrClient.sendRequest(CloudSolrClient.java:981)
   [junit4]    > 	at org.apache.solr.client.solrj.impl.CloudSolrClient.requestWithRetryOnStaleState(CloudSolrClient.java:870)
   [junit4]    > 	at org.apache.solr.client.solrj.impl.CloudSolrClient.request(CloudSolrClient.java:806)
   [junit4]    > 	at org.apache.solr.schema.TestManagedSchemaAPI.testAddFieldAndDocument(TestManagedSchemaAPI.java:101)
   [junit4]    > 	at org.apache.solr.schema.TestManagedSchemaAPI.test(TestManagedSchemaAPI.java:69)
   [junit4]    > 	at java.lang.Thread.run(Thread.java:745)
   [junit4]    > Caused by: org.apache.solr.client.solrj.impl.HttpSolrClient$RemoteSolrException: Error from server at http://127.0.0.1:45441/solr/testschemaapi_shard1_replica1: ERROR: [doc=2] unknown field 'myNewField1'
   [junit4]    > 	at org.apache.solr.client.solrj.impl.HttpSolrClient.executeMethod(HttpSolrClient.java:577)
   [junit4]    > 	at org.apache.solr.client.solrj.impl.HttpSolrClient.request(HttpSolrClient.java:241)
   [junit4]    > 	at org.apache.solr.client.solrj.impl.HttpSolrClient.request(HttpSolrClient.java:230)
   [junit4]    > 	at org.apache.solr.client.solrj.impl.LBHttpSolrClient.doRequest(LBHttpSolrClient.java:372)
   [junit4]    > 	at org.apache.solr.client.solrj.impl.LBHttpSolrClient.request(LBHttpSolrClient.java:325)
   [junit4]    > 	at org.apache.solr.client.solrj.impl.CloudSolrClient$2.call(CloudSolrClient.java:607)
   [junit4]    > 	at org.apache.solr.client.solrj.impl.CloudSolrClient$2.call(CloudSolrClient.java:604)
   [junit4]    > 	at java.util.concurrent.FutureTask.run(FutureTask.java:262)
   [junit4]    > 	at org.apache.solr.common.util.ExecutorUtil$MDCAwareThreadPoolExecutor$1.run(ExecutorUtil.java:231)
   [junit4]    > 	at java.util.concurrent.ThreadPoolExecutor.runWorker(ThreadPoolExecutor.java:1145)
   [junit4]    > 	at java.util.concurrent.ThreadPoolExecutor$Worker.run(ThreadPoolExecutor.java:615)
   [junit4]    > 	... 1 more
   [junit4]   2> 1544294 INFO  (SUITE-TestManagedSchemaAPI-seed#[FEF80C51808248CF]-worker) [    ] o.a.s.SolrTestCaseJ4 ###deleteCore
   [junit4]   2> NOTE: leaving temporary files on disk at: /export/home/jenkins/workspace/Lucene-Solr-5.5-Solaris/solr/build/solr-core/test/J0/temp/solr.schema.TestManagedSchemaAPI_FEF80C51808248CF-001
   [junit4]   2> May 01, 2016 9:16:06 AM com.carrotsearch.randomizedtesting.ThreadLeakControl checkThreadLeaks
   [junit4]   2> WARNING: Will linger awaiting termination of 2 leaked thread(s).
   [junit4]   2> NOTE: test params are: codec=CheapBastard, sim=DefaultSimilarity, locale=ja-JP, timezone=US/Arizona
   [junit4]   2> NOTE: SunOS 5.11 amd64/Oracle Corporation 1.7.0_101 (64-bit)/cpus=3,threads=1,free=221327584,total=493355008
   [junit4]   2> NOTE: All tests run in this JVM: [TestConfigSets, TestDocumentBuilder, RequiredFieldsTest, TestDownShardTolerantSearch, SystemInfoHandlerTest, TestRuleBasedAuthorizationPlugin, TestSolrConfigHandler, ExplicitHLLTest, SliceStateTest, TestCopyFieldCollectionResource, TestShortCircuitedRequests, TestSchemaNameResource, DistanceUnitsTest, TestGroupingSearch, TestNoOpRegenerator, SimplePostToolTest, TestSearchPerf, SegmentsInfoRequestHandlerTest, HdfsSyncSliceTest, TestExpandComponent, PeerSyncTest, ForceLeaderTest, TestReloadDeadlock, TestCSVLoader, TestRequestForwarding, HdfsUnloadDistributedZkTest, ExitableDirectoryReaderTest, OverriddenZkACLAndCredentialsProvidersTest, TestAuthenticationFramework, TestAddFieldRealTimeGet, DeleteReplicaTest, HdfsRecoveryZkTest, DOMUtilTest, TestImplicitCoreProperties, AssignTest, ResponseHeaderTest, TimeZoneUtilsTest, CoreAdminRequestStatusTest, TestSolrDeletionPolicy1, StandardRequestHandlerTest, SolrRequestParserTest, TestReRankQParserPlugin, TestNonDefinedSimilarityFactory, TestUseDocValuesAsStored, TestHighlightDedupGrouping, HighlighterTest, TestStressReorder, TestCloudManagedSchemaConcurrent, TestRawTransformer, TestQuerySenderNoQuery, MBeansHandlerTest, LeaderInitiatedRecoveryOnShardRestartTest, TestDistribIDF, DateRangeFieldTest, BlockJoinFacetSimpleTest, TestManagedSchemaDynamicFieldResource, CachingDirectoryFactoryTest, HdfsChaosMonkeySafeLeaderTest, TestCursorMarkWithoutUniqueKey, InfoHandlerTest, TestFaceting, HLLSerializationTest, SOLR749Test, DocValuesMultiTest, TestSort, DocValuesTest, IndexSchemaTest, SolrCloudExampleTest, SyncSliceTest, DistributedExpandComponentTest, TestRandomCollapseQParserPlugin, RegexBoostProcessorTest, TestDocSet, TestSchemaSimilarityResource, TestRandomDVFaceting, OverseerTest, SpatialHeatmapFacetsTest, BlockJoinFacetDistribTest, SolrCoreTest, TestSortingResponseWriter, TestXmlQParser, TestManagedStopFilterFactory, LeaderFailoverAfterPartitionTest, TestCollationFieldDocValues, TestFileDictionaryLookup, RemoteQueryErrorTest, BadComponentTest, TestComponentsName, TestStressLucene, TestWordDelimiterFilterFactory, DeleteInactiveReplicaTest, TermsComponentTest, DisMaxRequestHandlerTest, ReturnFieldsTest, FastVectorHighlighterTest, TestPostingsSolrHighlighter, TestConfig, RuleEngineTest, TestXIncludeConfig, TestFastLRUCache, TestSimpleQParserPlugin, RestartWhileUpdatingTest, TestExtendedDismaxParser, AnalysisAfterCoreReloadTest, LeaderElectionTest, SparseHLLTest, TestSolr4Spatial2, UpdateParamsTest, DistributedQueryComponentCustomSortTest, ShardSplitTest, XsltUpdateRequestHandlerTest, DataDrivenBlockJoinTest, MultiThreadedOCPTest, TestSolrQueryParserResource, TestCollapseQParserPlugin, TestRestoreCore, TestManagedSchemaAPI]
   [junit4] Completed [266/572 (1!)] on J0 in 12.14s, 1 test, 1 error <<< FAILURES!

[...truncated 961 lines...]
BUILD FAILED
/export/home/jenkins/workspace/Lucene-Solr-5.5-Solaris/build.xml:750: The following error occurred while executing this line:
/export/home/jenkins/workspace/Lucene-Solr-5.5-Solaris/build.xml:694: The following error occurred while executing this line:
/export/home/jenkins/workspace/Lucene-Solr-5.5-Solaris/build.xml:59: The following error occurred while executing this line:
/export/home/jenkins/workspace/Lucene-Solr-5.5-Solaris/solr/build.xml:233: The following error occurred while executing this line:
/export/home/jenkins/workspace/Lucene-Solr-5.5-Solaris/solr/common-build.xml:534: The following error occurred while executing this line:
/export/home/jenkins/workspace/Lucene-Solr-5.5-Solaris/lucene/common-build.xml:1477: The following error occurred while executing this line:
/export/home/jenkins/workspace/Lucene-Solr-5.5-Solaris/lucene/common-build.xml:1033: There were test failures: 572 suites (7 ignored), 2293 tests, 1 error, 56 ignored (40 assumptions) [seed: FEF80C51808248CF]

Total time: 81 minutes 25 seconds
Build step 'Invoke Ant' marked build as failure
Archiving artifacts
[WARNINGS] Skipping publisher since build result is FAILURE
Recording test results
Email was triggered for: Failure - Any
Sending email for trigger: Failure - Any



Mime
View raw message