lucene-dev mailing list archives

Site index · List index
Message view « Date » · « Thread »
Top « Date » · « Thread »
From Policeman Jenkins Server <jenk...@thetaphi.de>
Subject [JENKINS] Lucene-Solr-5.5-Linux (64bit/jdk1.7.0_80) - Build # 243 - Failure!
Date Mon, 02 May 2016 03:36:29 GMT
Build: http://jenkins.thetaphi.de/job/Lucene-Solr-5.5-Linux/243/
Java: 64bit/jdk1.7.0_80 -XX:+UseCompressedOops -XX:+UseConcMarkSweepGC

2 tests failed.
FAILED:  junit.framework.TestSuite.org.apache.solr.security.BasicAuthIntegrationTest

Error Message:
Suite timeout exceeded (>= 7200000 msec).

Stack Trace:
java.lang.Exception: Suite timeout exceeded (>= 7200000 msec).
	at __randomizedtesting.SeedInfo.seed([DD4AF6DD23C4FA68]:0)


FAILED:  org.apache.solr.security.BasicAuthIntegrationTest.testBasics

Error Message:
Test abandoned because suite timeout was reached.

Stack Trace:
java.lang.Exception: Test abandoned because suite timeout was reached.
	at __randomizedtesting.SeedInfo.seed([DD4AF6DD23C4FA68]:0)




Build Log:
[...truncated 12493 lines...]
   [junit4] Suite: org.apache.solr.security.BasicAuthIntegrationTest
   [junit4]   2> 2042855 INFO  (TEST-BasicAuthIntegrationTest.testBasics-seed#[DD4AF6DD23C4FA68]) [    ] o.a.s.c.ZkTestServer STARTING ZK TEST SERVER
   [junit4]   2> 2042855 INFO  (Thread-4864) [    ] o.a.s.c.ZkTestServer client port:0.0.0.0/0.0.0.0:0
   [junit4]   2> 2042855 INFO  (Thread-4864) [    ] o.a.s.c.ZkTestServer Starting server
   [junit4]   2> 2042955 INFO  (TEST-BasicAuthIntegrationTest.testBasics-seed#[DD4AF6DD23C4FA68]) [    ] o.a.s.c.ZkTestServer start zk server on port:44213
   [junit4]   2> 2042956 INFO  (TEST-BasicAuthIntegrationTest.testBasics-seed#[DD4AF6DD23C4FA68]) [    ] o.a.s.c.c.SolrZkClient Using default ZkCredentialsProvider
   [junit4]   2> 2042956 INFO  (TEST-BasicAuthIntegrationTest.testBasics-seed#[DD4AF6DD23C4FA68]) [    ] o.a.s.c.c.ConnectionManager Waiting for client to connect to ZooKeeper
   [junit4]   2> 2043078 INFO  (zkCallback-2006-thread-1) [    ] o.a.s.c.c.ConnectionManager Watcher org.apache.solr.common.cloud.ConnectionManager@36b29709 name:ZooKeeperConnection Watcher:127.0.0.1:44213 got event WatchedEvent state:SyncConnected type:None path:null path:null type:None
   [junit4]   2> 2043078 INFO  (TEST-BasicAuthIntegrationTest.testBasics-seed#[DD4AF6DD23C4FA68]) [    ] o.a.s.c.c.ConnectionManager Client is connected to ZooKeeper
   [junit4]   2> 2043078 INFO  (TEST-BasicAuthIntegrationTest.testBasics-seed#[DD4AF6DD23C4FA68]) [    ] o.a.s.c.c.SolrZkClient Using default ZkACLProvider
   [junit4]   2> 2043078 INFO  (TEST-BasicAuthIntegrationTest.testBasics-seed#[DD4AF6DD23C4FA68]) [    ] o.a.s.c.c.SolrZkClient makePath: /solr/solr.xml
   [junit4]   2> 2043203 INFO  (jetty-launcher-2005-thread-2) [    ] o.e.j.s.Server jetty-9.2.13.v20150730
   [junit4]   2> 2043203 INFO  (jetty-launcher-2005-thread-3) [    ] o.e.j.s.Server jetty-9.2.13.v20150730
   [junit4]   2> 2043203 INFO  (jetty-launcher-2005-thread-5) [    ] o.e.j.s.Server jetty-9.2.13.v20150730
   [junit4]   2> 2043203 INFO  (jetty-launcher-2005-thread-4) [    ] o.e.j.s.Server jetty-9.2.13.v20150730
   [junit4]   2> 2043203 INFO  (jetty-launcher-2005-thread-1) [    ] o.e.j.s.Server jetty-9.2.13.v20150730
   [junit4]   2> 2043205 INFO  (jetty-launcher-2005-thread-2) [    ] o.e.j.s.h.ContextHandler Started o.e.j.s.ServletContextHandler@15075488{/solr,null,AVAILABLE}
   [junit4]   2> 2043205 INFO  (jetty-launcher-2005-thread-5) [    ] o.e.j.s.h.ContextHandler Started o.e.j.s.ServletContextHandler@56d7e504{/solr,null,AVAILABLE}
   [junit4]   2> 2043205 INFO  (jetty-launcher-2005-thread-3) [    ] o.e.j.s.h.ContextHandler Started o.e.j.s.ServletContextHandler@67e5d654{/solr,null,AVAILABLE}
   [junit4]   2> 2043206 INFO  (jetty-launcher-2005-thread-2) [    ] o.e.j.s.ServerConnector Started ServerConnector@16489d42{HTTP/1.1}{127.0.0.1:36108}
   [junit4]   2> 2043206 INFO  (jetty-launcher-2005-thread-5) [    ] o.e.j.s.ServerConnector Started ServerConnector@6175e74{HTTP/1.1}{127.0.0.1:42452}
   [junit4]   2> 2043206 INFO  (jetty-launcher-2005-thread-2) [    ] o.e.j.s.Server Started @2045031ms
   [junit4]   2> 2043206 INFO  (jetty-launcher-2005-thread-3) [    ] o.e.j.s.ServerConnector Started ServerConnector@66cb44cd{HTTP/1.1}{127.0.0.1:45209}
   [junit4]   2> 2043206 INFO  (jetty-launcher-2005-thread-2) [    ] o.a.s.c.s.e.JettySolrRunner Jetty properties: {hostContext=/solr, hostPort=36108}
   [junit4]   2> 2043206 INFO  (jetty-launcher-2005-thread-3) [    ] o.e.j.s.Server Started @2045031ms
   [junit4]   2> 2043206 INFO  (jetty-launcher-2005-thread-5) [    ] o.e.j.s.Server Started @2045031ms
   [junit4]   2> 2043206 INFO  (jetty-launcher-2005-thread-3) [    ] o.a.s.c.s.e.JettySolrRunner Jetty properties: {hostContext=/solr, hostPort=45209}
   [junit4]   2> 2043206 INFO  (jetty-launcher-2005-thread-5) [    ] o.a.s.c.s.e.JettySolrRunner Jetty properties: {hostContext=/solr, hostPort=42452}
   [junit4]   2> 2043206 INFO  (jetty-launcher-2005-thread-2) [    ] o.a.s.s.SolrDispatchFilter SolrDispatchFilter.init(): sun.misc.Launcher$AppClassLoader@7be84195
   [junit4]   2> 2043206 INFO  (jetty-launcher-2005-thread-4) [    ] o.e.j.s.h.ContextHandler Started o.e.j.s.ServletContextHandler@2b122374{/solr,null,AVAILABLE}
   [junit4]   2> 2043206 INFO  (jetty-launcher-2005-thread-2) [    ] o.a.s.c.SolrResourceLoader new SolrResourceLoader for directory: '/home/jenkins/workspace/Lucene-Solr-5.5-Linux/solr/build/solr-core/test/J2/temp/solr.security.BasicAuthIntegrationTest_DD4AF6DD23C4FA68-001/tempDir-001/node2'
   [junit4]   2> 2043206 INFO  (jetty-launcher-2005-thread-3) [    ] o.a.s.s.SolrDispatchFilter SolrDispatchFilter.init(): sun.misc.Launcher$AppClassLoader@7be84195
   [junit4]   2> 2043206 INFO  (jetty-launcher-2005-thread-5) [    ] o.a.s.s.SolrDispatchFilter SolrDispatchFilter.init(): sun.misc.Launcher$AppClassLoader@7be84195
   [junit4]   2> 2043206 INFO  (jetty-launcher-2005-thread-3) [    ] o.a.s.c.SolrResourceLoader new SolrResourceLoader for directory: '/home/jenkins/workspace/Lucene-Solr-5.5-Linux/solr/build/solr-core/test/J2/temp/solr.security.BasicAuthIntegrationTest_DD4AF6DD23C4FA68-001/tempDir-001/node3'
   [junit4]   2> 2043206 INFO  (jetty-launcher-2005-thread-5) [    ] o.a.s.c.SolrResourceLoader new SolrResourceLoader for directory: '/home/jenkins/workspace/Lucene-Solr-5.5-Linux/solr/build/solr-core/test/J2/temp/solr.security.BasicAuthIntegrationTest_DD4AF6DD23C4FA68-001/tempDir-001/node5'
   [junit4]   2> 2043206 INFO  (jetty-launcher-2005-thread-4) [    ] o.e.j.s.ServerConnector Started ServerConnector@569f9784{HTTP/1.1}{127.0.0.1:43757}
   [junit4]   2> 2043206 INFO  (jetty-launcher-2005-thread-3) [    ] o.a.s.c.SolrResourceLoader JNDI not configured for solr (NoInitialContextEx)
   [junit4]   2> 2043206 INFO  (jetty-launcher-2005-thread-4) [    ] o.e.j.s.Server Started @2045031ms
   [junit4]   2> 2043206 INFO  (jetty-launcher-2005-thread-3) [    ] o.a.s.c.SolrResourceLoader solr home defaulted to 'solr/' (could not find system property or JNDI)
   [junit4]   2> 2043206 INFO  (jetty-launcher-2005-thread-4) [    ] o.a.s.c.s.e.JettySolrRunner Jetty properties: {hostContext=/solr, hostPort=43757}
   [junit4]   2> 2043206 INFO  (jetty-launcher-2005-thread-1) [    ] o.e.j.s.h.ContextHandler Started o.e.j.s.ServletContextHandler@3d2b50e2{/solr,null,AVAILABLE}
   [junit4]   2> 2043206 INFO  (jetty-launcher-2005-thread-5) [    ] o.a.s.c.SolrResourceLoader JNDI not configured for solr (NoInitialContextEx)
   [junit4]   2> 2043207 INFO  (jetty-launcher-2005-thread-3) [    ] o.a.s.c.c.SolrZkClient Using default ZkCredentialsProvider
   [junit4]   2> 2043207 INFO  (jetty-launcher-2005-thread-5) [    ] o.a.s.c.SolrResourceLoader solr home defaulted to 'solr/' (could not find system property or JNDI)
   [junit4]   2> 2043207 INFO  (jetty-launcher-2005-thread-4) [    ] o.a.s.s.SolrDispatchFilter SolrDispatchFilter.init(): sun.misc.Launcher$AppClassLoader@7be84195
   [junit4]   2> 2043206 INFO  (jetty-launcher-2005-thread-2) [    ] o.a.s.c.SolrResourceLoader JNDI not configured for solr (NoInitialContextEx)
   [junit4]   2> 2043207 INFO  (jetty-launcher-2005-thread-5) [    ] o.a.s.c.c.SolrZkClient Using default ZkCredentialsProvider
   [junit4]   2> 2043207 INFO  (jetty-launcher-2005-thread-2) [    ] o.a.s.c.SolrResourceLoader solr home defaulted to 'solr/' (could not find system property or JNDI)
   [junit4]   2> 2043207 INFO  (jetty-launcher-2005-thread-3) [    ] o.a.s.c.c.ConnectionManager Waiting for client to connect to ZooKeeper
   [junit4]   2> 2043207 INFO  (jetty-launcher-2005-thread-1) [    ] o.e.j.s.ServerConnector Started ServerConnector@23c453cf{HTTP/1.1}{127.0.0.1:36744}
   [junit4]   2> 2043207 INFO  (jetty-launcher-2005-thread-4) [    ] o.a.s.c.SolrResourceLoader new SolrResourceLoader for directory: '/home/jenkins/workspace/Lucene-Solr-5.5-Linux/solr/build/solr-core/test/J2/temp/solr.security.BasicAuthIntegrationTest_DD4AF6DD23C4FA68-001/tempDir-001/node4'
   [junit4]   2> 2043207 INFO  (jetty-launcher-2005-thread-1) [    ] o.e.j.s.Server Started @2045032ms
   [junit4]   2> 2043207 INFO  (jetty-launcher-2005-thread-5) [    ] o.a.s.c.c.ConnectionManager Waiting for client to connect to ZooKeeper
   [junit4]   2> 2043207 INFO  (jetty-launcher-2005-thread-1) [    ] o.a.s.c.s.e.JettySolrRunner Jetty properties: {hostPort=36744, hostContext=/solr}
   [junit4]   2> 2043207 INFO  (jetty-launcher-2005-thread-4) [    ] o.a.s.c.SolrResourceLoader JNDI not configured for solr (NoInitialContextEx)
   [junit4]   2> 2043207 INFO  (jetty-launcher-2005-thread-2) [    ] o.a.s.c.c.SolrZkClient Using default ZkCredentialsProvider
   [junit4]   2> 2043207 INFO  (jetty-launcher-2005-thread-4) [    ] o.a.s.c.SolrResourceLoader solr home defaulted to 'solr/' (could not find system property or JNDI)
   [junit4]   2> 2043207 INFO  (jetty-launcher-2005-thread-1) [    ] o.a.s.s.SolrDispatchFilter SolrDispatchFilter.init(): sun.misc.Launcher$AppClassLoader@7be84195
   [junit4]   2> 2043207 INFO  (jetty-launcher-2005-thread-1) [    ] o.a.s.c.SolrResourceLoader new SolrResourceLoader for directory: '/home/jenkins/workspace/Lucene-Solr-5.5-Linux/solr/build/solr-core/test/J2/temp/solr.security.BasicAuthIntegrationTest_DD4AF6DD23C4FA68-001/tempDir-001/node1'
   [junit4]   2> 2043207 INFO  (jetty-launcher-2005-thread-4) [    ] o.a.s.c.c.SolrZkClient Using default ZkCredentialsProvider
   [junit4]   2> 2043208 INFO  (jetty-launcher-2005-thread-2) [    ] o.a.s.c.c.ConnectionManager Waiting for client to connect to ZooKeeper
   [junit4]   2> 2043208 INFO  (jetty-launcher-2005-thread-1) [    ] o.a.s.c.SolrResourceLoader JNDI not configured for solr (NoInitialContextEx)
   [junit4]   2> 2043208 INFO  (jetty-launcher-2005-thread-1) [    ] o.a.s.c.SolrResourceLoader solr home defaulted to 'solr/' (could not find system property or JNDI)
   [junit4]   2> 2043208 INFO  (jetty-launcher-2005-thread-4) [    ] o.a.s.c.c.ConnectionManager Waiting for client to connect to ZooKeeper
   [junit4]   2> 2043208 INFO  (jetty-launcher-2005-thread-1) [    ] o.a.s.c.c.SolrZkClient Using default ZkCredentialsProvider
   [junit4]   2> 2043208 INFO  (jetty-launcher-2005-thread-1) [    ] o.a.s.c.c.ConnectionManager Waiting for client to connect to ZooKeeper
   [junit4]   2> 2043256 INFO  (zkCallback-2007-thread-1) [    ] o.a.s.c.c.ConnectionManager Watcher org.apache.solr.common.cloud.ConnectionManager@4aa399db name:ZooKeeperConnection Watcher:127.0.0.1:44213/solr got event WatchedEvent state:SyncConnected type:None path:null path:null type:None
   [junit4]   2> 2043256 INFO  (jetty-launcher-2005-thread-3) [    ] o.a.s.c.c.ConnectionManager Client is connected to ZooKeeper
   [junit4]   2> 2043257 INFO  (jetty-launcher-2005-thread-3) [    ] o.a.s.c.c.SolrZkClient Using default ZkACLProvider
   [junit4]   2> 2043291 INFO  (zkCallback-2008-thread-1) [    ] o.a.s.c.c.ConnectionManager Watcher org.apache.solr.common.cloud.ConnectionManager@602b33ad name:ZooKeeperConnection Watcher:127.0.0.1:44213/solr got event WatchedEvent state:SyncConnected type:None path:null path:null type:None
   [junit4]   2> 2043291 INFO  (jetty-launcher-2005-thread-5) [    ] o.a.s.c.c.ConnectionManager Client is connected to ZooKeeper
   [junit4]   2> 2043292 INFO  (zkCallback-2009-thread-1) [    ] o.a.s.c.c.ConnectionManager Watcher org.apache.solr.common.cloud.ConnectionManager@34ef3007 name:ZooKeeperConnection Watcher:127.0.0.1:44213/solr got event WatchedEvent state:SyncConnected type:None path:null path:null type:None
   [junit4]   2> 2043292 INFO  (jetty-launcher-2005-thread-2) [    ] o.a.s.c.c.ConnectionManager Client is connected to ZooKeeper
   [junit4]   2> 2043292 INFO  (jetty-launcher-2005-thread-5) [    ] o.a.s.c.c.SolrZkClient Using default ZkACLProvider
   [junit4]   2> 2043292 INFO  (zkCallback-2010-thread-1) [    ] o.a.s.c.c.ConnectionManager Watcher org.apache.solr.common.cloud.ConnectionManager@7314ea92 name:ZooKeeperConnection Watcher:127.0.0.1:44213/solr got event WatchedEvent state:SyncConnected type:None path:null path:null type:None
   [junit4]   2> 2043292 INFO  (jetty-launcher-2005-thread-3) [    ] o.a.s.s.SolrDispatchFilter solr.xml found in ZooKeeper. Loading...
   [junit4]   2> 2043292 INFO  (jetty-launcher-2005-thread-4) [    ] o.a.s.c.c.ConnectionManager Client is connected to ZooKeeper
   [junit4]   2> 2043292 INFO  (zkCallback-2011-thread-1) [    ] o.a.s.c.c.ConnectionManager Watcher org.apache.solr.common.cloud.ConnectionManager@7e6f94c1 name:ZooKeeperConnection Watcher:127.0.0.1:44213/solr got event WatchedEvent state:SyncConnected type:None path:null path:null type:None
   [junit4]   2> 2043292 INFO  (jetty-launcher-2005-thread-5) [    ] o.a.s.s.SolrDispatchFilter solr.xml found in ZooKeeper. Loading...
   [junit4]   2> 2043292 INFO  (jetty-launcher-2005-thread-1) [    ] o.a.s.c.c.ConnectionManager Client is connected to ZooKeeper
   [junit4]   2> 2043292 INFO  (jetty-launcher-2005-thread-4) [    ] o.a.s.c.c.SolrZkClient Using default ZkACLProvider
   [junit4]   2> 2043292 INFO  (jetty-launcher-2005-thread-2) [    ] o.a.s.c.c.SolrZkClient Using default ZkACLProvider
   [junit4]   2> 2043292 INFO  (jetty-launcher-2005-thread-1) [    ] o.a.s.c.c.SolrZkClient Using default ZkACLProvider
   [junit4]   2> 2043292 INFO  (jetty-launcher-2005-thread-4) [    ] o.a.s.s.SolrDispatchFilter solr.xml found in ZooKeeper. Loading...
   [junit4]   2> 2043292 INFO  (jetty-launcher-2005-thread-1) [    ] o.a.s.s.SolrDispatchFilter solr.xml found in ZooKeeper. Loading...
   [junit4]   2> 2043292 INFO  (jetty-launcher-2005-thread-2) [    ] o.a.s.s.SolrDispatchFilter solr.xml found in ZooKeeper. Loading...
   [junit4]   2> 2043364 INFO  (jetty-launcher-2005-thread-4) [    ] o.a.s.c.CorePropertiesLocator Config-defined core root directory: /home/jenkins/workspace/Lucene-Solr-5.5-Linux/solr/build/solr-core/test/J2/temp/solr.security.BasicAuthIntegrationTest_DD4AF6DD23C4FA68-001/tempDir-001/node4/.
   [junit4]   2> 2043364 INFO  (jetty-launcher-2005-thread-5) [    ] o.a.s.c.CorePropertiesLocator Config-defined core root directory: /home/jenkins/workspace/Lucene-Solr-5.5-Linux/solr/build/solr-core/test/J2/temp/solr.security.BasicAuthIntegrationTest_DD4AF6DD23C4FA68-001/tempDir-001/node5/.
   [junit4]   2> 2043365 WARN  (NIOServerCxn.Factory:0.0.0.0/0.0.0.0:0) [    ] o.a.z.s.NIOServerCnxn caught end of stream exception
   [junit4]   2> EndOfStreamException: Unable to read additional data from client sessionid 0x1546f1b80f70004, likely client has closed socket
   [junit4]   2> 	at org.apache.zookeeper.server.NIOServerCnxn.doIO(NIOServerCnxn.java:228)
   [junit4]   2> 	at org.apache.zookeeper.server.NIOServerCnxnFactory.run(NIOServerCnxnFactory.java:208)
   [junit4]   2> 	at java.lang.Thread.run(Thread.java:745)
   [junit4]   2> 2043364 INFO  (jetty-launcher-2005-thread-4) [    ] o.a.s.c.CoreContainer New CoreContainer 1807130586
   [junit4]   2> 2043364 INFO  (jetty-launcher-2005-thread-3) [    ] o.a.s.c.CorePropertiesLocator Config-defined core root directory: /home/jenkins/workspace/Lucene-Solr-5.5-Linux/solr/build/solr-core/test/J2/temp/solr.security.BasicAuthIntegrationTest_DD4AF6DD23C4FA68-001/tempDir-001/node3/.
   [junit4]   2> 2043403 INFO  (jetty-launcher-2005-thread-4) [    ] o.a.s.c.CoreContainer Loading cores into CoreContainer [instanceDir=/home/jenkins/workspace/Lucene-Solr-5.5-Linux/solr/build/solr-core/test/J2/temp/solr.security.BasicAuthIntegrationTest_DD4AF6DD23C4FA68-001/tempDir-001/node4]
   [junit4]   2> 2043403 INFO  (jetty-launcher-2005-thread-3) [    ] o.a.s.c.CoreContainer New CoreContainer 1466794042
   [junit4]   2> 2043403 WARN  (NIOServerCxn.Factory:0.0.0.0/0.0.0.0:0) [    ] o.a.z.s.NIOServerCnxn caught end of stream exception
   [junit4]   2> EndOfStreamException: Unable to read additional data from client sessionid 0x1546f1b80f70002, likely client has closed socket
   [junit4]   2> 	at org.apache.zookeeper.server.NIOServerCnxn.doIO(NIOServerCnxn.java:228)
   [junit4]   2> 	at org.apache.zookeeper.server.NIOServerCnxnFactory.run(NIOServerCnxnFactory.java:208)
   [junit4]   2> 	at java.lang.Thread.run(Thread.java:745)
   [junit4]   2> 2043403 INFO  (jetty-launcher-2005-thread-1) [    ] o.a.s.c.CorePropertiesLocator Config-defined core root directory: /home/jenkins/workspace/Lucene-Solr-5.5-Linux/solr/build/solr-core/test/J2/temp/solr.security.BasicAuthIntegrationTest_DD4AF6DD23C4FA68-001/tempDir-001/node1/.
   [junit4]   2> 2043403 INFO  (jetty-launcher-2005-thread-2) [    ] o.a.s.c.CorePropertiesLocator Config-defined core root directory: /home/jenkins/workspace/Lucene-Solr-5.5-Linux/solr/build/solr-core/test/J2/temp/solr.security.BasicAuthIntegrationTest_DD4AF6DD23C4FA68-001/tempDir-001/node2/.
   [junit4]   2> 2043403 INFO  (jetty-launcher-2005-thread-1) [    ] o.a.s.c.CoreContainer New CoreContainer 2032066037
   [junit4]   2> 2043403 INFO  (jetty-launcher-2005-thread-2) [    ] o.a.s.c.CoreContainer New CoreContainer 1501445618
   [junit4]   2> 2043403 INFO  (jetty-launcher-2005-thread-1) [    ] o.a.s.c.CoreContainer Loading cores into CoreContainer [instanceDir=/home/jenkins/workspace/Lucene-Solr-5.5-Linux/solr/build/solr-core/test/J2/temp/solr.security.BasicAuthIntegrationTest_DD4AF6DD23C4FA68-001/tempDir-001/node1]
   [junit4]   2> 2043403 INFO  (jetty-launcher-2005-thread-2) [    ] o.a.s.c.CoreContainer Loading cores into CoreContainer [instanceDir=/home/jenkins/workspace/Lucene-Solr-5.5-Linux/solr/build/solr-core/test/J2/temp/solr.security.BasicAuthIntegrationTest_DD4AF6DD23C4FA68-001/tempDir-001/node2]
   [junit4]   2> 2043402 INFO  (jetty-launcher-2005-thread-5) [    ] o.a.s.c.CoreContainer New CoreContainer 582539381
   [junit4]   2> 2043403 WARN  (jetty-launcher-2005-thread-1) [    ] o.a.s.c.CoreContainer Couldn't add files from /home/jenkins/workspace/Lucene-Solr-5.5-Linux/solr/build/solr-core/test/J2/temp/solr.security.BasicAuthIntegrationTest_DD4AF6DD23C4FA68-001/tempDir-001/node1/lib to classpath: /home/jenkins/workspace/Lucene-Solr-5.5-Linux/solr/build/solr-core/test/J2/temp/solr.security.BasicAuthIntegrationTest_DD4AF6DD23C4FA68-001/tempDir-001/node1/lib
   [junit4]   2> 2043403 WARN  (jetty-launcher-2005-thread-2) [    ] o.a.s.c.CoreContainer Couldn't add files from /home/jenkins/workspace/Lucene-Solr-5.5-Linux/solr/build/solr-core/test/J2/temp/solr.security.BasicAuthIntegrationTest_DD4AF6DD23C4FA68-001/tempDir-001/node2/lib to classpath: /home/jenkins/workspace/Lucene-Solr-5.5-Linux/solr/build/solr-core/test/J2/temp/solr.security.BasicAuthIntegrationTest_DD4AF6DD23C4FA68-001/tempDir-001/node2/lib
   [junit4]   2> 2043403 INFO  (jetty-launcher-2005-thread-5) [    ] o.a.s.c.CoreContainer Loading cores into CoreContainer [instanceDir=/home/jenkins/workspace/Lucene-Solr-5.5-Linux/solr/build/solr-core/test/J2/temp/solr.security.BasicAuthIntegrationTest_DD4AF6DD23C4FA68-001/tempDir-001/node5]
   [junit4]   2> 2043404 INFO  (jetty-launcher-2005-thread-1) [    ] o.a.s.h.c.HttpShardHandlerFactory created with socketTimeout : 90000,urlScheme : ,connTimeout : 15000,maxConnectionsPerHost : 20,maxConnections : 10000,corePoolSize : 0,maximumPoolSize : 2147483647,maxThreadIdleTime : 5,sizeOfQueue : -1,fairnessPolicy : false,useRetries : false,
   [junit4]   2> 2043404 WARN  (jetty-launcher-2005-thread-5) [    ] o.a.s.c.CoreContainer Couldn't add files from /home/jenkins/workspace/Lucene-Solr-5.5-Linux/solr/build/solr-core/test/J2/temp/solr.security.BasicAuthIntegrationTest_DD4AF6DD23C4FA68-001/tempDir-001/node5/lib to classpath: /home/jenkins/workspace/Lucene-Solr-5.5-Linux/solr/build/solr-core/test/J2/temp/solr.security.BasicAuthIntegrationTest_DD4AF6DD23C4FA68-001/tempDir-001/node5/lib
   [junit4]   2> 2043403 WARN  (NIOServerCxn.Factory:0.0.0.0/0.0.0.0:0) [    ] o.a.z.s.NIOServerCnxn caught end of stream exception
   [junit4]   2> EndOfStreamException: Unable to read additional data from client sessionid 0x1546f1b80f70005, likely client has closed socket
   [junit4]   2> 	at org.apache.zookeeper.server.NIOServerCnxn.doIO(NIOServerCnxn.java:228)
   [junit4]   2> 	at org.apache.zookeeper.server.NIOServerCnxnFactory.run(NIOServerCnxnFactory.java:208)
   [junit4]   2> 	at java.lang.Thread.run(Thread.java:745)
   [junit4]   2> 2043404 INFO  (jetty-launcher-2005-thread-5) [    ] o.a.s.h.c.HttpShardHandlerFactory created with socketTimeout : 90000,urlScheme : ,connTimeout : 15000,maxConnectionsPerHost : 20,maxConnections : 10000,corePoolSize : 0,maximumPoolSize : 2147483647,maxThreadIdleTime : 5,sizeOfQueue : -1,fairnessPolicy : false,useRetries : false,
   [junit4]   2> 2043403 WARN  (jetty-launcher-2005-thread-4) [    ] o.a.s.c.CoreContainer Couldn't add files from /home/jenkins/workspace/Lucene-Solr-5.5-Linux/solr/build/solr-core/test/J2/temp/solr.security.BasicAuthIntegrationTest_DD4AF6DD23C4FA68-001/tempDir-001/node4/lib to classpath: /home/jenkins/workspace/Lucene-Solr-5.5-Linux/solr/build/solr-core/test/J2/temp/solr.security.BasicAuthIntegrationTest_DD4AF6DD23C4FA68-001/tempDir-001/node4/lib
   [junit4]   2> 2043404 WARN  (NIOServerCxn.Factory:0.0.0.0/0.0.0.0:0) [    ] o.a.z.s.NIOServerCnxn caught end of stream exception
   [junit4]   2> EndOfStreamException: Unable to read additional data from client sessionid 0x1546f1b80f70003, likely client has closed socket
   [junit4]   2> 	at org.apache.zookeeper.server.NIOServerCnxn.doIO(NIOServerCnxn.java:228)
   [junit4]   2> 	at org.apache.zookeeper.server.NIOServerCnxnFactory.run(NIOServerCnxnFactory.java:208)
   [junit4]   2> 	at java.lang.Thread.run(Thread.java:745)
   [junit4]   2> 2043404 INFO  (jetty-launcher-2005-thread-4) [    ] o.a.s.h.c.HttpShardHandlerFactory created with socketTimeout : 90000,urlScheme : ,connTimeout : 15000,maxConnectionsPerHost : 20,maxConnections : 10000,corePoolSize : 0,maximumPoolSize : 2147483647,maxThreadIdleTime : 5,sizeOfQueue : -1,fairnessPolicy : false,useRetries : false,
   [junit4]   2> 2043403 INFO  (jetty-launcher-2005-thread-3) [    ] o.a.s.c.CoreContainer Loading cores into CoreContainer [instanceDir=/home/jenkins/workspace/Lucene-Solr-5.5-Linux/solr/build/solr-core/test/J2/temp/solr.security.BasicAuthIntegrationTest_DD4AF6DD23C4FA68-001/tempDir-001/node3]
   [junit4]   2> 2043404 WARN  (jetty-launcher-2005-thread-3) [    ] o.a.s.c.CoreContainer Couldn't add files from /home/jenkins/workspace/Lucene-Solr-5.5-Linux/solr/build/solr-core/test/J2/temp/solr.security.BasicAuthIntegrationTest_DD4AF6DD23C4FA68-001/tempDir-001/node3/lib to classpath: /home/jenkins/workspace/Lucene-Solr-5.5-Linux/solr/build/solr-core/test/J2/temp/solr.security.BasicAuthIntegrationTest_DD4AF6DD23C4FA68-001/tempDir-001/node3/lib
   [junit4]   2> 2043405 INFO  (jetty-launcher-2005-thread-3) [    ] o.a.s.h.c.HttpShardHandlerFactory created with socketTimeout : 90000,urlScheme : ,connTimeout : 15000,maxConnectionsPerHost : 20,maxConnections : 10000,corePoolSize : 0,maximumPoolSize : 2147483647,maxThreadIdleTime : 5,sizeOfQueue : -1,fairnessPolicy : false,useRetries : false,
   [junit4]   2> 2043404 INFO  (jetty-launcher-2005-thread-2) [    ] o.a.s.h.c.HttpShardHandlerFactory created with socketTimeout : 90000,urlScheme : ,connTimeout : 15000,maxConnectionsPerHost : 20,maxConnections : 10000,corePoolSize : 0,maximumPoolSize : 2147483647,maxThreadIdleTime : 5,sizeOfQueue : -1,fairnessPolicy : false,useRetries : false,
   [junit4]   2> 2043405 INFO  (jetty-launcher-2005-thread-1) [    ] o.a.s.u.UpdateShardHandler Creating UpdateShardHandler HTTP client with params: socketTimeout=340000&connTimeout=45000&retry=true
   [junit4]   2> 2043405 INFO  (jetty-launcher-2005-thread-5) [    ] o.a.s.u.UpdateShardHandler Creating UpdateShardHandler HTTP client with params: socketTimeout=340000&connTimeout=45000&retry=true
   [junit4]   2> 2043405 INFO  (jetty-launcher-2005-thread-4) [    ] o.a.s.u.UpdateShardHandler Creating UpdateShardHandler HTTP client with params: socketTimeout=340000&connTimeout=45000&retry=true
   [junit4]   2> 2043405 INFO  (jetty-launcher-2005-thread-1) [    ] o.a.s.l.LogWatcher SLF4J impl is org.slf4j.impl.Log4jLoggerFactory
   [junit4]   2> 2043405 INFO  (jetty-launcher-2005-thread-3) [    ] o.a.s.u.UpdateShardHandler Creating UpdateShardHandler HTTP client with params: socketTimeout=340000&connTimeout=45000&retry=true
   [junit4]   2> 2043405 INFO  (jetty-launcher-2005-thread-1) [    ] o.a.s.l.LogWatcher Registering Log Listener [Log4j (org.slf4j.impl.Log4jLoggerFactory)]
   [junit4]   2> 2043405 INFO  (jetty-launcher-2005-thread-2) [    ] o.a.s.u.UpdateShardHandler Creating UpdateShardHandler HTTP client with params: socketTimeout=340000&connTimeout=45000&retry=true
   [junit4]   2> 2043405 INFO  (jetty-launcher-2005-thread-5) [    ] o.a.s.l.LogWatcher SLF4J impl is org.slf4j.impl.Log4jLoggerFactory
   [junit4]   2> 2043406 INFO  (jetty-launcher-2005-thread-1) [    ] o.a.s.c.ZkContainer Zookeeper client=127.0.0.1:44213/solr
   [junit4]   2> 2043405 INFO  (jetty-launcher-2005-thread-4) [    ] o.a.s.l.LogWatcher SLF4J impl is org.slf4j.impl.Log4jLoggerFactory
   [junit4]   2> 2043406 INFO  (jetty-launcher-2005-thread-1) [    ] o.a.s.c.ZkController zkHost includes chroot
   [junit4]   2> 2043406 INFO  (jetty-launcher-2005-thread-4) [    ] o.a.s.l.LogWatcher Registering Log Listener [Log4j (org.slf4j.impl.Log4jLoggerFactory)]
   [junit4]   2> 2043406 INFO  (jetty-launcher-2005-thread-1) [    ] o.a.s.c.c.SolrZkClient Using default ZkCredentialsProvider
   [junit4]   2> 2043406 INFO  (jetty-launcher-2005-thread-2) [    ] o.a.s.l.LogWatcher SLF4J impl is org.slf4j.impl.Log4jLoggerFactory
   [junit4]   2> 2043406 INFO  (jetty-launcher-2005-thread-2) [    ] o.a.s.l.LogWatcher Registering Log Listener [Log4j (org.slf4j.impl.Log4jLoggerFactory)]
   [junit4]   2> 2043406 INFO  (jetty-launcher-2005-thread-4) [    ] o.a.s.c.ZkContainer Zookeeper client=127.0.0.1:44213/solr
   [junit4]   2> 2043406 INFO  (jetty-launcher-2005-thread-3) [    ] o.a.s.l.LogWatcher SLF4J impl is org.slf4j.impl.Log4jLoggerFactory
   [junit4]   2> 2043407 INFO  (jetty-launcher-2005-thread-4) [    ] o.a.s.c.ZkController zkHost includes chroot
   [junit4]   2> 2043407 INFO  (jetty-launcher-2005-thread-3) [    ] o.a.s.l.LogWatcher Registering Log Listener [Log4j (org.slf4j.impl.Log4jLoggerFactory)]
   [junit4]   2> 2043407 INFO  (jetty-launcher-2005-thread-1) [    ] o.a.s.c.c.ConnectionManager Waiting for client to connect to ZooKeeper
   [junit4]   2> 2043406 INFO  (jetty-launcher-2005-thread-5) [    ] o.a.s.l.LogWatcher Registering Log Listener [Log4j (org.slf4j.impl.Log4jLoggerFactory)]
   [junit4]   2> 2043407 INFO  (jetty-launcher-2005-thread-3) [    ] o.a.s.c.ZkContainer Zookeeper client=127.0.0.1:44213/solr
   [junit4]   2> 2043407 INFO  (jetty-launcher-2005-thread-4) [    ] o.a.s.c.c.SolrZkClient Using default ZkCredentialsProvider
   [junit4]   2> 2043408 INFO  (jetty-launcher-2005-thread-5) [    ] o.a.s.c.ZkContainer Zookeeper client=127.0.0.1:44213/solr
   [junit4]   2> 2043408 INFO  (jetty-launcher-2005-thread-3) [    ] o.a.s.c.ZkController zkHost includes chroot
   [junit4]   2> 2043408 INFO  (jetty-launcher-2005-thread-5) [    ] o.a.s.c.ZkController zkHost includes chroot
   [junit4]   2> 2043408 INFO  (jetty-launcher-2005-thread-4) [    ] o.a.s.c.c.ConnectionManager Waiting for client to connect to ZooKeeper
   [junit4]   2> 2043408 INFO  (jetty-launcher-2005-thread-5) [    ] o.a.s.c.c.SolrZkClient Using default ZkCredentialsProvider
   [junit4]   2> 2043408 INFO  (jetty-launcher-2005-thread-2) [    ] o.a.s.c.ZkContainer Zookeeper client=127.0.0.1:44213/solr
   [junit4]   2> 2043408 INFO  (jetty-launcher-2005-thread-3) [    ] o.a.s.c.c.SolrZkClient Using default ZkCredentialsProvider
   [junit4]   2> 2043409 INFO  (jetty-launcher-2005-thread-2) [    ] o.a.s.c.ZkController zkHost includes chroot
   [junit4]   2> 2043409 INFO  (jetty-launcher-2005-thread-2) [    ] o.a.s.c.c.SolrZkClient Using default ZkCredentialsProvider
   [junit4]   2> 2043409 INFO  (jetty-launcher-2005-thread-5) [    ] o.a.s.c.c.ConnectionManager Waiting for client to connect to ZooKeeper
   [junit4]   2> 2043409 INFO  (jetty-launcher-2005-thread-3) [    ] o.a.s.c.c.ConnectionManager Waiting for client to connect to ZooKeeper
   [junit4]   2> 2043409 INFO  (jetty-launcher-2005-thread-2) [    ] o.a.s.c.c.ConnectionManager Waiting for client to connect to ZooKeeper
   [junit4]   2> 2043532 INFO  (zkCallback-2022-thread-1) [    ] o.a.s.c.c.ConnectionManager Watcher org.apache.solr.common.cloud.ConnectionManager@6b0a459a name:ZooKeeperConnection Watcher:127.0.0.1:44213 got event WatchedEvent state:SyncConnected type:None path:null path:null type:None
   [junit4]   2> 2043533 INFO  (jetty-launcher-2005-thread-1) [    ] o.a.s.c.c.ConnectionManager Client is connected to ZooKeeper
   [junit4]   2> 2043533 INFO  (jetty-launcher-2005-thread-1) [    ] o.a.s.c.c.SolrZkClient Using default ZkACLProvider
   [junit4]   2> 2043573 INFO  (zkCallback-2023-thread-1) [    ] o.a.s.c.c.ConnectionManager Watcher org.apache.solr.common.cloud.ConnectionManager@51470e name:ZooKeeperConnection Watcher:127.0.0.1:44213 got event WatchedEvent state:SyncConnected type:None path:null path:null type:None
   [junit4]   2> 2043573 INFO  (jetty-launcher-2005-thread-4) [    ] o.a.s.c.c.ConnectionManager Client is connected to ZooKeeper
   [junit4]   2> 2043573 INFO  (zkCallback-2025-thread-1) [    ] o.a.s.c.c.ConnectionManager Watcher org.apache.solr.common.cloud.ConnectionManager@45b59774 name:ZooKeeperConnection Watcher:127.0.0.1:44213 got event WatchedEvent state:SyncConnected type:None path:null path:null type:None
   [junit4]   2> 2043574 INFO  (jetty-launcher-2005-thread-5) [    ] o.a.s.c.c.ConnectionManager Client is connected to ZooKeeper
   [junit4]   2> 2043574 INFO  (jetty-launcher-2005-thread-4) [    ] o.a.s.c.c.SolrZkClient Using default ZkACLProvider
   [junit4]   2> 2043574 INFO  (zkCallback-2024-thread-1) [    ] o.a.s.c.c.ConnectionManager Watcher org.apache.solr.common.cloud.ConnectionManager@3bc5abdc name:ZooKeeperConnection Watcher:127.0.0.1:44213 got event WatchedEvent state:SyncConnected type:None path:null path:null type:None
   [junit4]   2> 2043574 INFO  (jetty-launcher-2005-thread-5) [    ] o.a.s.c.c.SolrZkClient Using default ZkACLProvider
   [junit4]   2> 2043574 INFO  (jetty-launcher-2005-thread-3) [    ] o.a.s.c.c.ConnectionManager Client is connected to ZooKeeper
   [junit4]   2> 2043574 INFO  (zkCallback-2026-thread-1) [    ] o.a.s.c.c.ConnectionManager Watcher org.apache.solr.common.cloud.ConnectionManager@8729f2b name:ZooKeeperConnection Watcher:127.0.0.1:44213 got event WatchedEvent state:SyncConnected type:None path:null path:null type:None
   [junit4]   2> 2043574 INFO  (jetty-launcher-2005-thread-2) [    ] o.a.s.c.c.ConnectionManager Client is connected to ZooKeeper
   [junit4]   2> 2043574 INFO  (jetty-launcher-2005-thread-3) [    ] o.a.s.c.c.SolrZkClient Using default ZkACLProvider
   [junit4]   2> 2043574 INFO  (jetty-launcher-2005-thread-2) [    ] o.a.s.c.c.SolrZkClient Using default ZkACLProvider
   [junit4]   2> 2043624 INFO  (jetty-launcher-2005-thread-1) [n:127.0.0.1:36744_solr    ] o.a.s.c.ZkController Added new OnReconnect listener org.apache.solr.cloud.ZkController$6@21b7bd62
   [junit4]   2> 2043625 INFO  (jetty-launcher-2005-thread-1) [n:127.0.0.1:36744_solr    ] o.a.s.c.c.ConnectionManager Waiting for client to connect to ZooKeeper
   [junit4]   2> 2043648 INFO  (jetty-launcher-2005-thread-4) [n:127.0.0.1:43757_solr    ] o.a.s.c.ZkController Added new OnReconnect listener org.apache.solr.cloud.ZkController$6@558421d4
   [junit4]   2> 2043648 INFO  (jetty-launcher-2005-thread-2) [n:127.0.0.1:36108_solr    ] o.a.s.c.ZkController Added new OnReconnect listener org.apache.solr.cloud.ZkController$6@3858518
   [junit4]   2> 2043648 INFO  (jetty-launcher-2005-thread-3) [n:127.0.0.1:45209_solr    ] o.a.s.c.ZkController Added new OnReconnect listener org.apache.solr.cloud.ZkController$6@55c91128
   [junit4]   2> 2043648 WARN  (NIOServerCxn.Factory:0.0.0.0/0.0.0.0:0) [    ] o.a.z.s.NIOServerCnxn caught end of stream exception
   [junit4]   2> EndOfStreamException: Unable to read additional data from client sessionid 0x1546f1b80f7000a, likely client has closed socket
   [junit4]   2> 	at org.apache.zookeeper.server.NIOServerCnxn.doIO(NIOServerCnxn.java:228)
   [junit4]   2> 	at org.apache.zookeeper.server.NIOServerCnxnFactory.run(NIOServerCnxnFactory.java:208)
   [junit4]   2> 	at java.lang.Thread.run(Thread.java:745)
   [junit4]   2> 2043649 INFO  (jetty-launcher-2005-thread-4) [n:127.0.0.1:43757_solr    ] o.a.s.c.c.ConnectionManager Waiting for client to connect to ZooKeeper
   [junit4]   2> 2043649 INFO  (jetty-launcher-2005-thread-3) [n:127.0.0.1:45209_solr    ] o.a.s.c.c.ConnectionManager Waiting for client to connect to ZooKeeper
   [junit4]   2> 2043649 INFO  (jetty-launcher-2005-thread-2) [n:127.0.0.1:36108_solr    ] o.a.s.c.c.ConnectionManager Waiting for client to connect to ZooKeeper
   [junit4]   2> 2043649 WARN  (NIOServerCxn.Factory:0.0.0.0/0.0.0.0:0) [    ] o.a.z.s.NIOServerCnxn caught end of stream exception
   [junit4]   2> EndOfStreamException: Unable to read additional data from client sessionid 0x1546f1b80f70009, likely client has closed socket
   [junit4]   2> 	at org.apache.zookeeper.server.NIOServerCnxn.doIO(NIOServerCnxn.java:228)
   [junit4]   2> 	at org.apache.zookeeper.server.NIOServerCnxnFactory.run(NIOServerCnxnFactory.java:208)
   [junit4]   2> 	at java.lang.Thread.run(Thread.java:745)
   [junit4]   2> 2043648 INFO  (jetty-launcher-2005-thread-5) [n:127.0.0.1:42452_solr    ] o.a.s.c.ZkController Added new OnReconnect listener org.apache.solr.cloud.ZkController$6@586b22cf
   [junit4]   2> 2043650 INFO  (jetty-launcher-2005-thread-5) [n:127.0.0.1:42452_solr    ] o.a.s.c.c.ConnectionManager Waiting for client to connect to ZooKeeper
   [junit4]   2> 2043690 INFO  (zkCallback-2027-thread-1-processing-n:127.0.0.1:36744_solr) [n:127.0.0.1:36744_solr    ] o.a.s.c.c.ConnectionManager Watcher org.apache.solr.common.cloud.ConnectionManager@6598dadb name:ZooKeeperConnection Watcher:127.0.0.1:44213/solr got event WatchedEvent state:SyncConnected type:None path:null path:null type:None
   [junit4]   2> 2043690 INFO  (jetty-launcher-2005-thread-1) [n:127.0.0.1:36744_solr    ] o.a.s.c.c.ConnectionManager Client is connected to ZooKeeper
   [junit4]   2> 2043725 INFO  (zkCallback-2029-thread-1-processing-n:127.0.0.1:36108_solr) [n:127.0.0.1:36108_solr    ] o.a.s.c.c.ConnectionManager Watcher org.apache.solr.common.cloud.ConnectionManager@4a3a56bb name:ZooKeeperConnection Watcher:127.0.0.1:44213/solr got event WatchedEvent state:SyncConnected type:None path:null path:null type:None
   [junit4]   2> 2043725 INFO  (jetty-launcher-2005-thread-2) [n:127.0.0.1:36108_solr    ] o.a.s.c.c.ConnectionManager Client is connected to ZooKeeper
   [junit4]   2> 2043725 INFO  (zkCallback-2028-thread-1-processing-n:127.0.0.1:43757_solr) [n:127.0.0.1:43757_solr    ] o.a.s.c.c.ConnectionManager Watcher org.apache.solr.common.cloud.ConnectionManager@3be56b87 name:ZooKeeperConnection Watcher:127.0.0.1:44213/solr got event WatchedEvent state:SyncConnected type:None path:null path:null type:None
   [junit4]   2> 2043725 INFO  (zkCallback-2030-thread-1-processing-n:127.0.0.1:45209_solr) [n:127.0.0.1:45209_solr    ] o.a.s.c.c.ConnectionManager Watcher org.apache.solr.common.cloud.ConnectionManager@7b1e405f name:ZooKeeperConnection Watcher:127.0.0.1:44213/solr got event WatchedEvent state:SyncConnected type:None path:null path:null type:None
   [junit4]   2> 2043725 INFO  (jetty-launcher-2005-thread-4) [n:127.0.0.1:43757_solr    ] o.a.s.c.c.ConnectionManager Client is connected to ZooKeeper
   [junit4]   2> 2043725 INFO  (jetty-launcher-2005-thread-3) [n:127.0.0.1:45209_solr    ] o.a.s.c.c.ConnectionManager Client is connected to ZooKeeper
   [junit4]   2> 2043726 INFO  (zkCallback-2031-thread-1-processing-n:127.0.0.1:42452_solr) [n:127.0.0.1:42452_solr    ] o.a.s.c.c.ConnectionManager Watcher org.apache.solr.common.cloud.ConnectionManager@2ae0c5c0 name:ZooKeeperConnection Watcher:127.0.0.1:44213/solr got event WatchedEvent state:SyncConnected type:None path:null path:null type:None
   [junit4]   2> 2043726 INFO  (jetty-launcher-2005-thread-5) [n:127.0.0.1:42452_solr    ] o.a.s.c.c.ConnectionManager Client is connected to ZooKeeper
   [junit4]   2> 2043776 INFO  (jetty-launcher-2005-thread-1) [n:127.0.0.1:36744_solr    ] o.a.s.c.c.SolrZkClient makePath: /overseer/queue
   [junit4]   2> 2043776 INFO  (jetty-launcher-2005-thread-4) [n:127.0.0.1:43757_solr    ] o.a.s.c.c.SolrZkClient makePath: /overseer/queue
   [junit4]   2> 2043776 INFO  (jetty-launcher-2005-thread-3) [n:127.0.0.1:45209_solr    ] o.a.s.c.c.SolrZkClient makePath: /overseer/queue
   [junit4]   2> 2043776 INFO  (jetty-launcher-2005-thread-2) [n:127.0.0.1:36108_solr    ] o.a.s.c.c.SolrZkClient makePath: /overseer/queue
   [junit4]   2> 2043777 INFO  (jetty-launcher-2005-thread-5) [n:127.0.0.1:42452_solr    ] o.a.s.c.c.SolrZkClient makePath: /overseer/queue
   [junit4]   2> 2043899 INFO  (jetty-launcher-2005-thread-3) [n:127.0.0.1:45209_solr    ] o.a.s.c.c.SolrZkClient makePath: /overseer/collection-queue-work
   [junit4]   2> 2043899 INFO  (jetty-launcher-2005-thread-2) [n:127.0.0.1:36108_solr    ] o.a.s.c.c.SolrZkClient makePath: /overseer/collection-queue-work
   [junit4]   2> 2043899 INFO  (jetty-launcher-2005-thread-1) [n:127.0.0.1:36744_solr    ] o.a.s.c.c.SolrZkClient makePath: /overseer/collection-queue-work
   [junit4]   2> 2043899 INFO  (jetty-launcher-2005-thread-5) [n:127.0.0.1:42452_solr    ] o.a.s.c.c.SolrZkClient makePath: /overseer/collection-queue-work
   [junit4]   2> 2043899 INFO  (jetty-launcher-2005-thread-4) [n:127.0.0.1:43757_solr    ] o.a.s.c.c.SolrZkClient makePath: /overseer/collection-queue-work
   [junit4]   2> 2044579 INFO  (jetty-launcher-2005-thread-1) [n:127.0.0.1:36744_solr    ] o.a.s.c.c.SolrZkClient makePath: /overseer/collection-map-running
   [junit4]   2> 2044591 INFO  (jetty-launcher-2005-thread-3) [n:127.0.0.1:45209_solr    ] o.a.s.c.c.SolrZkClient makePath: /overseer/collection-map-running
   [junit4]   2> 2044591 INFO  (jetty-launcher-2005-thread-2) [n:127.0.0.1:36108_solr    ] o.a.s.c.c.SolrZkClient makePath: /overseer/collection-map-running
   [junit4]   2> 2044591 INFO  (jetty-launcher-2005-thread-5) [n:127.0.0.1:42452_solr    ] o.a.s.c.c.SolrZkClient makePath: /overseer/collection-map-running
   [junit4]   2> 2044591 INFO  (jetty-launcher-2005-thread-4) [n:127.0.0.1:43757_solr    ] o.a.s.c.c.SolrZkClient makePath: /overseer/collection-map-running
   [junit4]   2> 2044672 INFO  (jetty-launcher-2005-thread-1) [n:127.0.0.1:36744_solr    ] o.a.s.c.c.SolrZkClient makePath: /overseer/collection-map-completed
   [junit4]   2> 2044689 INFO  (jetty-launcher-2005-thread-3) [n:127.0.0.1:45209_solr    ] o.a.s.c.c.SolrZkClient makePath: /overseer/collection-map-completed
   [junit4]   2> 2044689 INFO  (jetty-launcher-2005-thread-2) [n:127.0.0.1:36108_solr    ] o.a.s.c.c.SolrZkClient makePath: /overseer/collection-map-completed
   [junit4]   2> 2044689 INFO  (jetty-launcher-2005-thread-4) [n:127.0.0.1:43757_solr    ] o.a.s.c.c.SolrZkClient makePath: /overseer/collection-map-completed
   [junit4]   2> 2044689 INFO  (jetty-launcher-2005-thread-5) [n:127.0.0.1:42452_solr    ] o.a.s.c.c.SolrZkClient makePath: /overseer/collection-map-completed
   [junit4]   2> 2045861 INFO  (jetty-launcher-2005-thread-1) [n:127.0.0.1:36744_solr    ] o.a.s.c.c.SolrZkClient makePath: /overseer/collection-map-failure
   [junit4]   2> 2045861 INFO  (jetty-launcher-2005-thread-3) [n:127.0.0.1:45209_solr    ] o.a.s.c.c.SolrZkClient makePath: /overseer/collection-map-failure
   [junit4]   2> 2045918 INFO  (jetty-launcher-2005-thread-2) [n:127.0.0.1:36108_solr    ] o.a.s.c.c.SolrZkClient makePath: /overseer/collection-map-failure
   [junit4]   2> 2046096 INFO  (jetty-launcher-2005-thread-5) [n:127.0.0.1:42452_solr    ] o.a.s.c.c.SolrZkClient makePath: /overseer/collection-map-failure
   [junit4]   2> 2046096 INFO  (jetty-launcher-2005-thread-4) [n:127.0.0.1:43757_solr    ] o.a.s.c.c.SolrZkClient makePath: /overseer/collection-map-failure
   [junit4]   2> 2046249 INFO  (jetty-launcher-2005-thread-1) [n:127.0.0.1:36744_solr    ] o.a.s.c.c.SolrZkClient makePath: /live_nodes
   [junit4]   2> 2046250 INFO  (jetty-launcher-2005-thread-2) [n:127.0.0.1:36108_solr    ] o.a.s.c.c.SolrZkClient makePath: /live_nodes
   [junit4]   2> 2046250 INFO  (jetty-launcher-2005-thread-5) [n:127.0.0.1:42452_solr    ] o.a.s.c.c.SolrZkClient makePath: /live_nodes
   [junit4]   2> 2046250 INFO  (jetty-launcher-2005-thread-4) [n:127.0.0.1:43757_solr    ] o.a.s.c.c.SolrZkClient makePath: /live_nodes
   [junit4]   2> 2046251 INFO  (jetty-launcher-2005-thread-3) [n:127.0.0.1:45209_solr    ] o.a.s.c.c.SolrZkClient makePath: /live_nodes
   [junit4]   2> 2046285 INFO  (jetty-launcher-2005-thread-2) [n:127.0.0.1:36108_solr    ] o.a.s.c.c.SolrZkClient makePath: /collections
   [junit4]   2> 2046370 INFO  (jetty-launcher-2005-thread-1) [n:127.0.0.1:36744_solr    ] o.a.s.c.c.SolrZkClient makePath: /collections
   [junit4]   2> 2046370 INFO  (jetty-launcher-2005-thread-3) [n:127.0.0.1:45209_solr    ] o.a.s.c.c.SolrZkClient makePath: /collections
   [junit4]   2> 2046370 INFO  (jetty-launcher-2005-thread-5) [n:127.0.0.1:42452_solr    ] o.a.s.c.c.SolrZkClient makePath: /collections
   [junit4]   2> 2046392 INFO  (jetty-launcher-2005-thread-4) [n:127.0.0.1:43757_solr    ] o.a.s.c.c.SolrZkClient makePath: /aliases.json
   [junit4]   2> 2046462 INFO  (jetty-launcher-2005-thread-2) [n:127.0.0.1:36108_solr    ] o.a.s.c.c.SolrZkClient makePath: /aliases.json
   [junit4]   2> 2046462 INFO  (jetty-launcher-2005-thread-5) [n:127.0.0.1:42452_solr    ] o.a.s.c.c.SolrZkClient makePath: /aliases.json
   [junit4]   2> 2046462 INFO  (jetty-launcher-2005-thread-1) [n:127.0.0.1:36744_solr    ] o.a.s.c.c.SolrZkClient makePath: /aliases.json
   [junit4]   2> 2046462 INFO  (jetty-launcher-2005-thread-3) [n:127.0.0.1:45209_solr    ] o.a.s.c.c.SolrZkClient makePath: /aliases.json
   [junit4]   2> 2046574 INFO  (jetty-launcher-2005-thread-4) [n:127.0.0.1:43757_solr    ] o.a.s.c.c.SolrZkClient makePath: /clusterstate.json
   [junit4]   2> 2046574 INFO  (jetty-launcher-2005-thread-5) [n:127.0.0.1:42452_solr    ] o.a.s.c.c.SolrZkClient makePath: /clusterstate.json
   [junit4]   2> 2046574 INFO  (jetty-launcher-2005-thread-3) [n:127.0.0.1:45209_solr    ] o.a.s.c.c.SolrZkClient makePath: /clusterstate.json
   [junit4]   2> 2046574 INFO  (jetty-launcher-2005-thread-1) [n:127.0.0.1:36744_solr    ] o.a.s.c.c.SolrZkClient makePath: /clusterstate.json
   [junit4]   2> 2046574 INFO  (jetty-launcher-2005-thread-2) [n:127.0.0.1:36108_solr    ] o.a.s.c.c.SolrZkClient makePath: /clusterstate.json
   [junit4]   2> 2046710 INFO  (jetty-launcher-2005-thread-5) [n:127.0.0.1:42452_solr    ] o.a.s.c.c.SolrZkClient makePath: /security.json
   [junit4]   2> 2046710 INFO  (jetty-launcher-2005-thread-4) [n:127.0.0.1:43757_solr    ] o.a.s.c.c.SolrZkClient makePath: /security.json
   [junit4]   2> 2046776 INFO  (jetty-launcher-2005-thread-3) [n:127.0.0.1:45209_solr    ] o.a.s.c.c.SolrZkClient makePath: /security.json
   [junit4]   2> 2046776 INFO  (jetty-launcher-2005-thread-1) [n:127.0.0.1:36744_solr    ] o.a.s.c.c.SolrZkClient makePath: /security.json
   [junit4]   2> 2046776 INFO  (jetty-launcher-2005-thread-2) [n:127.0.0.1:36108_solr    ] o.a.s.c.c.SolrZkClient makePath: /security.json
   [junit4]   2> 2046813 INFO  (jetty-launcher-2005-thread-5) [n:127.0.0.1:42452_solr    ] o.a.s.c.ZkController Register node as live in ZooKeeper:/live_nodes/127.0.0.1:42452_solr
   [junit4]   2> 2046813 INFO  (jetty-launcher-2005-thread-4) [n:127.0.0.1:43757_solr    ] o.a.s.c.ZkController Register node as live in ZooKeeper:/live_nodes/127.0.0.1:43757_solr
   [junit4]   2> 2046866 INFO  (jetty-launcher-2005-thread-1) [n:127.0.0.1:36744_solr    ] o.a.s.c.ZkController Register node as live in ZooKeeper:/live_nodes/127.0.0.1:36744_solr
   [junit4]   2> 2046866 INFO  (jetty-launcher-2005-thread-2) [n:127.0.0.1:36108_solr    ] o.a.s.c.ZkController Register node as live in ZooKeeper:/live_nodes/127.0.0.1:36108_solr
   [junit4]   2> 2046866 INFO  (jetty-launcher-2005-thread-3) [n:127.0.0.1:45209_solr    ] o.a.s.c.ZkController Register node as live in ZooKeeper:/live_nodes/127.0.0.1:45209_solr
   [junit4]   2> 2046893 INFO  (jetty-launcher-2005-thread-5) [n:127.0.0.1:42452_solr    ] o.a.s.c.c.SolrZkClient makePath: /live_nodes/127.0.0.1:42452_solr
   [junit4]   2> 2046893 INFO  (jetty-launcher-2005-thread-4) [n:127.0.0.1:43757_solr    ] o.a.s.c.c.SolrZkClient makePath: /live_nodes/127.0.0.1:43757_solr
   [junit4]   2> 2046951 INFO  (jetty-launcher-2005-thread-1) [n:127.0.0.1:36744_solr    ] o.a.s.c.c.SolrZkClient makePath: /live_nodes/127.0.0.1:36744_solr
   [junit4]   2> 2046951 INFO  (jetty-launcher-2005-thread-3) [n:127.0.0.1:45209_solr    ] o.a.s.c.c.SolrZkClient makePath: /live_nodes/127.0.0.1:45209_solr
   [junit4]   2> 2046951 INFO  (jetty-launcher-2005-thread-2) [n:127.0.0.1:36108_solr    ] o.a.s.c.c.SolrZkClient makePath: /live_nodes/127.0.0.1:36108_solr
   [junit4]   2> 2047027 INFO  (jetty-launcher-2005-thread-4) [n:127.0.0.1:43757_solr    ] o.a.s.c.c.SolrZkClient makePath: /overseer_elect
   [junit4]   2> 2047027 INFO  (jetty-launcher-2005-thread-5) [n:127.0.0.1:42452_solr    ] o.a.s.c.c.SolrZkClient makePath: /overseer_elect
   [junit4]   2> 2047028 INFO  (jetty-launcher-2005-thread-1) [n:127.0.0.1:36744_solr    ] o.a.s.c.c.SolrZkClient makePath: /overseer_elect
   [junit4]   2> 2047028 INFO  (jetty-launcher-2005-thread-2) [n:127.0.0.1:36108_solr    ] o.a.s.c.c.SolrZkClient makePath: /overseer_elect
   [junit4]   2> 2047028 INFO  (jetty-launcher-2005-thread-3) [n:127.0.0.1:45209_solr    ] o.a.s.c.c.SolrZkClient makePath: /overseer_elect
   [junit4]   2> 2047214 INFO  (jetty-launcher-2005-thread-5) [n:127.0.0.1:42452_solr    ] o.a.s.c.c.SolrZkClient makePath: /overseer_elect/election
   [junit4]   2> 2047214 INFO  (jetty-launcher-2005-thread-4) [n:127.0.0.1:43757_solr    ] o.a.s.c.c.SolrZkClient makePath: /overseer_elect/election
   [junit4]   2> 2047246 INFO  (jetty-launcher-2005-thread-2) [n:127.0.0.1:36108_solr    ] o.a.s.c.c.SolrZkClient makePath: /overseer_elect/election
   [junit4]   2> 2047246 INFO  (jetty-launcher-2005-thread-1) [n:127.0.0.1:36744_solr    ] o.a.s.c.c.SolrZkClient makePath: /overseer_elect/election
   [junit4]   2> 2047246 INFO  (jetty-launcher-2005-thread-3) [n:127.0.0.1:45209_solr    ] o.a.s.c.c.SolrZkClient makePath: /overseer_elect/election
   [junit4]   2> 2047333 INFO  (jetty-launcher-2005-thread-4) [n:127.0.0.1:43757_solr    ] o.a.s.c.Overseer Overseer (id=null) closing
   [junit4]   2> 2047333 INFO  (jetty-launcher-2005-thread-5) [n:127.0.0.1:42452_solr    ] o.a.s.c.Overseer Overseer (id=null) closing
   [junit4]   2> 2047394 INFO  (jetty-launcher-2005-thread-4) [n:127.0.0.1:43757_solr    ] o.a.s.c.LeaderElector Joined leadership election with path: /overseer_elect/election/95823656000094221-127.0.0.1:43757_solr-n_0000000000
   [junit4]   2> 2047422 INFO  (jetty-launcher-2005-thread-5) [n:127.0.0.1:42452_solr    ] o.a.s.c.LeaderElector Joined leadership election with path: /overseer_elect/election/95823656000094223-127.0.0.1:42452_solr-n_0000000001
   [junit4]   2> 2047422 INFO  (jetty-launcher-2005-thread-1) [n:127.0.0.1:36744_solr    ] o.a.s.c.Overseer Overseer (id=null) closing
   [junit4]   2> 2047422 INFO  (jetty-launcher-2005-thread-4) [n:127.0.0.1:43757_solr    ] o.a.s.c.OverseerElectionContext I am going to be the leader 127.0.0.1:43757_solr
   [junit4]   2> 2047422 INFO  (jetty-launcher-2005-thread-2) [n:127.0.0.1:36108_solr    ] o.a.s.c.Overseer Overseer (id=null) closing
   [junit4]   2> 2047422 INFO  (jetty-launcher-2005-thread-4) [n:127.0.0.1:43757_solr    ] o.a.s.c.c.SolrZkClient makePath: /overseer_elect/leader
   [junit4]   2> 2047422 INFO  (jetty-launcher-2005-thread-3) [n:127.0.0.1:45209_solr    ] o.a.s.c.Overseer Overseer (id=null) closing
   [junit4]   2> 2047476 INFO  (jetty-launcher-2005-thread-1) [n:127.0.0.1:36744_solr    ] o.a.s.c.LeaderElector Joined leadership election with path: /overseer_elect/election/95823656000094219-127.0.0.1:36744_solr-n_0000000002
   [junit4]   2> 2047476 INFO  (jetty-launcher-2005-thread-5) [n:127.0.0.1:42452_solr    ] o.a.s.c.LeaderElector Watching path /overseer_elect/election/95823656000094221-127.0.0.1:43757_solr-n_0000000000 to know if I could be the leader
   [junit4]   2> 2047476 INFO  (jetty-launcher-2005-thread-5) [n:127.0.0.1:42452_solr    ] o.a.s.c.c.ZkStateReader Updating cluster state from ZooKeeper... 
   [junit4]   2> 2047495 INFO  (jetty-launcher-2005-thread-2) [n:127.0.0.1:36108_solr    ] o.a.s.c.LeaderElector Joined leadership election with path: /overseer_elect/election/95823656000094220-127.0.0.1:36108_solr-n_0000000003
   [junit4]   2> 2047495 INFO  (jetty-launcher-2005-thread-3) [n:127.0.0.1:45209_solr    ] o.a.s.c.LeaderElector Joined leadership election with path: /overseer_elect/election/95823656000094222-127.0.0.1:45209_solr-n_0000000004
   [junit4]   2> 2047495 INFO  (jetty-launcher-2005-thread-1) [n:127.0.0.1:36744_solr    ] o.a.s.c.LeaderElector Watching path /overseer_elect/election/95823656000094223-127.0.0.1:42452_solr-n_0000000001 to know if I could be the leader
   [junit4]   2> 2047495 INFO  (jetty-launcher-2005-thread-1) [n:127.0.0.1:36744_solr    ] o.a.s.c.c.ZkStateReader Updating cluster state from ZooKeeper... 
   [junit4]   2> 2047553 INFO  (jetty-launcher-2005-thread-2) [n:127.0.0.1:36108_solr    ] o.a.s.c.LeaderElector Watching path /overseer_elect/election/95823656000094219-127.0.0.1:36744_solr-n_0000000002 to know if I could be the leader
   [junit4]   2> 2047553 INFO  (jetty-launcher-2005-thread-2) [n:127.0.0.1:36108_solr    ] o.a.s.c.c.ZkStateReader Updating cluster state from ZooKeeper... 
   [junit4]   2> 2047553 INFO  (jetty-launcher-2005-thread-4) [n:127.0.0.1:43757_solr    ] o.a.s.c.Overseer Overseer (id=95823656000094221-127.0.0.1:43757_solr-n_0000000000) starting
   [junit4]   2> 2047553 INFO  (jetty-launcher-2005-thread-3) [n:127.0.0.1:45209_solr    ] o.a.s.c.LeaderElector Watching path /overseer_elect/election/95823656000094220-127.0.0.1:36108_solr-n_0000000003 to know if I could be the leader
   [junit4]   2> 2047553 INFO  (jetty-launcher-2005-thread-3) [n:127.0.0.1:45209_solr    ] o.a.s.c.c.ZkStateReader Updating cluster state from ZooKeeper... 
   [junit4]   2> 2047616 INFO  (jetty-launcher-2005-thread-5) [n:127.0.0.1:42452_solr    ] o.a.s.c.CoreContainer Security conf doesn't exist. Skipping setup for authorization module.
   [junit4]   2> 2047616 INFO  (jetty-launcher-2005-thread-5) [n:127.0.0.1:42452_solr    ] o.a.s.c.CoreContainer No authentication plugin used.
   [junit4]   2> 2047617 INFO  (jetty-launcher-2005-thread-5) [n:127.0.0.1:42452_solr    ] o.a.s.c.CorePropertiesLocator Looking for core definitions underneath /home/jenkins/workspace/Lucene-Solr-5.5-Linux/solr/build/solr-core/test/J2/temp/solr.security.BasicAuthIntegrationTest_DD4AF6DD23C4FA68-001/tempDir-001/node5/.
   [junit4]   2> 2047618 INFO  (jetty-launcher-2005-thread-5) [n:127.0.0.1:42452_solr    ] o.a.s.c.CorePropertiesLocator Found 0 core definitions
   [junit4]   2> 2047622 INFO  (jetty-launcher-2005-thread-5) [n:127.0.0.1:42452_solr    ] o.a.s.s.SolrDispatchFilter user.dir=/home/jenkins/workspace/Lucene-Solr-5.5-Linux/solr/build/solr-core/test/J2
   [junit4]   2> 2047622 INFO  (jetty-launcher-2005-thread-5) [n:127.0.0.1:42452_solr    ] o.a.s.s.SolrDispatchFilter SolrDispatchFilter.init() done
   [junit4]   2> 2047622 INFO  (jetty-launcher-2005-thread-4) [n:127.0.0.1:43757_solr    ] o.a.s.c.c.SolrZkClient makePath: /overseer/queue-work
   [junit4]   2> 2047635 INFO  (jetty-launcher-2005-thread-1) [n:127.0.0.1:36744_solr    ] o.a.s.c.CoreContainer Security conf doesn't exist. Skipping setup for authorization module.
   [junit4]   2> 2047635 INFO  (jetty-launcher-2005-thread-1) [n:127.0.0.1:36744_solr    ] o.a.s.c.CoreContainer No authentication plugin used.
   [junit4]   2> 2047636 INFO  (jetty-launcher-2005-thread-1) [n:127.0.0.1:36744_solr    ] o.a.s.c.CorePropertiesLocator Looking for core definitions underneath /home/jenkins/workspace/Lucene-Solr-5.5-Linux/solr/build/solr-core/test/J2/temp/solr.security.BasicAuthIntegrationTest_DD4AF6DD23C4FA68-001/tempDir-001/node1/.
   [junit4]   2> 2047636 INFO  (jetty-launcher-2005-thread-1) [n:127.0.0.1:36744_solr    ] o.a.s.c.CorePropertiesLocator Found 0 core definitions
   [junit4]   2> 2047638 INFO  (jetty-launcher-2005-thread-2) [n:127.0.0.1:36108_solr    ] o.a.s.c.CoreContainer Security conf doesn't exist. Skipping setup for authorization module.
   [junit4]   2> 2047638 INFO  (jetty-launcher-2005-thread-2) [n:127.0.0.1:36108_solr    ] o.a.s.c.CoreContainer No authentication plugin used.
   [junit4]   2> 2047638 INFO  (jetty-launcher-2005-thread-2) [n:127.0.0.1:36108_solr    ] o.a.s.c.CorePropertiesLocator Looking for core definitions underneath /home/jenkins/workspace/Lucene-Solr-5.5-Linux/solr/build/solr-core/test/J2/temp/solr.security.BasicAuthIntegrationTest_DD4AF6DD23C4FA68-001/tempDir-001/node2/.
   [junit4]   2> 2047638 INFO  (jetty-launcher-2005-thread-2) [n:127.0.0.1:36108_solr    ] o.a.s.c.CorePropertiesLocator Found 0 core definitions
   [junit4]   2> 2047665 INFO  (jetty-launcher-2005-thread-1) [n:127.0.0.1:36744_solr    ] o.a.s.s.SolrDispatchFilter user.dir=/home/jenkins/workspace/Lucene-Solr-5.5-Linux/solr/build/solr-core/test/J2
   [junit4]   2> 2047665 INFO  (jetty-launcher-2005-thread-2) [n:127.0.0.1:36108_solr    ] o.a.s.s.SolrDispatchFilter user.dir=/home/jenkins/workspace/Lucene-Solr-5.5-Linux/solr/build/solr-core/test/J2
   [junit4]   2> 2047665 INFO  (jetty-launcher-2005-thread-1) [n:127.0.0.1:36744_solr    ] o.a.s.s.SolrDispatchFilter SolrDispatchFilter.init() done
   [junit4]   2> 2047665 INFO  (jetty-launcher-2005-thread-2) [n:127.0.0.1:36108_solr    ] o.a.s.s.SolrDispatchFilter SolrDispatchFilter.init() done
   [junit4]   2> 2047672 INFO  (jetty-launcher-2005-thread-3) [n:127.0.0.1:45209_solr    ] o.a.s.c.CoreContainer Security conf doesn't exist. Skipping setup for authorization module.
   [junit4]   2> 2047672 INFO  (jetty-launcher-2005-thread-3) [n:127.0.0.1:45209_solr    ] o.a.s.c.CoreContainer No authentication plugin used.
   [junit4]   2> 2047673 INFO  (jetty-launcher-2005-thread-3) [n:127.0.0.1:45209_solr    ] o.a.s.c.CorePropertiesLocator Looking for core definitions underneath /home/jenkins/workspace/Lucene-Solr-5.5-Linux/solr/build/solr-core/test/J2/temp/solr.security.BasicAuthIntegrationTest_DD4AF6DD23C4FA68-001/tempDir-001/node3/.
   [junit4]   2> 2047673 INFO  (jetty-launcher-2005-thread-3) [n:127.0.0.1:45209_solr    ] o.a.s.c.CorePropertiesLocator Found 0 core definitions
   [junit4]   2> 2047730 INFO  (jetty-launcher-2005-thread-3) [n:127.0.0.1:45209_solr    ] o.a.s.s.SolrDispatchFilter user.dir=/home/jenkins/workspace/Lucene-Solr-5.5-Linux/solr/build/solr-core/test/J2
   [junit4]   2> 2047730 INFO  (jetty-launcher-2005-thread-3) [n:127.0.0.1:45209_solr    ] o.a.s.s.SolrDispatchFilter SolrDispatchFilter.init() done
   [junit4]   2> 2047954 INFO  (jetty-launcher-2005-thread-4) [n:127.0.0.1:43757_solr    ] o.a.s.c.OverseerAutoReplicaFailoverThread Starting OverseerAutoReplicaFailoverThread autoReplicaFailoverWorkLoopDelay=10000 autoReplicaFailoverWaitAfterExpiration=30000 autoReplicaFailoverBadNodeExpiration=60000
   [junit4]   2> 2047954 INFO  (OverseerCollectionConfigSetProcessor-95823656000094221-127.0.0.1:43757_solr-n_0000000000) [n:127.0.0.1:43757_solr    ] o.a.s.c.OverseerTaskProcessor Process current queue of overseer operations
   [junit4]   2> 2047954 INFO  (jetty-launcher-2005-thread-4) [n:127.0.0.1:43757_solr    ] o.a.s.c.c.ZkStateReader Updating cluster state from ZooKeeper... 
   [junit4]   2> 2047954 INFO  (OverseerStateUpdate-95823656000094221-127.0.0.1:43757_solr-n_0000000000) [n:127.0.0.1:43757_solr    ] o.a.s.c.Overseer Starting to work on the main queue
   [junit4]   2> 2047966 INFO  (jetty-launcher-2005-thread-4) [n:127.0.0.1:43757_solr    ] o.a.s.c.CoreContainer Security conf doesn't exist. Skipping setup for authorization module.
   [junit4]   2> 2047966 INFO  (jetty-launcher-2005-thread-4) [n:127.0.0.1:43757_solr    ] o.a.s.c.CoreContainer No authentication plugin used.
   [junit4]   2> 2047967 INFO  (jetty-launcher-2005-thread-4) [n:127.0.0.1:43757_solr    ] o.a.s.c.CorePropertiesLocator Looking for core definitions underneath /home/jenkins/workspace/Lucene-Solr-5.5-Linux/solr/build/solr-core/test/J2/temp/solr.security.BasicAuthIntegrationTest_DD4AF6DD23C4FA68-001/tempDir-001/node4/.
   [junit4]   2> 2047967 INFO  (jetty-launcher-2005-thread-4) [n:127.0.0.1:43757_solr    ] o.a.s.c.CorePropertiesLocator Found 0 core definitions
   [junit4]   2> 2047967 INFO  (jetty-launcher-2005-thread-4) [n:127.0.0.1:43757_solr    ] o.a.s.s.SolrDispatchFilter user.dir=/home/jenkins/workspace/Lucene-Solr-5.5-Linux/solr/build/solr-core/test/J2
   [junit4]   2> 2047967 INFO  (jetty-launcher-2005-thread-4) [n:127.0.0.1:43757_solr    ] o.a.s.s.SolrDispatchFilter SolrDispatchFilter.init() done
   [junit4]   2> 2047967 INFO  (TEST-BasicAuthIntegrationTest.testBasics-seed#[DD4AF6DD23C4FA68]) [    ] o.a.s.c.c.SolrZkClient Using default ZkCredentialsProvider
   [junit4]   2> 2047968 INFO  (TEST-BasicAuthIntegrationTest.testBasics-seed#[DD4AF6DD23C4FA68]) [    ] o.a.s.c.c.ConnectionManager Waiting for client to connect to ZooKeeper
   [junit4]   2> 2047981 INFO  (zkCallback-2032-thread-1) [    ] o.a.s.c.c.ConnectionManager Watcher org.apache.solr.common.cloud.ConnectionManager@1be8aa8a name:ZooKeeperConnection Watcher:127.0.0.1:44213 got event WatchedEvent state:SyncConnected type:None path:null path:null type:None
   [junit4]   2> 2047981 INFO  (TEST-BasicAuthIntegrationTest.testBasics-seed#[DD4AF6DD23C4FA68]) [    ] o.a.s.c.c.ConnectionManager Client is connected to ZooKeeper
   [junit4]   2> 2047981 INFO  (TEST-BasicAuthIntegrationTest.testBasics-seed#[DD4AF6DD23C4FA68]) [    ] o.a.s.c.c.SolrZkClient Using default ZkACLProvider
   [junit4]   2> 2048040 INFO  (TEST-BasicAuthIntegrationTest.testBasics-seed#[DD4AF6DD23C4FA68]) [    ] o.e.j.s.ServerConnector Stopped ServerConnector@6175e74{HTTP/1.1}{127.0.0.1:0}
   [junit4]   2> 2048041 INFO  (TEST-BasicAuthIntegrationTest.testBasics-seed#[DD4AF6DD23C4FA68]) [    ] o.a.s.c.CoreContainer Shutting down CoreContainer instance=582539381
   [junit4]   2> 2048041 INFO  (TEST-BasicAuthIntegrationTest.testBasics-seed#[DD4AF6DD23C4FA68]) [    ] o.a.s.c.ZkController Publish node=127.0.0.1:42452_solr as DOWN
   [junit4]   2> 2048345 INFO  (OverseerStateUpdate-95823656000094221-127.0.0.1:43757_solr-n_0000000000) [n:127.0.0.1:43757_solr    ] o.a.s.c.Overseer processMessage: queueSize: 1, message = {
   [junit4]   2>   "operation":"downnode",
   [junit4]   2>   "node_name":"127.0.0.1:42452_solr"} current state version: 0
   [junit4]   2> 2048345 INFO  (OverseerStateUpdate-95823656000094221-127.0.0.1:43757_solr-n_0000000000) [n:127.0.0.1:43757_solr    ] o.a.s.c.o.NodeMutator DownNode state invoked for node: 127.0.0.1:42452_solr
   [junit4]   2> 2048378 INFO  (TEST-BasicAuthIntegrationTest.testBasics-seed#[DD4AF6DD23C4FA68]) [    ] o.e.j.s.h.ContextHandler Stopped o.e.j.s.ServletContextHandler@56d7e504{/solr,null,UNAVAILABLE}
   [junit4]   2> 2048378 INFO  (zkCallback-2030-thread-1-processing-n:127.0.0.1:45209_solr) [n:127.0.0.1:45209_solr    ] o.a.s.c.c.ZkStateReader A live node change: [WatchedEvent state:SyncConnected type:NodeChildrenChanged path:/live_nodes], has occurred - updating... (live nodes size: [5])
   [junit4]   2> 2048379 WARN  (NIOServerCxn.Factory:0.0.0.0/0.0.0.0:0) [    ] o.a.z.s.NIOServerCnxn caught end of stream exception
   [junit4]   2> EndOfStreamException: Unable to read additional data from client sessionid 0x1546f1b80f7000f, likely client has closed socket
   [junit4]   2> 	at org.apache.zookeeper.server.NIOServerCnxn.doIO(NIOServerCnxn.java:228)
   [junit4]   2> 	at org.apache.zookeeper.server.NIOServerCnxnFactory.run(NIOServerCnxnFactory.java:208)
   [junit4]   2> 	at java.lang.Thread.run(Thread.java:745)
   [junit4]   2> 2048379 INFO  (zkCallback-2029-thread-1-processing-n:127.0.0.1:36108_solr) [n:127.0.0.1:36108_solr    ] o.a.s.c.c.ZkStateReader A live node change: [WatchedEvent state:SyncConnected type:NodeChildrenChanged path:/live_nodes], has occurred - updating... (live nodes size: [5])
   [junit4]   2> 2048379 ERROR (jetty-launcher-2005-thread-5-EventThread) [n:127.0.0.1:42452_solr    ] o.a.z.ClientCnxn Error while calling watcher 
   [junit4]   2> java.util.concurrent.RejectedExecutionException: Task org.apache.solr.common.util.ExecutorUtil$MDCAwareThreadPoolExecutor$1@8238519 rejected from org.apache.solr.common.util.ExecutorUtil$MDCAwareThreadPoolExecutor@53f7307b[Terminated, pool size = 0, active threads = 0, queued tasks = 0, completed tasks = 1]
   [junit4]   2> 	at java.util.concurrent.ThreadPoolExecutor$AbortPolicy.rejectedExecution(ThreadPoolExecutor.java:2048)
   [junit4]   2> 	at java.util.concurrent.ThreadPoolExecutor.reject(ThreadPoolExecutor.java:821)
   [junit4]   2> 	at java.util.concurrent.ThreadPoolExecutor.execute(ThreadPoolExecutor.java:1372)
   [junit4]   2> 	at org.apache.solr.common.util.ExecutorUtil$MDCAwareThreadPoolExecutor.execute(ExecutorUtil.java:214)
   [junit4]   2> 	at java.util.concurrent.AbstractExecutorService.submit(AbstractExecutorService.java:110)
   [junit4]   2> 	at org.apache.solr.common.cloud.SolrZkClient$3.process(SolrZkClient.java:261)
   [junit4]   2> 	at org.apache.zookeeper.ClientCnxn$EventThread.processEvent(ClientCnxn.java:522)
   [junit4]   2> 	at org.apache.zookeeper.ClientCnxn$EventThread.run(ClientCnxn.java:498)
   [junit4]   2> 2048379 INFO  (zkCallback-2027-thread-1-processing-n:127.0.0.1:36744_solr) [n:127.0.0.1:36744_solr    ] o.a.s.c.c.ZkStateReader A live node change: [WatchedEvent state:SyncConnected type:NodeChildrenChanged path:/live_nodes], has occurred - updating... (live nodes size: [5])
   [junit4]   2> 2048379 INFO  (zkCallback-2028-thread-1-processing-n:127.0.0.1:43757_solr) [n:127.0.0.1:43757_solr    ] o.a.s.c.c.ZkStateReader A live node change: [WatchedEvent state:SyncConnected type:NodeChildrenChanged path:/live_nodes], has occurred - updating... (live nodes size: [5])
   [junit4]   2> 2048383 INFO  (TEST-BasicAuthIntegrationTest.testBasics-seed#[DD4AF6DD23C4FA68]) [    ] o.e.j.s.Server jetty-9.2.13.v20150730
   [junit4]   2> 2048384 INFO  (TEST-BasicAuthIntegrationTest.testBasics-seed#[DD4AF6DD23C4FA68]) [    ] o.e.j.s.h.ContextHandler Started o.e.j.s.ServletContextHandler@6fb2d5bb{/solr,null,AVAILABLE}
   [junit4]   2> 2048384 INFO  (TEST-BasicAuthIntegrationTest.testBasics-seed#[DD4AF6DD23C4FA68]) [    ] o.e.j.s.ServerConnector Started ServerConnector@14cae02f{HTTP/1.1}{127.0.0.1:44317}
   [junit4]   2> 2048384 INFO  (TEST-BasicAuthIntegrationTest.testBasics-seed#[DD4AF6DD23C4FA68]) [    ] o.e.j.s.Server Started @2050209ms
   [junit4]   2> 2048384 INFO  (TEST-BasicAuthIntegrationTest.testBasics-seed#[DD4AF6DD23C4FA68]) [    ] o.a.s.c.s.e.JettySolrRunner Jetty properties: {hostContext=/solr, hostPort=44317}
   [junit4]   2> 2048384 INFO  (TEST-BasicAuthIntegrationTest.testBasics-seed#[DD4AF6DD23C4FA68]) [    ] o.a.s.s.SolrDispatchFilter SolrDispatchFilter.init(): sun.misc.Launcher$AppClassLoader@7be84195
   [junit4]   2> 2048384 INFO  (TEST-BasicAuthIntegrationTest.testBasics-seed#[DD4AF6DD23C4FA68]) [    ] o.a.s.c.SolrResourceLoader new SolrResourceLoader for directory: '/home/jenkins/workspace/Lucene-Solr-5.5-Linux/solr/build/solr-core/test/J2/temp/solr.security.BasicAuthIntegrationTest_DD4AF6DD23C4FA68-001/tempDir-001/node6'
   [junit4]   2> 2048385 INFO  (TEST-BasicAuthIntegrationTest.testBasics-seed#[DD4AF6DD23C4FA68]) [    ] o.a.s.c.SolrResourceLoader JNDI not configured for solr (NoInitialContextEx)
   [junit4]   2> 2048385 INFO  (TEST-BasicAuthIntegrationTest.testBasics-seed#[DD4AF6DD23C4FA68]) [    ] o.a.s.c.SolrResourceLoader solr home defaulted to 'solr/' (could not find system property or JNDI)
   [junit4]   2> 2048385 INFO  (TEST-BasicAuthIntegrationTest.testBasics-seed#[DD4AF6DD23C4FA68]) [    ] o.a.s.c.c.SolrZkClient Using default ZkCredentialsProvider
   [junit4]   2> 2048385 INFO  (TEST-BasicAuthIntegrationTest.testBasics-seed#[DD4AF6DD23C4FA68]) [    ] o.a.s.c.c.ConnectionManager Waiting for client to connect to ZooKeeper
   [junit4]   2> 2048440 INFO  (zkCallback-2027-thread-2-processing-n:127.0.0.1:36744_solr) [n:127.0.0.1:36744_solr    ] o.a.s.c.LeaderElector Watching path /overseer_elect/election/95823656000094221-127.0.0.1:43757_solr-n_0000000000 to know if I could be the leader
   [junit4]   2> 2048440 INFO  (zkCallback-2034-thread-1) [    ] o.a.s.c.c.ConnectionManager Watcher org.apache.solr.common.cloud.ConnectionManager@27006334 name:ZooKeeperConnection Watcher:127.0.0.1:44213/solr got event WatchedEvent state:SyncConnected type:None path:null path:null type:None
   [junit4]   2> 2048440 INFO  (TEST-BasicAuthIntegrationTest.testBasics-seed#[DD4AF6DD23C4FA68]) [    ] o.a.s.c.c.ConnectionManager Client is connected to ZooKeeper
   [junit4]   2> 2048440 INFO  (TEST-BasicAuthIntegrationTest.testBasics-seed#[DD4AF6DD23C4FA68]) [    ] o.a.s.c.c.SolrZkClient Using default ZkACLProvider
   [junit4]   2> 2048441 INFO  (TEST-BasicAuthIntegrationTest.testBasics-seed#[DD4AF6DD23C4FA68]) [    ] o.a.s.s.SolrDispatchFilter solr.xml found in ZooKeeper. Loading...
   [junit4]   2> 2048476 INFO  (TEST-BasicAuthIntegrationTest.testBasics-seed#[DD4AF6DD23C4FA68]) [    ] o.a.s.c.CorePropertiesLocator Config-defined core root directory: /home/jenkins/workspace/Lucene-Solr-5.5-Linux/solr/build/solr-core/test/J2/temp/solr.security.BasicAuthIntegrationTest_DD4AF6DD23C4FA68-001/tempDir-001/node6/.
   [junit4]   2> 2048476 INFO  (TEST-BasicAuthIntegrationTest.testBasics-seed#[DD4AF6DD23C4FA68]) [    ] o.a.s.c.CoreContainer New CoreContainer 332607021
   [junit4]   2> 2048476 INFO  (TEST-BasicAuthIntegrationTest.testBasics-seed#[DD4AF6DD23C4FA68]) [    ] o.a.s.c.CoreContainer Loading cores into CoreContainer [instanceDir=/home/jenkins/workspace/Lucene-Solr-5.5-Linux/solr/build/solr-core/test/J2/temp/solr.security.BasicAuthIntegrationTest_DD4AF6DD23C4FA68-001/tempDir-001/node6]
   [junit4]   2> 2048476 WARN  (TEST-BasicAuthIntegrationTest.testBasics-seed#[DD4AF6DD23C4FA68]) [    ] o.a.s.c.CoreContainer Couldn't add files from /home/jenkins/workspace/Lucene-Solr-5.5-Linux/solr/build/solr-core/test/J2/temp/solr.security.BasicAuthIntegrationTest_DD4AF6DD23C4FA68-001/tempDir-001/node6/lib to classpath: /home/jenkins/workspace/Lucene-Solr-5.5-Linux/solr/build/solr-core/test/J2/temp/solr.security.BasicAuthIntegrationTest_DD4AF6DD23C4FA68-001/tempDir-001/node6/lib
   [junit4]   2> 2048478 INFO  (TEST-BasicAuthIntegrationTest.testBasics-seed#[DD4AF6DD23C4FA68]) [    ] o.a.s.h.c.HttpShardHandlerFactory created with socketTimeout : 90000,urlScheme : ,connTimeout : 15000,maxConnectionsPerHost : 20,maxConnections : 10000,corePoolSize : 0,maximumPoolSize : 2147483647,maxThreadIdleTime : 5,sizeOfQueue : -1,fairnessPolicy : false,useRetries : false,
   [junit4]   2> 2048478 INFO  (TEST-BasicAuthIntegrationTest.testBasics-seed#[DD4AF6DD23C4FA68]) [    ] o.a.s.u.UpdateShardHandler Creating UpdateShardHandler HTTP client with params: socketTimeout=340000&connTimeout=45000&retry=true
   [junit4]   2> 2048479 INFO  (TEST-BasicAuthIntegrationTest.testBasics-seed#[DD4AF6DD23C4FA68]) [    ] o.a.s.l.LogWatcher SLF4J impl is org.slf4j.impl.Log4jLoggerFactory
   [junit4]   2> 2048479 INFO  (TEST-BasicAuthIntegrationTest.testBasics-seed#[DD4AF6DD23C4FA68]) [    ] o.a.s.l.LogWatcher Registering Log Listener [Log4j (org.slf4j.impl.Log4jLoggerFactory)]
   [junit4]   2> 2048479 INFO  (TEST-BasicAuthIntegrationTest.testBasics-seed#[DD4AF6DD23C4FA68]) [    ] o.a.s.c.ZkContainer Zookeeper client=127.0.0.1:44213/solr
   [junit4]   2> 2048479 INFO  (TEST-BasicAuthIntegrationTest.testBasics-seed#[DD4AF6DD23C4FA68]) [    ] o.a.s.c.ZkController zkHost includes chroot
   [junit4]   2> 2048479 INFO  (TEST-BasicAuthIntegrationTest.testBasics-seed#[DD4AF6DD23C4FA68]) [    ] o.a.s.c.c.SolrZkClient Using default ZkCredentialsProvider
   [junit4]   2> 2048479 INFO  (TEST-BasicAuthIntegrationTest.testBasics-seed#[DD4AF6DD23C4FA68]) [    ] o.a.s.c.c.ConnectionManager Waiting for client to connect to ZooKeeper
   [junit4]   2> 2048507 INFO  (zkCallback-2037-thread-1) [    ] o.a.s.c.c.ConnectionManager Watcher org.apache.solr.common.cloud.ConnectionManager@33809909 name:ZooKeeperConnection Watcher:127.0.0.1:44213 got event WatchedEvent state:SyncConnected type:None path:null path:null type:None
   [junit4]   2> 2048507 INFO  (TEST-BasicAuthIntegrationTest.testBasics-seed#[DD4AF6DD23C4FA68]) [    ] o.a.s.c.c.ConnectionManager Client is connected to ZooKeeper
   [junit4]   2> 2048507 INFO  (TEST-BasicAuthIntegrationTest.testBasics-seed#[DD4AF6DD23C4FA68]) [    ] o.a.s.c.c.SolrZkClient Using default ZkACLProvider
   [junit4]   2> 2048531 INFO  (TEST-BasicAuthIntegrationTest.testBasics-seed#[DD4AF6DD23C4FA68]) [n:127.0.0.1:44317_solr    ] o.a.s.c.ZkController Added new OnReconnect listener org.apache.solr.cloud.ZkController$6@4f41a58f
   [junit4]   2> 2048531 INFO  (TEST-BasicAuthIntegrationTest.testBasics-seed#[DD4AF6DD23C4FA68]) [n:127.0.0.1:44317_solr    ] o.a.s.c.c.ConnectionManager Waiting for client to connect to ZooKeeper
   [junit4]   2> 2048550 INFO  (zkCallback-2038-thread-1-processing-n:127.0.0.1:44317_solr) [n:127.0.0.1:44317_solr    ] o.a.s.c.c.ConnectionManager Watcher org.apache.solr.common.cloud.ConnectionManager@40f6540d name:ZooKeeperConnection Watcher:127.0.0.1:44213/solr got event WatchedEvent state:SyncConnected type:None path:null path:null type:None
   [junit4]   2> 2048550 INFO  (TEST-BasicAuthIntegrationTest.testBasics-seed#[DD4AF6DD23C4FA68]) [n:127.0.0.1:44317_solr    ] o.a.s.c.c.ConnectionManager Client is connected to ZooKeeper
   [junit4]   2> 2048737 INFO  (TEST-BasicAuthIntegrationTest.testBasics-seed#[DD4AF6DD23C4FA68]) [n:127.0.0.1:44317_solr    ] o.a.s.c.c.ZkStateReader Updating cluster state from ZooKeeper... 
   [junit4]   2> 2049739 INFO  (TEST-BasicAuthIntegrationTest.testBasics-seed#[DD4AF6DD23C4FA68]) [n:127.0.0.1:44317_solr    ] o.a.s.c.ZkController Register node as live in ZooKeeper:/live_nodes/127.0.0.1:44317_solr
   [junit4]   2> 2049755 INFO  (TEST-BasicAuthIntegrationTest.testBasics-seed#[DD4AF6DD23C4FA68]) [n:127.0.0.1:44317_solr    ] o.a.s.c.c.SolrZkClient makePath: /live_nodes/127.0.0.1:44317_solr
   [junit4]   2> 2049778 INFO  (zkCallback-2028-thread-2-processing-n:127.0.0.1:43757_solr) [n:127.0.0.1:43757_solr    ] o.a.s.c.c.ZkStateReader A live node change: [WatchedEvent state:SyncConnected type:NodeChildrenChanged path:/live_nodes], has occurred - updating... (live nodes size: [4])
   [junit4]   2> 2049778 INFO  (zkCallback-2030-thread-1-processing-n:127.0.0.1:45209_solr) [n:127.0.0.1:45209_solr    ] o.a.s.c.c.ZkStateReader A live node change: [WatchedEvent state:SyncConnected type:NodeChildrenChanged path:/live_nodes], has occurred - updating... (live nodes size: [4])
   [junit4]   2> 2049778 INFO  (zkCallback-2027-thread-2-processing-n:127.0.0.1:36744_solr) [n:127.0.0.1:36744_solr    ] o.a.s.c.c.ZkStateReader A live node change: [WatchedEvent state:SyncConnected type:NodeChildrenChanged path:/live_nodes], has occurred - updating... (live nodes size: [4])
   [junit4]   2> 2049778 INFO  (zkCallback-2038-thread-1-processing-n:127.0.0.1:44317_solr) [n:127.0.0.1:44317_solr    ] o.a.s.c.c.ZkStateReader A live node change: [WatchedEvent state:SyncConnected type:NodeChildrenChanged path:/live_nodes], has occurred - updating... (live nodes size: [4])
   [junit4]   2> 2049778 INFO  (zkCallback-2029-thread-1-processing-n:127.0.0.1:36108_solr) [n:127.0.0.1:36108_solr    ] o.a.s.c.c.ZkStateReader A live node change: [WatchedEvent state:SyncConnected type:NodeChildrenChanged path:/live_nodes], has occurred - updating... (live nodes size: [4])
   [junit4]   2> 2049779 INFO  (TEST-BasicAuthIntegrationTest.testBasics-seed#[DD4AF6DD23C4FA68]) [n:127.0.0.1:44317_solr    ] o.a.s.c.Overseer Overseer (id=null) closing
   [junit4]   2> 2049818 INFO  (TEST-BasicAuthIntegrationTest.testBasics-seed#[DD4AF6DD23C4FA68]) [n:127.0.0.1:44317_solr    ] o.a.s.c.LeaderElector Joined leadership election with path: /overseer_elect/election/95823656000094227-127.0.0.1:44317_solr-n_0000000005
   [junit4]   2> 2049819 INFO  (TEST-BasicAuthIntegrationTest.testBasics-seed#[DD4AF6DD23C4FA68]) [n:127.0.0.1:44317_solr    ] o.a.s.c.LeaderElector Watching path /overseer_elect/election/95823656000094222-127.0.0.1:45209_solr-n_0000000004 to know if I could be the leader
   [junit4]   2> 2049826 INFO  (TEST-BasicAuthIntegrationTest.testBasics-seed#[DD4AF6DD23C4FA68]) [n:127.0.0.1:44317_solr    ] o.a.s.c.CoreContainer Security conf doesn't exist. Skipping setup for authorization module.
   [junit4]   2> 2049826 INFO  (TEST-BasicAuthIntegrationTest.testBasics-seed#[DD4AF6DD23C4FA68]) [n:127.0.0.1:44317_solr    ] o.a.s.c.CoreContainer No authentication plugin used.
   [junit4]   2> 2049826 INFO  (TEST-BasicAuthIntegrationTest.testBasics-seed#[DD4AF6DD23C4FA68]) [n:127.0.0.1:44317_solr    ] o.a.s.c.CorePropertiesLocator Looking for core definitions underneath /home/jenkins/workspace/Lucene-Solr-5.5-Linux/solr/build/solr-core/test/J2/temp/solr.security.BasicAuthIntegrationTest_DD4AF6DD23C4FA68-001/tempDir-001/node6/.
   [junit4]   2> 2049826 INFO  (TEST-BasicAuthIntegrationTest.testBasics-seed#[DD4AF6DD23C4FA68]) [n:127.0.0.1:44317_solr    ] o.a.s.c.CorePropertiesLocator Found 0 core definitions
   [junit4]   2> 2049827 INFO  (TEST-BasicAuthIntegrationTest.testBasics-seed#[DD4AF6DD23C4FA68]) [n:127.0.0.1:44317_solr    ] o.a.s.s.SolrDispatchFilter user.dir=/home/jenkins/workspace/Lucene-Solr-5.5-Linux/solr/build/solr-core/test/J2
   [junit4]   2> 2049827 INFO  (TEST-BasicAuthIntegrationTest.testBasics-seed#[DD4AF6DD23C4FA68]) [n:127.0.0.1:44317_solr    ] o.a.s.s.SolrDispatchFilter SolrDispatchFilter.init() done
   [junit4]   2> 2049827 INFO  (TEST-BasicAuthIntegrationTest.testBasics-seed#[DD4AF6DD23C4FA68]) [    ] o.a.s.c.c.SolrZkClient Using default ZkCredentialsProvider
   [junit4]   2> 2049828 INFO  (TEST-BasicAuthIntegrationTest.testBasics-seed#[DD4AF6DD23C4FA68]) [    ] o.a.s.c.c.ConnectionManager Waiting for client to connect to ZooKeeper
   [junit4]   2> 2049869 INFO  (zkCallback-2039-thread-1) [    ] o.a.s.c.c.ConnectionManager Watcher org.apache.solr.common.cloud.ConnectionManager@6081ef3 name:ZooKeeperConnection Watcher:127.0.0.1:44213/solr got event WatchedEvent state:SyncConnected type:None path:null path:null type:None
   [junit4]   2> 2049869 INFO  (TEST-BasicAuthIntegrationTest.testBasics-seed#[DD4AF6DD23C4FA68]) [    ] o.a.s.c.c.ConnectionManager Client is connected to ZooKeeper
   [junit4]   2> 2049869 INFO  (TEST-BasicAuthIntegrationTest.testBasics-seed#[DD4AF6DD23C4FA68]) [    ] o.a.s.c.c.SolrZkClient Using default ZkACLProvider
   [junit4]   2> 2049869 INFO  (TEST-BasicAuthIntegrationTest.testBasics-seed#[DD4AF6DD23C4FA68]) [    ] o.a.s.c.c.SolrZkClient makePath: /configs/solrCloudCollectionConfig/protwords.txt
   [junit4]   2> 2050018 INFO  (TEST-BasicAuthIntegrationTest.testBasics-seed#[DD4AF6DD23C4FA68]) [    ] o.a.s.c.c.SolrZkClient makePath: /configs/solrCloudCollectionConfig/solrconfig-delaying-component.xml
   [junit4]   2> 2050063 INFO  (TEST-BasicAuthIntegrationTest.testBasics-seed#[DD4AF6DD23C4FA68]) [    ] o.a.s.c.c.SolrZkClient makePath: /configs/solrCloudCollectionConfig/bad_solrconfig.xml
   [junit4]   2> 2050135 INFO  (TEST-BasicAuthIntegrationTest.testBasics-seed#[DD4AF6DD23C4FA68]) [    ] o.a.s.c.c.SolrZkClient makePath: /configs/solrCloudCollectionConfig/solrconfig-nocache.xml
   [junit4]   2> 2050176 INFO  (TEST-BasicAuthIntegrationTest.testBasics-seed#[DD4AF6DD23C4FA68]) [    ] o.a.s.c.c.SolrZkClient makePath: /configs/solrCloudCollectionConfig/solrconfig-implicitproperties.xml
   [junit4]   2> 2050245 INFO  (TEST-BasicAuthIntegrationTest.testBasics-seed#[DD4AF6DD23C4FA68]) [    ] o.a.s.c.c.SolrZkClient makePath: /configs/solrCloudCollectionConfig/solrconfig-mergepolicy-legacy.xml
   [junit4]   2> 2050290 INFO  (TEST-BasicAuthIntegrationTest.testBasics-seed#[DD4AF6DD23C4FA68]) [    ] o.a.s.c.c.SolrZkClient makePath: /configs/solrCloudCollectionConfig/bad-schema-uniquekey-uses-default.xml
   [junit4]   2> 2050367 INFO  (TEST-BasicAuthIntegrationTest.testBasics-seed#[DD4AF6DD23C4FA68]) [    ] o.a.s.c.c.SolrZkClient makePath: /configs/solrCloudCollectionConfig/bad-schema-sim-default-has-no-explicit-sim.xml
   [junit4]   2> 2050459 INFO  (TEST-BasicAuthIntegrationTest.testBasics-seed#[DD4AF6DD23C4FA68]) [    ] o.a.s.c.c.SolrZkClient makePath: /configs/solrCloudCollectionConfig/bad-schema-uniquekey-multivalued.xml
   [junit4]   2> 2050512 INFO  (TEST-BasicAuthIntegrationTest.testBasics-seed#[DD4AF6DD23C4FA68]) [    ] o.a.s.c.c.SolrZkClient makePath: /configs/solrCloudCollectionConfig/analyzingInfixSuggest.txt
   [junit4]   2> 2050577 INFO  (TEST-BasicAuthIntegrationTest.testBasics-seed#[DD4AF6DD23C4FA68]) [    ] o.a.s.c.c.SolrZkClient makePath: /configs/solrCloudCollectionConfig/missleading.extension.updateprocessor.js.txt
   [junit4]   2> 2050616 INFO  (TEST-BasicAuthIntegrationTest.testBasics-seed#[DD4AF6DD23C4FA68]) [    ] o.a.s.c.c.SolrZkClient makePath: /configs/solrCloudCollectionConfig/bad-schema-multiple-asterisk-copyfield-source-should-fail-test.xml
   [junit4]   2> 2050714 INFO  (TEST-BasicAuthIntegrationTest.testBasics-seed#[DD4AF6DD23C4FA68]) [    ] o.a.s.c.c.SolrZkClient makePath: /configs/solrCloudCollectionConfig/schema-replication2.xml
   [junit4]   2> 2050989 INFO  (TEST-BasicAuthIntegrationTest.testBasics-seed#[DD4AF6DD23C4FA68]) [    ] o.a.s.c.c.SolrZkClient makePath: /configs/solrCloudCollectionConfig/solrconfig-infostream-logging.xml
   [junit4]   2> 2051078 INFO  (TEST-BasicAuthIntegrationTest.testBasics-seed#[DD4AF6DD23C4FA68]) [    ] o.a.s.c.c.SolrZkClient makePath: /configs/solrCloudCollectionConfig/solrconfig-collapseqparser.xml
   [junit4]   2> 2051141 INFO  (TEST-BasicAuthIntegrationTest.testBasics-seed#[DD4AF6DD23C4FA68]) [    ] o.a.s.c.c.SolrZkClient makePath: /configs/solrCloudCollectionConfig/bad-schema-currency-ft-bogus-code-in-xml.xml
   [junit4]   2> 2051201 INFO  (TEST-BasicAuthIntegrationTest.testBasics-seed#[DD4AF6DD23C4FA68]) [    ] o.a.s.c.c.SolrZkClient makePath: /configs/solrCloudCollectionConfig/old_synonyms.txt
   [junit4]   2> 2051240 INFO  (TEST-BasicAuthIntegrationTest.testBasics-seed#[DD4AF6DD23C4FA68]) [    ] o.a.s.c.c.SolrZkClient makePath: /configs/solrCloudCollectionConfig/enumsConfig.xml
   [junit4]   2> 2051314 INFO  (TEST-BasicAuthIntegrationTest.testBasics-seed#[DD4AF6DD23C4FA68]) [    ] o.a.s.c.c.SolrZkClient makePath: /configs/solrCloudCollectionConfig/solrconfig-script-updateprocessor.xml
   [junit4]   2> 2051387 INFO  (TEST-BasicAuthIntegrationTest.testBasics-seed#[DD4AF6DD23C4FA68]) [    ] o.a.s.c.c.SolrZkClient makePath: /configs/solrCloudCollectionConfig/schema-add-schema-fields-update-processor.xml
   [junit4]   2> 2051420 INFO  (TEST-BasicAuthIntegrationTest.testBasics-seed#[DD4AF6DD23C4FA68]) [    ] o.a.s.c.c.SolrZkClient makePath: /configs/solrCloudCollectionConfig/solrconfig-mergepolicyfactory-nocfs.xml
   [junit4]   2> 2051462 INFO  (TEST-BasicAuthIntegrationTest.testBasics-seed#[DD4AF6DD23C4FA68]) [    ] o.a.s.c.c.SolrZkClient makePath: /configs/solrCloudCollectionConfig/bad-schema-sweetspot-both-tf.xml
   [junit4]   2> 2051534 INFO  (TEST-BasicAuthIntegrationTest.testBasics-seed#[DD4AF6DD23C4FA68]) [    ] o.a.s.c.c.SolrZkClient makePath: /configs/solrCloudCollectionConfig/schema-phrasesuggest.xml
   [junit4]   2> 2051563 INFO  (TEST-BasicAuthIntegrationTest.testBasics-seed#[DD4AF6DD23C4FA68]) [    ] o.a.s.c.c.SolrZkClient makePath: /configs/solrCloudCollectionConfig/solrconfig.xml
   [junit4]   2> 2051611 INFO  (TEST-BasicAuthIntegrationTest.testBasics-seed#[DD4AF6DD23C4FA68]) [    ] o.a.s.c.c.SolrZkClient makePath: /configs/solrCloudCollectionConfig/solrconfig-delpolicy1.xml
   [junit4]   2> 2051634 INFO  (TEST-BasicAuthIntegrationTest.testBasics-seed#[DD4AF6DD23C4FA68]) [    ] o.a.s.c.c.SolrZkClient makePath: /configs/solrCloudCollectionConfig/schema-sim.xml
   [junit4]   2> 2051705 INFO  (TEST-BasicAuthIntegrationTest.testBasics-seed#[DD4AF6DD23C4FA68]) [    ] o.a.s.c.c.SolrZkClient makePath: /configs/solrCloudCollectionConfig/schema15.xml
   [junit4]   2> 2051750 INFO  (TEST-BasicAuthIntegrationTest.testBasics-seed#[DD4AF6DD23C4FA68]) [    ] o.a.s.c.c.SolrZkClient makePath: /configs/solrCloudCollectionConfig/bad-schema-misplaced-asterisk-copyfield-source-should-fail-test.xml
   [junit4]   2> 2051769 INFO  (TEST-BasicAuthIntegrationTest.testBasics-seed#[DD4AF6DD23C4FA68]) [    ] o.a.s.c.c.SolrZkClient makePath: /configs/solrCloudCollectionConfig/stemdict.txt
   [junit4]   2> 2051829 INFO  (TEST-BasicAuthIntegrationTest.testBasics-seed#[DD4AF6DD23C4FA68]) [    ] o.a.s.c.c.SolrZkClient makePath: /configs/solrCloudCollectionConfig/hunspell-test.aff
   [junit4]   2> 2051852 INFO  (TEST-BasicAuthIntegrationTest.testBasics-seed#[DD4AF6DD23C4FA68]) [    ] o.a.s.c.c.SolrZkClient makePath: /configs/solrCloudCollectionConfig/solrconfig-spatial.xml
   [junit4]   2> 2051870 INFO  (TEST-BasicAuthIntegrationTest.testBasics-seed#[DD4AF6DD23C4FA68]) [    ] o.a.s.c.c.SolrZkClient makePath: /configs/solrCloudCollectionConfig/solrconfig-slave1.xml
   [junit4]   2> 2051909 INFO  (TEST-BasicAuthIntegrationTest.testBasics-seed#[DD4AF6DD23C4FA68]) [    ] o.a.s.c.c.SolrZkClient makePath: /configs/solrCloudCollectionConfig/bad-schema-dup-fieldType.xml
   [junit4]   2> 2051920 INFO  (TEST-BasicAuthIntegrationTest.testBasics-seed#[DD4AF6DD23C4FA68]) [    ] o.a.s.c.c.SolrZkClient makePath: /configs/solrCloudCollectionConfig/bad-schema-external-filefield.xml
   [junit4]   2> 2051942 INFO  (TEST-BasicAuthIntegrationTest.testBasics-seed#[DD4AF6DD23C4FA68]) [    ] o.a.s.c.c.SolrZkClient makePath: /configs/solrCloudCollectionConfig/solrconfig-query-parser-init.xml
   [junit4]   2> 2051997 INFO  (TEST-BasicAuthIntegrationTest.testBasics-seed#[DD4AF6DD23C4FA68]) [    ] o.a.s.c.c.SolrZkClient makePath: /configs/solrCloudCollectionConfig/schema-complex-phrase.xml
   [junit4]   2> 2052014 INFO  (TEST-BasicAuthIntegrationTest.testBasics-seed#[DD4AF6DD23C4FA68]) [    ] o.a.s.c.c.SolrZkClient makePath: /configs/solrCloudCollectionConfig/conditional.updateprocessor.js
   [junit4]   2> 2052032 INFO  (TEST-BasicAuthIntegrationTest.testBasics-seed#[DD4AF6DD23C4FA68]) [    ] o.a.s.c.c.SolrZkClient makePath: /configs/solrCloudCollectionConfig/bad-schema-analyzer-class-and-nested.xml
   [junit4]   2> 2052061 INFO  (TEST-BasicAuthIntegrationTest.testBasics-seed#[DD4AF6DD23C4FA68]) [    ] o.a.s.c.c.SolrZkClient makePath: /configs/solrCloudCollectionConfig/schema-eff.xml
   [junit4]   2> 2052081 INFO  (TEST-BasicAuthIntegrationTest.testBasics-seed#[DD4AF6DD23C4FA68]) [    ] o.a.s.c.c.SolrZkClient makePath: /configs/solrCloudCollectionConfig/schema-folding.xml
   [junit4]   2> 2052147 INFO  (TEST-BasicAuthIntegrationTest.testBasics-seed#[DD4AF6DD23C4FA68]) [    ] o.a.s.c.c.SolrZkClient makePath: /configs/solrCloudCollectionConfig/solrconfig-tieredmergepolicyfactory.xml
   [junit4]   2> 2052211 INFO  (TEST-BasicAuthIntegrationTest.testBasics-seed#[DD4AF6DD23C4FA68]) [    ] o.a.s.c.c.SolrZkClient makePath: /configs/solrCloudCollectionConfig/schema-simpleqpplugin.xml
   [junit4]   2> 2052244 INFO  (TEST-BasicAuthIntegrationTest.testBasics-seed#[DD4AF6DD23C4FA68]) [    ] o.a.s.c.c.SolrZkClient makePath: /configs/solrCloudCollectionConfig/solrconfig-hash.xml
   [junit4]   2> 2052293 INFO  (TEST-BasicAuthIntegrationTest.testBasics-seed#[DD4AF6DD23C4FA68]) [    ] o.a.s.c.c.SolrZkClient makePath: /configs/solrCloudCollectionConfig/stopwords.txt
   [junit4]   2> 2052314 INFO  (TEST-BasicAuthIntegrationTest.testBasics-seed#[DD4AF6DD23C4FA68]) [    ] o.a.s.c.c.SolrZkClient makePath: /configs/solrCloudCollectionConfig/bad-schema-dynamicfield-required.xml
   [junit4]   2> 2052334 INFO  (TEST-BasicAuthIntegrationTest.testBasics-seed#[DD4AF6DD23C4FA68]) [    ] o.a.s.c.c.SolrZkClient makePath: /configs/solrCloudCollectionConfig/solrconfig-mergepolicy-nocfs.xml
   [junit4]   2> 2052356 INFO  (TEST-BasicAuthIntegrationTest.testBasics-seed#[DD4AF6DD23C4FA68]) [    ] o.a.s.c.c.SolrZkClient makePath: /configs/solrCloudCollectionConfig/bad-solrconfig-bogus-scriptengine-name.xml
   [junit4]   2> 2052380 INFO  (TEST-BasicAuthIntegrationTest.testBasics-seed#[DD4AF6DD23C4FA68]) [    ] o.a.s.c.c.SolrZkClient makePath: /configs/solrCloudCollectionConfig/throw.error.on.add.updateprocessor.js
   [junit4]   2> 2052390 INFO  (TEST-BasicAuthIntegrationTest.testBasics-seed#[DD4AF6DD23C4FA68]) [    ] o.a.s.c.c.SolrZkClient makePath: /configs/solrCloudCollectionConfig/solrconfig-minimal.xml
   [junit4]   2> 2052438 INFO  (TEST-BasicAuthIntegrationTest.testBasics-seed#[DD4AF6DD23C4FA68]) [    ] o.a.s.c.c.SolrZkClient makePath: /configs/solrCloudCollectionConfig/solrconfig-defaults.xml
   [junit4]   2> 2052442 INFO  (TEST-BasicAuthIntegrationTest.testBasics-seed#[DD4AF6DD23C4FA68]) [    ] o.a.s.c.c.SolrZkClient makePath: /configs/solrCloudCollectionConfig/blendedInfixSuggest.txt
   [junit4]   2> 2052465 INFO  (TEST-BasicAuthIntegrationTest.testBasics-seed#[DD4AF6DD23C4FA68]) [    ] o.a.s.c.c.SolrZkClient makePath: /configs/solrCloudCollectionConfig/solrconfig-postingshighlight.xml
   [junit4]   2> 2052494 INFO  (TEST-BasicAuthIntegrationTest.testBasics-seed#[DD4AF6DD23C4FA68]) [    ] o.a.s.c.c.SolrZkClient makePath: /configs/solrCloudCollectionConfig/schema-docValuesJoin.xml
   [junit4]   2> 2052536 INFO  (TEST-BasicAuthIntegrationTest.testBasics-seed#[DD4AF6DD23C4FA68]) [    ] o.a.s.c.c.SolrZkClient makePath: /configs/solrCloudCollectionConfig/schema-docValues.xml
   [junit4]   2> 2052575 INFO  (TEST-BasicAuthIntegrationTest.testBasics-seed#[DD4AF6DD23C4FA68]) [    ] o.a.s.c.c.SolrZkClient makePath: /configs/solrCloudCollectionConfig/bad-schema-misplaced-asterisk-copyfield-dest-should-fail-test.xml
   [junit4]   2> 2052628 INFO  (TEST-BasicAuthIntegrationTest.testBasics-seed#[DD4AF6DD23C4FA68]) [    ] o.a.s.c.c.SolrZkClient makePath: /configs/solrCloudCollectionConfig/schema-snippet-types.incl
   [junit4]   2> 2052637 INFO  (TEST-BasicAuthIntegrationTest.testBasics-seed#[DD4AF6DD23C4FA68]) [    ] o.a.s.c.c.SolrZkClient makePath: /configs/solrCloudCollectionConfig/schema-minimal.xml
   [junit4]   2> 2052661 INFO  (TEST-BasicAuthIntegrationTest.testBasics-seed#[DD4AF6DD23C4FA68]) [    ] o.a.s.c.c.SolrZkClient makePath: /configs/solrCloudCollectionConfig/solrconfig.snippet.randomindexconfig.xml
   [junit4]   2> 2052682 INFO  (TEST-BasicAuthIntegrationTest.testBasics-seed#[DD4AF6DD23C4FA68]) [    ] o.a.s.c.c.SolrZkClient makePath: /configs/solrCloudCollectionConfig/schema-collate.xml
   [junit4]   2> 2052735 INFO  (TEST-BasicAuthIntegrationTest.testBasics-seed#[DD4AF6DD23C4FA68]) [    ] o.a.s.c.c.SolrZkClient makePath: /configs/solrCloudCollectionConfig/schema-rest.xml
   [junit4]   2> 2052773 INFO  (TEST-BasicAuthIntegrationTest.testBasics-seed#[DD4AF6DD23C4FA68]) [    ] o.a.s.c.c.SolrZkClient makePath: /configs/solrCloudCollectionConfig/bad-schema-codec-global-vs-ft-mismatch.xml
   [junit4]   2> 2052824 INFO  (TEST-BasicAuthIntegrationTest.testBasics-seed#[DD4AF6DD23C4FA68]) [    ] o.a.s.c.c.SolrZkClient makePath: /configs/solrCloudCollectionConfig/bad-schema-not-indexed-but-norms.xml
   [junit4]   2> 2052843 INFO  (TEST-BasicAuthIntegrationTest.testBasics-seed#[DD4AF6DD23C4FA68]) [    ] o.a.s.c.c.SolrZkClient makePath: /configs/solrCloudCollectionConfig/phrasesuggest.txt
   [junit4]   2> 2052866 INFO  (TEST-BasicAuthIntegrationTest.testBasics-seed#[DD4AF6DD23C4FA68]) [    ] o.a.s.c.c.SolrZkClient makePath: /configs/solrCloudCollectionConfig/stopwordsWrongEncoding.txt
   [junit4]   2> 2052880 INFO  (TEST-BasicAuthIntegrationTest.testBasics-seed#[DD4AF6DD23C4FA68]) [    ] o.a.s.c.c.SolrZkClient makePath: /configs/solrCloudCollectionConfig/solrconfig-logmergepolicy.xml
   [junit4]   2> 2052894 INFO  (TEST-BasicAuthIntegrationTest.testBasics-seed#[DD4AF6DD23C4FA68]) [    ] o.a.s.c.c.SolrZkClient makePath: /configs/solrCloudCollectionConfig/solrconfig-plugcollector.xml
   [junit4]   2> 2053005 INFO  (TEST-BasicAuthIntegrationTest.testBasics-seed#[DD4AF6DD23C4FA68]) [    ] o.a.s.c.c.SolrZkClient makePath: /configs/solrCloudCollectionConfig/solrconfig-noopregen.xml
   [junit4]   2> 2053110 INFO  (TEST-BasicAuthIntegrationTest.testBasics-seed#[DD4AF6DD23C4FA68]) [    ] o.a.s.c.c.SolrZkClient makePath: /configs/solrCloudCollectionConfig/solrconfig-analytics-query.xml
   [junit4]   2> 2053203 INFO  (TEST-BasicAuthIntegrationTest.testBasics-seed#[DD4AF6DD23C4FA68]) [    ] o.a.s.c.c.SolrZkClient makePath: /con

[...truncated too long message...]

.ZooKeeper.exists(ZooKeeper.java:1040)
   [junit4]   2> 	at org.apache.solr.common.cloud.SolrZkClient$5.execute(SolrZkClient.java:311)
   [junit4]   2> 	at org.apache.solr.common.cloud.SolrZkClient$5.execute(SolrZkClient.java:308)
   [junit4]   2> 	at org.apache.solr.common.cloud.ZkCmdExecutor.retryOperation(ZkCmdExecutor.java:60)
   [junit4]   2> 	at org.apache.solr.common.cloud.SolrZkClient.exists(SolrZkClient.java:308)
   [junit4]   2> 	at org.apache.solr.common.cloud.ZkStateReader.getClusterProps(ZkStateReader.java:713)
   [junit4]   2> 	... 3 more
   [junit4]   2> 
   [junit4]   2> NOTE: All tests run in this JVM: [CoreAdminHandlerTest, TestCharFilters, TestWriterPerf, TestFieldCollectionResource, FieldMutatingUpdateProcessorTest, DistributedFacetPivotLargeTest, RegexBoostProcessorTest, TestSha256AuthenticationProvider, TestInfoStreamLogging, SortSpecParsingTest, DeleteReplicaTest, SolrXmlInZkTest, TestSolrDeletionPolicy1, WrapperMergePolicyFactoryTest, BinaryUpdateRequestHandlerTest, TestManagedSchemaAPI, SliceStateTest, TestUseDocValuesAsStored2, HdfsChaosMonkeySafeLeaderTest, RequestHandlersTest, TestFreeTextSuggestions, SaslZkACLProviderTest, CollectionReloadTest, BadComponentTest, SharedFSAutoReplicaFailoverUtilsTest, SearchHandlerTest, TestElisionMultitermQuery, HdfsSyncSliceTest, OverseerRolesTest, ExitableDirectoryReaderTest, TestZkChroot, SimpleFacetsTest, TestExclusionRuleCollectionAccess, TestRequestStatusCollectionAPI, AtomicUpdatesTest, TestTrackingShardHandlerFactory, TestIndexingPerformance, ShowFileRequestHandlerTest, TestCollapseQParserPlugin, TermVectorComponentDistributedTest, FieldAnalysisRequestHandlerTest, TestRebalanceLeaders, DocValuesMissingTest, TestChildDocTransformer, TestConfigSets, TestSweetSpotSimilarityFactory, CursorMarkTest, TestPostingsSolrHighlighter, TestAnalyzeInfixSuggestions, TestSolrIndexConfig, AutoCommitTest, ClusterStateTest, TestObjectReleaseTracker, TestTrieFacet, QueryParsingTest, PluginInfoTest, CustomCollectionTest, TestReRankQParserPlugin, TestMinMaxOnMultiValuedField, TestManagedSchemaFieldTypeResource, SegmentsInfoRequestHandlerTest, TestPHPSerializedResponseWriter, TestJmxIntegration, AssignTest, SuggesterWFSTTest, TestBulkSchemaAPI, TestPerFieldSimilarityWithDefaultOverride, HttpPartitionTest, BlockJoinFacetSimpleTest, SuggesterTest, TestBulkSchemaConcurrent, DirectUpdateHandlerOptimizeTest, CollectionsAPIAsyncDistributedZkTest, PrimitiveFieldTypeTest, TestDefaultSearchFieldResource, TestTestInjection, DocValuesMultiTest, TestJsonRequest, BasicDistributedZk2Test, TestCollationField, TestLRUStatsCache, ConfigSetsAPITest, DirectSolrConnectionTest, DistribCursorPagingTest, TestCloudSchemaless, BadIndexSchemaTest, SolrTestCaseJ4Test, TestStressReorder, TestReversedWildcardFilterFactory, RulesTest, LeaderElectionTest, TestMaxScoreQueryParser, ClusterStateUpdateTest, ZkCLITest, TestFaceting, TestRecovery, HardAutoCommitTest, TestRangeQuery, TestCoreContainer, TestSolr4Spatial, TestGroupingSearch, ConvertedLegacyTest, TestSort, TestFiltering, CurrencyFieldOpenExchangeTest, CurrencyFieldXmlFileTest, SolrIndexSplitterTest, SimplePostToolTest, SignatureUpdateProcessorFactoryTest, TestExtendedDismaxParser, SuggesterFSTTest, SolrRequestParserTest, DocValuesTest, HighlighterConfigTest, UpdateParamsTest, CopyFieldTest, SolrIndexConfigTest, TestStressRecovery, NotRequiredUniqueKeyTest, SpellPossibilityIteratorTest, TestXIncludeConfig, EchoParamsTest, TestDFRSimilarityFactory, TestIBSimilarityFactory, TestJmxMonitoredMap, URLClassifyProcessorTest, TestSuggestSpellingConverter, TestSolrJ, TestLRUCache, TestUtils, ZkNodePropsTest, UUIDFieldTest, FileUtilsTest, CircularListTest, DistributedMLTComponentTest, DistributedIntervalFacetingTest, CleanupOldIndexTest, CollectionStateFormat2Test, DeleteInactiveReplicaTest, DeleteShardTest, DistribJoinFromCollectionTest, DistributedVersionInfoTest, LeaderInitiatedRecoveryOnCommitTest, MultiThreadedOCPTest, ReplicationFactorTest, RestartWhileUpdatingTest, SimpleCollectionCreateDeleteTest, TestCloudInspectUtil, TestConfigSetsAPI, TestCryptoKeys, TestReplicaProperties, TestSolrCloudWithKerberosAlt, VMParamsZkACLAndCredentialsProvidersTest, HdfsBasicDistributedZkTest, HdfsNNFailoverTest, HdfsWriteToMultipleCollectionsTest, ZkStateWriterTest, TestConfigSetProperties, TestShardHandlerFactory, TestSolrDynamicMBean, TestBlobHandler, CoreAdminCreateDiscoverTest, CoreMergeIndexesAdminHandlerTest, InfoHandlerTest, DistributedDebugComponentTest, DistributedFacetPivotLongTailTest, DistributedFacetPivotSmallAdvancedTest, DistributedQueryComponentOptimizationTest, TestDistributedStatsComponentCardinality, TestAddFieldRealTimeGet, TestComplexPhraseQParserPlugin, TestOverriddenPrefixQueryForCustomFieldType, TestRandomCollapseQParserPlugin, TestExactSharedStatsCache, BasicAuthIntegrationTest]
   [junit4]   2> 9266458 ERROR (OverseerHdfsCoreFailoverThread-95823656000094221-127.0.0.1:43757_solr-n_0000000000) [n:127.0.0.1:43757_solr    ] o.a.s.c.OverseerAutoReplicaFailoverThread OverseerAutoReplicaFailoverThread had an error in its thread work loop.:org.apache.solr.common.SolrException: Thread interrupted. Error reading cluster properties
   [junit4]   2> 	at org.apache.solr.common.cloud.ZkStateReader.getClusterProps(ZkStateReader.java:720)
   [junit4]   2> 	at org.apache.solr.cloud.OverseerAutoReplicaFailoverThread.doWork(OverseerAutoReplicaFailoverThread.java:152)
   [junit4]   2> 	at org.apache.solr.cloud.OverseerAutoReplicaFailoverThread.run(OverseerAutoReplicaFailoverThread.java:131)
   [junit4]   2> 	at java.lang.Thread.run(Thread.java:745)
   [junit4]   2> Caused by: java.lang.InterruptedException
   [junit4]   2> 	at java.lang.Object.wait(Native Method)
   [junit4]   2> 	at java.lang.Object.wait(Object.java:503)
   [junit4]   2> 	at org.apache.zookeeper.ClientCnxn.submitRequest(ClientCnxn.java:1342)
   [junit4]   2> 	at org.apache.zookeeper.ZooKeeper.exists(ZooKeeper.java:1040)
   [junit4]   2> 	at org.apache.solr.common.cloud.SolrZkClient$5.execute(SolrZkClient.java:311)
   [junit4]   2> 	at org.apache.solr.common.cloud.SolrZkClient$5.execute(SolrZkClient.java:308)
   [junit4]   2> 	at org.apache.solr.common.cloud.ZkCmdExecutor.retryOperation(ZkCmdExecutor.java:60)
   [junit4]   2> 	at org.apache.solr.common.cloud.SolrZkClient.exists(SolrZkClient.java:308)
   [junit4]   2> 	at org.apache.solr.common.cloud.ZkStateReader.getClusterProps(ZkStateReader.java:713)
   [junit4]   2> 	... 3 more
   [junit4]   2> 
   [junit4]   2> NOTE: reproduce with: ant test  -Dtestcase=BasicAuthIntegrationTest -Dtests.seed=DD4AF6DD23C4FA68 -Dtests.multiplier=3 -Dtests.slow=true -Dtests.locale=be -Dtests.timezone=Canada/East-Saskatchewan -Dtests.asserts=true -Dtests.file.encoding=US-ASCII
   [junit4]   2> 9266458 ERROR (OverseerHdfsCoreFailoverThread-95823656000094221-127.0.0.1:43757_solr-n_0000000000) [n:127.0.0.1:43757_solr    ] o.a.s.c.OverseerAutoReplicaFailoverThread OverseerAutoReplicaFailoverThread had an error in its thread work loop.:org.apache.solr.common.SolrException: Thread interrupted. Error reading cluster properties
   [junit4]   2> 	at org.apache.solr.common.cloud.ZkStateReader.getClusterProps(ZkStateReader.java:720)
   [junit4]   2> 	at org.apache.solr.cloud.OverseerAutoReplicaFailoverThread.doWork(OverseerAutoReplicaFailoverThread.java:152)
   [junit4]   2> 	at org.apache.solr.cloud.OverseerAutoReplicaFailoverThread.run(OverseerAutoReplicaFailoverThread.java:131)
   [junit4]   2> 	at java.lang.Thread.run(Thread.java:745)
   [junit4]   2> Caused by: java.lang.InterruptedException
   [junit4]   2> 	at java.lang.Object.wait(Native Method)
   [junit4]   2> 	at java.lang.Object.wait(Object.java:503)
   [junit4]   2> 	at org.apache.zookeeper.ClientCnxn.submitRequest(ClientCnxn.java:1342)
   [junit4]   2> 	at org.apache.zookeeper.ZooKeeper.exists(ZooKeeper.java:1040)
   [junit4]   2> 	at org.apache.solr.common.cloud.SolrZkClient$5.execute(SolrZkClient.java:311)
   [junit4]   2> 	at org.apache.solr.common.cloud.SolrZkClient$5.execute(SolrZkClient.java:308)
   [junit4]   2> 	at org.apache.solr.common.cloud.ZkCmdExecutor.retryOperation(ZkCmdExecutor.java:60)
   [junit4]   2> 	at org.apache.solr.common.cloud.SolrZkClient.exists(SolrZkClient.java:308)
   [junit4]   2> 	at org.apache.solr.common.cloud.ZkStateReader.getClusterProps(ZkStateReader.java:713)
   [junit4]   2> 	... 3 more
   [junit4]   2> 
   [junit4] ERROR   0.00s J2 | BasicAuthIntegrationTest (suite) <<<
   [junit4]    > Throwable #1: java.lang.Exception: Suite timeout exceeded (>= 7200000 msec).
   [junit4]    > 	at __randomizedtesting.SeedInfo.seed([DD4AF6DD23C4FA68]:0)
   [junit4] Completed [572/572 (1!)] on J2 in 7223.62s, 1 test, 2 errors <<< FAILURES!

[...truncated 12 lines...]
BUILD FAILED
/home/jenkins/workspace/Lucene-Solr-5.5-Linux/build.xml:750: The following error occurred while executing this line:
/home/jenkins/workspace/Lucene-Solr-5.5-Linux/build.xml:694: The following error occurred while executing this line:
/home/jenkins/workspace/Lucene-Solr-5.5-Linux/build.xml:59: The following error occurred while executing this line:
/home/jenkins/workspace/Lucene-Solr-5.5-Linux/solr/build.xml:233: The following error occurred while executing this line:
/home/jenkins/workspace/Lucene-Solr-5.5-Linux/solr/common-build.xml:534: The following error occurred while executing this line:
/home/jenkins/workspace/Lucene-Solr-5.5-Linux/lucene/common-build.xml:1477: The following error occurred while executing this line:
/home/jenkins/workspace/Lucene-Solr-5.5-Linux/lucene/common-build.xml:1033: There were test failures: 572 suites (7 ignored), 2293 tests, 1 suite-level error, 1 error, 84 ignored (39 assumptions) [seed: DD4AF6DD23C4FA68]

Total time: 177 minutes 14 seconds
Build step 'Invoke Ant' marked build as failure
Archiving artifacts
[WARNINGS] Skipping publisher since build result is FAILURE
Recording test results
Email was triggered for: Failure - Any
Sending email for trigger: Failure - Any



Mime
View raw message