lucene-dev mailing list archives

Site index · List index
Message view « Date » · « Thread »
Top « Date » · « Thread »
From Policeman Jenkins Server <jenk...@thetaphi.de>
Subject [JENKINS-EA] Lucene-Solr-master-Linux (32bit/jdk-9-ea+116) - Build # 16755 - Still Failing!
Date Mon, 16 May 2016 02:41:38 GMT
Build: http://jenkins.thetaphi.de/job/Lucene-Solr-master-Linux/16755/
Java: 32bit/jdk-9-ea+116 -client -XX:+UseConcMarkSweepGC

1 tests failed.
FAILED:  org.apache.solr.handler.TestReqParamsAPI.test

Error Message:
Could not get expected value  'f' for path 'params/fixed' full output: {   "responseHeader":{     "status":0,     "QTime":0},   "params":{     "add":"second",     "a":"A val",     "fixed":"changeit",     "b":"B val",     "wt":"json"},   "context":{     "webapp":"",     "path":"/dump1",     "httpMethod":"GET"}},  from server:  http://127.0.0.1:39709/collection1

Stack Trace:
java.lang.AssertionError: Could not get expected value  'f' for path 'params/fixed' full output: {
  "responseHeader":{
    "status":0,
    "QTime":0},
  "params":{
    "add":"second",
    "a":"A val",
    "fixed":"changeit",
    "b":"B val",
    "wt":"json"},
  "context":{
    "webapp":"",
    "path":"/dump1",
    "httpMethod":"GET"}},  from server:  http://127.0.0.1:39709/collection1
	at __randomizedtesting.SeedInfo.seed([450C2F11B0BE0E92:CD5810CB1E42636A]:0)
	at org.junit.Assert.fail(Assert.java:93)
	at org.junit.Assert.assertTrue(Assert.java:43)
	at org.apache.solr.core.TestSolrConfigHandler.testForResponseElement(TestSolrConfigHandler.java:457)
	at org.apache.solr.handler.TestReqParamsAPI.testReqParams(TestReqParamsAPI.java:242)
	at org.apache.solr.handler.TestReqParamsAPI.test(TestReqParamsAPI.java:62)
	at jdk.internal.reflect.NativeMethodAccessorImpl.invoke0(java.base@9-ea/Native Method)
	at jdk.internal.reflect.NativeMethodAccessorImpl.invoke(java.base@9-ea/NativeMethodAccessorImpl.java:62)
	at jdk.internal.reflect.DelegatingMethodAccessorImpl.invoke(java.base@9-ea/DelegatingMethodAccessorImpl.java:43)
	at java.lang.reflect.Method.invoke(java.base@9-ea/Method.java:531)
	at com.carrotsearch.randomizedtesting.RandomizedRunner.invoke(RandomizedRunner.java:1764)
	at com.carrotsearch.randomizedtesting.RandomizedRunner$8.evaluate(RandomizedRunner.java:871)
	at com.carrotsearch.randomizedtesting.RandomizedRunner$9.evaluate(RandomizedRunner.java:907)
	at com.carrotsearch.randomizedtesting.RandomizedRunner$10.evaluate(RandomizedRunner.java:921)
	at org.apache.solr.BaseDistributedSearchTestCase$ShardsRepeatRule$ShardsFixedStatement.callStatement(BaseDistributedSearchTestCase.java:985)
	at org.apache.solr.BaseDistributedSearchTestCase$ShardsRepeatRule$ShardsStatement.evaluate(BaseDistributedSearchTestCase.java:960)
	at com.carrotsearch.randomizedtesting.rules.SystemPropertiesRestoreRule$1.evaluate(SystemPropertiesRestoreRule.java:57)
	at org.apache.lucene.util.TestRuleSetupTeardownChained$1.evaluate(TestRuleSetupTeardownChained.java:49)
	at org.apache.lucene.util.AbstractBeforeAfterRule$1.evaluate(AbstractBeforeAfterRule.java:45)
	at org.apache.lucene.util.TestRuleThreadAndTestName$1.evaluate(TestRuleThreadAndTestName.java:48)
	at org.apache.lucene.util.TestRuleIgnoreAfterMaxFailures$1.evaluate(TestRuleIgnoreAfterMaxFailures.java:64)
	at org.apache.lucene.util.TestRuleMarkFailure$1.evaluate(TestRuleMarkFailure.java:47)
	at com.carrotsearch.randomizedtesting.rules.StatementAdapter.evaluate(StatementAdapter.java:36)
	at com.carrotsearch.randomizedtesting.ThreadLeakControl$StatementRunner.run(ThreadLeakControl.java:367)
	at com.carrotsearch.randomizedtesting.ThreadLeakControl.forkTimeoutingTask(ThreadLeakControl.java:809)
	at com.carrotsearch.randomizedtesting.ThreadLeakControl$3.evaluate(ThreadLeakControl.java:460)
	at com.carrotsearch.randomizedtesting.RandomizedRunner.runSingleTest(RandomizedRunner.java:880)
	at com.carrotsearch.randomizedtesting.RandomizedRunner$5.evaluate(RandomizedRunner.java:781)
	at com.carrotsearch.randomizedtesting.RandomizedRunner$6.evaluate(RandomizedRunner.java:816)
	at com.carrotsearch.randomizedtesting.RandomizedRunner$7.evaluate(RandomizedRunner.java:827)
	at com.carrotsearch.randomizedtesting.rules.StatementAdapter.evaluate(StatementAdapter.java:36)
	at com.carrotsearch.randomizedtesting.rules.SystemPropertiesRestoreRule$1.evaluate(SystemPropertiesRestoreRule.java:57)
	at org.apache.lucene.util.AbstractBeforeAfterRule$1.evaluate(AbstractBeforeAfterRule.java:45)
	at com.carrotsearch.randomizedtesting.rules.StatementAdapter.evaluate(StatementAdapter.java:36)
	at org.apache.lucene.util.TestRuleStoreClassName$1.evaluate(TestRuleStoreClassName.java:41)
	at com.carrotsearch.randomizedtesting.rules.NoShadowingOrOverridesOnMethodsRule$1.evaluate(NoShadowingOrOverridesOnMethodsRule.java:40)
	at com.carrotsearch.randomizedtesting.rules.NoShadowingOrOverridesOnMethodsRule$1.evaluate(NoShadowingOrOverridesOnMethodsRule.java:40)
	at com.carrotsearch.randomizedtesting.rules.StatementAdapter.evaluate(StatementAdapter.java:36)
	at com.carrotsearch.randomizedtesting.rules.StatementAdapter.evaluate(StatementAdapter.java:36)
	at com.carrotsearch.randomizedtesting.rules.StatementAdapter.evaluate(StatementAdapter.java:36)
	at org.apache.lucene.util.TestRuleAssertionsRequired$1.evaluate(TestRuleAssertionsRequired.java:53)
	at org.apache.lucene.util.TestRuleMarkFailure$1.evaluate(TestRuleMarkFailure.java:47)
	at org.apache.lucene.util.TestRuleIgnoreAfterMaxFailures$1.evaluate(TestRuleIgnoreAfterMaxFailures.java:64)
	at org.apache.lucene.util.TestRuleIgnoreTestSuites$1.evaluate(TestRuleIgnoreTestSuites.java:54)
	at com.carrotsearch.randomizedtesting.rules.StatementAdapter.evaluate(StatementAdapter.java:36)
	at com.carrotsearch.randomizedtesting.ThreadLeakControl$StatementRunner.run(ThreadLeakControl.java:367)
	at java.lang.Thread.run(java.base@9-ea/Thread.java:804)




Build Log:
[...truncated 12154 lines...]
   [junit4] Suite: org.apache.solr.handler.TestReqParamsAPI
   [junit4]   2> Creating dataDir: /home/jenkins/workspace/Lucene-Solr-master-Linux/solr/build/solr-core/test/J0/temp/solr.handler.TestReqParamsAPI_450C2F11B0BE0E92-001/init-core-data-001
   [junit4]   2> 2209775 INFO  (SUITE-TestReqParamsAPI-seed#[450C2F11B0BE0E92]-worker) [    ] o.a.s.SolrTestCaseJ4 Randomized ssl (false) and clientAuth (false)
   [junit4]   2> 2209776 INFO  (SUITE-TestReqParamsAPI-seed#[450C2F11B0BE0E92]-worker) [    ] o.a.s.BaseDistributedSearchTestCase Setting hostContext system property: /
   [junit4]   2> 2209782 INFO  (TEST-TestReqParamsAPI.test-seed#[450C2F11B0BE0E92]) [    ] o.a.s.c.ZkTestServer STARTING ZK TEST SERVER
   [junit4]   2> 2209782 INFO  (Thread-5303) [    ] o.a.s.c.ZkTestServer client port:0.0.0.0/0.0.0.0:0
   [junit4]   2> 2209782 INFO  (Thread-5303) [    ] o.a.s.c.ZkTestServer Starting server
   [junit4]   2> 2209882 INFO  (TEST-TestReqParamsAPI.test-seed#[450C2F11B0BE0E92]) [    ] o.a.s.c.ZkTestServer start zk server on port:36986
   [junit4]   2> 2209882 INFO  (TEST-TestReqParamsAPI.test-seed#[450C2F11B0BE0E92]) [    ] o.a.s.c.c.SolrZkClient Using default ZkCredentialsProvider
   [junit4]   2> 2209883 INFO  (TEST-TestReqParamsAPI.test-seed#[450C2F11B0BE0E92]) [    ] o.a.s.c.c.ConnectionManager Waiting for client to connect to ZooKeeper
   [junit4]   2> 2209885 INFO  (zkCallback-2751-thread-1) [    ] o.a.s.c.c.ConnectionManager Watcher org.apache.solr.common.cloud.ConnectionManager@1f62aa8 name:ZooKeeperConnection Watcher:127.0.0.1:36986 got event WatchedEvent state:SyncConnected type:None path:null path:null type:None
   [junit4]   2> 2209885 INFO  (TEST-TestReqParamsAPI.test-seed#[450C2F11B0BE0E92]) [    ] o.a.s.c.c.ConnectionManager Client is connected to ZooKeeper
   [junit4]   2> 2209885 INFO  (TEST-TestReqParamsAPI.test-seed#[450C2F11B0BE0E92]) [    ] o.a.s.c.c.SolrZkClient Using default ZkACLProvider
   [junit4]   2> 2209885 INFO  (TEST-TestReqParamsAPI.test-seed#[450C2F11B0BE0E92]) [    ] o.a.s.c.c.SolrZkClient makePath: /solr
   [junit4]   2> 2209887 INFO  (TEST-TestReqParamsAPI.test-seed#[450C2F11B0BE0E92]) [    ] o.a.s.c.c.SolrZkClient Using default ZkCredentialsProvider
   [junit4]   2> 2209888 INFO  (TEST-TestReqParamsAPI.test-seed#[450C2F11B0BE0E92]) [    ] o.a.s.c.c.ConnectionManager Waiting for client to connect to ZooKeeper
   [junit4]   2> 2209888 INFO  (zkCallback-2752-thread-1) [    ] o.a.s.c.c.ConnectionManager Watcher org.apache.solr.common.cloud.ConnectionManager@193d7da name:ZooKeeperConnection Watcher:127.0.0.1:36986/solr got event WatchedEvent state:SyncConnected type:None path:null path:null type:None
   [junit4]   2> 2209888 INFO  (TEST-TestReqParamsAPI.test-seed#[450C2F11B0BE0E92]) [    ] o.a.s.c.c.ConnectionManager Client is connected to ZooKeeper
   [junit4]   2> 2209889 INFO  (TEST-TestReqParamsAPI.test-seed#[450C2F11B0BE0E92]) [    ] o.a.s.c.c.SolrZkClient Using default ZkACLProvider
   [junit4]   2> 2209889 INFO  (TEST-TestReqParamsAPI.test-seed#[450C2F11B0BE0E92]) [    ] o.a.s.c.c.SolrZkClient makePath: /collections/collection1
   [junit4]   2> 2209890 INFO  (TEST-TestReqParamsAPI.test-seed#[450C2F11B0BE0E92]) [    ] o.a.s.c.c.SolrZkClient makePath: /collections/collection1/shards
   [junit4]   2> 2209891 INFO  (TEST-TestReqParamsAPI.test-seed#[450C2F11B0BE0E92]) [    ] o.a.s.c.c.SolrZkClient makePath: /collections/control_collection
   [junit4]   2> 2209891 INFO  (TEST-TestReqParamsAPI.test-seed#[450C2F11B0BE0E92]) [    ] o.a.s.c.c.SolrZkClient makePath: /collections/control_collection/shards
   [junit4]   2> 2209892 INFO  (TEST-TestReqParamsAPI.test-seed#[450C2F11B0BE0E92]) [    ] o.a.s.c.AbstractZkTestCase put /home/jenkins/workspace/Lucene-Solr-master-Linux/solr/core/src/test-files/solr/collection1/conf/solrconfig-tlog.xml to /configs/conf1/solrconfig.xml
   [junit4]   2> 2209892 INFO  (TEST-TestReqParamsAPI.test-seed#[450C2F11B0BE0E92]) [    ] o.a.s.c.c.SolrZkClient makePath: /configs/conf1/solrconfig.xml
   [junit4]   2> 2209894 INFO  (TEST-TestReqParamsAPI.test-seed#[450C2F11B0BE0E92]) [    ] o.a.s.c.AbstractZkTestCase put /home/jenkins/workspace/Lucene-Solr-master-Linux/solr/core/src/test-files/solr/collection1/conf/schema.xml to /configs/conf1/schema.xml
   [junit4]   2> 2209894 INFO  (TEST-TestReqParamsAPI.test-seed#[450C2F11B0BE0E92]) [    ] o.a.s.c.c.SolrZkClient makePath: /configs/conf1/schema.xml
   [junit4]   2> 2209895 INFO  (TEST-TestReqParamsAPI.test-seed#[450C2F11B0BE0E92]) [    ] o.a.s.c.AbstractZkTestCase put /home/jenkins/workspace/Lucene-Solr-master-Linux/solr/core/src/test-files/solr/collection1/conf/solrconfig.snippet.randomindexconfig.xml to /configs/conf1/solrconfig.snippet.randomindexconfig.xml
   [junit4]   2> 2209895 INFO  (TEST-TestReqParamsAPI.test-seed#[450C2F11B0BE0E92]) [    ] o.a.s.c.c.SolrZkClient makePath: /configs/conf1/solrconfig.snippet.randomindexconfig.xml
   [junit4]   2> 2209896 INFO  (TEST-TestReqParamsAPI.test-seed#[450C2F11B0BE0E92]) [    ] o.a.s.c.AbstractZkTestCase put /home/jenkins/workspace/Lucene-Solr-master-Linux/solr/core/src/test-files/solr/collection1/conf/stopwords.txt to /configs/conf1/stopwords.txt
   [junit4]   2> 2209896 INFO  (TEST-TestReqParamsAPI.test-seed#[450C2F11B0BE0E92]) [    ] o.a.s.c.c.SolrZkClient makePath: /configs/conf1/stopwords.txt
   [junit4]   2> 2209897 INFO  (TEST-TestReqParamsAPI.test-seed#[450C2F11B0BE0E92]) [    ] o.a.s.c.AbstractZkTestCase put /home/jenkins/workspace/Lucene-Solr-master-Linux/solr/core/src/test-files/solr/collection1/conf/protwords.txt to /configs/conf1/protwords.txt
   [junit4]   2> 2209897 INFO  (TEST-TestReqParamsAPI.test-seed#[450C2F11B0BE0E92]) [    ] o.a.s.c.c.SolrZkClient makePath: /configs/conf1/protwords.txt
   [junit4]   2> 2209898 INFO  (TEST-TestReqParamsAPI.test-seed#[450C2F11B0BE0E92]) [    ] o.a.s.c.AbstractZkTestCase put /home/jenkins/workspace/Lucene-Solr-master-Linux/solr/core/src/test-files/solr/collection1/conf/currency.xml to /configs/conf1/currency.xml
   [junit4]   2> 2209898 INFO  (TEST-TestReqParamsAPI.test-seed#[450C2F11B0BE0E92]) [    ] o.a.s.c.c.SolrZkClient makePath: /configs/conf1/currency.xml
   [junit4]   2> 2209899 INFO  (TEST-TestReqParamsAPI.test-seed#[450C2F11B0BE0E92]) [    ] o.a.s.c.AbstractZkTestCase put /home/jenkins/workspace/Lucene-Solr-master-Linux/solr/core/src/test-files/solr/collection1/conf/enumsConfig.xml to /configs/conf1/enumsConfig.xml
   [junit4]   2> 2209899 INFO  (TEST-TestReqParamsAPI.test-seed#[450C2F11B0BE0E92]) [    ] o.a.s.c.c.SolrZkClient makePath: /configs/conf1/enumsConfig.xml
   [junit4]   2> 2209899 INFO  (TEST-TestReqParamsAPI.test-seed#[450C2F11B0BE0E92]) [    ] o.a.s.c.AbstractZkTestCase put /home/jenkins/workspace/Lucene-Solr-master-Linux/solr/core/src/test-files/solr/collection1/conf/open-exchange-rates.json to /configs/conf1/open-exchange-rates.json
   [junit4]   2> 2209899 INFO  (TEST-TestReqParamsAPI.test-seed#[450C2F11B0BE0E92]) [    ] o.a.s.c.c.SolrZkClient makePath: /configs/conf1/open-exchange-rates.json
   [junit4]   2> 2209900 INFO  (TEST-TestReqParamsAPI.test-seed#[450C2F11B0BE0E92]) [    ] o.a.s.c.AbstractZkTestCase put /home/jenkins/workspace/Lucene-Solr-master-Linux/solr/core/src/test-files/solr/collection1/conf/mapping-ISOLatin1Accent.txt to /configs/conf1/mapping-ISOLatin1Accent.txt
   [junit4]   2> 2209900 INFO  (TEST-TestReqParamsAPI.test-seed#[450C2F11B0BE0E92]) [    ] o.a.s.c.c.SolrZkClient makePath: /configs/conf1/mapping-ISOLatin1Accent.txt
   [junit4]   2> 2209901 INFO  (TEST-TestReqParamsAPI.test-seed#[450C2F11B0BE0E92]) [    ] o.a.s.c.AbstractZkTestCase put /home/jenkins/workspace/Lucene-Solr-master-Linux/solr/core/src/test-files/solr/collection1/conf/old_synonyms.txt to /configs/conf1/old_synonyms.txt
   [junit4]   2> 2209909 INFO  (TEST-TestReqParamsAPI.test-seed#[450C2F11B0BE0E92]) [    ] o.a.s.c.c.SolrZkClient makePath: /configs/conf1/old_synonyms.txt
   [junit4]   2> 2209910 INFO  (TEST-TestReqParamsAPI.test-seed#[450C2F11B0BE0E92]) [    ] o.a.s.c.AbstractZkTestCase put /home/jenkins/workspace/Lucene-Solr-master-Linux/solr/core/src/test-files/solr/collection1/conf/synonyms.txt to /configs/conf1/synonyms.txt
   [junit4]   2> 2209910 INFO  (TEST-TestReqParamsAPI.test-seed#[450C2F11B0BE0E92]) [    ] o.a.s.c.c.SolrZkClient makePath: /configs/conf1/synonyms.txt
   [junit4]   2> 2210018 INFO  (TEST-TestReqParamsAPI.test-seed#[450C2F11B0BE0E92]) [    ] o.a.s.SolrTestCaseJ4 Writing core.properties file to /home/jenkins/workspace/Lucene-Solr-master-Linux/solr/build/solr-core/test/J0/temp/solr.handler.TestReqParamsAPI_450C2F11B0BE0E92-001/control-001/cores/collection1
   [junit4]   2> 2210020 INFO  (TEST-TestReqParamsAPI.test-seed#[450C2F11B0BE0E92]) [    ] o.e.j.s.Server jetty-9.3.8.v20160314
   [junit4]   2> 2210021 INFO  (TEST-TestReqParamsAPI.test-seed#[450C2F11B0BE0E92]) [    ] o.e.j.s.h.ContextHandler Started o.e.j.s.ServletContextHandler@1678c57{/,null,AVAILABLE}
   [junit4]   2> 2210023 INFO  (TEST-TestReqParamsAPI.test-seed#[450C2F11B0BE0E92]) [    ] o.e.j.s.ServerConnector Started ServerConnector@1de6abc{HTTP/1.1,[http/1.1]}{127.0.0.1:37538}
   [junit4]   2> 2210023 INFO  (TEST-TestReqParamsAPI.test-seed#[450C2F11B0BE0E92]) [    ] o.e.j.s.Server Started @2212043ms
   [junit4]   2> 2210023 INFO  (TEST-TestReqParamsAPI.test-seed#[450C2F11B0BE0E92]) [    ] o.a.s.c.s.e.JettySolrRunner Jetty properties: {solr.data.dir=/home/jenkins/workspace/Lucene-Solr-master-Linux/solr/build/solr-core/test/J0/temp/solr.handler.TestReqParamsAPI_450C2F11B0BE0E92-001/tempDir-001/control/data, hostContext=/, hostPort=37538, coreRootDirectory=/home/jenkins/workspace/Lucene-Solr-master-Linux/solr/build/solr-core/test/J0/temp/solr.handler.TestReqParamsAPI_450C2F11B0BE0E92-001/control-001/cores}
   [junit4]   2> 2210024 INFO  (TEST-TestReqParamsAPI.test-seed#[450C2F11B0BE0E92]) [    ] o.a.s.s.SolrDispatchFilter SolrDispatchFilter.init(): jdk.internal.loader.ClassLoaders$AppClassLoader@c6a292
   [junit4]   2> 2210024 INFO  (TEST-TestReqParamsAPI.test-seed#[450C2F11B0BE0E92]) [    ] o.a.s.c.SolrResourceLoader new SolrResourceLoader for directory: '/home/jenkins/workspace/Lucene-Solr-master-Linux/solr/build/solr-core/test/J0/temp/solr.handler.TestReqParamsAPI_450C2F11B0BE0E92-001/control-001'
   [junit4]   2> 2210024 INFO  (TEST-TestReqParamsAPI.test-seed#[450C2F11B0BE0E92]) [    ] o.a.s.c.SolrResourceLoader JNDI not configured for solr (NoInitialContextEx)
   [junit4]   2> 2210024 INFO  (TEST-TestReqParamsAPI.test-seed#[450C2F11B0BE0E92]) [    ] o.a.s.c.SolrResourceLoader solr home defaulted to 'solr/' (could not find system property or JNDI)
   [junit4]   2> 2210024 INFO  (TEST-TestReqParamsAPI.test-seed#[450C2F11B0BE0E92]) [    ] o.a.s.c.c.SolrZkClient Using default ZkCredentialsProvider
   [junit4]   2> 2210024 INFO  (TEST-TestReqParamsAPI.test-seed#[450C2F11B0BE0E92]) [    ] o.a.s.c.c.ConnectionManager Waiting for client to connect to ZooKeeper
   [junit4]   2> 2210026 INFO  (zkCallback-2753-thread-1) [    ] o.a.s.c.c.ConnectionManager Watcher org.apache.solr.common.cloud.ConnectionManager@133ddfb name:ZooKeeperConnection Watcher:127.0.0.1:36986/solr got event WatchedEvent state:SyncConnected type:None path:null path:null type:None
   [junit4]   2> 2210026 INFO  (TEST-TestReqParamsAPI.test-seed#[450C2F11B0BE0E92]) [    ] o.a.s.c.c.ConnectionManager Client is connected to ZooKeeper
   [junit4]   2> 2210026 INFO  (TEST-TestReqParamsAPI.test-seed#[450C2F11B0BE0E92]) [    ] o.a.s.c.c.SolrZkClient Using default ZkACLProvider
   [junit4]   2> 2210027 INFO  (TEST-TestReqParamsAPI.test-seed#[450C2F11B0BE0E92]) [    ] o.a.s.s.SolrDispatchFilter Loading solr.xml from SolrHome (not found in ZooKeeper)
   [junit4]   2> 2210027 INFO  (TEST-TestReqParamsAPI.test-seed#[450C2F11B0BE0E92]) [    ] o.a.s.c.SolrXmlConfig Loading container configuration from /home/jenkins/workspace/Lucene-Solr-master-Linux/solr/build/solr-core/test/J0/temp/solr.handler.TestReqParamsAPI_450C2F11B0BE0E92-001/control-001/solr.xml
   [junit4]   2> 2210030 INFO  (TEST-TestReqParamsAPI.test-seed#[450C2F11B0BE0E92]) [    ] o.a.s.c.CorePropertiesLocator Config-defined core root directory: /home/jenkins/workspace/Lucene-Solr-master-Linux/solr/build/solr-core/test/J0/temp/solr.handler.TestReqParamsAPI_450C2F11B0BE0E92-001/control-001/cores
   [junit4]   2> 2210030 INFO  (TEST-TestReqParamsAPI.test-seed#[450C2F11B0BE0E92]) [    ] o.a.s.c.CoreContainer New CoreContainer 18737024
   [junit4]   2> 2210030 INFO  (TEST-TestReqParamsAPI.test-seed#[450C2F11B0BE0E92]) [    ] o.a.s.c.CoreContainer Loading cores into CoreContainer [instanceDir=/home/jenkins/workspace/Lucene-Solr-master-Linux/solr/build/solr-core/test/J0/temp/solr.handler.TestReqParamsAPI_450C2F11B0BE0E92-001/control-001]
   [junit4]   2> 2210030 WARN  (TEST-TestReqParamsAPI.test-seed#[450C2F11B0BE0E92]) [    ] o.a.s.c.CoreContainer Couldn't add files from /home/jenkins/workspace/Lucene-Solr-master-Linux/solr/build/solr-core/test/J0/temp/solr.handler.TestReqParamsAPI_450C2F11B0BE0E92-001/control-001/lib to classpath: /home/jenkins/workspace/Lucene-Solr-master-Linux/solr/build/solr-core/test/J0/temp/solr.handler.TestReqParamsAPI_450C2F11B0BE0E92-001/control-001/lib
   [junit4]   2> 2210031 INFO  (TEST-TestReqParamsAPI.test-seed#[450C2F11B0BE0E92]) [    ] o.a.s.h.c.HttpShardHandlerFactory created with socketTimeout : 90000,urlScheme : ,connTimeout : 15000,maxConnectionsPerHost : 20,maxConnections : 10000,corePoolSize : 0,maximumPoolSize : 2147483647,maxThreadIdleTime : 5,sizeOfQueue : -1,fairnessPolicy : false,
   [junit4]   2> 2210032 INFO  (TEST-TestReqParamsAPI.test-seed#[450C2F11B0BE0E92]) [    ] o.a.s.u.UpdateShardHandler Creating UpdateShardHandler HTTP client with params: 
   [junit4]   2> 2210034 INFO  (TEST-TestReqParamsAPI.test-seed#[450C2F11B0BE0E92]) [    ] o.a.s.l.LogWatcher SLF4J impl is org.slf4j.impl.Log4jLoggerFactory
   [junit4]   2> 2210034 INFO  (TEST-TestReqParamsAPI.test-seed#[450C2F11B0BE0E92]) [    ] o.a.s.l.LogWatcher Registering Log Listener [Log4j (org.slf4j.impl.Log4jLoggerFactory)]
   [junit4]   2> 2210034 INFO  (TEST-TestReqParamsAPI.test-seed#[450C2F11B0BE0E92]) [    ] o.a.s.c.ZkContainer Zookeeper client=127.0.0.1:36986/solr
   [junit4]   2> 2210034 INFO  (TEST-TestReqParamsAPI.test-seed#[450C2F11B0BE0E92]) [    ] o.a.s.c.ZkController zkHost includes chroot
   [junit4]   2> 2210034 INFO  (TEST-TestReqParamsAPI.test-seed#[450C2F11B0BE0E92]) [    ] o.a.s.c.c.SolrZkClient Using default ZkCredentialsProvider
   [junit4]   2> 2210034 INFO  (TEST-TestReqParamsAPI.test-seed#[450C2F11B0BE0E92]) [    ] o.a.s.c.c.ConnectionManager Waiting for client to connect to ZooKeeper
   [junit4]   2> 2210035 INFO  (zkCallback-2756-thread-1) [    ] o.a.s.c.c.ConnectionManager Watcher org.apache.solr.common.cloud.ConnectionManager@1f0363e name:ZooKeeperConnection Watcher:127.0.0.1:36986 got event WatchedEvent state:SyncConnected type:None path:null path:null type:None
   [junit4]   2> 2210035 INFO  (TEST-TestReqParamsAPI.test-seed#[450C2F11B0BE0E92]) [    ] o.a.s.c.c.ConnectionManager Client is connected to ZooKeeper
   [junit4]   2> 2210036 INFO  (TEST-TestReqParamsAPI.test-seed#[450C2F11B0BE0E92]) [    ] o.a.s.c.c.SolrZkClient Using default ZkACLProvider
   [junit4]   2> 2210036 INFO  (TEST-TestReqParamsAPI.test-seed#[450C2F11B0BE0E92]) [    ] o.a.s.c.ZkController Added new OnReconnect listener org.apache.solr.cloud.ZkController$$Lambda$118/15276833@e56b57
   [junit4]   2> 2210036 INFO  (TEST-TestReqParamsAPI.test-seed#[450C2F11B0BE0E92]) [    ] o.a.s.c.c.ConnectionManager Waiting for client to connect to ZooKeeper
   [junit4]   2> 2210037 INFO  (zkCallback-2757-thread-1) [    ] o.a.s.c.c.ConnectionManager Watcher org.apache.solr.common.cloud.ConnectionManager@60cff9 name:ZooKeeperConnection Watcher:127.0.0.1:36986/solr got event WatchedEvent state:SyncConnected type:None path:null path:null type:None
   [junit4]   2> 2210037 INFO  (TEST-TestReqParamsAPI.test-seed#[450C2F11B0BE0E92]) [    ] o.a.s.c.c.ConnectionManager Client is connected to ZooKeeper
   [junit4]   2> 2210039 INFO  (TEST-TestReqParamsAPI.test-seed#[450C2F11B0BE0E92]) [    ] o.a.s.c.c.SolrZkClient makePath: /overseer/queue
   [junit4]   2> 2210039 INFO  (TEST-TestReqParamsAPI.test-seed#[450C2F11B0BE0E92]) [    ] o.a.s.c.c.SolrZkClient makePath: /overseer/collection-queue-work
   [junit4]   2> 2210040 INFO  (TEST-TestReqParamsAPI.test-seed#[450C2F11B0BE0E92]) [    ] o.a.s.c.c.SolrZkClient makePath: /overseer/collection-map-running
   [junit4]   2> 2210041 INFO  (TEST-TestReqParamsAPI.test-seed#[450C2F11B0BE0E92]) [    ] o.a.s.c.c.SolrZkClient makePath: /overseer/collection-map-completed
   [junit4]   2> 2210041 INFO  (TEST-TestReqParamsAPI.test-seed#[450C2F11B0BE0E92]) [    ] o.a.s.c.c.SolrZkClient makePath: /overseer/collection-map-failure
   [junit4]   2> 2210042 INFO  (TEST-TestReqParamsAPI.test-seed#[450C2F11B0BE0E92]) [    ] o.a.s.c.c.SolrZkClient makePath: /live_nodes
   [junit4]   2> 2210042 INFO  (TEST-TestReqParamsAPI.test-seed#[450C2F11B0BE0E92]) [    ] o.a.s.c.c.SolrZkClient makePath: /aliases.json
   [junit4]   2> 2210043 INFO  (TEST-TestReqParamsAPI.test-seed#[450C2F11B0BE0E92]) [    ] o.a.s.c.c.SolrZkClient makePath: /clusterstate.json
   [junit4]   2> 2210043 INFO  (TEST-TestReqParamsAPI.test-seed#[450C2F11B0BE0E92]) [    ] o.a.s.c.c.SolrZkClient makePath: /security.json
   [junit4]   2> 2210043 INFO  (TEST-TestReqParamsAPI.test-seed#[450C2F11B0BE0E92]) [    ] o.a.s.c.c.ZkStateReader Updating cluster state from ZooKeeper... 
   [junit4]   2> 2210043 INFO  (TEST-TestReqParamsAPI.test-seed#[450C2F11B0BE0E92]) [    ] o.a.s.c.c.ZkStateReader Loaded empty cluster properties
   [junit4]   2> 2210044 INFO  (TEST-TestReqParamsAPI.test-seed#[450C2F11B0BE0E92]) [    ] o.a.s.c.c.ZkStateReader Updated live nodes from ZooKeeper... (0) -> (0)
   [junit4]   2> 2210044 INFO  (TEST-TestReqParamsAPI.test-seed#[450C2F11B0BE0E92]) [    ] o.a.s.c.c.SolrZkClient makePath: /overseer_elect
   [junit4]   2> 2210045 INFO  (TEST-TestReqParamsAPI.test-seed#[450C2F11B0BE0E92]) [    ] o.a.s.c.c.SolrZkClient makePath: /overseer_elect/election
   [junit4]   2> 2210045 INFO  (TEST-TestReqParamsAPI.test-seed#[450C2F11B0BE0E92]) [    ] o.a.s.c.Overseer Overseer (id=null) closing
   [junit4]   2> 2210045 INFO  (TEST-TestReqParamsAPI.test-seed#[450C2F11B0BE0E92]) [    ] o.a.s.c.LeaderElector Joined leadership election with path: /overseer_elect/election/95903171226501124-127.0.0.1:37538_-n_0000000000
   [junit4]   2> 2210045 INFO  (TEST-TestReqParamsAPI.test-seed#[450C2F11B0BE0E92]) [    ] o.a.s.c.OverseerElectionContext I am going to be the leader 127.0.0.1:37538_
   [junit4]   2> 2210046 INFO  (TEST-TestReqParamsAPI.test-seed#[450C2F11B0BE0E92]) [    ] o.a.s.c.c.SolrZkClient makePath: /overseer_elect/leader
   [junit4]   2> 2210046 INFO  (TEST-TestReqParamsAPI.test-seed#[450C2F11B0BE0E92]) [    ] o.a.s.c.Overseer Overseer (id=95903171226501124-127.0.0.1:37538_-n_0000000000) starting
   [junit4]   2> 2210046 INFO  (TEST-TestReqParamsAPI.test-seed#[450C2F11B0BE0E92]) [    ] o.a.s.c.c.SolrZkClient makePath: /overseer/queue-work
   [junit4]   2> 2210048 INFO  (TEST-TestReqParamsAPI.test-seed#[450C2F11B0BE0E92]) [    ] o.a.s.c.OverseerAutoReplicaFailoverThread Starting OverseerAutoReplicaFailoverThread autoReplicaFailoverWorkLoopDelay=10000 autoReplicaFailoverWaitAfterExpiration=30000 autoReplicaFailoverBadNodeExpiration=60000
   [junit4]   2> 2210048 INFO  (OverseerCollectionConfigSetProcessor-95903171226501124-127.0.0.1:37538_-n_0000000000) [    ] o.a.s.c.OverseerTaskProcessor Process current queue of overseer operations
   [junit4]   2> 2210048 INFO  (TEST-TestReqParamsAPI.test-seed#[450C2F11B0BE0E92]) [    ] o.a.s.c.ZkController Register node as live in ZooKeeper:/live_nodes/127.0.0.1:37538_
   [junit4]   2> 2210048 INFO  (OverseerStateUpdate-95903171226501124-127.0.0.1:37538_-n_0000000000) [    ] o.a.s.c.Overseer Starting to work on the main queue
   [junit4]   2> 2210049 INFO  (TEST-TestReqParamsAPI.test-seed#[450C2F11B0BE0E92]) [    ] o.a.s.c.c.SolrZkClient makePath: /live_nodes/127.0.0.1:37538_
   [junit4]   2> 2210051 INFO  (OverseerStateUpdate-95903171226501124-127.0.0.1:37538_-n_0000000000) [    ] o.a.s.c.c.ZkStateReader Updated live nodes from ZooKeeper... (0) -> (0)
   [junit4]   2> 2210051 INFO  (zkCallback-2757-thread-1) [    ] o.a.s.c.c.ZkStateReader A live node change: [WatchedEvent state:SyncConnected type:NodeChildrenChanged path:/live_nodes], has occurred - updating... (live nodes size: [0])
   [junit4]   2> 2210051 INFO  (zkCallback-2757-thread-1) [    ] o.a.s.c.c.ZkStateReader Updated live nodes from ZooKeeper... (0) -> (1)
   [junit4]   2> 2210061 INFO  (TEST-TestReqParamsAPI.test-seed#[450C2F11B0BE0E92]) [    ] o.a.s.c.CoreContainer Security conf doesn't exist. Skipping setup for authorization module.
   [junit4]   2> 2210061 INFO  (TEST-TestReqParamsAPI.test-seed#[450C2F11B0BE0E92]) [    ] o.a.s.c.CoreContainer No authentication plugin used.
   [junit4]   2> 2210062 INFO  (TEST-TestReqParamsAPI.test-seed#[450C2F11B0BE0E92]) [    ] o.a.s.c.CorePropertiesLocator Looking for core definitions underneath /home/jenkins/workspace/Lucene-Solr-master-Linux/solr/build/solr-core/test/J0/temp/solr.handler.TestReqParamsAPI_450C2F11B0BE0E92-001/control-001/cores
   [junit4]   2> 2210066 INFO  (TEST-TestReqParamsAPI.test-seed#[450C2F11B0BE0E92]) [    ] o.a.s.c.CoreDescriptor Created CoreDescriptor: {name=collection1, config=solrconfig.xml, transient=false, schema=schema.xml, loadOnStartup=true, configSetProperties=configsetprops.json, collection=control_collection, coreNodeName=, dataDir=data/, shard=}
   [junit4]   2> 2210066 INFO  (TEST-TestReqParamsAPI.test-seed#[450C2F11B0BE0E92]) [    ] o.a.s.c.CorePropertiesLocator Found core collection1 in /home/jenkins/workspace/Lucene-Solr-master-Linux/solr/build/solr-core/test/J0/temp/solr.handler.TestReqParamsAPI_450C2F11B0BE0E92-001/control-001/cores/collection1
   [junit4]   2> 2210067 INFO  (TEST-TestReqParamsAPI.test-seed#[450C2F11B0BE0E92]) [    ] o.a.s.c.CorePropertiesLocator Found 1 core definitions
   [junit4]   2> 2210067 INFO  (coreLoadExecutor-7416-thread-1) [    ] o.a.s.c.ZkController publishing state=down
   [junit4]   2> 2210067 INFO  (coreLoadExecutor-7416-thread-1) [    ] o.a.s.c.ZkController numShards not found on descriptor - reading it from system property
   [junit4]   2> 2210067 INFO  (TEST-TestReqParamsAPI.test-seed#[450C2F11B0BE0E92]) [    ] o.a.s.s.SolrDispatchFilter user.dir=/home/jenkins/workspace/Lucene-Solr-master-Linux/solr/build/solr-core/test/J0
   [junit4]   2> 2210067 INFO  (TEST-TestReqParamsAPI.test-seed#[450C2F11B0BE0E92]) [    ] o.a.s.s.SolrDispatchFilter SolrDispatchFilter.init() done
   [junit4]   2> 2210068 INFO  (coreLoadExecutor-7416-thread-1) [    ] o.a.s.c.ZkController Collection control_collection not visible yet, but flagging it so a watch is registered when it becomes visible
   [junit4]   2> 2210068 INFO  (OverseerStateUpdate-95903171226501124-127.0.0.1:37538_-n_0000000000) [    ] o.a.s.c.Overseer processMessage: queueSize: 1, message = {
   [junit4]   2>   "core":"collection1",
   [junit4]   2>   "roles":null,
   [junit4]   2>   "base_url":"http://127.0.0.1:37538",
   [junit4]   2>   "node_name":"127.0.0.1:37538_",
   [junit4]   2>   "numShards":"1",
   [junit4]   2>   "state":"down",
   [junit4]   2>   "shard":null,
   [junit4]   2>   "collection":"control_collection",
   [junit4]   2>   "operation":"state"} current state version: 0
   [junit4]   2> 2210068 INFO  (OverseerStateUpdate-95903171226501124-127.0.0.1:37538_-n_0000000000) [    ] o.a.s.c.o.ReplicaMutator Update state numShards=1 message={
   [junit4]   2>   "core":"collection1",
   [junit4]   2>   "roles":null,
   [junit4]   2>   "base_url":"http://127.0.0.1:37538",
   [junit4]   2>   "node_name":"127.0.0.1:37538_",
   [junit4]   2>   "numShards":"1",
   [junit4]   2>   "state":"down",
   [junit4]   2>   "shard":null,
   [junit4]   2>   "collection":"control_collection",
   [junit4]   2>   "operation":"state"}
   [junit4]   2> 2210068 INFO  (coreLoadExecutor-7416-thread-1) [    ] o.a.s.c.c.ZkStateReader Deleting data for [control_collection]
   [junit4]   2> 2210068 INFO  (OverseerStateUpdate-95903171226501124-127.0.0.1:37538_-n_0000000000) [    ] o.a.s.c.o.ClusterStateMutator building a new cName: control_collection
   [junit4]   2> 2210068 INFO  (coreLoadExecutor-7416-thread-1) [    ] o.a.s.c.ZkController look for our core node name
   [junit4]   2> 2210069 INFO  (OverseerStateUpdate-95903171226501124-127.0.0.1:37538_-n_0000000000) [    ] o.a.s.c.o.ReplicaMutator Assigning new node to shard shard=shard1
   [junit4]   2> 2210069 INFO  (zkCallback-2757-thread-1) [    ] o.a.s.c.c.ZkStateReader A cluster state change: [WatchedEvent state:SyncConnected type:NodeDataChanged path:/clusterstate.json], has occurred - updating... (live nodes size: [1])
   [junit4]   2> 2211069 INFO  (coreLoadExecutor-7416-thread-1) [    ] o.a.s.c.ZkController waiting to find shard id in clusterstate for collection1
   [junit4]   2> 2211069 INFO  (coreLoadExecutor-7416-thread-1) [    ] o.a.s.c.ZkController Check for collection zkNode:control_collection
   [junit4]   2> 2211069 INFO  (coreLoadExecutor-7416-thread-1) [    ] o.a.s.c.ZkController Collection zkNode exists
   [junit4]   2> 2211069 INFO  (coreLoadExecutor-7416-thread-1) [    ] o.a.s.c.c.ZkStateReader Load collection config from: [/collections/control_collection]
   [junit4]   2> 2211070 INFO  (coreLoadExecutor-7416-thread-1) [    ] o.a.s.c.c.ZkStateReader path=[/collections/control_collection] [configName]=[conf1] specified config exists in ZooKeeper
   [junit4]   2> 2211070 INFO  (coreLoadExecutor-7416-thread-1) [    ] o.a.s.c.SolrResourceLoader new SolrResourceLoader for directory: '/home/jenkins/workspace/Lucene-Solr-master-Linux/solr/build/solr-core/test/J0/temp/solr.handler.TestReqParamsAPI_450C2F11B0BE0E92-001/control-001/cores/collection1'
   [junit4]   2> 2211070 INFO  (coreLoadExecutor-7416-thread-1) [    ] o.a.s.c.SolrResourceLoader JNDI not configured for solr (NoInitialContextEx)
   [junit4]   2> 2211071 INFO  (coreLoadExecutor-7416-thread-1) [    ] o.a.s.c.SolrResourceLoader solr home defaulted to 'solr/' (could not find system property or JNDI)
   [junit4]   2> 2211071 INFO  (coreLoadExecutor-7416-thread-1) [    ] o.a.s.c.Config loaded config solrconfig.xml with version 0 
   [junit4]   2> 2211074 INFO  (coreLoadExecutor-7416-thread-1) [    ] o.a.s.c.SolrConfig current version of requestparams : -1
   [junit4]   2> 2211086 WARN  (coreLoadExecutor-7416-thread-1) [    ] o.a.s.c.Config Beginning with Solr 5.5, <mergePolicy> is deprecated, use <mergePolicyFactory> instead.
   [junit4]   2> 2211087 INFO  (coreLoadExecutor-7416-thread-1) [    ] o.a.s.c.SolrConfig Using Lucene MatchVersion: 7.0.0
   [junit4]   2> 2211091 INFO  (coreLoadExecutor-7416-thread-1) [    ] o.a.s.c.SolrConfig Loaded SolrConfig: solrconfig.xml
   [junit4]   2> 2211095 INFO  (coreLoadExecutor-7416-thread-1) [    ] o.a.s.s.IndexSchema [collection1] Schema name=test
   [junit4]   2> 2211155 INFO  (coreLoadExecutor-7416-thread-1) [    ] o.a.s.s.OpenExchangeRatesOrgProvider Initialized with rates=open-exchange-rates.json, refreshInterval=1440.
   [junit4]   2> 2211159 INFO  (coreLoadExecutor-7416-thread-1) [    ] o.a.s.s.IndexSchema default search field in schema is text
   [junit4]   2> 2211160 INFO  (coreLoadExecutor-7416-thread-1) [    ] o.a.s.s.IndexSchema unique key field: id
   [junit4]   2> 2211163 INFO  (coreLoadExecutor-7416-thread-1) [    ] o.a.s.s.FileExchangeRateProvider Reloading exchange rates from file currency.xml
   [junit4]   2> 2211168 INFO  (coreLoadExecutor-7416-thread-1) [    ] o.a.s.s.FileExchangeRateProvider Reloading exchange rates from file currency.xml
   [junit4]   2> 2211169 INFO  (coreLoadExecutor-7416-thread-1) [    ] o.a.s.s.OpenExchangeRatesOrgProvider Reloading exchange rates from open-exchange-rates.json
   [junit4]   2> 2211170 INFO  (coreLoadExecutor-7416-thread-1) [    ] o.a.s.s.OpenExchangeRatesOrgProvider Reloading exchange rates from open-exchange-rates.json
   [junit4]   2> 2211170 INFO  (coreLoadExecutor-7416-thread-1) [    ] o.a.s.c.ConfigSetProperties Did not find ConfigSet properties, assuming default properties: Can't find resource 'configsetprops.json' in classpath or '/configs/conf1', cwd=/home/jenkins/workspace/Lucene-Solr-master-Linux/solr/build/solr-core/test/J0
   [junit4]   2> 2211171 INFO  (coreLoadExecutor-7416-thread-1) [    ] o.a.s.c.CoreContainer Creating SolrCore 'collection1' using configuration from collection control_collection
   [junit4]   2> 2211171 INFO  (coreLoadExecutor-7416-thread-1) [    ] o.a.s.c.SolrCore org.apache.solr.core.MockDirectoryFactory
   [junit4]   2> 2211171 INFO  (coreLoadExecutor-7416-thread-1) [    ] o.a.s.c.SolrCore [[collection1] ] Opening new SolrCore at [/home/jenkins/workspace/Lucene-Solr-master-Linux/solr/build/solr-core/test/J0/temp/solr.handler.TestReqParamsAPI_450C2F11B0BE0E92-001/control-001/cores/collection1], dataDir=[/home/jenkins/workspace/Lucene-Solr-master-Linux/solr/build/solr-core/test/J0/temp/solr.handler.TestReqParamsAPI_450C2F11B0BE0E92-001/control-001/cores/collection1/data/]
   [junit4]   2> 2211171 INFO  (coreLoadExecutor-7416-thread-1) [    ] o.a.s.c.JmxMonitoredMap JMX monitoring is enabled. Adding Solr mbeans to JMX Server: com.sun.jmx.mbeanserver.JmxMBeanServer@16e7bcb
   [junit4]   2> 2211171 INFO  (coreLoadExecutor-7416-thread-1) [    ] o.a.s.c.CachingDirectoryFactory return new directory for /home/jenkins/workspace/Lucene-Solr-master-Linux/solr/build/solr-core/test/J0/temp/solr.handler.TestReqParamsAPI_450C2F11B0BE0E92-001/control-001/cores/collection1/data
   [junit4]   2> 2211172 INFO  (coreLoadExecutor-7416-thread-1) [    ] o.a.s.c.SolrCore New index directory detected: old=null new=/home/jenkins/workspace/Lucene-Solr-master-Linux/solr/build/solr-core/test/J0/temp/solr.handler.TestReqParamsAPI_450C2F11B0BE0E92-001/control-001/cores/collection1/data/index/
   [junit4]   2> 2211172 WARN  (coreLoadExecutor-7416-thread-1) [    ] o.a.s.c.SolrCore [collection1] Solr index directory '/home/jenkins/workspace/Lucene-Solr-master-Linux/solr/build/solr-core/test/J0/temp/solr.handler.TestReqParamsAPI_450C2F11B0BE0E92-001/control-001/cores/collection1/data/index' doesn't exist. Creating new index...
   [junit4]   2> 2211172 INFO  (coreLoadExecutor-7416-thread-1) [    ] o.a.s.c.CachingDirectoryFactory return new directory for /home/jenkins/workspace/Lucene-Solr-master-Linux/solr/build/solr-core/test/J0/temp/solr.handler.TestReqParamsAPI_450C2F11B0BE0E92-001/control-001/cores/collection1/data/index
   [junit4]   2> 2211172 INFO  (coreLoadExecutor-7416-thread-1) [    ] o.a.s.u.RandomMergePolicy RandomMergePolicy wrapping class org.apache.lucene.index.LogByteSizeMergePolicy: [LogByteSizeMergePolicy: minMergeSize=1677721, mergeFactor=48, maxMergeSize=2147483648, maxMergeSizeForForcedMerge=9223372036854775807, calibrateSizeByDeletes=false, maxMergeDocs=2147483647, maxCFSSegmentSizeMB=8.796093022207999E12, noCFSRatio=0.0]
   [junit4]   2> 2211172 INFO  (coreLoadExecutor-7416-thread-1) [    ] o.a.s.c.SolrDeletionPolicy SolrDeletionPolicy.onCommit: commits: num=1
   [junit4]   2> 	commit{dir=MockDirectoryWrapper(RAMDirectory@d6a939 lockFactory=org.apache.lucene.store.SingleInstanceLockFactory@16bcadb),segFN=segments_1,generation=1}
   [junit4]   2> 2211172 INFO  (coreLoadExecutor-7416-thread-1) [    ] o.a.s.c.SolrDeletionPolicy newest commit generation = 1
   [junit4]   2> 2211173 INFO  (OldIndexDirectoryCleanupThreadForCore-collection1) [    ] o.a.s.c.SolrCore Looking for old index directories to cleanup for core collection1 in /home/jenkins/workspace/Lucene-Solr-master-Linux/solr/build/solr-core/test/J0/temp/solr.handler.TestReqParamsAPI_450C2F11B0BE0E92-001/control-001/cores/collection1/data/
   [junit4]   2> 2211173 WARN  (OldIndexDirectoryCleanupThreadForCore-collection1) [    ] o.a.s.c.DirectoryFactory /home/jenkins/workspace/Lucene-Solr-master-Linux/solr/build/solr-core/test/J0/temp/solr.handler.TestReqParamsAPI_450C2F11B0BE0E92-001/control-001/cores/collection1/data/ does not point to a valid data directory; skipping clean-up of old index directories.
   [junit4]   2> 2211174 INFO  (coreLoadExecutor-7416-thread-1) [    ] o.a.s.u.p.UpdateRequestProcessorChain creating updateRequestProcessorChain "nodistrib"
   [junit4]   2> 2211174 INFO  (coreLoadExecutor-7416-thread-1) [    ] o.a.s.u.p.UpdateRequestProcessorChain creating updateRequestProcessorChain "dedupe"
   [junit4]   2> 2211174 INFO  (coreLoadExecutor-7416-thread-1) [    ] o.a.s.u.p.UpdateRequestProcessorChain inserting DistributedUpdateProcessorFactory into updateRequestProcessorChain "dedupe"
   [junit4]   2> 2211174 INFO  (coreLoadExecutor-7416-thread-1) [    ] o.a.s.u.p.UpdateRequestProcessorChain creating updateRequestProcessorChain "stored_sig"
   [junit4]   2> 2211174 INFO  (coreLoadExecutor-7416-thread-1) [    ] o.a.s.u.p.UpdateRequestProcessorChain inserting DistributedUpdateProcessorFactory into updateRequestProcessorChain "stored_sig"
   [junit4]   2> 2211174 INFO  (coreLoadExecutor-7416-thread-1) [    ] o.a.s.u.p.UpdateRequestProcessorChain creating updateRequestProcessorChain "distrib-dup-test-chain-explicit"
   [junit4]   2> 2211174 INFO  (coreLoadExecutor-7416-thread-1) [    ] o.a.s.u.p.UpdateRequestProcessorChain creating updateRequestProcessorChain "distrib-dup-test-chain-implicit"
   [junit4]   2> 2211174 INFO  (coreLoadExecutor-7416-thread-1) [    ] o.a.s.u.p.UpdateRequestProcessorChain inserting DistributedUpdateProcessorFactory into updateRequestProcessorChain "distrib-dup-test-chain-implicit"
   [junit4]   2> 2211175 INFO  (coreLoadExecutor-7416-thread-1) [    ] o.a.s.c.SolrCore no updateRequestProcessorChain defined as default, creating implicit default
   [junit4]   2> 2211175 WARN  (coreLoadExecutor-7416-thread-1) [    ] o.a.s.c.RequestHandlers INVALID paramSet a in requestHandler {type = requestHandler,name = /dump,class = DumpRequestHandler,args = {defaults={a=A,b=B}}}
   [junit4]   2> 2211176 INFO  (coreLoadExecutor-7416-thread-1) [    ] o.a.s.h.l.XMLLoader xsltCacheLifetimeSeconds=60
   [junit4]   2> 2211177 INFO  (coreLoadExecutor-7416-thread-1) [    ] o.a.s.h.l.XMLLoader xsltCacheLifetimeSeconds=60
   [junit4]   2> 2211178 INFO  (coreLoadExecutor-7416-thread-1) [    ] o.a.s.h.l.XMLLoader xsltCacheLifetimeSeconds=60
   [junit4]   2> 2211178 INFO  (coreLoadExecutor-7416-thread-1) [    ] o.a.s.h.l.XMLLoader xsltCacheLifetimeSeconds=60
   [junit4]   2> 2211180 INFO  (coreLoadExecutor-7416-thread-1) [    ] o.a.s.c.RequestHandlers Registered paths: /admin/mbeans,standard,/update/json/docs,/admin/luke,/export,/get,/admin/properties,/update/json,/admin/threads,/dump,/update/csv,/sql,/graph,/admin/segments,/admin/system,/replication,/config,/stream,/schema,/admin/plugins,/admin/logging,/admin/ping,/update,/admin/file
   [junit4]   2> 2211180 INFO  (coreLoadExecutor-7416-thread-1) [    ] o.a.s.c.SolrCore Using default statsCache cache: org.apache.solr.search.stats.LocalStatsCache
   [junit4]   2> 2211180 INFO  (coreLoadExecutor-7416-thread-1) [    ] o.a.s.u.UpdateHandler Using UpdateLog implementation: org.apache.solr.update.UpdateLog
   [junit4]   2> 2211180 INFO  (coreLoadExecutor-7416-thread-1) [    ] o.a.s.u.UpdateLog Initializing UpdateLog: dataDir= defaultSyncLevel=FLUSH numRecordsToKeep=100 maxNumLogsToKeep=10 numVersionBuckets=65536
   [junit4]   2> 2211181 INFO  (coreLoadExecutor-7416-thread-1) [    ] o.a.s.u.CommitTracker Hard AutoCommit: disabled
   [junit4]   2> 2211181 INFO  (coreLoadExecutor-7416-thread-1) [    ] o.a.s.u.CommitTracker Soft AutoCommit: disabled
   [junit4]   2> 2211181 INFO  (coreLoadExecutor-7416-thread-1) [    ] o.a.s.u.RandomMergePolicy RandomMergePolicy wrapping class org.apache.lucene.index.TieredMergePolicy: [TieredMergePolicy: maxMergeAtOnce=39, maxMergeAtOnceExplicit=26, maxMergedSegmentMB=71.08984375, floorSegmentMB=0.2373046875, forceMergeDeletesPctAllowed=26.035403851071994, segmentsPerTier=10.0, maxCFSSegmentSizeMB=8.796093022207999E12, noCFSRatio=0.2834454109106882
   [junit4]   2> 2211181 INFO  (coreLoadExecutor-7416-thread-1) [    ] o.a.s.c.SolrDeletionPolicy SolrDeletionPolicy.onInit: commits: num=1
   [junit4]   2> 	commit{dir=MockDirectoryWrapper(RAMDirectory@d6a939 lockFactory=org.apache.lucene.store.SingleInstanceLockFactory@16bcadb),segFN=segments_1,generation=1}
   [junit4]   2> 2211181 INFO  (coreLoadExecutor-7416-thread-1) [    ] o.a.s.c.SolrDeletionPolicy newest commit generation = 1
   [junit4]   2> 2211181 INFO  (coreLoadExecutor-7416-thread-1) [    ] o.a.s.s.SolrIndexSearcher Opening [Searcher@100b1f1[collection1] main]
   [junit4]   2> 2211182 INFO  (coreLoadExecutor-7416-thread-1) [    ] o.a.s.c.c.ZkStateReader Load collection config from: [/collections/control_collection]
   [junit4]   2> 2211182 INFO  (coreLoadExecutor-7416-thread-1) [    ] o.a.s.c.c.ZkStateReader path=[/collections/control_collection] [configName]=[conf1] specified config exists in ZooKeeper
   [junit4]   2> 2211182 INFO  (coreLoadExecutor-7416-thread-1) [    ] o.a.s.r.ManagedResourceStorage Setting up ZooKeeper-based storage for the RestManager with znodeBase: /configs/conf1
   [junit4]   2> 2211182 INFO  (coreLoadExecutor-7416-thread-1) [    ] o.a.s.r.ManagedResourceStorage Configured ZooKeeperStorageIO with znodeBase: /configs/conf1
   [junit4]   2> 2211182 INFO  (coreLoadExecutor-7416-thread-1) [    ] o.a.s.r.RestManager Initializing RestManager with initArgs: {}
   [junit4]   2> 2211182 INFO  (coreLoadExecutor-7416-thread-1) [    ] o.a.s.r.ManagedResourceStorage Reading _rest_managed.json using ZooKeeperStorageIO:path=/configs/conf1
   [junit4]   2> 2211182 INFO  (coreLoadExecutor-7416-thread-1) [    ] o.a.s.r.ManagedResourceStorage No data found for znode /configs/conf1/_rest_managed.json
   [junit4]   2> 2211182 INFO  (coreLoadExecutor-7416-thread-1) [    ] o.a.s.r.ManagedResourceStorage Loaded null at path _rest_managed.json using ZooKeeperStorageIO:path=/configs/conf1
   [junit4]   2> 2211182 INFO  (coreLoadExecutor-7416-thread-1) [    ] o.a.s.r.RestManager Initializing 0 registered ManagedResources
   [junit4]   2> 2211183 INFO  (coreLoadExecutor-7416-thread-1) [    ] o.a.s.h.ReplicationHandler Commits will be reserved for  10000
   [junit4]   2> 2211183 INFO  (searcherExecutor-7417-thread-1) [    ] o.a.s.c.SolrCore [collection1] Registered new searcher Searcher@100b1f1[collection1] main{ExitableDirectoryReader(UninvertingDirectoryReader())}
   [junit4]   2> 2211183 INFO  (coreLoadExecutor-7416-thread-1) [    ] o.a.s.u.UpdateLog Looking up max value of version field to seed version buckets
   [junit4]   2> 2211183 INFO  (coreLoadExecutor-7416-thread-1) [    ] o.a.s.u.VersionInfo Refreshing highest value of _version_ for 65536 version buckets from index
   [junit4]   2> 2211183 INFO  (coreLoadExecutor-7416-thread-1) [    ] o.a.s.u.VersionInfo No terms found for _version_, cannot seed version bucket highest value from index
   [junit4]   2> 2211183 INFO  (coreLoadExecutor-7416-thread-1) [    ] o.a.s.u.UpdateLog Could not find max version in index or recent updates, using new clock 1534450741090975744
   [junit4]   2> 2211185 INFO  (coreLoadExecutor-7416-thread-1) [    ] o.a.s.u.UpdateLog Took 1.0ms to seed version buckets with highest version 1534450741090975744
   [junit4]   2> 2211185 INFO  (coreLoadExecutor-7416-thread-1) [    ] o.a.s.c.ZkController watch zkdir /configs/conf1
   [junit4]   2> 2211185 INFO  (coreLoadExecutor-7416-thread-1) [    ] o.a.s.c.CoreContainer registering core: collection1
   [junit4]   2> 2211185 INFO  (coreZkRegister-7410-thread-1) [    ] o.a.s.c.ZkController Register replica - core:collection1 address:http://127.0.0.1:37538 collection:control_collection shard:shard1
   [junit4]   2> 2211186 INFO  (coreZkRegister-7410-thread-1) [    ] o.a.s.c.c.SolrZkClient makePath: /collections/control_collection/leader_elect/shard1/election
   [junit4]   2> 2211187 INFO  (coreZkRegister-7410-thread-1) [    ] o.a.s.c.LeaderElector Joined leadership election with path: /collections/control_collection/leader_elect/shard1/election/95903171226501124-core_node1-n_0000000000
   [junit4]   2> 2211187 INFO  (coreZkRegister-7410-thread-1) [    ] o.a.s.c.ShardLeaderElectionContext Running the leader process for shard=shard1 and weAreReplacement=false and leaderVoteWait=10000
   [junit4]   2> 2211188 INFO  (coreZkRegister-7410-thread-1) [    ] o.a.s.c.ShardLeaderElectionContext Enough replicas found to continue.
   [junit4]   2> 2211188 INFO  (coreZkRegister-7410-thread-1) [    ] o.a.s.c.ShardLeaderElectionContext I may be the new leader - try and sync
   [junit4]   2> 2211188 INFO  (coreZkRegister-7410-thread-1) [    ] o.a.s.c.SyncStrategy Sync replicas to http://127.0.0.1:37538/collection1/
   [junit4]   2> 2211188 INFO  (OverseerStateUpdate-95903171226501124-127.0.0.1:37538_-n_0000000000) [    ] o.a.s.c.Overseer processMessage: queueSize: 1, message = {
   [junit4]   2>   "operation":"leader",
   [junit4]   2>   "shard":"shard1",
   [junit4]   2>   "collection":"control_collection"} current state version: 1
   [junit4]   2> 2211188 INFO  (coreZkRegister-7410-thread-1) [    ] o.a.s.c.SyncStrategy Sync Success - now sync replicas to me
   [junit4]   2> 2211188 INFO  (coreZkRegister-7410-thread-1) [    ] o.a.s.c.SyncStrategy http://127.0.0.1:37538/collection1/ has no replicas
   [junit4]   2> 2211188 INFO  (coreZkRegister-7410-thread-1) [    ] o.a.s.c.c.SolrZkClient makePath: /collections/control_collection/leaders/shard1
   [junit4]   2> 2211189 INFO  (coreZkRegister-7410-thread-1) [    ] o.a.s.c.ShardLeaderElectionContextBase Creating leader registration node /collections/control_collection/leaders/shard1/leader after winning as /collections/control_collection/leader_elect/shard1/election/95903171226501124-core_node1-n_0000000000
   [junit4]   2> 2211190 INFO  (coreZkRegister-7410-thread-1) [    ] o.a.s.c.ShardLeaderElectionContext I am the new leader: http://127.0.0.1:37538/collection1/ shard1
   [junit4]   2> 2211190 INFO  (OverseerStateUpdate-95903171226501124-127.0.0.1:37538_-n_0000000000) [    ] o.a.s.c.Overseer processMessage: queueSize: 1, message = {
   [junit4]   2>   "operation":"leader",
   [junit4]   2>   "shard":"shard1",
   [junit4]   2>   "collection":"control_collection",
   [junit4]   2>   "base_url":"http://127.0.0.1:37538",
   [junit4]   2>   "core":"collection1",
   [junit4]   2>   "state":"active"} current state version: 1
   [junit4]   2> 2211291 INFO  (zkCallback-2757-thread-1) [    ] o.a.s.c.c.ZkStateReader A cluster state change: [WatchedEvent state:SyncConnected type:NodeDataChanged path:/clusterstate.json], has occurred - updating... (live nodes size: [1])
   [junit4]   2> 2211341 INFO  (coreZkRegister-7410-thread-1) [    ] o.a.s.c.ZkController We are http://127.0.0.1:37538/collection1/ and leader is http://127.0.0.1:37538/collection1/
   [junit4]   2> 2211341 INFO  (coreZkRegister-7410-thread-1) [    ] o.a.s.c.ZkController No LogReplay needed for core=collection1 baseURL=http://127.0.0.1:37538
   [junit4]   2> 2211341 INFO  (coreZkRegister-7410-thread-1) [    ] o.a.s.c.ZkController I am the leader, no recovery necessary
   [junit4]   2> 2211341 INFO  (coreZkRegister-7410-thread-1) [    ] o.a.s.c.ZkController publishing state=active
   [junit4]   2> 2211341 INFO  (coreZkRegister-7410-thread-1) [    ] o.a.s.c.ZkController numShards not found on descriptor - reading it from system property
   [junit4]   2> 2211342 INFO  (OverseerStateUpdate-95903171226501124-127.0.0.1:37538_-n_0000000000) [    ] o.a.s.c.Overseer processMessage: queueSize: 1, message = {
   [junit4]   2>   "core":"collection1",
   [junit4]   2>   "core_node_name":"core_node1",
   [junit4]   2>   "roles":null,
   [junit4]   2>   "base_url":"http://127.0.0.1:37538",
   [junit4]   2>   "node_name":"127.0.0.1:37538_",
   [junit4]   2>   "numShards":"1",
   [junit4]   2>   "state":"active",
   [junit4]   2>   "shard":"shard1",
   [junit4]   2>   "collection":"control_collection",
   [junit4]   2>   "operation":"state"} current state version: 2
   [junit4]   2> 2211342 INFO  (OverseerStateUpdate-95903171226501124-127.0.0.1:37538_-n_0000000000) [    ] o.a.s.c.o.ReplicaMutator Update state numShards=1 message={
   [junit4]   2>   "core":"collection1",
   [junit4]   2>   "core_node_name":"core_node1",
   [junit4]   2>   "roles":null,
   [junit4]   2>   "base_url":"http://127.0.0.1:37538",
   [junit4]   2>   "node_name":"127.0.0.1:37538_",
   [junit4]   2>   "numShards":"1",
   [junit4]   2>   "state":"active",
   [junit4]   2>   "shard":"shard1",
   [junit4]   2>   "collection":"control_collection",
   [junit4]   2>   "operation":"state"}
   [junit4]   2> 2211443 INFO  (zkCallback-2757-thread-1) [    ] o.a.s.c.c.ZkStateReader A cluster state change: [WatchedEvent state:SyncConnected type:NodeDataChanged path:/clusterstate.json], has occurred - updating... (live nodes size: [1])
   [junit4]   2> 2211569 INFO  (TEST-TestReqParamsAPI.test-seed#[450C2F11B0BE0E92]) [    ] o.a.s.c.s.i.CloudSolrClient Final constructed zkHost string: 127.0.0.1:36986/solr
   [junit4]   2> 2211569 INFO  (TEST-TestReqParamsAPI.test-seed#[450C2F11B0BE0E92]) [    ] o.a.s.c.c.SolrZkClient Using default ZkCredentialsProvider
   [junit4]   2> 2211570 INFO  (TEST-TestReqParamsAPI.test-seed#[450C2F11B0BE0E92]) [    ] o.a.s.c.c.ConnectionManager Waiting for client to connect to ZooKeeper
   [junit4]   2> 2211571 INFO  (zkCallback-2761-thread-1) [    ] o.a.s.c.c.ConnectionManager Watcher org.apache.solr.common.cloud.ConnectionManager@1c6c2b1 name:ZooKeeperConnection Watcher:127.0.0.1:36986/solr got event WatchedEvent state:SyncConnected type:None path:null path:null type:None
   [junit4]   2> 2211571 INFO  (TEST-TestReqParamsAPI.test-seed#[450C2F11B0BE0E92]) [    ] o.a.s.c.c.ConnectionManager Client is connected to ZooKeeper
   [junit4]   2> 2211571 INFO  (TEST-TestReqParamsAPI.test-seed#[450C2F11B0BE0E92]) [    ] o.a.s.c.c.SolrZkClient Using default ZkACLProvider
   [junit4]   2> 2211571 INFO  (TEST-TestReqParamsAPI.test-seed#[450C2F11B0BE0E92]) [    ] o.a.s.c.c.ZkStateReader Updating cluster state from ZooKeeper... 
   [junit4]   2> 2211571 INFO  (TEST-TestReqParamsAPI.test-seed#[450C2F11B0BE0E92]) [    ] o.a.s.c.c.ZkStateReader Loaded empty cluster properties
   [junit4]   2> 2211571 INFO  (TEST-TestReqParamsAPI.test-seed#[450C2F11B0BE0E92]) [    ] o.a.s.c.c.ZkStateReader Updated live nodes from ZooKeeper... (0) -> (1)
   [junit4]   2> 2211572 INFO  (TEST-TestReqParamsAPI.test-seed#[450C2F11B0BE0E92]) [    ] o.a.s.c.ChaosMonkey monkey: init - expire sessions:false cause connection loss:false
   [junit4]   2> 2211629 INFO  (TEST-TestReqParamsAPI.test-seed#[450C2F11B0BE0E92]) [    ] o.a.s.SolrTestCaseJ4 Writing core.properties file to /home/jenkins/workspace/Lucene-Solr-master-Linux/solr/build/solr-core/test/J0/temp/solr.handler.TestReqParamsAPI_450C2F11B0BE0E92-001/shard-1-001/cores/collection1
   [junit4]   2> 2211629 INFO  (TEST-TestReqParamsAPI.test-seed#[450C2F11B0BE0E92]) [    ] o.a.s.c.AbstractFullDistribZkTestBase create jetty 1 in directory /home/jenkins/workspace/Lucene-Solr-master-Linux/solr/build/solr-core/test/J0/temp/solr.handler.TestReqParamsAPI_450C2F11B0BE0E92-001/shard-1-001
   [junit4]   2> 2211630 INFO  (TEST-TestReqParamsAPI.test-seed#[450C2F11B0BE0E92]) [    ] o.e.j.s.Server jetty-9.3.8.v20160314
   [junit4]   2> 2211630 INFO  (TEST-TestReqParamsAPI.test-seed#[450C2F11B0BE0E92]) [    ] o.e.j.s.h.ContextHandler Started o.e.j.s.ServletContextHandler@19a5820{/,null,AVAILABLE}
   [junit4]   2> 2211631 INFO  (TEST-TestReqParamsAPI.test-seed#[450C2F11B0BE0E92]) [    ] o.e.j.s.ServerConnector Started ServerConnector@1c5e6d9{HTTP/1.1,[http/1.1]}{127.0.0.1:36710}
   [junit4]   2> 2211631 INFO  (TEST-TestReqParamsAPI.test-seed#[450C2F11B0BE0E92]) [    ] o.e.j.s.Server Started @2213650ms
   [junit4]   2> 2211631 INFO  (TEST-TestReqParamsAPI.test-seed#[450C2F11B0BE0E92]) [    ] o.a.s.c.s.e.JettySolrRunner Jetty properties: {solr.data.dir=/home/jenkins/workspace/Lucene-Solr-master-Linux/solr/build/solr-core/test/J0/temp/solr.handler.TestReqParamsAPI_450C2F11B0BE0E92-001/tempDir-001/jetty1, solrconfig=solrconfig.xml, hostContext=/, hostPort=36710, coreRootDirectory=/home/jenkins/workspace/Lucene-Solr-master-Linux/solr/build/solr-core/test/J0/../../../../../../../../../home/jenkins/workspace/Lucene-Solr-master-Linux/solr/build/solr-core/test/J0/temp/solr.handler.TestReqParamsAPI_450C2F11B0BE0E92-001/shard-1-001/cores}
   [junit4]   2> 2211631 INFO  (TEST-TestReqParamsAPI.test-seed#[450C2F11B0BE0E92]) [    ] o.a.s.s.SolrDispatchFilter SolrDispatchFilter.init(): jdk.internal.loader.ClassLoaders$AppClassLoader@c6a292
   [junit4]   2> 2211631 INFO  (TEST-TestReqParamsAPI.test-seed#[450C2F11B0BE0E92]) [    ] o.a.s.c.SolrResourceLoader new SolrResourceLoader for directory: '/home/jenkins/workspace/Lucene-Solr-master-Linux/solr/build/solr-core/test/J0/temp/solr.handler.TestReqParamsAPI_450C2F11B0BE0E92-001/shard-1-001'
   [junit4]   2> 2211631 INFO  (TEST-TestReqParamsAPI.test-seed#[450C2F11B0BE0E92]) [    ] o.a.s.c.SolrResourceLoader JNDI not configured for solr (NoInitialContextEx)
   [junit4]   2> 2211631 INFO  (TEST-TestReqParamsAPI.test-seed#[450C2F11B0BE0E92]) [    ] o.a.s.c.SolrResourceLoader solr home defaulted to 'solr/' (could not find system property or JNDI)
   [junit4]   2> 2211631 INFO  (TEST-TestReqParamsAPI.test-seed#[450C2F11B0BE0E92]) [    ] o.a.s.c.c.SolrZkClient Using default ZkCredentialsProvider
   [junit4]   2> 2211632 INFO  (TEST-TestReqParamsAPI.test-seed#[450C2F11B0BE0E92]) [    ] o.a.s.c.c.ConnectionManager Waiting for client to connect to ZooKeeper
   [junit4]   2> 2211632 INFO  (zkCallback-2762-thread-1) [    ] o.a.s.c.c.ConnectionManager Watcher org.apache.solr.common.cloud.ConnectionManager@1406c98 name:ZooKeeperConnection Watcher:127.0.0.1:36986/solr got event WatchedEvent state:SyncConnected type:None path:null path:null type:None
   [junit4]   2> 2211632 INFO  (TEST-TestReqParamsAPI.test-seed#[450C2F11B0BE0E92]) [    ] o.a.s.c.c.ConnectionManager Client is connected to ZooKeeper
   [junit4]   2> 2211633 INFO  (TEST-TestReqParamsAPI.test-seed#[450C2F11B0BE0E92]) [    ] o.a.s.c.c.SolrZkClient Using default ZkACLProvider
   [junit4]   2> 2211633 INFO  (TEST-TestReqParamsAPI.test-seed#[450C2F11B0BE0E92]) [    ] o.a.s.s.SolrDispatchFilter Loading solr.xml from SolrHome (not found in ZooKeeper)
   [junit4]   2> 2211633 INFO  (TEST-TestReqParamsAPI.test-seed#[450C2F11B0BE0E92]) [    ] o.a.s.c.SolrXmlConfig Loading container configuration from /home/jenkins/workspace/Lucene-Solr-master-Linux/solr/build/solr-core/test/J0/temp/solr.handler.TestReqParamsAPI_450C2F11B0BE0E92-001/shard-1-001/solr.xml
   [junit4]   2> 2211636 INFO  (TEST-TestReqParamsAPI.test-seed#[450C2F11B0BE0E92]) [    ] o.a.s.c.CorePropertiesLocator Config-defined core root directory: /home/jenkins/workspace/Lucene-Solr-master-Linux/solr/build/solr-core/test/J0/../../../../../../../../../home/jenkins/workspace/Lucene-Solr-master-Linux/solr/build/solr-core/test/J0/temp/solr.handler.TestReqParamsAPI_450C2F11B0BE0E92-001/shard-1-001/cores
   [junit4]   2> 2211636 INFO  (TEST-TestReqParamsAPI.test-seed#[450C2F11B0BE0E92]) [    ] o.a.s.c.CoreContainer New CoreContainer 32163924
   [junit4]   2> 2211636 INFO  (TEST-TestReqParamsAPI.test-seed#[450C2F11B0BE0E92]) [    ] o.a.s.c.CoreContainer Loading cores into CoreContainer [instanceDir=/home/jenkins/workspace/Lucene-Solr-master-Linux/solr/build/solr-core/test/J0/temp/solr.handler.TestReqParamsAPI_450C2F11B0BE0E92-001/shard-1-001]
   [junit4]   2> 2211636 WARN  (TEST-TestReqParamsAPI.test-seed#[450C2F11B0BE0E92]) [    ] o.a.s.c.CoreContainer Couldn't add files from /home/jenkins/workspace/Lucene-Solr-master-Linux/solr/build/solr-core/test/J0/temp/solr.handler.TestReqParamsAPI_450C2F11B0BE0E92-001/shard-1-001/lib to classpath: /home/jenkins/workspace/Lucene-Solr-master-Linux/solr/build/solr-core/test/J0/temp/solr.handler.TestReqParamsAPI_450C2F11B0BE0E92-001/shard-1-001/lib
   [junit4]   2> 2211636 INFO  (TEST-TestReqParamsAPI.test-seed#[450C2F11B0BE0E92]) [    ] o.a.s.h.c.HttpShardHandlerFactory created with socketTimeout : 90000,urlScheme : ,connTimeout : 15000,maxConnectionsPerHost : 20,maxConnections : 10000,corePoolSize : 0,maximumPoolSize : 2147483647,maxThreadIdleTime : 5,sizeOfQueue : -1,fairnessPolicy : false,
   [junit4]   2> 2211638 INFO  (TEST-TestReqParamsAPI.test-seed#[450C2F11B0BE0E92]) [    ] o.a.s.u.UpdateShardHandler Creating UpdateShardHandler HTTP client with params: 
   [junit4]   2> 2211639 INFO  (TEST-TestReqParamsAPI.test-seed#[450C2F11B0BE0E92]) [    ] o.a.s.l.LogWatcher SLF4J impl is org.slf4j.impl.Log4jLoggerFactory
   [junit4]   2> 2211639 INFO  (TEST-TestReqParamsAPI.test-seed#[450C2F11B0BE0E92]) [    ] o.a.s.l.LogWatcher Registering Log Listener [Log4j (org.slf4j.impl.Log4jLoggerFactory)]
   [junit4]   2> 2211639 INFO  (TEST-TestReqParamsAPI.test-seed#[450C2F11B0BE0E92]) [    ] o.a.s.c.ZkContainer Zookeeper client=127.0.0.1:36986/solr
   [junit4]   2> 2211639 INFO  (TEST-TestReqParamsAPI.test-seed#[450C2F11B0BE0E92]) [    ] o.a.s.c.ZkController zkHost includes chroot
   [junit4]   2> 2211639 INFO  (TEST-TestReqParamsAPI.test-seed#[450C2F11B0BE0E92]) [    ] o.a.s.c.c.SolrZkClient Using default ZkCredentialsProvider
   [junit4]   2> 2211641 INFO  (TEST-TestReqParamsAPI.test-seed#[450C2F11B0BE0E92]) [    ] o.a.s.c.c.ConnectionManager Waiting for client to connect to ZooKeeper
   [junit4]   2> 2211642 INFO  (zkCallback-2765-thread-1) [    ] o.a.s.c.c.ConnectionManager Watcher org.apache.solr.common.cloud.ConnectionManager@93f701 name:ZooKeeperConnection Watcher:127.0.0.1:36986 got event WatchedEvent state:SyncConnected type:None path:null path:null type:None
   [junit4]   2> 2211642 INFO  (TEST-TestReqParamsAPI.test-seed#[450C2F11B0BE0E92]) [    ] o.a.s.c.c.ConnectionManager Client is connected to ZooKeeper
   [junit4]   2> 2211642 INFO  (TEST-TestReqParamsAPI.test-seed#[450C2F11B0BE0E92]) [    ] o.a.s.c.c.SolrZkClient Using default ZkACLProvider
   [junit4]   2> 2211643 INFO  (TEST-TestReqParamsAPI.test-seed#[450C2F11B0BE0E92]) [    ] o.a.s.c.ZkController Added new OnReconnect listener org.apache.solr.cloud.ZkController$$Lambda$118/15276833@11f1e32
   [junit4]   2> 2211643 INFO  (TEST-TestReqParamsAPI.test-seed#[450C2F11B0BE0E92]) [    ] o.a.s.c.c.ConnectionManager Waiting for client to connect to ZooKeeper
   [junit4]   2> 2211643 INFO  (zkCallback-2766-thread-1) [    ] o.a.s.c.c.ConnectionManager Watcher org.apache.solr.common.cloud.ConnectionManager@ab0267 name:ZooKeeperConnection Watcher:127.0.0.1:36986/solr got event WatchedEvent state:SyncConnected type:None path:null path:null type:None
   [junit4]   2> 2211643 INFO  (TEST-TestReqParamsAPI.test-seed#[450C2F11B0BE0E92]) [    ] o.a.s.c.c.ConnectionManager Client is connected to ZooKeeper
   [junit4]   2> 2211646 INFO  (TEST-TestReqParamsAPI.test-seed#[450C2F11B0BE0E92]) [    ] o.a.s.c.c.ZkStateReader Updating cluster state from ZooKeeper... 
   [junit4]   2> 2211646 INFO  (TEST-TestReqParamsAPI.test-seed#[450C2F11B0BE0E92]) [    ] o.a.s.c.c.ZkStateReader Loaded empty cluster properties
   [junit4]   2> 2211647 INFO  (TEST-TestReqParamsAPI.test-seed#[450C2F11B0BE0E92]) [    ] o.a.s.c.c.ZkStateReader Updated live nodes from ZooKeeper... (0) -> (1)
   [junit4]   2> 2211647 INFO  (TEST-TestReqParamsAPI.test-seed#[450C2F11B0BE0E92]) [    ] o.a.s.c.Overseer Overseer (id=null) closing
   [junit4]   2> 2211648 INFO  (TEST-TestReqParamsAPI.test-seed#[450C2F11B0BE0E92]) [    ] o.a.s.c.LeaderElector Joined leadership election with path: /overseer_elect/election/95903171226501128-127.0.0.1:36710_-n_0000000001
   [junit4]   2> 2211648 INFO  (TEST-TestReqParamsAPI.test-seed#[450C2F11B0BE0E92]) [    ] o.a.s.c.LeaderElector Watching path /overseer_elect/election/95903171226501124-127.0.0.1:37538_-n_0000000000 to know if I could be the leader
   [junit4]   2> 2211648 INFO  (TEST-TestReqParamsAPI.test-seed#[450C2F11B0BE0E92]) [    ] o.a.s.c.ZkController Publish node=127.0.0.1:36710_ as DOWN
   [junit4]   2> 2211649 INFO  (OverseerStateUpdate-95903171226501124-127.0.0.1:37538_-n_0000000000) [    ] o.a.s.c.Overseer processMessage: queueSize: 1, message = {
   [junit4]   2>   "operation":"downnode",
   [junit4]   2>   "node_name":"127.0.0.1:36710_"} current state version: 3
   [junit4]   2> 2211649 INFO  (OverseerStateUpdate-95903171226501124-127.0.0.1:37538_-n_0000000000) [    ] o.a.s.c.o.NodeMutator DownNode state invoked for node: 127.0.0.1:36710_
   [junit4]   2> 2211750 INFO  (zkCallback-2757-thread-1) [    ] o.a.s.c.c.ZkStateReader A cluster state change: [WatchedEvent state:SyncConnected type:NodeDataChanged path:/clusterstate.json], has occurred - updating... (live nodes size: [1])
   [junit4]   2> 2211750 INFO  (zkCallback-2766-thread-1) [    ] o.a.s.c.c.ZkStateReader A cluster state change: [WatchedEvent state:SyncConnected type:NodeDataChanged path:/clusterstate.json], has occurred - updating... (live nodes size: [1])
   [junit4]   2> 2211750 INFO  (zkCallback-2761-thread-1) [    ] o.a.s.c.c.ZkStateReader A cluster state change: [WatchedEvent state:SyncConnected type:NodeDataChanged path:/clusterstate.json], has occurred - updating... (live nodes size: [1])
   [junit4]   2> 2212649 INFO  (TEST-TestReqParamsAPI.test-seed#[450C2F11B0BE0E92]) [    ] o.a.s.c.ZkController Register node as live in ZooKeeper:/live_nodes/127.0.0.1:36710_
   [junit4]   2> 2212649 INFO  (TEST-TestReqParamsAPI.test-seed#[450C2F11B0BE0E92]) [    ] o.a.s.c.c.SolrZkClient makePath: /live_nodes/127.0.0.1:36710_
   [junit4]   2> 2212650 INFO  (zkCallback-2766-thread-1) [    ] o.a.s.c.c.ZkStateReader A live node change: [WatchedEvent state:SyncConnected type:NodeChildrenChanged path:/live_nodes], has occurred - updating... (live nodes size: [1])
   [junit4]   2> 2212650 INFO  (zkCallback-2757-thread-1) [    ] o.a.s.c.c.ZkStateReader A live node change: [WatchedEvent state:SyncConnected type:NodeChildrenChanged path:/live_nodes], has occurred - updating... (live nodes size: [1])
   [junit4]   2> 2212650 INFO  (zkCallback-2761-thread-1) [    ] o.a.s.c.c.ZkStateReader A live node change: [WatchedEvent state:SyncConnected type:NodeChildrenChanged path:/live_nodes], has occurred - updating... (live nodes size: [1])
   [junit4]   2> 2212650 INFO  (zkCallback-2766-thread-1) [    ] o.a.s.c.c.ZkStateReader Updated live nodes from ZooKeeper... (1) -> (2)
   [junit4]   2> 2212650 INFO  (zkCallback-2757-thread-1) [    ] o.a.s.c.c.ZkStateReader Updated live nodes from ZooKeeper... (1) -> (2)
   [junit4]   2> 2212650 INFO  (zkCallback-2761-thread-1) [    ] o.a.s.c.c.ZkStateReader Updated live nodes from ZooKeeper... (1) -> (2)
   [junit4]   2> 2212662 INFO  (TEST-TestReqParamsAPI.test-seed#[450C2F11B0BE0E92]) [    ] o.a.s.c.CoreContainer Security conf doesn't exist. Skipping setup for authorization module.
   [junit4]   2> 2212662 INFO  (TEST-TestReqParamsAPI.test-seed#[450C2F11B0BE0E92]) [    ] o.a.s.c.CoreContainer No authentication plugin used.
   [junit4]   2> 2212662 INFO  (TEST-TestReqParamsAPI.test-seed#[450C2F11B0BE0E92]) [    ] o.a.s.c.CorePropertiesLocator Looking for core definitions underneath /home/jenkins/workspace/Lucene-Solr-master-Linux/solr/build/solr-core/test/J0/../../../../../../../../../home/jenkins/workspace/Lucene-Solr-master-Linux/solr/build/solr-core/test/J0/temp/solr.handler.TestReqParamsAPI_450C2F11B0BE0E92-001/shard-1-001/cores
   [junit4]   2> 2212663 INFO  (TEST-TestReqParamsAPI.test-seed#[450C2F11B0BE0E92]) [    ] o.a.s.c.CoreDescriptor Created CoreDescriptor: {name=collection1, config=solrconfig.xml, transient=false, schema=schema.xml, loadOnStartup=true, configSetProperties=configsetprops.json, collection=collection1, coreNodeName=, dataDir=data/, shard=}
   [junit4]   2> 2212663 INFO  (TEST-TestReqParamsAPI.test-seed#[450C2F11B0BE0E92]) [    ] o.a.s.c.CorePropertiesLocator Found core collection1 in /home/jenkins/workspace/Lucene-Solr-master-Linux/solr/build/solr-core/test/J0/../../../../../../../../../home/jenkins/workspace/Lucene-Solr-master-Linux/solr/build/solr-core/test/J0/temp/solr.handler.TestReqParamsAPI_450C2F11B0BE0E92-001/shard-1-001/cores/collection1
   [junit4]   2> 2212663 INFO  (TEST-TestReqParamsAPI.test-seed#[450C2F11B0BE0E92]) [    ] o.a.s.c.CorePropertiesLocator Found 1 core definitions
   [junit4]   2> 2212664 INFO  (coreLoadExecutor-7427-thread-1) [    ] o.a.s.c.ZkController publishing state=down
   [junit4]   2> 2212664 INFO  (TEST-TestReqParamsAPI.test-seed#[450C2F11B0BE0E92]) [    ] o.a.s.s.SolrDispatchFilter user.dir=/home/jenkins/workspace/Lucene-Solr-master-Linux/solr/build/solr-core/test/J0
   [junit4]   2> 2212664 INFO  (coreLoadExecutor-7427-thread-1) [    ] o.a.s.c.ZkController numShards not found on descriptor - reading it from system property
   [junit4]   2> 2212664 INFO  (TEST-TestReqParamsAPI.test-seed#[450C2F11B0BE0E92]) [    ] o.a.s.s.SolrDispatchFilter SolrDispatchFilter.init() done
   [junit4]   2> 2212664 INFO  (coreLoadExecutor-7427-thread-1) [    ] o.a.s.c.ZkController Collection collection1 not visible yet, but flagging it so a watch is registered when it becomes visible
   [junit4]   2> 2212664 INFO  (OverseerStateUpdate-95903171226501124-127.0.0.1:37538_-n_0000000000) [    ] o.a.s.c.Overseer processMessage: queueSize: 1, message = {
   [junit4]   2>   "core":"collection1",
   [junit4]   2>   "roles":null,
   [junit4]   2>   "base_url":"http://127.0.0.1:36710",
   [junit4]   2>   "node_name":"127.0.0.1:36710_",
   [junit4]   2>   "numShards":"2",
   [junit4]   2>   "state":"down",
   [junit4]   2>   "shard":null,
   [junit4]   2>   "collection":"collection1",
   [junit4]   2>   "operation":"state"} current state version: 4
   [junit4]   2> 2212664 INFO  (coreLoadExecutor-7427-thread-1) [    ] o.a.s.c.c.ZkStateReader Deleting data for [collection1]
   [junit4]   2> 2212664 INFO  (OverseerStateUpdate-95903171226501124-127.0.0.1:37538_-n_0000000000) [    ] o.a.s.c.o.ReplicaMutator Update state numShards=2 message={
   [junit4]   2>   "core":"collection1",
   [junit4]   2>   "roles":null,
   [junit4]   2>   "base_url":"http://127.0.0.1:36710",
   [junit4]   2>   "node_name":"127.0.0.1:36710_",
   [junit4]   2>   "numShards":"2",
   [junit4]   2>   "state":"down",
   [junit4]   2>   "shard":null,
   [junit4]   2>   "collection":"collection1",
   [junit4]   2>   "operation":"state"}
   [junit4]   2> 2212664 INFO  (OverseerStateUpdate-95903171226501124-127.0.0.1:37538_-n_0000000000) [    ] o.a.s.c.o.ClusterStateMutator building a new cName: collection1
   [junit4]   2> 2212665 INFO  (OverseerStateUpdate-95903171226501124-127.0.0.1:37538_-n_0000000000) [    ] o.a.s.c.o.ReplicaMutator Assigning new node to shard shard=shard2
   [junit4]   2> 2212665 INFO  (coreLoadExecutor-7427-thread-1) [    ] o.a.s.c.ZkController look for our core node name
   [junit4]   2> 2212766 INFO  (zkCallback-2757-thread-1) [    ] o.a.s.c.c.ZkStateReader A cluster state change: [WatchedEvent state:SyncConnected type:NodeDataChanged path:/clusterstate.json], has occurred - updating... (live nodes size: [2])
   [junit4]   2> 2212766 INFO  (zkCallback-2766-thread-1) [    ] o.a.s.c.c.ZkStateReader A cluster state change: [WatchedEvent state:SyncConnected type:NodeDataChanged path:/clusterstate.json], has occurred - updating... (live nodes size: [2])
   [junit4]   2> 2212766 INFO  (zkCallback-2761-thread-1) [    ] o.a.s.c.c.ZkStateReader A cluster state change: [WatchedEvent state:SyncConnected type:NodeDataChanged path:/clusterstate.json], has occurred - updating... (live nodes size: [2])
   [junit4]   2> 2213665 INFO  (coreLoadExecutor-7427-thread-1) [    ] o.a.s.c.ZkController waiting to find shard id in clusterstate for collection1
   [junit4]   2> 2213665 INFO  (coreLoadExecutor-7427-thread-1) [    ] o.a.s.c.ZkController Check for collection zkNode:collection1
   [junit4]   2> 2213665 INFO  (coreLoadExecutor-7427-thread-1) [    ] o.a.s.c.ZkController Collection zkNode exists
   [junit4]   2> 2213666 INFO  (coreLoadExecutor-7427-thread-1) [    ] o.a.s.c.c.ZkStateReader Load collection config from: [/collections/collection1]
   [junit4]   2> 2213666 INFO  (coreLoadExecutor-7427-thread-1) [    ] o.a.s.c.c.ZkStateReader path=[/collections/collection1] [configName]=[conf1] specified config exists in ZooKeeper
   [junit4]   2> 2213666 INFO  (coreLoadExecutor-7427-thread-1) [    ] o.a.s.c.SolrResourceLoader new SolrResourceLoader for directory: '/home/jenkins/workspace/Lucene-Solr-master-Linux/solr/build/solr-core/test/J0/temp/solr.handler.TestReqParamsAPI_450C2F11B0BE0E92-001/shard-1-001/cores/collection1'
   [junit4]   2> 2213666 INFO  (coreLoadExecutor-7427-thread-1) [    ] o.a.s.c.SolrResourceLoader JNDI not configured for solr (NoInitialContextEx)
   [junit4]   2> 2213666 INFO  (coreLoadExecutor-7427-thread-1) [    ] o.a.s.c.SolrResourceLoader solr home defaulted to 'solr/' (could not find system property or JNDI)
   [junit4]   2> 2213667 INFO  (coreLoadExecutor-7427-thread-1) [    ] o.a.s.c.Config loaded config solrconfig.xml with version 0 
   [junit4]   2> 2213669 INFO  (coreLoadExecutor-7427-thread-1) [    ] o.a.s.c.SolrConfig current version of requestparams : -1
   [junit4]   2> 2213671 WARN  (coreLoadExecutor-7427-thread-1) [    ] o.a.s.c.Config Beginning with Solr 5.5, <mergePolicy> is deprecated, use <mergePolicyFactory> instead.
   [junit4]   2> 2213671 INFO  (coreLoadExecutor-7427-thread-1) [    ] o.a.s.c.SolrConfig Using Lucene MatchVersion: 7.0.0
   [junit4]   2> 2213676 INFO  (coreLoadExecutor-7427-thread-1) [    ] o.a.s.c.SolrConfig Loaded SolrConfig: solrconfig.xml
   [junit4]   2> 2213680 INFO  (coreLoadExecutor-7427-thread-1) [    ] o.a.s.s.IndexSchema [collection1] Schema name=test
   [junit4]   2> 2213739 INFO  (coreLoadExecutor-7427-thread-1) [    ] o.a.s.s.OpenExchangeRatesOrgProvider Initialized with rates=open-exchange-rates.json, refreshInterval=1440.
   [junit4]   2> 2213743 INFO  (coreLoadExecutor-7427-thread-1) [    ] o.a.s.s.IndexSchema default search field in schema is text
   [junit4]   2> 2213743 INFO  (coreLoadExecutor-7427-thread-1) [    ] o.a.s.s.IndexSchema unique key field: id
   [junit4]   2> 2213747 INFO  (coreLoadExecutor-7427-thread-1) [    ] o.a.s.s.FileExchangeRateProvider Reloading exchange rates from file currency.xml
   [junit4]   2> 2213748 INFO  (coreLoadExecutor-7427-thread-1) [    ] o.a.s.s.FileExchangeRateProvider Reloading exchange rates from file currency.xml
   [junit4]   2> 2213749 INFO  (coreLoadExecutor-7427-thread-1) [    ] o.a.s.s.OpenExchangeRatesOrgProvider Reloading exchange rates from open-exchange-rates.json
   [junit4]   2> 2213749 INFO  (coreLoadExecutor-7427-thread-1) [    ] o.a.s.s.OpenExchangeRatesOrgProvider Reloading exchange rates from open-exchange-rates.json
   [junit4]   2> 2213750 INFO  (coreLoadExecutor-7427-thread-1) [    ] o.a.s.c.ConfigSetProperties Did not find ConfigSet properties, assuming default properties: Can't find resource 'configsetprops.json' in classpath or '/configs/conf1', cwd=/home/jenkins/workspace/Lucene-Solr-master-Linux/solr/build/solr-core/test/J0
   [junit4]   2> 2213750 INFO  (coreLoadExecutor-7427-thread-1) [    ] o.a.s.c.CoreContainer Creating SolrCore 'collection1' using configuration from collection collection1
   [junit4]   2> 2213750 INFO  (coreLoadExecutor-7427-thread-1) [    ] o.a.s.c.SolrCore org.apache.solr.core.MockDirectoryFactory
   [junit4]   2> 2213750 INFO  (coreLoadExecutor-7427-thread-1) [    ] o.a.s.c.SolrCore [[collection1] ] Opening new SolrCore at [/home/jenkins/workspace/Lucene-Solr-master-Linux/solr/build/solr-core/test/J0/temp/solr.handler.TestReqParamsAPI_450C2F11B0BE0E92-001/shard-1-001/cores/collection1], dataDir=[/home/jenkins/workspace/Lucene-Solr-master-Linux/solr/build/solr-core/test/J0/../../../../../../../../../home/jenkins/workspace/Lucene-Solr-master-Linux/solr/build/solr-core/test/J0/temp/solr.handler.TestReqParamsAPI_450C2F11B0BE0E92-001/shard-1-001/cores/collection1/data/]
   [junit4]   2> 2213750 INFO  (coreLoadExecutor-7427-thread-1) [    ] o.a.s.c.JmxMonitoredMap JMX monitoring is enabled. Adding Solr mbeans to JMX Server: com.sun.jmx.mbeanserver.JmxMBeanServer@16e7bcb
   [junit4]   2> 2213751 INFO  (coreLoadExecutor-7427-thread-1) [    ] o.a.s.c.CachingDirectoryFactory return new directory for /home/jenkins/workspace/Lucene-Solr-master-Linux/solr/build/solr-core/test/J0/../../../../../../../../../home/jenkins/workspace/Lucene-Solr-master-Linux/solr/build/solr-core/test/J0/temp/solr.handler.TestReqParamsAPI_450C2F11B0BE0E92-001/shard-1-001/cores/collection1/data
   [junit4]   2> 2213751 INFO  (coreLoadExecutor-7427-thread-1) [    ] o.a.s.c.SolrCore New index directory detected: old=null new=/home/jenkins/workspace/Lucene-Solr-master-Linux/solr/build/solr-core/test/J0/../../../../../../../../../home/jenkins/workspace/Lucene-Solr-master-Linux/solr/build/solr-core/test/J0/temp/solr.handler.TestReqParamsAPI_450C2F11B0BE0E92-001/shard-1-001/cores/collection1/data/index/
   [junit4]   2> 2213751 WARN  (coreLoadExecutor-7427-thread-1) [    ] o.a.s.c.SolrCore [collection1] Solr index directory '/home/jenkins/workspace/Lucene-Solr-master-Linux/solr/build/solr-core/test/J0/../../../../../../../../../home/jenkins/workspace/Lucene-Solr-master-Linux/solr/build/solr-core/test/J0/temp/solr.handler.TestReqParamsAPI_450C2F11B0BE0E92-001/shard-1-001/cores/collection1/data/index' doesn't exist. Creating new index...
   [junit4]   2> 2213751 INFO  (coreLoadExecutor-7427-thread-1) [    ] o.a.s.c.CachingDirectoryFactory return new directory for /home/jenkins/workspace/Lucene-Solr-master-Linux/solr/build/solr-core/test/J0/../../../../../../../../../home/jenkins/workspace/Lucene-Solr-master-Linux/solr/build/solr-core/test/J0/temp/solr.handler.TestReqParamsAPI_450C2F11B0BE0E92-001/shard-1-001/cores/collection1/data/index
   [junit4]   2> 2213751 INFO  (coreLoadExecutor-7427-thread-1) [    ] o.a.s.u.RandomMergePolicy RandomMergePolicy wrapping class org.apache.lucene.index.LogByteSizeMergePolicy: [LogByteSizeMergePolicy: minMergeSize=1677721, mergeFactor=48, maxMergeSize=2147483648, maxMergeSizeForForcedMerge=9223372036854775807, calibrateSizeByDeletes=false, maxMergeDocs=2147483647, maxCFSSegmentSizeMB=8.796093022207999E12, noCFSRatio=0.0]
   [junit4]   2> 2213752 INFO  (coreLoadExecutor-7427-thread-1) [    ] o.a.s.c.SolrDeletionPolicy SolrDeletionPolicy.onCommit: commits: num=1
   [junit4]   2> 	commit{dir=MockDirectoryWrapper(RAMDirectory@1a0442a lockFactory=org.apache.lucene.store.SingleInstanceLockFactory@1866823),segFN=segments_1,generation=1}
   [junit4]   2> 2213752 INFO  (coreLoadExecutor-7427-thread-1) [    ] o.a.s.c.SolrDeletionPolicy newest commit generation = 1
   [junit4]   2> 2213752 INFO  (OldIndexDirectoryCleanupThreadForCore-collection1) [    ] o.a.s.c.SolrCore Looking for old index directories to cleanup for core collection1 in /home/jenkins/workspace/Lucene-Solr-master-Linux/solr/build/solr-core/test/J0/../../../../../../../../../home/jenkins/workspace/Lucene-Solr-master-Linux/solr/build/solr-core/test/J0/temp/solr.handler.TestReqParamsAPI_450C2F11B0BE0E92-001/shard-1-001/cores/collection1/data/
   [junit4]   2> 2213752 WARN  (OldIndexDirectoryCleanupThreadForCore-collection1) [    ] o.a.s.c.DirectoryFactory /home/jenkins/workspace/Lucene-Solr-master-Linux/solr/build/solr-core/test/J0/../../../../../../../../../home/jenkins/workspace/Lucene-Solr-master-Linux/solr/build/solr-core/test/J0/temp/solr.handler.TestReqParamsAPI_450C2F11B0BE0E92-001/shard-1-001/cores/collection1/data/ does not point to a valid data directory; skipping clean-up of old index directories.
   [junit4]   2> 2213754 INFO  (coreLoadExecutor-7427-thread-1) [    ] o.a.s.u.p.UpdateRequestProcessorChain creating updateRequestProcessorChain "nodistrib"
   [junit4]   2> 2213754 INFO  (coreLoadExecutor-7427-thread-1) [    ] o.a.s.u.p.UpdateRequestProcessorChain creating updateRequestProcessorChain "dedupe"
   [junit4]   2> 2213754 INFO  (coreLoadExecutor-7427-thread-1) [    ] o.a.s.u.p.UpdateRequestProcessorChain inserting DistributedUpdateProcessorFactory into updateRequestProcessorChain "dedupe"
   [junit4]   2> 2213754 INFO  (coreLoadExecutor-7427-thread-1) [    ] o.a.s.u.p.UpdateRequestProcessorChain creating updateRequestProcessorChain "stored_sig"
   [junit4]   2> 2213754 INFO  (coreLoadExecutor-7427-thread-1) [    ] o.a.s.u.p.UpdateRequestProcessorChain inserting DistributedUpdateProcessorFactory into updateRequestProcessorChain "stored_sig"
   [junit4]   2> 2213754 INFO  (coreLoadExecutor-7427-thread-1) [    ] o.a.s.u.p.UpdateRequestProcessorChain creating updateRequestProcessorChain "distrib-dup-test-chain-explicit"
   [junit4]   2> 2213754 INFO  (coreLoadExecutor-7427-thread-1) [    ] o.a.s.u.p.UpdateRequestProcessorChain creating updateRequestProcessorChain "distrib-dup-test-chain-implicit"
   [junit4]   2> 2213755 INFO  (coreLoadExecutor-7427-thread-1) [    ] o.a.s.u.p.UpdateRequestProcessorChain inserting DistributedUpdateProcessorFactory into updateRequestProcessorChain "distrib-dup-test-chain-implicit"
   [junit4]   2> 2213755 INFO  (coreLoadExecutor-7427-thread-1) [    ] o.a.s.c.SolrCore no updateRequestProcessorChain defined as default, creating implicit default
   [junit4]   2> 2213755 WARN  (coreLoadExecutor-7427-thread-1) [    ] o.a.s.c.RequestHandlers INVALID paramSet a in requestHandler {type = requestHandler,name = /dump,class = DumpRequestHandler,args = {defaults={a=A,b=B}}}
   [junit4]   2> 2213756 INFO  (coreLoadExecutor-7427-thread-1) [    ] o.a.s.h.l.XMLLoader xsltCacheLifetimeSeconds=60
   [junit4]   2> 2213756 INFO  (coreLoadExecutor-7427-thread-1) [    ] o.a.s.h.l.XMLLoader xsltCacheLifetimeSeconds=60
   [junit4]   2> 2213757 INFO  (coreLoadExecutor-7427-thread-1) [    ] o.a.s.h.l.XMLLoader xsltCacheLifetimeSeconds=60
   [junit4]   2> 2213758 INFO  (coreLoadExecutor-7427-thread-1) [    ] o.a.s.h.l.XMLLoader xsltCacheLifetimeSeconds=60
   [junit4]   2> 2213760 INFO  (coreLoadExecutor-7427-thread-1) [    ] o.a.s.c.RequestHandlers Registered paths: /admin/mbeans,standard,/update/json/docs,/admin/luke,/export,/get,/admin/properties,/update/json,/admin/threads,/dump,/update/csv,/sql,/graph,/admin/segments,/admin/system,/replication,/config,/stream,/schema,/admin/plugins,/admin/logging,/admin/ping,/update,/admin/file
   [junit4]   2> 2213760 INFO  (coreLoadExecutor-7427-thread-1) [    ] o.a.s.c.SolrCore Using default statsCache cache: org.apache.solr.search.stats.LocalStatsCache
   [junit4]   2> 2213760 INFO  (coreLoadExecutor-7427-thread-1) [    ] o.a.s.u.UpdateHandler Using UpdateLog implementation: org.apache.solr.update.UpdateLog
   [junit4]   2> 2213760 INFO  (coreLoadExecutor-7427-thread-1) [    ] o.a.s.u.UpdateLog Initializing UpdateLog: dataDir= defaultSyncLevel=FLUSH numRecordsToKeep=100 maxNumLogsToKeep=10 numVersionBuckets=65536
   [junit4]   2> 2213761 INFO  (coreLoadExecutor-7427-thread-1) [    ] o.a.s.u.CommitTracker Hard AutoCommit: disabled
   [junit4]   2> 2213761 INFO  (coreLoadExecutor-7427-thread-1) [    ] o.a.s.u.CommitTracker Soft AutoCommit: disabled
   [junit4]   2> 2213762 INFO  (coreLoadExecutor-7427-thread-1) [    ] o.a.s.u.RandomMergePolicy RandomMergePolicy wrapping class org.apache.lucene.index.TieredMergePolicy: [TieredMergePolicy: maxMergeAtOnce=39, maxMergeAtOnceExplicit=26, maxMergedSegmentMB=71.08984375, floorSegmentMB=0.2373046875, forceMergeDeletesPctAllowed=26.035403851071994, segmentsPerTier=10.0, maxCFSSegmentSizeMB=8.796093022207999E12, noCFSRatio=0.2834454109106882
   [junit4]   2> 2213762 INFO  (coreLoadExecutor-7427-thread-1) [    ] o.a.s.c.SolrDeletionPolicy SolrDeletionPolicy.onInit: commits: num=1
   [junit4]   2> 	commit{dir=MockDirectoryWrapper(RAMDirectory@1a0442a lockFactory=org.apache.lucene.store.SingleInstanceLockFactory@1866823),segFN=segments_1,generation=1}
   [junit4]   2> 2213762 INFO  (coreLoadExecutor-7427-thread-1) [    ] o.a.s.c.SolrDeletionPolicy newest commit generation = 1
   [junit4]   2> 2213762 INFO  (coreLoadExecutor-7427-thread-1) [    ] o.a.s.s.SolrIndexSearcher Opening [Searcher@180f1fc[collection1] main]
   [junit4]   2> 2213762 INFO  (coreLoadExecutor-7427-thread-1) [    ] o.a.s.c.c.ZkStateReader Load collection config from: [/collections/collection1]
   [junit4]   2> 2213762 INFO  (coreLoadExecutor-7427-thread-1) [    ] o.a.s.c.c.ZkStateReader path=[/collections/collection1] [configName]=[conf1] specified config exists in ZooKeeper
   [junit4]   2> 2213762 INFO  (coreLoadExecutor-7427-thread-1) [    ] o.a.s.r.ManagedResourceStorage Setting up ZooKeeper-based storage for the RestManager with znodeBase: /configs/conf1
   [junit4]   2> 2213763 INFO  (coreLoadExecutor-7427-thread-1) [    ] o.a.s.r.ManagedResourceStorage Configured ZooKeeperStorageIO with znodeBase: /configs/conf1
   [junit4]   2> 2213763 INFO  (coreLoadExecutor-7427-thread-1) [    ] o.a.s.r.RestManager Initializing RestManager with initArgs: {}
   [junit4]   2> 2213763 INFO  (coreLoadExecutor-7427-thread-1) [    ] o.a.s.r.ManagedResourceStorage Reading _rest_managed.json using ZooKeeperStorageIO:path=/configs/conf1
   [junit4]   2> 2213763 INFO  (coreLoadExecutor-7427-thread-1) [    ] o.a.s.r.ManagedResourceStorage No data found for znode /configs/conf1/_rest_managed.json
   [junit4]   2> 2213763 INFO  (coreLoadExecutor-7427-thread-1) [    ] o.a.s.r.ManagedResourceStorage Loaded null at path _rest_managed.json using ZooKeeperStorageIO:path=/configs/conf1
   [junit4]   2> 2213763 INFO  (coreLoadExecutor-7427-thread-1) [    ] o.a.s.r.RestManager Initializing 0 registered ManagedResources
   [junit4]   2> 2213763 INFO  (coreLoadExecutor-7427-thread-1) [    ] o.a.s.h.ReplicationHandler Commits will be reserved for  10000
   [junit4]   2> 2213764 INFO  (searcherExecutor-7428-thread-1) [    ] o.a.s.c.SolrCore [collection1] Registered new searcher Searcher@180f1fc[collection1] main{ExitableDirectoryReader(UninvertingDirectoryReader())}
   [junit4]   2> 2213764 INFO  (coreLoadExecutor-7427-thread-1) [    ] o.a.s.u.UpdateLog Looking up max value of version field to seed version buckets
   [junit4]   2> 2213764 INFO  (coreLoadExecutor-7427-thread-1) [    ] o.a.s.u.VersionInfo Refreshing highest value of _version_ for 65536 version buckets from index
   [junit4]   2> 2213764 INFO  (coreLoadExecutor-7427-thread-1) [    ] o.a.s.u.VersionInfo No terms found for _version_, cannot seed version bucket highest value from index
   [junit4]   2> 2213764 INFO  (coreLoadExecutor-7427-thread-1) [    ] o.a.s.u.UpdateLog Could not find max version in index or recent updates, using new clock 1534450743797350400
   [junit4]   2> 2213766 INFO  (coreLoadExecutor-7427-thread-1) [    ] o.a.s.u.UpdateLog Took 1.0ms to seed version buckets with highest version 1534450743797350400
   [junit4]   2> 2213766 INFO  (coreLoadExecutor-7427-thread-1) [    ] o.a.s.c.ZkController watch zkdir /configs/conf1
   [junit4]   2> 2213766 INFO  (coreLoadExecutor-7427-thread-1) [    ] o.a.s.c.CoreContainer registering core: collection1
   [junit4]   2> 2213766 INFO  (coreZkRegister-7422-thread-1) [    ] o.a.s.c.ZkController Register replica - core:collection1 address:http://127.0.0.1:36710 collection:collection1 shard:shard2
   [junit4]   2> 2213767 INFO  (coreZkRegister-7422-thread-1) [    ] o.a.s.c.c.SolrZkClient makePath: /collections/collection1/leader_elect/shard2/election
   [junit4]   2> 2213768 INFO  (coreZkRegister-7422-thread-1) [    ] o.a.s.c.LeaderElector Joined leadership election with path: /collections/collection1/leader_elect/shard2/election/95903171226501128-core_node1-n_0000000000
   [junit4]   2> 2213768 INFO  (coreZkRegister-7422-thread-1) [    ] o.a.s.c.ShardLeaderElectionContext Running the leader process for shard=shard2 and weAreReplacement=false and leaderVoteWait=10000
   [junit4]   2> 2213768 INFO  (coreZkRegister-7422-thread-1) [    ] o.a.s.c.ShardLeaderElectionContext Enough replicas found to continue.
   [junit4]   2> 2213768 INFO  (coreZkRegister-7422-thread-1) [    ] o.a.s.c.ShardLeaderElectionContext I may be the new leader - try and sync
   [junit4]   2> 2213768 INFO  (coreZkRegister-7422-thread-1) [    ] o.a.s.c.SyncStrategy Sync replicas to http://127.0.0.1:36710/collection1/
   [junit4]   2> 2213769 INFO  (OverseerStateUpdate-95903171226501124-127.0.0.1:37538_-n_0000000000) [    ] o.a.s.c.Overseer processMessage: queueSize: 1, message = {
   [junit4]   2>   "operation":"leader",
   [junit4]   2>   "shard":"shard2",
   [junit4]   2>   "collection":"collection1"} current state version: 5
   [junit4]   2> 2213769 INFO  (coreZkRegister-7422-thread-1) [    ] o.a.s.c.SyncStrategy Sync Success - now sync replicas to me
   [junit4]   2> 2213769 INFO  (coreZkRegister-7422-thread-1) [    ] o.a.s.c.SyncStrategy http://127.0.0.1:36710/collection1/ has no replicas
   [junit4]   2> 2213769 INFO  (coreZkRegister-7422-thread-1) [    ] o.a.s.c.c.SolrZkClient makePath: /collections/collection1/leaders/shard2
   [junit4]   2> 2213770 INFO  (coreZkRegister-7422-thread-1) [    ] o.a.s.c.ShardLeaderElectionContextBase Creating leader registration node /collections/collection1/leaders/shard2/leader after winning as /collections/collection1/leader_elect/shard2/election/95903171226501128-core_node1-n_0000000000
   [junit4]   2> 2213771 INFO  (coreZkRegister-7422-thread-1) [    ] o.a.s.c.ShardLeaderElectionContext I am the new leader: http://127.0.0.1:36710/collection1/ shard2
   [junit4]   2> 2213771 INFO  (OverseerStateUpdate-95903171226501124-127.0.0.1:37538_-n_0000000000) [    ] o.a.s.c.Overseer processMessage: queueSize: 1, message = {
   [junit4]   2>   "operation":"leader",
   [junit4]   2>   "shard":"shard2",
   [junit4]   2>   "collection":"collection1",
   [junit4]   2>   "base_url":"http://127.0.0.1:36710",
   [junit4]   2>   "core":"collection1",
   [junit4]   2>   "state":"active"} current state version: 5
   [junit4]   2> 2213872 INFO  (zkCallback-2761-thread-1) [    ] o.a.s.c.c.ZkStateReader A cluster state change: [WatchedEvent state:SyncConnected type:NodeDataChanged path:/clusterstate.json], has occurred - updating... (live nodes size: [2])
   [junit4]   2> 2213872 INFO  (zkCallback-2757-thread-1) [    ] o.a.s.c.c.ZkStateReader A cluster state change: [WatchedEvent state:SyncConnected type:NodeDataChanged path:/clusterstate.json], has occurred - updating... (live nodes size: [2])
   [junit4]   2> 2213872 INFO  (zkCallback-2766-thread-1) [    ] o.a.s.c.c.ZkStateReader A cluster state change: [WatchedEvent state:SyncConnected type:NodeDataChanged path:/clusterstate.json], has occurred - updating... (live nodes size: [2])
   [junit4]   2> 2213921 INFO  (coreZkRegister-7422-thread-1) [    ] o.a.s.c.ZkController We are http://127.0.0.1:36710/collection1/ and leader is http://127.0.0.1:36710/collection1/
   [junit4]   2> 2213922 INFO  (coreZkRegister-7422-thread-1) [    ] o.a.s.c.ZkController No LogReplay needed for core=collection1 baseURL=http://127.0.0.1:36710
   [junit4]   2> 2213922 INFO  (coreZkRegister-7422-thread-1) [    ] o.a.s.c.ZkController I am the leader, no recovery necessary
   [junit4]   2> 2213922 INFO  (coreZkRegister-7422-thread-1) [    ] o.a.s.c.ZkController publishing state=active
   [junit4]   2> 2213922 INFO  (coreZkRegister-7422-thread-1) [    ] o.a.s.c.ZkController numShards not found on descriptor - reading it from system property
   [junit4]   2> 2213923 INFO  (OverseerStateUpdate-95903171226501124-127.0.0.1:37538_-n_0000000000) [    ] o.a.s.c.Overseer processMessage: queueSize: 1, message = {
   [junit4]   2>   "core":"collection1",
   [junit4]   2>   "core_node_name":"core_node1",
   [junit4]   2>   "roles":null,
   [junit4]   2>   "base_url":"http://127.0.0.1:36710",
   [junit4]   2>   "node_name":"127.0.0.1:36710_",
   [junit4]   2>   "numShards":"2",
   [junit4]   2>   "state":"active",
   [junit4]   2>   "shard":"shard2",
   [junit4]   2>   "collection":"collection1",
   [junit4]   2>   "operation":"state"} current state version: 6
   [junit4]   2> 2213923 INFO  (OverseerStateUpdate-95903171226501124-127.0.0.1:37538_-n_0000000000) [    ] o.a.s.c.o.ReplicaMutator Update state numShar

[...truncated too long message...]

ader ZooKeeper watch triggered, but Solr cannot talk to ZK: [KeeperErrorCode = Session expired for /live_nodes]
   [junit4]   2> 2234577 INFO  (TEST-TestReqParamsAPI.test-seed#[450C2F11B0BE0E92]) [    ] o.e.j.s.ServerConnector Stopped ServerConnector@ecd641{HTTP/1.1,[http/1.1]}{127.0.0.1:0}
   [junit4]   2> 2234577 INFO  (TEST-TestReqParamsAPI.test-seed#[450C2F11B0BE0E92]) [    ] o.e.j.s.h.ContextHandler Stopped o.e.j.s.ServletContextHandler@58dc31{/,null,UNAVAILABLE}
   [junit4]   2> 2234579 INFO  (TEST-TestReqParamsAPI.test-seed#[450C2F11B0BE0E92]) [    ] o.a.s.c.ZkTestServer connecting to 127.0.0.1:36986 36986
   [junit4]   2> 2234585 INFO  (Thread-5303) [    ] o.a.s.c.ZkTestServer connecting to 127.0.0.1:36986 36986
   [junit4]   2> 2234586 WARN  (Thread-5303) [    ] o.a.s.c.ZkTestServer Watch limit violations: 
   [junit4]   2> Maximum concurrent create/delete watches above limit:
   [junit4]   2> 
   [junit4]   2> 	40	/solr/configs/conf1
   [junit4]   2> 	6	/solr/aliases.json
   [junit4]   2> 	6	/solr/clusterprops.json
   [junit4]   2> 	5	/solr/security.json
   [junit4]   2> 	4	/solr/collections/collection1/state.json
   [junit4]   2> 
   [junit4]   2> Maximum concurrent data watches above limit:
   [junit4]   2> 
   [junit4]   2> 	6	/solr/clusterstate.json
   [junit4]   2> 
   [junit4]   2> Maximum concurrent children watches above limit:
   [junit4]   2> 
   [junit4]   2> 	6	/solr/live_nodes
   [junit4]   2> 	6	/solr/collections
   [junit4]   2> 	5	/solr/overseer/collection-queue-work
   [junit4]   2> 	4	/solr/overseer/queue
   [junit4]   2> 	2	/solr/overseer/queue-work
   [junit4]   2> 
   [junit4]   2> NOTE: reproduce with: ant test  -Dtestcase=TestReqParamsAPI -Dtests.method=test -Dtests.seed=450C2F11B0BE0E92 -Dtests.multiplier=3 -Dtests.slow=true -Dtests.locale=saq-KE -Dtests.timezone=America/Paramaribo -Dtests.asserts=true -Dtests.file.encoding=UTF-8
   [junit4] FAILURE 24.8s J0 | TestReqParamsAPI.test <<<
   [junit4]    > Throwable #1: java.lang.AssertionError: Could not get expected value  'f' for path 'params/fixed' full output: {
   [junit4]    >   "responseHeader":{
   [junit4]    >     "status":0,
   [junit4]    >     "QTime":0},
   [junit4]    >   "params":{
   [junit4]    >     "add":"second",
   [junit4]    >     "a":"A val",
   [junit4]    >     "fixed":"changeit",
   [junit4]    >     "b":"B val",
   [junit4]    >     "wt":"json"},
   [junit4]    >   "context":{
   [junit4]    >     "webapp":"",
   [junit4]    >     "path":"/dump1",
   [junit4]    >     "httpMethod":"GET"}},  from server:  http://127.0.0.1:39709/collection1
   [junit4]    > 	at __randomizedtesting.SeedInfo.seed([450C2F11B0BE0E92:CD5810CB1E42636A]:0)
   [junit4]    > 	at org.apache.solr.core.TestSolrConfigHandler.testForResponseElement(TestSolrConfigHandler.java:457)
   [junit4]    > 	at org.apache.solr.handler.TestReqParamsAPI.testReqParams(TestReqParamsAPI.java:242)
   [junit4]    > 	at org.apache.solr.handler.TestReqParamsAPI.test(TestReqParamsAPI.java:62)
   [junit4]    > 	at jdk.internal.reflect.NativeMethodAccessorImpl.invoke0(java.base@9-ea/Native Method)
   [junit4]    > 	at jdk.internal.reflect.NativeMethodAccessorImpl.invoke(java.base@9-ea/NativeMethodAccessorImpl.java:62)
   [junit4]    > 	at jdk.internal.reflect.DelegatingMethodAccessorImpl.invoke(java.base@9-ea/DelegatingMethodAccessorImpl.java:43)
   [junit4]    > 	at org.apache.solr.BaseDistributedSearchTestCase$ShardsRepeatRule$ShardsFixedStatement.callStatement(BaseDistributedSearchTestCase.java:985)
   [junit4]    > 	at org.apache.solr.BaseDistributedSearchTestCase$ShardsRepeatRule$ShardsStatement.evaluate(BaseDistributedSearchTestCase.java:960)
   [junit4]    > 	at java.lang.Thread.run(java.base@9-ea/Thread.java:804)
   [junit4]   2> 2234591 INFO  (SUITE-TestReqParamsAPI-seed#[450C2F11B0BE0E92]-worker) [    ] o.a.s.SolrTestCaseJ4 ###deleteCore
   [junit4]   2> NOTE: leaving temporary files on disk at: /home/jenkins/workspace/Lucene-Solr-master-Linux/solr/build/solr-core/test/J0/temp/solr.handler.TestReqParamsAPI_450C2F11B0BE0E92-001
   [junit4]   2> May 16, 2016 2:38:04 AM com.carrotsearch.randomizedtesting.ThreadLeakControl checkThreadLeaks
   [junit4]   2> WARNING: Will linger awaiting termination of 2 leaked thread(s).
   [junit4]   2> NOTE: test params are: codec=Asserting(Lucene62), sim=ClassicSimilarity, locale=saq-KE, timezone=America/Paramaribo
   [junit4]   2> NOTE: Linux 4.4.0-21-generic i386/Oracle Corporation 9-ea (32-bit)/cpus=12,threads=1,free=205724520,total=371253248
   [junit4]   2> NOTE: All tests run in this JVM: [CoreMergeIndexesAdminHandlerTest, SOLR749Test, HdfsTlogReplayBufferedWhileIndexingTest, HdfsDirectoryFactoryTest, HdfsLockFactoryTest, StandardRequestHandlerTest, DefaultValueUpdateProcessorTest, SolrCloudExampleTest, HdfsNNFailoverTest, TestConfigSetImmutable, TestConfigReload, TestAtomicUpdateErrorCases, URLClassifyProcessorTest, ConnectionReuseTest, HLLSerializationTest, TestBinaryField, TestSmileRequest, TestSchemaNameResource, RAMDirectoryFactoryTest, TestFieldResource, TestSolrQueryParserResource, RulesTest, TestRTGBase, TestStressLucene, BitVectorTest, TestSSLRandomization, SolrRequestParserTest, DistributedQueryElevationComponentTest, TestRawResponseWriter, DistribJoinFromCollectionTest, TestSchemaVersionResource, StressHdfsTest, CloneFieldUpdateProcessorFactoryTest, SpatialRPTFieldTypeTest, TestRandomFaceting, QueryElevationComponentTest, TestStandardQParsers, TestFastOutputStream, TestTrackingShardHandlerFactory, TestConfigSetsAPIExclusivity, TestCrossCoreJoin, UUIDFieldTest, TestRealTimeGet, TestFunctionQuery, TestDynamicFieldCollectionResource, TestManagedSynonymFilterFactory, JSONWriterTest, GraphQueryTest, SystemInfoHandlerTest, TestRemoteStreaming, TestTolerantUpdateProcessorRandomCloud, EchoParamsTest, TestUseDocValuesAsStored, TestJoin, SynonymTokenizerTest, LeaderInitiatedRecoveryOnCommitTest, ResourceLoaderTest, PathHierarchyTokenizerFactoryTest, TestLazyCores, CacheHeaderTest, TestShardHandlerFactory, TestFoldingMultitermQuery, ResponseLogComponentTest, TestDistribDocBasedVersion, HdfsChaosMonkeyNothingIsSafeTest, BlockDirectoryTest, TestCloudBackupRestore, SegmentsInfoRequestHandlerTest, DisMaxRequestHandlerTest, CreateCollectionCleanupTest, TestLuceneMatchVersion, SignatureUpdateProcessorFactoryTest, TestArbitraryIndexDir, TestManagedResourceStorage, XsltUpdateRequestHandlerTest, TestOrdValues, CursorPagingTest, LeaderElectionIntegrationTest, AsyncCallRequestStatusResponseTest, TestReplicationHandler, TestSha256AuthenticationProvider, TestManagedSchema, PolyFieldTest, PrimUtilsTest, SharedFSAutoReplicaFailoverTest, TestDynamicLoading, CloudExitableDirectoryReaderTest, DateRangeFieldTest, TestSubQueryTransformerCrossCore, MultiThreadedOCPTest, TestValueSourceCache, TestOmitPositions, IndexSchemaRuntimeFieldTest, TestLeaderElectionZkExpiry, PingRequestHandlerTest, ReplicationFactorTest, TestMiniSolrCloudClusterBase, DistributedFacetPivotLargeTest, SyncSliceTest, BasicZkTest, FullSolrCloudDistribCmdsTest, ClusterStateUpdateTest, LeaderElectionTest, ZkSolrClientTest, TestDistributedGrouping, DistributedSpellCheckComponentTest, TestReload, HardAutoCommitTest, SolrCoreTest, SolrCmdDistributorTest, PeerSyncTest, BadIndexSchemaTest, TestSort, TestBadConfig, HighlighterTest, CurrencyFieldOpenExchangeTest, SolrIndexSplitterTest, AnalysisAfterCoreReloadTest, SuggesterFSTTest, DocValuesTest, TestQueryUtils, DocumentAnalysisRequestHandlerTest, TermsComponentTest, RequestHandlersTest, RequiredFieldsTest, FastVectorHighlighterTest, TestJmxIntegration, MBeansHandlerTest, TestPartialUpdateDeduplication, TestPHPSerializedResponseWriter, TestComponentsName, TestQuerySenderListener, CopyFieldTest, BadComponentTest, TestStressRecovery, PreAnalyzedFieldTest, TestSuggestSpellingConverter, DateFieldTest, SpellingQueryConverterTest, DOMUtilTest, TestSolrJ, TestLRUCache, TestUtils, TestDocumentBuilder, ZkNodePropsTest, TestHighlightDedupGrouping, TestTolerantSearch, TestJettySolrRunner, ActionThrottleTest, AsyncMigrateRouteKeyTest, CollectionStateFormat2Test, ConcurrentDeleteAndCreateCollectionTest, ConnectionManagerTest, DeleteInactiveReplicaTest, DeleteShardTest, DistribDocExpirationUpdateProcessorTest, OverriddenZkACLAndCredentialsProvidersTest, OverseerTaskQueueTest, RecoveryAfterSoftCommitTest, SharedFSAutoReplicaFailoverUtilsTest, SimpleCollectionCreateDeleteTest, TestCloudDeleteByQuery, TestCloudPivotFacet, TestCryptoKeys, TestLeaderInitiatedRecoveryThread, TestMiniSolrCloudCluster, VMParamsZkACLAndCredentialsProvidersTest, ZkStateWriterTest, TestSolrXml, RequestLoggingTest, TestReqParamsAPI]
   [junit4] Completed [502/597 (1!)] on J0 in 25.09s, 1 test, 1 failure <<< FAILURES!

[...truncated 321 lines...]
BUILD FAILED
/home/jenkins/workspace/Lucene-Solr-master-Linux/build.xml:740: The following error occurred while executing this line:
/home/jenkins/workspace/Lucene-Solr-master-Linux/build.xml:684: The following error occurred while executing this line:
/home/jenkins/workspace/Lucene-Solr-master-Linux/build.xml:59: The following error occurred while executing this line:
/home/jenkins/workspace/Lucene-Solr-master-Linux/solr/build.xml:233: The following error occurred while executing this line:
/home/jenkins/workspace/Lucene-Solr-master-Linux/solr/common-build.xml:529: The following error occurred while executing this line:
/home/jenkins/workspace/Lucene-Solr-master-Linux/lucene/common-build.xml:1457: The following error occurred while executing this line:
/home/jenkins/workspace/Lucene-Solr-master-Linux/lucene/common-build.xml:1014: There were test failures: 597 suites (10 ignored), 2413 tests, 1 failure, 117 ignored (71 assumptions) [seed: 450C2F11B0BE0E92]

Total time: 65 minutes 41 seconds
Build step 'Invoke Ant' marked build as failure
Archiving artifacts
[WARNINGS] Skipping publisher since build result is FAILURE
Recording test results
Email was triggered for: Failure - Any
Sending email for trigger: Failure - Any



Mime
View raw message