lucene-dev mailing list archives

Site index · List index
Message view « Date » · « Thread »
Top « Date » · « Thread »
From Policeman Jenkins Server <jenk...@thetaphi.de>
Subject [JENKINS] Lucene-Solr-6.x-MacOSX (64bit/jdk1.8.0) - Build # 139 - Still Failing!
Date Sun, 15 May 2016 01:16:53 GMT
Build: http://jenkins.thetaphi.de/job/Lucene-Solr-6.x-MacOSX/139/
Java: 64bit/jdk1.8.0 -XX:-UseCompressedOops -XX:+UseConcMarkSweepGC

1 tests failed.
FAILED:  org.apache.solr.cloud.DistribDocExpirationUpdateProcessorTest.test

Error Message:
There are still nodes recoverying - waited for 45 seconds

Stack Trace:
java.lang.AssertionError: There are still nodes recoverying - waited for 45 seconds
	at __randomizedtesting.SeedInfo.seed([9E6267C4443DD8E1:1636581EEAC1B519]:0)
	at org.junit.Assert.fail(Assert.java:93)
	at org.apache.solr.cloud.AbstractDistribZkTestBase.waitForRecoveriesToFinish(AbstractDistribZkTestBase.java:182)
	at org.apache.solr.cloud.AbstractFullDistribZkTestBase.waitForRecoveriesToFinish(AbstractFullDistribZkTestBase.java:858)
	at org.apache.solr.cloud.DistribDocExpirationUpdateProcessorTest.test(DistribDocExpirationUpdateProcessorTest.java:74)
	at sun.reflect.NativeMethodAccessorImpl.invoke0(Native Method)
	at sun.reflect.NativeMethodAccessorImpl.invoke(NativeMethodAccessorImpl.java:62)
	at sun.reflect.DelegatingMethodAccessorImpl.invoke(DelegatingMethodAccessorImpl.java:43)
	at java.lang.reflect.Method.invoke(Method.java:498)
	at com.carrotsearch.randomizedtesting.RandomizedRunner.invoke(RandomizedRunner.java:1764)
	at com.carrotsearch.randomizedtesting.RandomizedRunner$8.evaluate(RandomizedRunner.java:871)
	at com.carrotsearch.randomizedtesting.RandomizedRunner$9.evaluate(RandomizedRunner.java:907)
	at com.carrotsearch.randomizedtesting.RandomizedRunner$10.evaluate(RandomizedRunner.java:921)
	at org.apache.solr.BaseDistributedSearchTestCase$ShardsRepeatRule$ShardsFixedStatement.callStatement(BaseDistributedSearchTestCase.java:992)
	at org.apache.solr.BaseDistributedSearchTestCase$ShardsRepeatRule$ShardsStatement.evaluate(BaseDistributedSearchTestCase.java:967)
	at com.carrotsearch.randomizedtesting.rules.SystemPropertiesRestoreRule$1.evaluate(SystemPropertiesRestoreRule.java:57)
	at org.apache.lucene.util.TestRuleSetupTeardownChained$1.evaluate(TestRuleSetupTeardownChained.java:49)
	at org.apache.lucene.util.AbstractBeforeAfterRule$1.evaluate(AbstractBeforeAfterRule.java:45)
	at org.apache.lucene.util.TestRuleThreadAndTestName$1.evaluate(TestRuleThreadAndTestName.java:48)
	at org.apache.lucene.util.TestRuleIgnoreAfterMaxFailures$1.evaluate(TestRuleIgnoreAfterMaxFailures.java:64)
	at org.apache.lucene.util.TestRuleMarkFailure$1.evaluate(TestRuleMarkFailure.java:47)
	at com.carrotsearch.randomizedtesting.rules.StatementAdapter.evaluate(StatementAdapter.java:36)
	at com.carrotsearch.randomizedtesting.ThreadLeakControl$StatementRunner.run(ThreadLeakControl.java:367)
	at com.carrotsearch.randomizedtesting.ThreadLeakControl.forkTimeoutingTask(ThreadLeakControl.java:809)
	at com.carrotsearch.randomizedtesting.ThreadLeakControl$3.evaluate(ThreadLeakControl.java:460)
	at com.carrotsearch.randomizedtesting.RandomizedRunner.runSingleTest(RandomizedRunner.java:880)
	at com.carrotsearch.randomizedtesting.RandomizedRunner$5.evaluate(RandomizedRunner.java:781)
	at com.carrotsearch.randomizedtesting.RandomizedRunner$6.evaluate(RandomizedRunner.java:816)
	at com.carrotsearch.randomizedtesting.RandomizedRunner$7.evaluate(RandomizedRunner.java:827)
	at com.carrotsearch.randomizedtesting.rules.StatementAdapter.evaluate(StatementAdapter.java:36)
	at com.carrotsearch.randomizedtesting.rules.SystemPropertiesRestoreRule$1.evaluate(SystemPropertiesRestoreRule.java:57)
	at org.apache.lucene.util.AbstractBeforeAfterRule$1.evaluate(AbstractBeforeAfterRule.java:45)
	at com.carrotsearch.randomizedtesting.rules.StatementAdapter.evaluate(StatementAdapter.java:36)
	at org.apache.lucene.util.TestRuleStoreClassName$1.evaluate(TestRuleStoreClassName.java:41)
	at com.carrotsearch.randomizedtesting.rules.NoShadowingOrOverridesOnMethodsRule$1.evaluate(NoShadowingOrOverridesOnMethodsRule.java:40)
	at com.carrotsearch.randomizedtesting.rules.NoShadowingOrOverridesOnMethodsRule$1.evaluate(NoShadowingOrOverridesOnMethodsRule.java:40)
	at com.carrotsearch.randomizedtesting.rules.StatementAdapter.evaluate(StatementAdapter.java:36)
	at com.carrotsearch.randomizedtesting.rules.StatementAdapter.evaluate(StatementAdapter.java:36)
	at com.carrotsearch.randomizedtesting.rules.StatementAdapter.evaluate(StatementAdapter.java:36)
	at org.apache.lucene.util.TestRuleAssertionsRequired$1.evaluate(TestRuleAssertionsRequired.java:53)
	at org.apache.lucene.util.TestRuleMarkFailure$1.evaluate(TestRuleMarkFailure.java:47)
	at org.apache.lucene.util.TestRuleIgnoreAfterMaxFailures$1.evaluate(TestRuleIgnoreAfterMaxFailures.java:64)
	at org.apache.lucene.util.TestRuleIgnoreTestSuites$1.evaluate(TestRuleIgnoreTestSuites.java:54)
	at com.carrotsearch.randomizedtesting.rules.StatementAdapter.evaluate(StatementAdapter.java:36)
	at com.carrotsearch.randomizedtesting.ThreadLeakControl$StatementRunner.run(ThreadLeakControl.java:367)
	at java.lang.Thread.run(Thread.java:745)




Build Log:
[...truncated 11257 lines...]
   [junit4] Suite: org.apache.solr.cloud.DistribDocExpirationUpdateProcessorTest
   [junit4]   2> Creating dataDir: /Users/jenkins/workspace/Lucene-Solr-6.x-MacOSX/solr/build/solr-core/test/J1/temp/solr.cloud.DistribDocExpirationUpdateProcessorTest_9E6267C4443DD8E1-001/init-core-data-001
   [junit4]   2> 1555405 INFO  (SUITE-DistribDocExpirationUpdateProcessorTest-seed#[9E6267C4443DD8E1]-worker) [    ] o.a.s.SolrTestCaseJ4 Randomized ssl (false) and clientAuth (false)
   [junit4]   2> 1555408 INFO  (SUITE-DistribDocExpirationUpdateProcessorTest-seed#[9E6267C4443DD8E1]-worker) [    ] o.a.s.BaseDistributedSearchTestCase Setting hostContext system property: /
   [junit4]   2> 1555410 INFO  (TEST-DistribDocExpirationUpdateProcessorTest.test-seed#[9E6267C4443DD8E1]) [    ] o.a.s.c.ZkTestServer STARTING ZK TEST SERVER
   [junit4]   2> 1555410 INFO  (Thread-3349) [    ] o.a.s.c.ZkTestServer client port:0.0.0.0/0.0.0.0:0
   [junit4]   2> 1555410 INFO  (Thread-3349) [    ] o.a.s.c.ZkTestServer Starting server
   [junit4]   2> 1555520 INFO  (TEST-DistribDocExpirationUpdateProcessorTest.test-seed#[9E6267C4443DD8E1]) [    ] o.a.s.c.ZkTestServer start zk server on port:59784
   [junit4]   2> 1555520 INFO  (TEST-DistribDocExpirationUpdateProcessorTest.test-seed#[9E6267C4443DD8E1]) [    ] o.a.s.c.c.SolrZkClient Using default ZkCredentialsProvider
   [junit4]   2> 1555521 INFO  (TEST-DistribDocExpirationUpdateProcessorTest.test-seed#[9E6267C4443DD8E1]) [    ] o.a.s.c.c.ConnectionManager Waiting for client to connect to ZooKeeper
   [junit4]   2> 1555568 INFO  (zkCallback-1751-thread-1) [    ] o.a.s.c.c.ConnectionManager Watcher org.apache.solr.common.cloud.ConnectionManager@65be30a5 name:ZooKeeperConnection Watcher:127.0.0.1:59784 got event WatchedEvent state:SyncConnected type:None path:null path:null type:None
   [junit4]   2> 1555568 INFO  (TEST-DistribDocExpirationUpdateProcessorTest.test-seed#[9E6267C4443DD8E1]) [    ] o.a.s.c.c.ConnectionManager Client is connected to ZooKeeper
   [junit4]   2> 1555569 INFO  (TEST-DistribDocExpirationUpdateProcessorTest.test-seed#[9E6267C4443DD8E1]) [    ] o.a.s.c.c.SolrZkClient Using default ZkACLProvider
   [junit4]   2> 1555569 INFO  (TEST-DistribDocExpirationUpdateProcessorTest.test-seed#[9E6267C4443DD8E1]) [    ] o.a.s.c.c.SolrZkClient makePath: /solr
   [junit4]   2> 1555573 INFO  (TEST-DistribDocExpirationUpdateProcessorTest.test-seed#[9E6267C4443DD8E1]) [    ] o.a.s.c.c.SolrZkClient Using default ZkCredentialsProvider
   [junit4]   2> 1555573 INFO  (TEST-DistribDocExpirationUpdateProcessorTest.test-seed#[9E6267C4443DD8E1]) [    ] o.a.s.c.c.ConnectionManager Waiting for client to connect to ZooKeeper
   [junit4]   2> 1555575 INFO  (zkCallback-1752-thread-1) [    ] o.a.s.c.c.ConnectionManager Watcher org.apache.solr.common.cloud.ConnectionManager@ab1ca2d name:ZooKeeperConnection Watcher:127.0.0.1:59784/solr got event WatchedEvent state:SyncConnected type:None path:null path:null type:None
   [junit4]   2> 1555575 INFO  (TEST-DistribDocExpirationUpdateProcessorTest.test-seed#[9E6267C4443DD8E1]) [    ] o.a.s.c.c.ConnectionManager Client is connected to ZooKeeper
   [junit4]   2> 1555575 INFO  (TEST-DistribDocExpirationUpdateProcessorTest.test-seed#[9E6267C4443DD8E1]) [    ] o.a.s.c.c.SolrZkClient Using default ZkACLProvider
   [junit4]   2> 1555575 INFO  (TEST-DistribDocExpirationUpdateProcessorTest.test-seed#[9E6267C4443DD8E1]) [    ] o.a.s.c.c.SolrZkClient makePath: /collections/collection1
   [junit4]   2> 1555580 INFO  (TEST-DistribDocExpirationUpdateProcessorTest.test-seed#[9E6267C4443DD8E1]) [    ] o.a.s.c.c.SolrZkClient makePath: /collections/collection1/shards
   [junit4]   2> 1555583 INFO  (TEST-DistribDocExpirationUpdateProcessorTest.test-seed#[9E6267C4443DD8E1]) [    ] o.a.s.c.c.SolrZkClient makePath: /collections/control_collection
   [junit4]   2> 1555585 INFO  (TEST-DistribDocExpirationUpdateProcessorTest.test-seed#[9E6267C4443DD8E1]) [    ] o.a.s.c.c.SolrZkClient makePath: /collections/control_collection/shards
   [junit4]   2> 1555587 INFO  (TEST-DistribDocExpirationUpdateProcessorTest.test-seed#[9E6267C4443DD8E1]) [    ] o.a.s.c.AbstractZkTestCase put /Users/jenkins/workspace/Lucene-Solr-6.x-MacOSX/solr/core/src/test-files/solr/collection1/conf/solrconfig-doc-expire-update-processor.xml to /configs/conf1/solrconfig.xml
   [junit4]   2> 1555588 INFO  (TEST-DistribDocExpirationUpdateProcessorTest.test-seed#[9E6267C4443DD8E1]) [    ] o.a.s.c.c.SolrZkClient makePath: /configs/conf1/solrconfig.xml
   [junit4]   2> 1555591 INFO  (TEST-DistribDocExpirationUpdateProcessorTest.test-seed#[9E6267C4443DD8E1]) [    ] o.a.s.c.AbstractZkTestCase put /Users/jenkins/workspace/Lucene-Solr-6.x-MacOSX/solr/core/src/test-files/solr/collection1/conf/schema15.xml to /configs/conf1/schema.xml
   [junit4]   2> 1555591 INFO  (TEST-DistribDocExpirationUpdateProcessorTest.test-seed#[9E6267C4443DD8E1]) [    ] o.a.s.c.c.SolrZkClient makePath: /configs/conf1/schema.xml
   [junit4]   2> 1555595 INFO  (TEST-DistribDocExpirationUpdateProcessorTest.test-seed#[9E6267C4443DD8E1]) [    ] o.a.s.c.AbstractZkTestCase put /Users/jenkins/workspace/Lucene-Solr-6.x-MacOSX/solr/core/src/test-files/solr/collection1/conf/solrconfig.snippet.randomindexconfig.xml to /configs/conf1/solrconfig.snippet.randomindexconfig.xml
   [junit4]   2> 1555595 INFO  (TEST-DistribDocExpirationUpdateProcessorTest.test-seed#[9E6267C4443DD8E1]) [    ] o.a.s.c.c.SolrZkClient makePath: /configs/conf1/solrconfig.snippet.randomindexconfig.xml
   [junit4]   2> 1555597 INFO  (TEST-DistribDocExpirationUpdateProcessorTest.test-seed#[9E6267C4443DD8E1]) [    ] o.a.s.c.AbstractZkTestCase put /Users/jenkins/workspace/Lucene-Solr-6.x-MacOSX/solr/core/src/test-files/solr/collection1/conf/stopwords.txt to /configs/conf1/stopwords.txt
   [junit4]   2> 1555598 INFO  (TEST-DistribDocExpirationUpdateProcessorTest.test-seed#[9E6267C4443DD8E1]) [    ] o.a.s.c.c.SolrZkClient makePath: /configs/conf1/stopwords.txt
   [junit4]   2> 1555600 INFO  (TEST-DistribDocExpirationUpdateProcessorTest.test-seed#[9E6267C4443DD8E1]) [    ] o.a.s.c.AbstractZkTestCase put /Users/jenkins/workspace/Lucene-Solr-6.x-MacOSX/solr/core/src/test-files/solr/collection1/conf/protwords.txt to /configs/conf1/protwords.txt
   [junit4]   2> 1555600 INFO  (TEST-DistribDocExpirationUpdateProcessorTest.test-seed#[9E6267C4443DD8E1]) [    ] o.a.s.c.c.SolrZkClient makePath: /configs/conf1/protwords.txt
   [junit4]   2> 1555603 INFO  (TEST-DistribDocExpirationUpdateProcessorTest.test-seed#[9E6267C4443DD8E1]) [    ] o.a.s.c.AbstractZkTestCase put /Users/jenkins/workspace/Lucene-Solr-6.x-MacOSX/solr/core/src/test-files/solr/collection1/conf/currency.xml to /configs/conf1/currency.xml
   [junit4]   2> 1555603 INFO  (TEST-DistribDocExpirationUpdateProcessorTest.test-seed#[9E6267C4443DD8E1]) [    ] o.a.s.c.c.SolrZkClient makePath: /configs/conf1/currency.xml
   [junit4]   2> 1555605 INFO  (TEST-DistribDocExpirationUpdateProcessorTest.test-seed#[9E6267C4443DD8E1]) [    ] o.a.s.c.AbstractZkTestCase put /Users/jenkins/workspace/Lucene-Solr-6.x-MacOSX/solr/core/src/test-files/solr/collection1/conf/enumsConfig.xml to /configs/conf1/enumsConfig.xml
   [junit4]   2> 1555605 INFO  (TEST-DistribDocExpirationUpdateProcessorTest.test-seed#[9E6267C4443DD8E1]) [    ] o.a.s.c.c.SolrZkClient makePath: /configs/conf1/enumsConfig.xml
   [junit4]   2> 1555609 INFO  (TEST-DistribDocExpirationUpdateProcessorTest.test-seed#[9E6267C4443DD8E1]) [    ] o.a.s.c.AbstractZkTestCase put /Users/jenkins/workspace/Lucene-Solr-6.x-MacOSX/solr/core/src/test-files/solr/collection1/conf/open-exchange-rates.json to /configs/conf1/open-exchange-rates.json
   [junit4]   2> 1555609 INFO  (TEST-DistribDocExpirationUpdateProcessorTest.test-seed#[9E6267C4443DD8E1]) [    ] o.a.s.c.c.SolrZkClient makePath: /configs/conf1/open-exchange-rates.json
   [junit4]   2> 1555611 INFO  (TEST-DistribDocExpirationUpdateProcessorTest.test-seed#[9E6267C4443DD8E1]) [    ] o.a.s.c.AbstractZkTestCase put /Users/jenkins/workspace/Lucene-Solr-6.x-MacOSX/solr/core/src/test-files/solr/collection1/conf/mapping-ISOLatin1Accent.txt to /configs/conf1/mapping-ISOLatin1Accent.txt
   [junit4]   2> 1555611 INFO  (TEST-DistribDocExpirationUpdateProcessorTest.test-seed#[9E6267C4443DD8E1]) [    ] o.a.s.c.c.SolrZkClient makePath: /configs/conf1/mapping-ISOLatin1Accent.txt
   [junit4]   2> 1555614 INFO  (TEST-DistribDocExpirationUpdateProcessorTest.test-seed#[9E6267C4443DD8E1]) [    ] o.a.s.c.AbstractZkTestCase put /Users/jenkins/workspace/Lucene-Solr-6.x-MacOSX/solr/core/src/test-files/solr/collection1/conf/old_synonyms.txt to /configs/conf1/old_synonyms.txt
   [junit4]   2> 1555614 INFO  (TEST-DistribDocExpirationUpdateProcessorTest.test-seed#[9E6267C4443DD8E1]) [    ] o.a.s.c.c.SolrZkClient makePath: /configs/conf1/old_synonyms.txt
   [junit4]   2> 1555616 INFO  (TEST-DistribDocExpirationUpdateProcessorTest.test-seed#[9E6267C4443DD8E1]) [    ] o.a.s.c.AbstractZkTestCase put /Users/jenkins/workspace/Lucene-Solr-6.x-MacOSX/solr/core/src/test-files/solr/collection1/conf/synonyms.txt to /configs/conf1/synonyms.txt
   [junit4]   2> 1555617 INFO  (TEST-DistribDocExpirationUpdateProcessorTest.test-seed#[9E6267C4443DD8E1]) [    ] o.a.s.c.c.SolrZkClient makePath: /configs/conf1/synonyms.txt
   [junit4]   2> 1555870 INFO  (TEST-DistribDocExpirationUpdateProcessorTest.test-seed#[9E6267C4443DD8E1]) [    ] o.a.s.SolrTestCaseJ4 Writing core.properties file to /Users/jenkins/workspace/Lucene-Solr-6.x-MacOSX/solr/build/solr-core/test/J1/temp/solr.cloud.DistribDocExpirationUpdateProcessorTest_9E6267C4443DD8E1-001/control-001/cores/collection1
   [junit4]   2> 1555872 INFO  (TEST-DistribDocExpirationUpdateProcessorTest.test-seed#[9E6267C4443DD8E1]) [    ] o.e.j.s.Server jetty-9.3.8.v20160314
   [junit4]   2> 1555874 INFO  (TEST-DistribDocExpirationUpdateProcessorTest.test-seed#[9E6267C4443DD8E1]) [    ] o.e.j.s.h.ContextHandler Started o.e.j.s.ServletContextHandler@5a87e3d5{/,null,AVAILABLE}
   [junit4]   2> 1555875 INFO  (TEST-DistribDocExpirationUpdateProcessorTest.test-seed#[9E6267C4443DD8E1]) [    ] o.e.j.s.ServerConnector Started ServerConnector@2f34c7e1{HTTP/1.1,[http/1.1]}{127.0.0.1:59787}
   [junit4]   2> 1555875 INFO  (TEST-DistribDocExpirationUpdateProcessorTest.test-seed#[9E6267C4443DD8E1]) [    ] o.e.j.s.Server Started @1561218ms
   [junit4]   2> 1555875 INFO  (TEST-DistribDocExpirationUpdateProcessorTest.test-seed#[9E6267C4443DD8E1]) [    ] o.a.s.c.s.e.JettySolrRunner Jetty properties: {solr.data.dir=/Users/jenkins/workspace/Lucene-Solr-6.x-MacOSX/solr/build/solr-core/test/J1/temp/solr.cloud.DistribDocExpirationUpdateProcessorTest_9E6267C4443DD8E1-001/tempDir-001/control/data, hostContext=/, hostPort=59787, coreRootDirectory=/Users/jenkins/workspace/Lucene-Solr-6.x-MacOSX/solr/build/solr-core/test/J1/temp/solr.cloud.DistribDocExpirationUpdateProcessorTest_9E6267C4443DD8E1-001/control-001/cores}
   [junit4]   2> 1555875 INFO  (TEST-DistribDocExpirationUpdateProcessorTest.test-seed#[9E6267C4443DD8E1]) [    ] o.a.s.s.SolrDispatchFilter SolrDispatchFilter.init(): sun.misc.Launcher$AppClassLoader@4554617c
   [junit4]   2> 1555875 INFO  (TEST-DistribDocExpirationUpdateProcessorTest.test-seed#[9E6267C4443DD8E1]) [    ] o.a.s.c.SolrResourceLoader new SolrResourceLoader for directory: '/Users/jenkins/workspace/Lucene-Solr-6.x-MacOSX/solr/build/solr-core/test/J1/temp/solr.cloud.DistribDocExpirationUpdateProcessorTest_9E6267C4443DD8E1-001/control-001'
   [junit4]   2> 1555876 INFO  (TEST-DistribDocExpirationUpdateProcessorTest.test-seed#[9E6267C4443DD8E1]) [    ] o.a.s.c.SolrResourceLoader JNDI not configured for solr (NoInitialContextEx)
   [junit4]   2> 1555876 INFO  (TEST-DistribDocExpirationUpdateProcessorTest.test-seed#[9E6267C4443DD8E1]) [    ] o.a.s.c.SolrResourceLoader solr home defaulted to 'solr/' (could not find system property or JNDI)
   [junit4]   2> 1555876 INFO  (TEST-DistribDocExpirationUpdateProcessorTest.test-seed#[9E6267C4443DD8E1]) [    ] o.a.s.c.c.SolrZkClient Using default ZkCredentialsProvider
   [junit4]   2> 1555877 INFO  (TEST-DistribDocExpirationUpdateProcessorTest.test-seed#[9E6267C4443DD8E1]) [    ] o.a.s.c.c.ConnectionManager Waiting for client to connect to ZooKeeper
   [junit4]   2> 1555878 INFO  (zkCallback-1753-thread-1) [    ] o.a.s.c.c.ConnectionManager Watcher org.apache.solr.common.cloud.ConnectionManager@3e82564a name:ZooKeeperConnection Watcher:127.0.0.1:59784/solr got event WatchedEvent state:SyncConnected type:None path:null path:null type:None
   [junit4]   2> 1555878 INFO  (TEST-DistribDocExpirationUpdateProcessorTest.test-seed#[9E6267C4443DD8E1]) [    ] o.a.s.c.c.ConnectionManager Client is connected to ZooKeeper
   [junit4]   2> 1555879 INFO  (TEST-DistribDocExpirationUpdateProcessorTest.test-seed#[9E6267C4443DD8E1]) [    ] o.a.s.c.c.SolrZkClient Using default ZkACLProvider
   [junit4]   2> 1555880 INFO  (TEST-DistribDocExpirationUpdateProcessorTest.test-seed#[9E6267C4443DD8E1]) [    ] o.a.s.s.SolrDispatchFilter Loading solr.xml from SolrHome (not found in ZooKeeper)
   [junit4]   2> 1555880 INFO  (TEST-DistribDocExpirationUpdateProcessorTest.test-seed#[9E6267C4443DD8E1]) [    ] o.a.s.c.SolrXmlConfig Loading container configuration from /Users/jenkins/workspace/Lucene-Solr-6.x-MacOSX/solr/build/solr-core/test/J1/temp/solr.cloud.DistribDocExpirationUpdateProcessorTest_9E6267C4443DD8E1-001/control-001/solr.xml
   [junit4]   2> 1555893 INFO  (TEST-DistribDocExpirationUpdateProcessorTest.test-seed#[9E6267C4443DD8E1]) [    ] o.a.s.c.CorePropertiesLocator Config-defined core root directory: /Users/jenkins/workspace/Lucene-Solr-6.x-MacOSX/solr/build/solr-core/test/J1/temp/solr.cloud.DistribDocExpirationUpdateProcessorTest_9E6267C4443DD8E1-001/control-001/cores
   [junit4]   2> 1555893 INFO  (TEST-DistribDocExpirationUpdateProcessorTest.test-seed#[9E6267C4443DD8E1]) [    ] o.a.s.c.CoreContainer New CoreContainer 1890947154
   [junit4]   2> 1555893 INFO  (TEST-DistribDocExpirationUpdateProcessorTest.test-seed#[9E6267C4443DD8E1]) [    ] o.a.s.c.CoreContainer Loading cores into CoreContainer [instanceDir=/Users/jenkins/workspace/Lucene-Solr-6.x-MacOSX/solr/build/solr-core/test/J1/temp/solr.cloud.DistribDocExpirationUpdateProcessorTest_9E6267C4443DD8E1-001/control-001]
   [junit4]   2> 1555893 WARN  (TEST-DistribDocExpirationUpdateProcessorTest.test-seed#[9E6267C4443DD8E1]) [    ] o.a.s.c.CoreContainer Couldn't add files from /Users/jenkins/workspace/Lucene-Solr-6.x-MacOSX/solr/build/solr-core/test/J1/temp/solr.cloud.DistribDocExpirationUpdateProcessorTest_9E6267C4443DD8E1-001/control-001/lib to classpath: /Users/jenkins/workspace/Lucene-Solr-6.x-MacOSX/solr/build/solr-core/test/J1/temp/solr.cloud.DistribDocExpirationUpdateProcessorTest_9E6267C4443DD8E1-001/control-001/lib
   [junit4]   2> 1555894 INFO  (TEST-DistribDocExpirationUpdateProcessorTest.test-seed#[9E6267C4443DD8E1]) [    ] o.a.s.h.c.HttpShardHandlerFactory created with socketTimeout : 90000,urlScheme : ,connTimeout : 15000,maxConnectionsPerHost : 20,maxConnections : 10000,corePoolSize : 0,maximumPoolSize : 2147483647,maxThreadIdleTime : 5,sizeOfQueue : -1,fairnessPolicy : false,useRetries : false,
   [junit4]   2> 1555897 INFO  (TEST-DistribDocExpirationUpdateProcessorTest.test-seed#[9E6267C4443DD8E1]) [    ] o.a.s.u.UpdateShardHandler Creating UpdateShardHandler HTTP client with params: socketTimeout=340000&connTimeout=45000&retry=true
   [junit4]   2> 1555898 INFO  (TEST-DistribDocExpirationUpdateProcessorTest.test-seed#[9E6267C4443DD8E1]) [    ] o.a.s.l.LogWatcher SLF4J impl is org.slf4j.impl.Log4jLoggerFactory
   [junit4]   2> 1555898 INFO  (TEST-DistribDocExpirationUpdateProcessorTest.test-seed#[9E6267C4443DD8E1]) [    ] o.a.s.l.LogWatcher Registering Log Listener [Log4j (org.slf4j.impl.Log4jLoggerFactory)]
   [junit4]   2> 1555898 INFO  (TEST-DistribDocExpirationUpdateProcessorTest.test-seed#[9E6267C4443DD8E1]) [    ] o.a.s.c.ZkContainer Zookeeper client=127.0.0.1:59784/solr
   [junit4]   2> 1555898 INFO  (TEST-DistribDocExpirationUpdateProcessorTest.test-seed#[9E6267C4443DD8E1]) [    ] o.a.s.c.ZkController zkHost includes chroot
   [junit4]   2> 1555898 INFO  (TEST-DistribDocExpirationUpdateProcessorTest.test-seed#[9E6267C4443DD8E1]) [    ] o.a.s.c.c.SolrZkClient Using default ZkCredentialsProvider
   [junit4]   2> 1555899 INFO  (TEST-DistribDocExpirationUpdateProcessorTest.test-seed#[9E6267C4443DD8E1]) [    ] o.a.s.c.c.ConnectionManager Waiting for client to connect to ZooKeeper
   [junit4]   2> 1555900 INFO  (zkCallback-1756-thread-1) [    ] o.a.s.c.c.ConnectionManager Watcher org.apache.solr.common.cloud.ConnectionManager@6877b973 name:ZooKeeperConnection Watcher:127.0.0.1:59784 got event WatchedEvent state:SyncConnected type:None path:null path:null type:None
   [junit4]   2> 1555900 INFO  (TEST-DistribDocExpirationUpdateProcessorTest.test-seed#[9E6267C4443DD8E1]) [    ] o.a.s.c.c.ConnectionManager Client is connected to ZooKeeper
   [junit4]   2> 1555901 INFO  (TEST-DistribDocExpirationUpdateProcessorTest.test-seed#[9E6267C4443DD8E1]) [    ] o.a.s.c.c.SolrZkClient Using default ZkACLProvider
   [junit4]   2> 1555902 INFO  (TEST-DistribDocExpirationUpdateProcessorTest.test-seed#[9E6267C4443DD8E1]) [n:127.0.0.1:59787_    ] o.a.s.c.ZkController Added new OnReconnect listener org.apache.solr.cloud.ZkController$$Lambda$74/1144300127@4f85de1e
   [junit4]   2> 1555903 INFO  (TEST-DistribDocExpirationUpdateProcessorTest.test-seed#[9E6267C4443DD8E1]) [n:127.0.0.1:59787_    ] o.a.s.c.c.ConnectionManager Waiting for client to connect to ZooKeeper
   [junit4]   2> 1555904 INFO  (zkCallback-1757-thread-1-processing-n:127.0.0.1:59787_) [n:127.0.0.1:59787_    ] o.a.s.c.c.ConnectionManager Watcher org.apache.solr.common.cloud.ConnectionManager@679f75be name:ZooKeeperConnection Watcher:127.0.0.1:59784/solr got event WatchedEvent state:SyncConnected type:None path:null path:null type:None
   [junit4]   2> 1555904 INFO  (TEST-DistribDocExpirationUpdateProcessorTest.test-seed#[9E6267C4443DD8E1]) [n:127.0.0.1:59787_    ] o.a.s.c.c.ConnectionManager Client is connected to ZooKeeper
   [junit4]   2> 1555906 INFO  (TEST-DistribDocExpirationUpdateProcessorTest.test-seed#[9E6267C4443DD8E1]) [n:127.0.0.1:59787_    ] o.a.s.c.c.SolrZkClient makePath: /overseer/queue
   [junit4]   2> 1555909 INFO  (TEST-DistribDocExpirationUpdateProcessorTest.test-seed#[9E6267C4443DD8E1]) [n:127.0.0.1:59787_    ] o.a.s.c.c.SolrZkClient makePath: /overseer/collection-queue-work
   [junit4]   2> 1555914 INFO  (TEST-DistribDocExpirationUpdateProcessorTest.test-seed#[9E6267C4443DD8E1]) [n:127.0.0.1:59787_    ] o.a.s.c.c.SolrZkClient makePath: /overseer/collection-map-running
   [junit4]   2> 1555917 INFO  (TEST-DistribDocExpirationUpdateProcessorTest.test-seed#[9E6267C4443DD8E1]) [n:127.0.0.1:59787_    ] o.a.s.c.c.SolrZkClient makePath: /overseer/collection-map-completed
   [junit4]   2> 1555920 INFO  (TEST-DistribDocExpirationUpdateProcessorTest.test-seed#[9E6267C4443DD8E1]) [n:127.0.0.1:59787_    ] o.a.s.c.c.SolrZkClient makePath: /overseer/collection-map-failure
   [junit4]   2> 1555923 INFO  (TEST-DistribDocExpirationUpdateProcessorTest.test-seed#[9E6267C4443DD8E1]) [n:127.0.0.1:59787_    ] o.a.s.c.c.SolrZkClient makePath: /live_nodes
   [junit4]   2> 1555926 INFO  (TEST-DistribDocExpirationUpdateProcessorTest.test-seed#[9E6267C4443DD8E1]) [n:127.0.0.1:59787_    ] o.a.s.c.c.SolrZkClient makePath: /aliases.json
   [junit4]   2> 1555928 INFO  (TEST-DistribDocExpirationUpdateProcessorTest.test-seed#[9E6267C4443DD8E1]) [n:127.0.0.1:59787_    ] o.a.s.c.c.SolrZkClient makePath: /clusterstate.json
   [junit4]   2> 1555930 INFO  (TEST-DistribDocExpirationUpdateProcessorTest.test-seed#[9E6267C4443DD8E1]) [n:127.0.0.1:59787_    ] o.a.s.c.c.SolrZkClient makePath: /security.json
   [junit4]   2> 1555932 INFO  (TEST-DistribDocExpirationUpdateProcessorTest.test-seed#[9E6267C4443DD8E1]) [n:127.0.0.1:59787_    ] o.a.s.c.c.ZkStateReader Updating cluster state from ZooKeeper... 
   [junit4]   2> 1555933 INFO  (TEST-DistribDocExpirationUpdateProcessorTest.test-seed#[9E6267C4443DD8E1]) [n:127.0.0.1:59787_    ] o.a.s.c.c.ZkStateReader Loaded empty cluster properties
   [junit4]   2> 1555934 INFO  (TEST-DistribDocExpirationUpdateProcessorTest.test-seed#[9E6267C4443DD8E1]) [n:127.0.0.1:59787_    ] o.a.s.c.c.ZkStateReader Updated live nodes from ZooKeeper... (0) -> (0)
   [junit4]   2> 1555939 INFO  (TEST-DistribDocExpirationUpdateProcessorTest.test-seed#[9E6267C4443DD8E1]) [n:127.0.0.1:59787_    ] o.a.s.c.c.SolrZkClient makePath: /overseer_elect
   [junit4]   2> 1555941 INFO  (TEST-DistribDocExpirationUpdateProcessorTest.test-seed#[9E6267C4443DD8E1]) [n:127.0.0.1:59787_    ] o.a.s.c.c.SolrZkClient makePath: /overseer_elect/election
   [junit4]   2> 1555943 INFO  (TEST-DistribDocExpirationUpdateProcessorTest.test-seed#[9E6267C4443DD8E1]) [n:127.0.0.1:59787_    ] o.a.s.c.Overseer Overseer (id=null) closing
   [junit4]   2> 1555943 INFO  (TEST-DistribDocExpirationUpdateProcessorTest.test-seed#[9E6267C4443DD8E1]) [n:127.0.0.1:59787_    ] o.a.s.c.LeaderElector Joined leadership election with path: /overseer_elect/election/95897013834416132-127.0.0.1:59787_-n_0000000000
   [junit4]   2> 1555944 INFO  (TEST-DistribDocExpirationUpdateProcessorTest.test-seed#[9E6267C4443DD8E1]) [n:127.0.0.1:59787_    ] o.a.s.c.OverseerElectionContext I am going to be the leader 127.0.0.1:59787_
   [junit4]   2> 1555944 INFO  (TEST-DistribDocExpirationUpdateProcessorTest.test-seed#[9E6267C4443DD8E1]) [n:127.0.0.1:59787_    ] o.a.s.c.c.SolrZkClient makePath: /overseer_elect/leader
   [junit4]   2> 1555946 INFO  (TEST-DistribDocExpirationUpdateProcessorTest.test-seed#[9E6267C4443DD8E1]) [n:127.0.0.1:59787_    ] o.a.s.c.Overseer Overseer (id=95897013834416132-127.0.0.1:59787_-n_0000000000) starting
   [junit4]   2> 1555949 INFO  (TEST-DistribDocExpirationUpdateProcessorTest.test-seed#[9E6267C4443DD8E1]) [n:127.0.0.1:59787_    ] o.a.s.c.c.SolrZkClient makePath: /overseer/queue-work
   [junit4]   2> 1555958 INFO  (TEST-DistribDocExpirationUpdateProcessorTest.test-seed#[9E6267C4443DD8E1]) [n:127.0.0.1:59787_    ] o.a.s.c.OverseerAutoReplicaFailoverThread Starting OverseerAutoReplicaFailoverThread autoReplicaFailoverWorkLoopDelay=10000 autoReplicaFailoverWaitAfterExpiration=30000 autoReplicaFailoverBadNodeExpiration=60000
   [junit4]   2> 1555959 INFO  (OverseerCollectionConfigSetProcessor-95897013834416132-127.0.0.1:59787_-n_0000000000) [n:127.0.0.1:59787_    ] o.a.s.c.OverseerTaskProcessor Process current queue of overseer operations
   [junit4]   2> 1555959 INFO  (OverseerStateUpdate-95897013834416132-127.0.0.1:59787_-n_0000000000) [n:127.0.0.1:59787_    ] o.a.s.c.Overseer Starting to work on the main queue
   [junit4]   2> 1555961 INFO  (TEST-DistribDocExpirationUpdateProcessorTest.test-seed#[9E6267C4443DD8E1]) [n:127.0.0.1:59787_    ] o.a.s.c.ZkController Register node as live in ZooKeeper:/live_nodes/127.0.0.1:59787_
   [junit4]   2> 1555962 INFO  (TEST-DistribDocExpirationUpdateProcessorTest.test-seed#[9E6267C4443DD8E1]) [n:127.0.0.1:59787_    ] o.a.s.c.c.SolrZkClient makePath: /live_nodes/127.0.0.1:59787_
   [junit4]   2> 1555962 INFO  (OverseerStateUpdate-95897013834416132-127.0.0.1:59787_-n_0000000000) [n:127.0.0.1:59787_    ] o.a.s.c.c.ZkStateReader Updated live nodes from ZooKeeper... (0) -> (0)
   [junit4]   2> 1555964 INFO  (zkCallback-1757-thread-1-processing-n:127.0.0.1:59787_) [n:127.0.0.1:59787_    ] o.a.s.c.c.ZkStateReader A live node change: [WatchedEvent state:SyncConnected type:NodeChildrenChanged path:/live_nodes], has occurred - updating... (live nodes size: [0])
   [junit4]   2> 1555964 INFO  (zkCallback-1757-thread-1-processing-n:127.0.0.1:59787_) [n:127.0.0.1:59787_    ] o.a.s.c.c.ZkStateReader Updated live nodes from ZooKeeper... (0) -> (1)
   [junit4]   2> 1555991 INFO  (TEST-DistribDocExpirationUpdateProcessorTest.test-seed#[9E6267C4443DD8E1]) [n:127.0.0.1:59787_    ] o.a.s.c.CoreContainer Security conf doesn't exist. Skipping setup for authorization module.
   [junit4]   2> 1555991 INFO  (TEST-DistribDocExpirationUpdateProcessorTest.test-seed#[9E6267C4443DD8E1]) [n:127.0.0.1:59787_    ] o.a.s.c.CoreContainer No authentication plugin used.
   [junit4]   2> 1555993 INFO  (TEST-DistribDocExpirationUpdateProcessorTest.test-seed#[9E6267C4443DD8E1]) [n:127.0.0.1:59787_    ] o.a.s.c.CorePropertiesLocator Looking for core definitions underneath /Users/jenkins/workspace/Lucene-Solr-6.x-MacOSX/solr/build/solr-core/test/J1/temp/solr.cloud.DistribDocExpirationUpdateProcessorTest_9E6267C4443DD8E1-001/control-001/cores
   [junit4]   2> 1555994 INFO  (TEST-DistribDocExpirationUpdateProcessorTest.test-seed#[9E6267C4443DD8E1]) [n:127.0.0.1:59787_    ] o.a.s.c.CoreDescriptor Created CoreDescriptor: {name=collection1, config=solrconfig.xml, transient=false, schema=schema.xml, loadOnStartup=true, configSetProperties=configsetprops.json, collection=control_collection, coreNodeName=, dataDir=data/, shard=}
   [junit4]   2> 1555994 INFO  (TEST-DistribDocExpirationUpdateProcessorTest.test-seed#[9E6267C4443DD8E1]) [n:127.0.0.1:59787_    ] o.a.s.c.CorePropertiesLocator Found core collection1 in /Users/jenkins/workspace/Lucene-Solr-6.x-MacOSX/solr/build/solr-core/test/J1/temp/solr.cloud.DistribDocExpirationUpdateProcessorTest_9E6267C4443DD8E1-001/control-001/cores/collection1
   [junit4]   2> 1555994 INFO  (TEST-DistribDocExpirationUpdateProcessorTest.test-seed#[9E6267C4443DD8E1]) [n:127.0.0.1:59787_    ] o.a.s.c.CorePropertiesLocator Found 1 core definitions
   [junit4]   2> 1555995 INFO  (coreLoadExecutor-4734-thread-1-processing-n:127.0.0.1:59787_) [n:127.0.0.1:59787_ c:control_collection   x:collection1] o.a.s.c.ZkController publishing state=down
   [junit4]   2> 1555995 INFO  (coreLoadExecutor-4734-thread-1-processing-n:127.0.0.1:59787_) [n:127.0.0.1:59787_ c:control_collection   x:collection1] o.a.s.c.ZkController numShards not found on descriptor - reading it from system property
   [junit4]   2> 1555997 INFO  (coreLoadExecutor-4734-thread-1-processing-n:127.0.0.1:59787_) [n:127.0.0.1:59787_ c:control_collection   x:collection1] o.a.s.c.ZkController Collection control_collection not visible yet, but flagging it so a watch is registered when it becomes visible
   [junit4]   2> 1555997 INFO  (TEST-DistribDocExpirationUpdateProcessorTest.test-seed#[9E6267C4443DD8E1]) [n:127.0.0.1:59787_    ] o.a.s.s.SolrDispatchFilter user.dir=/Users/jenkins/workspace/Lucene-Solr-6.x-MacOSX/solr/build/solr-core/test/J1
   [junit4]   2> 1555997 INFO  (TEST-DistribDocExpirationUpdateProcessorTest.test-seed#[9E6267C4443DD8E1]) [n:127.0.0.1:59787_    ] o.a.s.s.SolrDispatchFilter SolrDispatchFilter.init() done
   [junit4]   2> 1555998 INFO  (coreLoadExecutor-4734-thread-1-processing-n:127.0.0.1:59787_) [n:127.0.0.1:59787_ c:control_collection   x:collection1] o.a.s.c.c.ZkStateReader Deleting data for [control_collection]
   [junit4]   2> 1555998 INFO  (OverseerStateUpdate-95897013834416132-127.0.0.1:59787_-n_0000000000) [n:127.0.0.1:59787_    ] o.a.s.c.Overseer processMessage: queueSize: 1, message = {
   [junit4]   2>   "core":"collection1",
   [junit4]   2>   "roles":null,
   [junit4]   2>   "base_url":"http://127.0.0.1:59787",
   [junit4]   2>   "node_name":"127.0.0.1:59787_",
   [junit4]   2>   "numShards":"1",
   [junit4]   2>   "state":"down",
   [junit4]   2>   "shard":null,
   [junit4]   2>   "collection":"control_collection",
   [junit4]   2>   "operation":"state"} current state version: 0
   [junit4]   2> 1555998 INFO  (OverseerStateUpdate-95897013834416132-127.0.0.1:59787_-n_0000000000) [n:127.0.0.1:59787_    ] o.a.s.c.o.ReplicaMutator Update state numShards=1 message={
   [junit4]   2>   "core":"collection1",
   [junit4]   2>   "roles":null,
   [junit4]   2>   "base_url":"http://127.0.0.1:59787",
   [junit4]   2>   "node_name":"127.0.0.1:59787_",
   [junit4]   2>   "numShards":"1",
   [junit4]   2>   "state":"down",
   [junit4]   2>   "shard":null,
   [junit4]   2>   "collection":"control_collection",
   [junit4]   2>   "operation":"state"}
   [junit4]   2> 1555999 INFO  (OverseerStateUpdate-95897013834416132-127.0.0.1:59787_-n_0000000000) [n:127.0.0.1:59787_    ] o.a.s.c.o.ClusterStateMutator building a new cName: control_collection
   [junit4]   2> 1555999 INFO  (coreLoadExecutor-4734-thread-1-processing-n:127.0.0.1:59787_) [n:127.0.0.1:59787_ c:control_collection   x:collection1] o.a.s.c.ZkController look for our core node name
   [junit4]   2> 1555999 INFO  (OverseerStateUpdate-95897013834416132-127.0.0.1:59787_-n_0000000000) [n:127.0.0.1:59787_    ] o.a.s.c.o.ReplicaMutator Assigning new node to shard shard=shard1
   [junit4]   2> 1556001 INFO  (zkCallback-1757-thread-1-processing-n:127.0.0.1:59787_) [n:127.0.0.1:59787_    ] o.a.s.c.c.ZkStateReader A cluster state change: [WatchedEvent state:SyncConnected type:NodeDataChanged path:/clusterstate.json], has occurred - updating... (live nodes size: [1])
   [junit4]   2> 1557000 INFO  (coreLoadExecutor-4734-thread-1-processing-n:127.0.0.1:59787_) [n:127.0.0.1:59787_ c:control_collection   x:collection1] o.a.s.c.ZkController waiting to find shard id in clusterstate for collection1
   [junit4]   2> 1557000 INFO  (coreLoadExecutor-4734-thread-1-processing-n:127.0.0.1:59787_) [n:127.0.0.1:59787_ c:control_collection   x:collection1] o.a.s.c.ZkController Check for collection zkNode:control_collection
   [junit4]   2> 1557001 INFO  (coreLoadExecutor-4734-thread-1-processing-n:127.0.0.1:59787_) [n:127.0.0.1:59787_ c:control_collection   x:collection1] o.a.s.c.ZkController Collection zkNode exists
   [junit4]   2> 1557001 INFO  (coreLoadExecutor-4734-thread-1-processing-n:127.0.0.1:59787_) [n:127.0.0.1:59787_ c:control_collection   x:collection1] o.a.s.c.c.ZkStateReader Load collection config from: [/collections/control_collection]
   [junit4]   2> 1557002 INFO  (coreLoadExecutor-4734-thread-1-processing-n:127.0.0.1:59787_) [n:127.0.0.1:59787_ c:control_collection   x:collection1] o.a.s.c.c.ZkStateReader path=[/collections/control_collection] [configName]=[conf1] specified config exists in ZooKeeper
   [junit4]   2> 1557002 INFO  (coreLoadExecutor-4734-thread-1-processing-n:127.0.0.1:59787_) [n:127.0.0.1:59787_ c:control_collection   x:collection1] o.a.s.c.SolrResourceLoader new SolrResourceLoader for directory: '/Users/jenkins/workspace/Lucene-Solr-6.x-MacOSX/solr/build/solr-core/test/J1/temp/solr.cloud.DistribDocExpirationUpdateProcessorTest_9E6267C4443DD8E1-001/control-001/cores/collection1'
   [junit4]   2> 1557002 INFO  (coreLoadExecutor-4734-thread-1-processing-n:127.0.0.1:59787_) [n:127.0.0.1:59787_ c:control_collection   x:collection1] o.a.s.c.SolrResourceLoader JNDI not configured for solr (NoInitialContextEx)
   [junit4]   2> 1557002 INFO  (coreLoadExecutor-4734-thread-1-processing-n:127.0.0.1:59787_) [n:127.0.0.1:59787_ c:control_collection   x:collection1] o.a.s.c.SolrResourceLoader solr home defaulted to 'solr/' (could not find system property or JNDI)
   [junit4]   2> 1557005 INFO  (coreLoadExecutor-4734-thread-1-processing-n:127.0.0.1:59787_) [n:127.0.0.1:59787_ c:control_collection   x:collection1] o.a.s.c.Config loaded config solrconfig.xml with version 0 
   [junit4]   2> 1557013 INFO  (coreLoadExecutor-4734-thread-1-processing-n:127.0.0.1:59787_) [n:127.0.0.1:59787_ c:control_collection   x:collection1] o.a.s.c.SolrConfig current version of requestparams : -1
   [junit4]   2> 1557016 INFO  (coreLoadExecutor-4734-thread-1-processing-n:127.0.0.1:59787_) [n:127.0.0.1:59787_ c:control_collection   x:collection1] o.a.s.c.SolrConfig Using Lucene MatchVersion: 6.1.0
   [junit4]   2> 1557026 INFO  (coreLoadExecutor-4734-thread-1-processing-n:127.0.0.1:59787_) [n:127.0.0.1:59787_ c:control_collection   x:collection1] o.a.s.c.SolrConfig Loaded SolrConfig: solrconfig.xml
   [junit4]   2> 1557031 INFO  (coreLoadExecutor-4734-thread-1-processing-n:127.0.0.1:59787_) [n:127.0.0.1:59787_ c:control_collection   x:collection1] o.a.s.s.IndexSchema [collection1] Schema name=test
   [junit4]   2> 1557089 INFO  (coreLoadExecutor-4734-thread-1-processing-n:127.0.0.1:59787_) [n:127.0.0.1:59787_ c:control_collection   x:collection1] o.a.s.s.IndexSchema default search field in schema is text
   [junit4]   2> 1557089 INFO  (coreLoadExecutor-4734-thread-1-processing-n:127.0.0.1:59787_) [n:127.0.0.1:59787_ c:control_collection   x:collection1] o.a.s.s.IndexSchema unique key field: id
   [junit4]   2> 1557090 INFO  (coreLoadExecutor-4734-thread-1-processing-n:127.0.0.1:59787_) [n:127.0.0.1:59787_ c:control_collection   x:collection1] o.a.s.s.FileExchangeRateProvider Reloading exchange rates from file currency.xml
   [junit4]   2> 1557093 INFO  (coreLoadExecutor-4734-thread-1-processing-n:127.0.0.1:59787_) [n:127.0.0.1:59787_ c:control_collection   x:collection1] o.a.s.s.FileExchangeRateProvider Reloading exchange rates from file currency.xml
   [junit4]   2> 1557122 INFO  (coreLoadExecutor-4734-thread-1-processing-n:127.0.0.1:59787_) [n:127.0.0.1:59787_ c:control_collection   x:collection1] o.a.s.c.ConfigSetProperties Did not find ConfigSet properties, assuming default properties: Can't find resource 'configsetprops.json' in classpath or '/configs/conf1', cwd=/Users/jenkins/workspace/Lucene-Solr-6.x-MacOSX/solr/build/solr-core/test/J1
   [junit4]   2> 1557122 INFO  (coreLoadExecutor-4734-thread-1-processing-n:127.0.0.1:59787_) [n:127.0.0.1:59787_ c:control_collection   x:collection1] o.a.s.c.CoreContainer Creating SolrCore 'collection1' using configuration from collection control_collection
   [junit4]   2> 1557122 INFO  (coreLoadExecutor-4734-thread-1-processing-n:127.0.0.1:59787_) [n:127.0.0.1:59787_ c:control_collection s:shard1 r:core_node1 x:collection1] o.a.s.c.SolrCore org.apache.solr.core.MockDirectoryFactory
   [junit4]   2> 1557122 INFO  (coreLoadExecutor-4734-thread-1-processing-n:127.0.0.1:59787_) [n:127.0.0.1:59787_ c:control_collection s:shard1 r:core_node1 x:collection1] o.a.s.c.SolrCore [[collection1] ] Opening new SolrCore at [/Users/jenkins/workspace/Lucene-Solr-6.x-MacOSX/solr/build/solr-core/test/J1/temp/solr.cloud.DistribDocExpirationUpdateProcessorTest_9E6267C4443DD8E1-001/control-001/cores/collection1], dataDir=[/Users/jenkins/workspace/Lucene-Solr-6.x-MacOSX/solr/build/solr-core/test/J1/temp/solr.cloud.DistribDocExpirationUpdateProcessorTest_9E6267C4443DD8E1-001/control-001/cores/collection1/data/]
   [junit4]   2> 1557122 INFO  (coreLoadExecutor-4734-thread-1-processing-n:127.0.0.1:59787_) [n:127.0.0.1:59787_ c:control_collection s:shard1 r:core_node1 x:collection1] o.a.s.c.SolrCore JMX monitoring not detected for core: collection1
   [junit4]   2> 1557123 INFO  (coreLoadExecutor-4734-thread-1-processing-n:127.0.0.1:59787_) [n:127.0.0.1:59787_ c:control_collection s:shard1 r:core_node1 x:collection1] o.a.s.c.CachingDirectoryFactory return new directory for /Users/jenkins/workspace/Lucene-Solr-6.x-MacOSX/solr/build/solr-core/test/J1/temp/solr.cloud.DistribDocExpirationUpdateProcessorTest_9E6267C4443DD8E1-001/control-001/cores/collection1/data
   [junit4]   2> 1557123 INFO  (coreLoadExecutor-4734-thread-1-processing-n:127.0.0.1:59787_) [n:127.0.0.1:59787_ c:control_collection s:shard1 r:core_node1 x:collection1] o.a.s.c.SolrCore New index directory detected: old=null new=/Users/jenkins/workspace/Lucene-Solr-6.x-MacOSX/solr/build/solr-core/test/J1/temp/solr.cloud.DistribDocExpirationUpdateProcessorTest_9E6267C4443DD8E1-001/control-001/cores/collection1/data/index/
   [junit4]   2> 1557123 WARN  (coreLoadExecutor-4734-thread-1-processing-n:127.0.0.1:59787_) [n:127.0.0.1:59787_ c:control_collection s:shard1 r:core_node1 x:collection1] o.a.s.c.SolrCore [collection1] Solr index directory '/Users/jenkins/workspace/Lucene-Solr-6.x-MacOSX/solr/build/solr-core/test/J1/temp/solr.cloud.DistribDocExpirationUpdateProcessorTest_9E6267C4443DD8E1-001/control-001/cores/collection1/data/index' doesn't exist. Creating new index...
   [junit4]   2> 1557123 INFO  (coreLoadExecutor-4734-thread-1-processing-n:127.0.0.1:59787_) [n:127.0.0.1:59787_ c:control_collection s:shard1 r:core_node1 x:collection1] o.a.s.c.CachingDirectoryFactory return new directory for /Users/jenkins/workspace/Lucene-Solr-6.x-MacOSX/solr/build/solr-core/test/J1/temp/solr.cloud.DistribDocExpirationUpdateProcessorTest_9E6267C4443DD8E1-001/control-001/cores/collection1/data/index
   [junit4]   2> 1557123 INFO  (coreLoadExecutor-4734-thread-1-processing-n:127.0.0.1:59787_) [n:127.0.0.1:59787_ c:control_collection s:shard1 r:core_node1 x:collection1] o.a.s.u.RandomMergePolicy RandomMergePolicy wrapping class org.apache.lucene.index.TieredMergePolicy: [TieredMergePolicy: maxMergeAtOnce=21, maxMergeAtOnceExplicit=22, maxMergedSegmentMB=3.345703125, floorSegmentMB=1.2763671875, forceMergeDeletesPctAllowed=5.280699755721545, segmentsPerTier=11.0, maxCFSSegmentSizeMB=8.796093022207999E12, noCFSRatio=1.0
   [junit4]   2> 1557124 INFO  (coreLoadExecutor-4734-thread-1-processing-n:127.0.0.1:59787_) [n:127.0.0.1:59787_ c:control_collection s:shard1 r:core_node1 x:collection1] o.a.s.c.SolrDeletionPolicy SolrDeletionPolicy.onCommit: commits: num=1
   [junit4]   2> 	commit{dir=MockDirectoryWrapper(RAMDirectory@5a47323a lockFactory=org.apache.lucene.store.SingleInstanceLockFactory@3dbd777d),segFN=segments_1,generation=1}
   [junit4]   2> 1557124 INFO  (coreLoadExecutor-4734-thread-1-processing-n:127.0.0.1:59787_) [n:127.0.0.1:59787_ c:control_collection s:shard1 r:core_node1 x:collection1] o.a.s.c.SolrDeletionPolicy newest commit generation = 1
   [junit4]   2> 1557124 INFO  (OldIndexDirectoryCleanupThreadForCore-collection1) [n:127.0.0.1:59787_ c:control_collection s:shard1 r:core_node1 x:collection1] o.a.s.c.SolrCore Looking for old index directories to cleanup for core collection1 in /Users/jenkins/workspace/Lucene-Solr-6.x-MacOSX/solr/build/solr-core/test/J1/temp/solr.cloud.DistribDocExpirationUpdateProcessorTest_9E6267C4443DD8E1-001/control-001/cores/collection1/data/
   [junit4]   2> 1557125 WARN  (OldIndexDirectoryCleanupThreadForCore-collection1) [n:127.0.0.1:59787_ c:control_collection s:shard1 r:core_node1 x:collection1] o.a.s.c.DirectoryFactory /Users/jenkins/workspace/Lucene-Solr-6.x-MacOSX/solr/build/solr-core/test/J1/temp/solr.cloud.DistribDocExpirationUpdateProcessorTest_9E6267C4443DD8E1-001/control-001/cores/collection1/data/ does not point to a valid data directory; skipping clean-up of old index directories.
   [junit4]   2> 1557127 INFO  (coreLoadExecutor-4734-thread-1-processing-n:127.0.0.1:59787_) [n:127.0.0.1:59787_ c:control_collection s:shard1 r:core_node1 x:collection1] o.a.s.u.p.UpdateRequestProcessorChain creating updateRequestProcessorChain "convert-ttl-defaults"
   [junit4]   2> 1557167 INFO  (coreLoadExecutor-4734-thread-1-processing-n:127.0.0.1:59787_) [n:127.0.0.1:59787_ c:control_collection s:shard1 r:core_node1 x:collection1] o.a.s.u.p.UpdateRequestProcessorChain creating updateRequestProcessorChain "convert-ttl-field"
   [junit4]   2> 1557213 INFO  (coreLoadExecutor-4734-thread-1-processing-n:127.0.0.1:59787_) [n:127.0.0.1:59787_ c:control_collection s:shard1 r:core_node1 x:collection1] o.a.s.u.p.UpdateRequestProcessorChain creating updateRequestProcessorChain "convert-ttl-param"
   [junit4]   2> 1557213 INFO  (coreLoadExecutor-4734-thread-1-processing-n:127.0.0.1:59787_) [n:127.0.0.1:59787_ c:control_collection s:shard1 r:core_node1 x:collection1] o.a.s.u.p.UpdateRequestProcessorChain creating updateRequestProcessorChain "convert-ttl-field-with-param-default"
   [junit4]   2> 1557213 INFO  (coreLoadExecutor-4734-thread-1-processing-n:127.0.0.1:59787_) [n:127.0.0.1:59787_ c:control_collection s:shard1 r:core_node1 x:collection1] o.a.s.u.p.UpdateRequestProcessorChain creating updateRequestProcessorChain "scheduled-delete" (default)
   [junit4]   2> 1557272 INFO  (coreLoadExecutor-4734-thread-1-processing-n:127.0.0.1:59787_) [n:127.0.0.1:59787_ c:control_collection s:shard1 r:core_node1 x:collection1] o.a.s.u.p.UpdateRequestProcessorChain inserting DistributedUpdateProcessorFactory into updateRequestProcessorChain "scheduled-delete" (default)
   [junit4]   2> 1557279 INFO  (coreLoadExecutor-4734-thread-1-processing-n:127.0.0.1:59787_) [n:127.0.0.1:59787_ c:control_collection s:shard1 r:core_node1 x:collection1] o.a.s.h.l.XMLLoader xsltCacheLifetimeSeconds=60
   [junit4]   2> 1557280 INFO  (coreLoadExecutor-4734-thread-1-processing-n:127.0.0.1:59787_) [n:127.0.0.1:59787_ c:control_collection s:shard1 r:core_node1 x:collection1] o.a.s.h.l.XMLLoader xsltCacheLifetimeSeconds=60
   [junit4]   2> 1557281 INFO  (coreLoadExecutor-4734-thread-1-processing-n:127.0.0.1:59787_) [n:127.0.0.1:59787_ c:control_collection s:shard1 r:core_node1 x:collection1] o.a.s.h.l.XMLLoader xsltCacheLifetimeSeconds=60
   [junit4]   2> 1557282 INFO  (coreLoadExecutor-4734-thread-1-processing-n:127.0.0.1:59787_) [n:127.0.0.1:59787_ c:control_collection s:shard1 r:core_node1 x:collection1] o.a.s.h.l.XMLLoader xsltCacheLifetimeSeconds=60
   [junit4]   2> 1557284 INFO  (coreLoadExecutor-4734-thread-1-processing-n:127.0.0.1:59787_) [n:127.0.0.1:59787_ c:control_collection s:shard1 r:core_node1 x:collection1] o.a.s.c.RequestHandlers Registered paths: /admin/mbeans,,/update/json/docs,/admin/luke,/export,/get,/admin/properties,/update/json,/admin/threads,/update/csv,/sql,/graph,/select,/admin/segments,/admin/system,/replication,/config,/stream,/schema,/admin/plugins,/admin/logging,/admin/ping,/update,/admin/file
   [junit4]   2> 1557284 INFO  (coreLoadExecutor-4734-thread-1-processing-n:127.0.0.1:59787_) [n:127.0.0.1:59787_ c:control_collection s:shard1 r:core_node1 x:collection1] o.a.s.c.SolrCore Using default statsCache cache: org.apache.solr.search.stats.LocalStatsCache
   [junit4]   2> 1557285 INFO  (coreLoadExecutor-4734-thread-1-processing-n:127.0.0.1:59787_) [n:127.0.0.1:59787_ c:control_collection s:shard1 r:core_node1 x:collection1] o.a.s.u.UpdateHandler Using UpdateLog implementation: org.apache.solr.update.UpdateLog
   [junit4]   2> 1557285 INFO  (coreLoadExecutor-4734-thread-1-processing-n:127.0.0.1:59787_) [n:127.0.0.1:59787_ c:control_collection s:shard1 r:core_node1 x:collection1] o.a.s.u.UpdateLog Initializing UpdateLog: dataDir= defaultSyncLevel=FLUSH numRecordsToKeep=100 maxNumLogsToKeep=10 numVersionBuckets=65536
   [junit4]   2> 1557287 INFO  (coreLoadExecutor-4734-thread-1-processing-n:127.0.0.1:59787_) [n:127.0.0.1:59787_ c:control_collection s:shard1 r:core_node1 x:collection1] o.a.s.u.CommitTracker Hard AutoCommit: disabled
   [junit4]   2> 1557287 INFO  (coreLoadExecutor-4734-thread-1-processing-n:127.0.0.1:59787_) [n:127.0.0.1:59787_ c:control_collection s:shard1 r:core_node1 x:collection1] o.a.s.u.CommitTracker Soft AutoCommit: disabled
   [junit4]   2> 1557287 INFO  (coreLoadExecutor-4734-thread-1-processing-n:127.0.0.1:59787_) [n:127.0.0.1:59787_ c:control_collection s:shard1 r:core_node1 x:collection1] o.a.s.u.RandomMergePolicy RandomMergePolicy wrapping class org.apache.lucene.index.TieredMergePolicy: [TieredMergePolicy: maxMergeAtOnce=22, maxMergeAtOnceExplicit=46, maxMergedSegmentMB=66.505859375, floorSegmentMB=1.4150390625, forceMergeDeletesPctAllowed=0.8274954163336989, segmentsPerTier=38.0, maxCFSSegmentSizeMB=8.796093022207999E12, noCFSRatio=1.0
   [junit4]   2> 1557287 INFO  (coreLoadExecutor-4734-thread-1-processing-n:127.0.0.1:59787_) [n:127.0.0.1:59787_ c:control_collection s:shard1 r:core_node1 x:collection1] o.a.s.c.SolrDeletionPolicy SolrDeletionPolicy.onInit: commits: num=1
   [junit4]   2> 	commit{dir=MockDirectoryWrapper(RAMDirectory@5a47323a lockFactory=org.apache.lucene.store.SingleInstanceLockFactory@3dbd777d),segFN=segments_1,generation=1}
   [junit4]   2> 1557288 INFO  (coreLoadExecutor-4734-thread-1-processing-n:127.0.0.1:59787_) [n:127.0.0.1:59787_ c:control_collection s:shard1 r:core_node1 x:collection1] o.a.s.c.SolrDeletionPolicy newest commit generation = 1
   [junit4]   2> 1557288 INFO  (coreLoadExecutor-4734-thread-1-processing-n:127.0.0.1:59787_) [n:127.0.0.1:59787_ c:control_collection s:shard1 r:core_node1 x:collection1] o.a.s.s.SolrIndexSearcher Opening [Searcher@2b5fb2f1[collection1] main]
   [junit4]   2> 1557288 INFO  (coreLoadExecutor-4734-thread-1-processing-n:127.0.0.1:59787_) [n:127.0.0.1:59787_ c:control_collection s:shard1 r:core_node1 x:collection1] o.a.s.c.c.ZkStateReader Load collection config from: [/collections/control_collection]
   [junit4]   2> 1557289 INFO  (coreLoadExecutor-4734-thread-1-processing-n:127.0.0.1:59787_) [n:127.0.0.1:59787_ c:control_collection s:shard1 r:core_node1 x:collection1] o.a.s.c.c.ZkStateReader path=[/collections/control_collection] [configName]=[conf1] specified config exists in ZooKeeper
   [junit4]   2> 1557289 INFO  (coreLoadExecutor-4734-thread-1-processing-n:127.0.0.1:59787_) [n:127.0.0.1:59787_ c:control_collection s:shard1 r:core_node1 x:collection1] o.a.s.r.ManagedResourceStorage Setting up ZooKeeper-based storage for the RestManager with znodeBase: /configs/conf1
   [junit4]   2> 1557290 INFO  (coreLoadExecutor-4734-thread-1-processing-n:127.0.0.1:59787_) [n:127.0.0.1:59787_ c:control_collection s:shard1 r:core_node1 x:collection1] o.a.s.r.ManagedResourceStorage Configured ZooKeeperStorageIO with znodeBase: /configs/conf1
   [junit4]   2> 1557290 INFO  (coreLoadExecutor-4734-thread-1-processing-n:127.0.0.1:59787_) [n:127.0.0.1:59787_ c:control_collection s:shard1 r:core_node1 x:collection1] o.a.s.r.RestManager Initializing RestManager with initArgs: {}
   [junit4]   2> 1557290 INFO  (coreLoadExecutor-4734-thread-1-processing-n:127.0.0.1:59787_) [n:127.0.0.1:59787_ c:control_collection s:shard1 r:core_node1 x:collection1] o.a.s.r.ManagedResourceStorage Reading _rest_managed.json using ZooKeeperStorageIO:path=/configs/conf1
   [junit4]   2> 1557291 INFO  (coreLoadExecutor-4734-thread-1-processing-n:127.0.0.1:59787_) [n:127.0.0.1:59787_ c:control_collection s:shard1 r:core_node1 x:collection1] o.a.s.r.ManagedResourceStorage No data found for znode /configs/conf1/_rest_managed.json
   [junit4]   2> 1557291 INFO  (coreLoadExecutor-4734-thread-1-processing-n:127.0.0.1:59787_) [n:127.0.0.1:59787_ c:control_collection s:shard1 r:core_node1 x:collection1] o.a.s.r.ManagedResourceStorage Loaded null at path _rest_managed.json using ZooKeeperStorageIO:path=/configs/conf1
   [junit4]   2> 1557291 INFO  (coreLoadExecutor-4734-thread-1-processing-n:127.0.0.1:59787_) [n:127.0.0.1:59787_ c:control_collection s:shard1 r:core_node1 x:collection1] o.a.s.r.RestManager Initializing 0 registered ManagedResources
   [junit4]   2> 1557315 INFO  (coreLoadExecutor-4734-thread-1-processing-n:127.0.0.1:59787_) [n:127.0.0.1:59787_ c:control_collection s:shard1 r:core_node1 x:collection1] o.a.s.h.ReplicationHandler Commits will be reserved for  10000
   [junit4]   2> 1557315 INFO  (coreLoadExecutor-4734-thread-1-processing-n:127.0.0.1:59787_) [n:127.0.0.1:59787_ c:control_collection s:shard1 r:core_node1 x:collection1] o.a.s.u.UpdateLog Looking up max value of version field to seed version buckets
   [junit4]   2> 1557315 INFO  (searcherExecutor-4735-thread-1-processing-n:127.0.0.1:59787_ x:collection1 s:shard1 c:control_collection r:core_node1) [n:127.0.0.1:59787_ c:control_collection s:shard1 r:core_node1 x:collection1] o.a.s.c.SolrCore [collection1] Registered new searcher Searcher@2b5fb2f1[collection1] main{ExitableDirectoryReader(UninvertingDirectoryReader())}
   [junit4]   2> 1557315 INFO  (coreLoadExecutor-4734-thread-1-processing-n:127.0.0.1:59787_) [n:127.0.0.1:59787_ c:control_collection s:shard1 r:core_node1 x:collection1] o.a.s.u.VersionInfo Refreshing highest value of _version_ for 65536 version buckets from index
   [junit4]   2> 1557316 INFO  (coreLoadExecutor-4734-thread-1-processing-n:127.0.0.1:59787_) [n:127.0.0.1:59787_ c:control_collection s:shard1 r:core_node1 x:collection1] o.a.s.u.VersionInfo No terms found for _version_, cannot seed version bucket highest value from index
   [junit4]   2> 1557316 INFO  (coreLoadExecutor-4734-thread-1-processing-n:127.0.0.1:59787_) [n:127.0.0.1:59787_ c:control_collection s:shard1 r:core_node1 x:collection1] o.a.s.u.UpdateLog Could not find max version in index or recent updates, using new clock 1534352223344001024
   [junit4]   2> 1557318 INFO  (coreLoadExecutor-4734-thread-1-processing-n:127.0.0.1:59787_) [n:127.0.0.1:59787_ c:control_collection s:shard1 r:core_node1 x:collection1] o.a.s.u.UpdateLog Took 2.0ms to seed version buckets with highest version 1534352223344001024
   [junit4]   2> 1557318 INFO  (coreLoadExecutor-4734-thread-1-processing-n:127.0.0.1:59787_) [n:127.0.0.1:59787_ c:control_collection s:shard1 r:core_node1 x:collection1] o.a.s.c.ZkController watch zkdir /configs/conf1
   [junit4]   2> 1557319 INFO  (coreLoadExecutor-4734-thread-1-processing-n:127.0.0.1:59787_) [n:127.0.0.1:59787_ c:control_collection s:shard1 r:core_node1 x:collection1] o.a.s.c.CoreContainer registering core: collection1
   [junit4]   2> 1557319 INFO  (coreZkRegister-4728-thread-1-processing-n:127.0.0.1:59787_ x:collection1 s:shard1 c:control_collection r:core_node1) [n:127.0.0.1:59787_ c:control_collection s:shard1 r:core_node1 x:collection1] o.a.s.c.ZkController Register replica - core:collection1 address:http://127.0.0.1:59787 collection:control_collection shard:shard1
   [junit4]   2> 1557320 INFO  (coreZkRegister-4728-thread-1-processing-n:127.0.0.1:59787_ x:collection1 s:shard1 c:control_collection r:core_node1) [n:127.0.0.1:59787_ c:control_collection s:shard1 r:core_node1 x:collection1] o.a.s.c.c.SolrZkClient makePath: /collections/control_collection/leader_elect/shard1/election
   [junit4]   2> 1557327 INFO  (coreZkRegister-4728-thread-1-processing-n:127.0.0.1:59787_ x:collection1 s:shard1 c:control_collection r:core_node1) [n:127.0.0.1:59787_ c:control_collection s:shard1 r:core_node1 x:collection1] o.a.s.c.LeaderElector Joined leadership election with path: /collections/control_collection/leader_elect/shard1/election/95897013834416132-core_node1-n_0000000000
   [junit4]   2> 1557328 INFO  (coreZkRegister-4728-thread-1-processing-n:127.0.0.1:59787_ x:collection1 s:shard1 c:control_collection r:core_node1) [n:127.0.0.1:59787_ c:control_collection s:shard1 r:core_node1 x:collection1] o.a.s.c.ShardLeaderElectionContext Running the leader process for shard=shard1 and weAreReplacement=false and leaderVoteWait=10000
   [junit4]   2> 1557331 INFO  (coreZkRegister-4728-thread-1-processing-n:127.0.0.1:59787_ x:collection1 s:shard1 c:control_collection r:core_node1) [n:127.0.0.1:59787_ c:control_collection s:shard1 r:core_node1 x:collection1] o.a.s.c.ShardLeaderElectionContext Enough replicas found to continue.
   [junit4]   2> 1557331 INFO  (coreZkRegister-4728-thread-1-processing-n:127.0.0.1:59787_ x:collection1 s:shard1 c:control_collection r:core_node1) [n:127.0.0.1:59787_ c:control_collection s:shard1 r:core_node1 x:collection1] o.a.s.c.ShardLeaderElectionContext I may be the new leader - try and sync
   [junit4]   2> 1557331 INFO  (coreZkRegister-4728-thread-1-processing-n:127.0.0.1:59787_ x:collection1 s:shard1 c:control_collection r:core_node1) [n:127.0.0.1:59787_ c:control_collection s:shard1 r:core_node1 x:collection1] o.a.s.c.SyncStrategy Sync replicas to http://127.0.0.1:59787/collection1/
   [junit4]   2> 1557331 INFO  (coreZkRegister-4728-thread-1-processing-n:127.0.0.1:59787_ x:collection1 s:shard1 c:control_collection r:core_node1) [n:127.0.0.1:59787_ c:control_collection s:shard1 r:core_node1 x:collection1] o.a.s.c.SyncStrategy Sync Success - now sync replicas to me
   [junit4]   2> 1557331 INFO  (coreZkRegister-4728-thread-1-processing-n:127.0.0.1:59787_ x:collection1 s:shard1 c:control_collection r:core_node1) [n:127.0.0.1:59787_ c:control_collection s:shard1 r:core_node1 x:collection1] o.a.s.c.SyncStrategy http://127.0.0.1:59787/collection1/ has no replicas
   [junit4]   2> 1557332 INFO  (OverseerStateUpdate-95897013834416132-127.0.0.1:59787_-n_0000000000) [n:127.0.0.1:59787_    ] o.a.s.c.Overseer processMessage: queueSize: 1, message = {
   [junit4]   2>   "operation":"leader",
   [junit4]   2>   "shard":"shard1",
   [junit4]   2>   "collection":"control_collection"} current state version: 1
   [junit4]   2> 1557332 INFO  (coreZkRegister-4728-thread-1-processing-n:127.0.0.1:59787_ x:collection1 s:shard1 c:control_collection r:core_node1) [n:127.0.0.1:59787_ c:control_collection s:shard1 r:core_node1 x:collection1] o.a.s.c.c.SolrZkClient makePath: /collections/control_collection/leaders/shard1
   [junit4]   2> 1557337 INFO  (coreZkRegister-4728-thread-1-processing-n:127.0.0.1:59787_ x:collection1 s:shard1 c:control_collection r:core_node1) [n:127.0.0.1:59787_ c:control_collection s:shard1 r:core_node1 x:collection1] o.a.s.c.ShardLeaderElectionContextBase Creating leader registration node /collections/control_collection/leaders/shard1/leader after winning as /collections/control_collection/leader_elect/shard1/election/95897013834416132-core_node1-n_0000000000
   [junit4]   2> 1557340 INFO  (coreZkRegister-4728-thread-1-processing-n:127.0.0.1:59787_ x:collection1 s:shard1 c:control_collection r:core_node1) [n:127.0.0.1:59787_ c:control_collection s:shard1 r:core_node1 x:collection1] o.a.s.c.ShardLeaderElectionContext I am the new leader: http://127.0.0.1:59787/collection1/ shard1
   [junit4]   2> 1557341 INFO  (OverseerStateUpdate-95897013834416132-127.0.0.1:59787_-n_0000000000) [n:127.0.0.1:59787_    ] o.a.s.c.Overseer processMessage: queueSize: 1, message = {
   [junit4]   2>   "operation":"leader",
   [junit4]   2>   "shard":"shard1",
   [junit4]   2>   "collection":"control_collection",
   [junit4]   2>   "base_url":"http://127.0.0.1:59787",
   [junit4]   2>   "core":"collection1",
   [junit4]   2>   "state":"active"} current state version: 1
   [junit4]   2> 1557447 INFO  (zkCallback-1757-thread-1-processing-n:127.0.0.1:59787_) [n:127.0.0.1:59787_    ] o.a.s.c.c.ZkStateReader A cluster state change: [WatchedEvent state:SyncConnected type:NodeDataChanged path:/clusterstate.json], has occurred - updating... (live nodes size: [1])
   [junit4]   2> 1557503 INFO  (TEST-DistribDocExpirationUpdateProcessorTest.test-seed#[9E6267C4443DD8E1]) [    ] o.a.s.c.c.SolrZkClient Using default ZkCredentialsProvider
   [junit4]   2> 1557503 INFO  (coreZkRegister-4728-thread-1-processing-n:127.0.0.1:59787_ x:collection1 s:shard1 c:control_collection r:core_node1) [n:127.0.0.1:59787_ c:control_collection s:shard1 r:core_node1 x:collection1] o.a.s.c.ZkController We are http://127.0.0.1:59787/collection1/ and leader is http://127.0.0.1:59787/collection1/
   [junit4]   2> 1557503 INFO  (coreZkRegister-4728-thread-1-processing-n:127.0.0.1:59787_ x:collection1 s:shard1 c:control_collection r:core_node1) [n:127.0.0.1:59787_ c:control_collection s:shard1 r:core_node1 x:collection1] o.a.s.c.ZkController No LogReplay needed for core=collection1 baseURL=http://127.0.0.1:59787
   [junit4]   2> 1557503 INFO  (coreZkRegister-4728-thread-1-processing-n:127.0.0.1:59787_ x:collection1 s:shard1 c:control_collection r:core_node1) [n:127.0.0.1:59787_ c:control_collection s:shard1 r:core_node1 x:collection1] o.a.s.c.ZkController I am the leader, no recovery necessary
   [junit4]   2> 1557503 INFO  (TEST-DistribDocExpirationUpdateProcessorTest.test-seed#[9E6267C4443DD8E1]) [    ] o.a.s.c.c.ConnectionManager Waiting for client to connect to ZooKeeper
   [junit4]   2> 1557503 INFO  (coreZkRegister-4728-thread-1-processing-n:127.0.0.1:59787_ x:collection1 s:shard1 c:control_collection r:core_node1) [n:127.0.0.1:59787_ c:control_collection s:shard1 r:core_node1 x:collection1] o.a.s.c.ZkController publishing state=active
   [junit4]   2> 1557503 INFO  (coreZkRegister-4728-thread-1-processing-n:127.0.0.1:59787_ x:collection1 s:shard1 c:control_collection r:core_node1) [n:127.0.0.1:59787_ c:control_collection s:shard1 r:core_node1 x:collection1] o.a.s.c.ZkController numShards not found on descriptor - reading it from system property
   [junit4]   2> 1557505 INFO  (zkCallback-1761-thread-1) [    ] o.a.s.c.c.ConnectionManager Watcher org.apache.solr.common.cloud.ConnectionManager@687c3375 name:ZooKeeperConnection Watcher:127.0.0.1:59784/solr got event WatchedEvent state:SyncConnected type:None path:null path:null type:None
   [junit4]   2> 1557505 INFO  (TEST-DistribDocExpirationUpdateProcessorTest.test-seed#[9E6267C4443DD8E1]) [    ] o.a.s.c.c.ConnectionManager Client is connected to ZooKeeper
   [junit4]   2> 1557505 INFO  (TEST-DistribDocExpirationUpdateProcessorTest.test-seed#[9E6267C4443DD8E1]) [    ] o.a.s.c.c.SolrZkClient Using default ZkACLProvider
   [junit4]   2> 1557507 INFO  (TEST-DistribDocExpirationUpdateProcessorTest.test-seed#[9E6267C4443DD8E1]) [    ] o.a.s.c.c.ZkStateReader Updating cluster state from ZooKeeper... 
   [junit4]   2> 1557508 INFO  (OverseerStateUpdate-95897013834416132-127.0.0.1:59787_-n_0000000000) [n:127.0.0.1:59787_    ] o.a.s.c.Overseer processMessage: queueSize: 1, message = {
   [junit4]   2>   "core":"collection1",
   [junit4]   2>   "core_node_name":"core_node1",
   [junit4]   2>   "roles":null,
   [junit4]   2>   "base_url":"http://127.0.0.1:59787",
   [junit4]   2>   "node_name":"127.0.0.1:59787_",
   [junit4]   2>   "numShards":"2",
   [junit4]   2>   "state":"active",
   [junit4]   2>   "shard":"shard1",
   [junit4]   2>   "collection":"control_collection",
   [junit4]   2>   "operation":"state"} current state version: 2
   [junit4]   2> 1557508 INFO  (OverseerStateUpdate-95897013834416132-127.0.0.1:59787_-n_0000000000) [n:127.0.0.1:59787_    ] o.a.s.c.o.ReplicaMutator Update state numShards=2 message={
   [junit4]   2>   "core":"collection1",
   [junit4]   2>   "core_node_name":"core_node1",
   [junit4]   2>   "roles":null,
   [junit4]   2>   "base_url":"http://127.0.0.1:59787",
   [junit4]   2>   "node_name":"127.0.0.1:59787_",
   [junit4]   2>   "numShards":"2",
   [junit4]   2>   "state":"active",
   [junit4]   2>   "shard":"shard1",
   [junit4]   2>   "collection":"control_collection",
   [junit4]   2>   "operation":"state"}
   [junit4]   2> 1557508 INFO  (TEST-DistribDocExpirationUpdateProcessorTest.test-seed#[9E6267C4443DD8E1]) [    ] o.a.s.c.c.ZkStateReader Loaded empty cluster properties
   [junit4]   2> 1557510 INFO  (TEST-DistribDocExpirationUpdateProcessorTest.test-seed#[9E6267C4443DD8E1]) [    ] o.a.s.c.c.ZkStateReader Updated live nodes from ZooKeeper... (0) -> (1)
   [junit4]   2> 1557512 INFO  (TEST-DistribDocExpirationUpdateProcessorTest.test-seed#[9E6267C4443DD8E1]) [    ] o.a.s.c.ChaosMonkey monkey: init - expire sessions:false cause connection loss:false
   [junit4]   2> 1557512 INFO  (TEST-DistribDocExpirationUpdateProcessorTest.test-seed#[9E6267C4443DD8E1]) [    ] o.a.s.c.AbstractFullDistribZkTestBase Creating collection1 with stateFormat=2
   [junit4]   2> 1557512 INFO  (TEST-DistribDocExpirationUpdateProcessorTest.test-seed#[9E6267C4443DD8E1]) [    ] o.a.s.c.c.SolrZkClient Using default ZkCredentialsProvider
   [junit4]   2> 1557513 INFO  (TEST-DistribDocExpirationUpdateProcessorTest.test-seed#[9E6267C4443DD8E1]) [    ] o.a.s.c.c.ConnectionManager Waiting for client to connect to ZooKeeper
   [junit4]   2> 1557516 INFO  (zkCallback-1762-thread-1) [    ] o.a.s.c.c.ConnectionManager Watcher org.apache.solr.common.cloud.ConnectionManager@7a209fec name:ZooKeeperConnection Watcher:127.0.0.1:59784/solr got event WatchedEvent state:SyncConnected type:None path:null path:null type:None
   [junit4]   2> 1557516 INFO  (TEST-DistribDocExpirationUpdateProcessorTest.test-seed#[9E6267C4443DD8E1]) [    ] o.a.s.c.c.ConnectionManager Client is connected to ZooKeeper
   [junit4]   2> 1557517 INFO  (TEST-DistribDocExpirationUpdateProcessorTest.test-seed#[9E6267C4443DD8E1]) [    ] o.a.s.c.c.SolrZkClient Using default ZkACLProvider
   [junit4]   2> 1557520 INFO  (OverseerStateUpdate-95897013834416132-127.0.0.1:59787_-n_0000000000) [n:127.0.0.1:59787_    ] o.a.s.c.Overseer processMessage: queueSize: 1, message = {
   [junit4]   2>   "operation":"create",
   [junit4]   2>   "name":"collection1",
   [junit4]   2>   "numShards":"2",
   [junit4]   2>   "stateFormat":"2"} current state version: 2
   [junit4]   2> 1557520 INFO  (OverseerStateUpdate-95897013834416132-127.0.0.1:59787_-n_0000000000) [n:127.0.0.1:59787_    ] o.a.s.c.o.ClusterStateMutator building a new cName: collection1
   [junit4]   2> 1557521 INFO  (zkCallback-1761-thread-1) [    ] o.a.s.c.c.ZkStateReader A cluster state change: [WatchedEvent state:SyncConnected type:NodeDataChanged path:/clusterstate.json], has occurred - updating... (live nodes size: [1])
   [junit4]   2> 1557521 INFO  (zkCallback-1757-thread-1-processing-n:127.0.0.1:59787_) [n:127.0.0.1:59787_    ] o.a.s.c.c.ZkStateReader A cluster state change: [WatchedEvent state:SyncConnected type:NodeDataChanged path:/clusterstate.json], has occurred - updating... (live nodes size: [1])
   [junit4]   2> 1557635 INFO  (OverseerStateUpdate-95897013834416132-127.0.0.1:59787_-n_0000000000) [n:127.0.0.1:59787_    ] o.a.s.c.o.ZkStateWriter going to create_collection /collections/collection1/state.json
   [junit4]   2> 1557796 INFO  (TEST-DistribDocExpirationUpdateProcessorTest.test-seed#[9E6267C4443DD8E1]) [    ] o.a.s.SolrTestCaseJ4 Writing core.properties file to /Users/jenkins/workspace/Lucene-Solr-6.x-MacOSX/solr/build/solr-core/test/J1/temp/solr.cloud.DistribDocExpirationUpdateProcessorTest_9E6267C4443DD8E1-001/shard-1-001/cores/collection1
   [junit4]   2> 1557797 INFO  (TEST-DistribDocExpirationUpdateProcessorTest.test-seed#[9E6267C4443DD8E1]) [    ] o.a.s.c.AbstractFullDistribZkTestBase create jetty 1 in directory /Users/jenkins/workspace/Lucene-Solr-6.x-MacOSX/solr/build/solr-core/test/J1/temp/solr.cloud.DistribDocExpirationUpdateProcessorTest_9E6267C4443DD8E1-001/shard-1-001
   [junit4]   2> 1557798 INFO  (TEST-DistribDocExpirationUpdateProcessorTest.test-seed#[9E6267C4443DD8E1]) [    ] o.e.j.s.Server jetty-9.3.8.v20160314
   [junit4]   2> 1557800 INFO  (TEST-DistribDocExpirationUpdateProcessorTest.test-seed#[9E6267C4443DD8E1]) [    ] o.e.j.s.h.ContextHandler Started o.e.j.s.ServletContextHandler@7c964d04{/,null,AVAILABLE}
   [junit4]   2> 1557800 INFO  (TEST-DistribDocExpirationUpdateProcessorTest.test-seed#[9E6267C4443DD8E1]) [    ] o.e.j.s.ServerConnector Started ServerConnector@4759b0e6{HTTP/1.1,[http/1.1]}{127.0.0.1:59793}
   [junit4]   2> 1557800 INFO  (TEST-DistribDocExpirationUpdateProcessorTest.test-seed#[9E6267C4443DD8E1]) [    ] o.e.j.s.Server Started @1563143ms
   [junit4]   2> 1557800 INFO  (TEST-DistribDocExpirationUpdateProcessorTest.test-seed#[9E6267C4443DD8E1]) [    ] o.a.s.c.s.e.JettySolrRunner Jetty properties: {solr.data.dir=/Users/jenkins/workspace/Lucene-Solr-6.x-MacOSX/solr/build/solr-core/test/J1/temp/solr.cloud.DistribDocExpirationUpdateProcessorTest_9E6267C4443DD8E1-001/tempDir-001/jetty1, solrconfig=solrconfig.xml, hostContext=/, hostPort=59793, coreRootDirectory=/Users/jenkins/workspace/Lucene-Solr-6.x-MacOSX/solr/build/solr-core/test/J1/temp/solr.cloud.DistribDocExpirationUpdateProcessorTest_9E6267C4443DD8E1-001/shard-1-001/cores}
   [junit4]   2> 1557801 INFO  (TEST-DistribDocExpirationUpdateProcessorTest.test-seed#[9E6267C4443DD8E1]) [    ] o.a.s.s.SolrDispatchFilter SolrDispatchFilter.init(): sun.misc.Launcher$AppClassLoader@4554617c
   [junit4]   2> 1557801 INFO  (TEST-DistribDocExpirationUpdateProcessorTest.test-seed#[9E6267C4443DD8E1]) [    ] o.a.s.c.SolrResourceLoader new SolrResourceLoader for directory: '/Users/jenkins/workspace/Lucene-Solr-6.x-MacOSX/solr/build/solr-core/test/J1/temp/solr.cloud.DistribDocExpirationUpdateProcessorTest_9E6267C4443DD8E1-001/shard-1-001'
   [junit4]   2> 1557801 INFO  (TEST-DistribDocExpirationUpdateProcessorTest.test-seed#[9E6267C4443DD8E1]) [    ] o.a.s.c.SolrResourceLoader JNDI not configured for solr (NoInitialContextEx)
   [junit4]   2> 1557801 INFO  (TEST-DistribDocExpirationUpdateProcessorTest.test-seed#[9E6267C4443DD8E1]) [    ] o.a.s.c.SolrResourceLoader solr home defaulted to 'solr/' (could not find system property or JNDI)
   [junit4]   2> 1557802 INFO  (TEST-DistribDocExpirationUpdateProcessorTest.test-seed#[9E6267C4443DD8E1]) [    ] o.a.s.c.c.SolrZkClient Using default ZkCredentialsProvider
   [junit4]   2> 1557802 INFO  (TEST-DistribDocExpirationUpdateProcessorTest.test-seed#[9E6267C4443DD8E1]) [    ] o.a.s.c.c.ConnectionManager Waiting for client to connect to ZooKeeper
   [junit4]   2> 1557804 INFO  (zkCallback-1763-thread-1) [    ] o.a.s.c.c.ConnectionManager Watcher org.apache.solr.common.cloud.ConnectionManager@3e5b0ce5 name:ZooKeeperConnection Watcher:127.0.0.1:59784/solr got event WatchedEvent state:SyncConnected type:None path:null path:null type:None
   [junit4]   2> 1557804 INFO  (TEST-DistribDocExpirationUpdateProcessorTest.test-seed#[9E6267C4443DD8E1]) [    ] o.a.s.c.c.ConnectionManager Client is connected to ZooKeeper
   [junit4]   2> 1557804 INFO  (TEST-DistribDocExpirationUpdateProcessorTest.test-seed#[9E6267C4443DD8E1]) [    ] o.a.s.c.c.SolrZkClient Using default ZkACLProvider
   [junit4]   2> 1557806 INFO  (TEST-DistribDocExpirationUpdateProcessorTest.test-seed#[9E6267C4443DD8E1]) [    ] o.a.s.s.SolrDispatchFilter Loading solr.xml from SolrHome (not found in ZooKeeper)
   [junit4]   2> 1557806 INFO  (TEST-DistribDocExpirationUpdateProcessorTest.test-seed#[9E6267C4443DD8E1]) [    ] o.a.s.c.SolrXmlConfig Loading container configuration from /Users/jenkins/workspace/Lucene-Solr-6.x-MacOSX/solr/build/solr-core/test/J1/temp/solr.cloud.DistribDocExpirationUpdateProcessorTest_9E6267C4443DD8E1-001/shard-1-001/solr.xml
   [junit4]   2> 1557819 INFO  (TEST-DistribDocExpirationUpdateProcessorTest.test-seed#[9E6267C4443DD8E1]) [    ] o.a.s.c.CorePropertiesLocator Config-defined core root directory: /Users/jenkins/workspace/Lucene-Solr-6.x-MacOSX/solr/build/solr-core/test/J1/temp/solr.cloud.DistribDocExpirationUpdateProcessorTest_9E6267C4443DD8E1-001/shard-1-001/cores
   [junit4]   2> 1557819 INFO  (TEST-DistribDocExpirationUpdateProcessorTest.test-seed#[9E6267C4443DD8E1]) [    ] o.a.s.c.CoreContainer New CoreContainer 1374887143
   [junit4]   2> 1557819 INFO  (TEST-DistribDocExpirationUpdateProcessorTest.test-seed#[9E6267C4443DD8E1]) [    ] o.a.s.c.CoreContainer Loading cores into CoreContainer [instanceDir=/Users/jenkins/workspace/Lucene-Solr-6.x-MacOSX/solr/build/solr-core/test/J1/temp/solr.cloud.DistribDocExpirationUpdateProcessorTest_9E6267C4443DD8E1-001/shard-1-001]
   [junit4]   2> 1557819 WARN  (TEST-DistribDocExpirationUpdateProcessorTest.test-seed#[9E6267C4443DD8E1]) [    ] o.a.s.c.CoreContainer Couldn't add files from /Users/jenkins/workspace/Lucene-Solr-6.x-MacOSX/solr/build/solr-core/test/J1/temp/solr.cloud.DistribDocExpirationUpdateProcessorTest_9E6267C4443DD8E1-001/shard-1-001/lib to classpath: /Users/jenkins/workspace/Lucene-Solr-6.x-MacOSX/solr/build/solr-core/test/J1/temp/solr.cloud.DistribDocExpirationUpdateProcessorTest_9E6267C4443DD8E1-001/shard-1-001/lib
   [junit4]   2> 1557820 INFO  (TEST-DistribDocExpirationUpdateProcessorTest.test-seed#[9E6267C4443DD8E1]) [    ] o.a.s.h.c.HttpShardHandlerFactory created with socketTimeout : 90000,urlScheme : ,connTimeout : 15000,maxConnectionsPerHost : 20,maxConnections : 10000,corePoolSize : 0,maximumPoolSize : 2147483647,maxThreadIdleTime : 5,sizeOfQueue : -1,fairnessPolicy : false,useRetries : false,
   [junit4]   2> 1557822 INFO  (TEST-DistribDocExpirationUpdateProcessorTest.test-seed#[9E6267C4443DD8E1]) [    ] o.a.s.u.UpdateShardHandler Creating UpdateShardHandler HTTP client with params: socketTimeout=340000&connTimeout=45000&retry=true
   [junit4]   2> 1557823 INFO  (TEST-DistribDocExpirationUpdateProcessorTest.test-seed#[9E6267C4443DD8E1]) [    ] o.a.s.l.LogWatcher SLF4J impl is org.slf4j.impl.Log4jLoggerFactory
   [junit4]   2> 1557823 INFO  (TEST-DistribDocExpirationUpdateProcessorTest.test-seed#[9E6267C4443DD8E1]) [    ] o.a.s.l.LogWatcher Registering Log Listener [Log4j (org.slf4j.impl.Log4jLoggerFactory)]
   [junit4]   2> 1557823 INFO  (TEST-DistribDocExpirationUpdateProcessorTest.test-seed#[9E6267C4443DD8E1]) [    ] o.a.s.c.ZkContainer Zookeeper client=127.0.0.1:59784/solr
   [junit4]   2> 1557823 INFO  (TEST-DistribDocExpirationUpdateProcessorTest.test-seed#[9E6267C4443DD8E1]) [    ] o.a.s.c.ZkController zkHost includes chroot
   [junit4]   2> 1557823 INFO  (TEST-DistribDocExpirationUpdateProcessorTest.test-seed#[9E6267C4443DD8E1]) [    ] o.a.s.c.c.SolrZkClient Using default ZkCredentialsProvider
   [junit4]   2> 1557824 INFO  (TEST-DistribDocExpirationUpdateProcessorTest.test-seed#[9E6267C4443DD8E1]) [    ] o.a.s.c.c.ConnectionManager Waiting for client to connect to ZooKeeper
   [junit4]   2> 1557825 INFO  (zkCallback-1766-thread-1) [    ] o.a.s.c.c.ConnectionManager Watcher org.apache.solr.common.cloud.ConnectionManager@2b21af47 name:ZooKeeperConnection Watcher:127.0.0.1:59784 got event WatchedEvent state:SyncConnected type:None path:null path:null type:None
   [junit4]   2> 1557826 INFO  (TEST-DistribDocExpirationUpdateProcessorTest.test-seed#[9E6267C4443DD8E1]) [    ] o.a.s.c.c.ConnectionManager Client is connected to ZooKeeper
   [junit4]   2> 1557826 INFO  (TEST-DistribDocExpirationUpdateProcessorTest.test-seed#[9E6267C4443DD8E1]) [    ] o.a.s.c.c.SolrZkClient Using default ZkACLProvider
   [junit4]   2> 1557828 INFO  (TEST-DistribDocExpirationUpdateProcessorTest.test-seed#[9E6267C4443DD8E1]) [n:127.0.0.1:59793_    ] o.a.s.c.ZkController Added new OnReconnect listener org.apache.solr.cloud.ZkController$$Lambda$74/1144300127@732b1296
   [junit4]   2> 1557828 INFO  (TEST-DistribDocExpirationUpdateProcessorTest.test-seed#[9E6267C4443DD8E1]) [n:127.0.0.1:59793_    ] o.a.s.c.c.ConnectionManager Waiting for client to connect to ZooKeeper
   [junit4]   2> 1557831 INFO  (zkCallback-1767-thread-1-processing-n:127.0.0.1:59793_) [n:127.0.0.1:59793_    ] o.a.s.c.c.ConnectionManager Watcher org.apache.solr.common.cloud.ConnectionManager@6edbccb3 name:ZooKeeperConnection Watcher:127.0.0.1:59784/solr got event WatchedEvent state:SyncConnected type:None path:null path:null type:None
   [junit4]   2> 1557831 INFO  (TEST-DistribDocExpirationUpdateProcessorTest.test-seed#[9E6267C4443DD8E1]) [n:127.0.0.1:59793_    ] o.a.s.c.c.ConnectionManager Client is connected to ZooKeeper
   [junit4]   2> 1557841 INFO  (TEST-DistribDocExpirationUpdateProcessorTest.test-seed#[9E6267C4443DD8E1]) [n:127.0.0.1:59793_    ] o.a.s.c.c.ZkStateReader Updating cluster state from ZooKeeper... 
   [junit4]   2> 1557843 INFO  (TEST-DistribDocExpirationUpdateProcessorTest.test-seed#[9E6267C4443DD8E1]) [n:127.0.0.1:59793_    ] o.a.s.c.c.ZkStateReader Loaded empty cluster properties
   [junit4]   2> 1557844 INFO  (TEST-DistribDocExpirationUpdateProcessorTest.test-seed#[9E6267C4443DD8E1]) [n:127.0.0.1:59793_    ] o.a.s.c.c.ZkStateReader Updated live nodes from ZooKeeper... (0) -> (1)
   [junit4]   2> 1557848 INFO  (TEST-DistribDocExpirationUpdateProcessorTest.test-seed#[9E6267C4443DD8E1]) [n:127.0.0.1:59793_    ] o.a.s.c.Overseer Overseer (id=null) closing
   [junit4]   2> 1557849 INFO  (TEST-DistribDocExpirationUpdateProcessorTest.test-seed#[9E6267C4443DD8E1]) [n:127.0.0.1:59793_    ] o.a.s.c.LeaderElector Joined leadership election with path: /overseer_elect/election/95897013834416137-127.0.0.1:59793_-n_0000000001
   [junit4]   2> 1557850 INFO  (TEST-DistribDocExpirationUpdateProcessorTest.test-seed#[9E6267C4443DD8E1]) [n:127.0.0.1:59793_    ] o.a.s.c.LeaderElector Watching path /overseer_elect/election/95897013834416132-127.0.0.1:59787_-n_0000000000 to know if I could be the leader
   [junit4]   2> 1557851 INFO  (TEST-DistribDocExpirationUpdateProcessorTest.test-seed#[9E6267C4443DD8E1]) [n:127.0.0.1:59793_    ] o.a.s.c.ZkController Publish node=127.0.0.1:59793_ as DOWN
   [junit4]   2> 1557854 INFO  (OverseerStateUpdate-95897013834416132-127.0.0.1:59787_-n_0000000000) [n:127.0.0.1:59787_    ] o.a.s.c.Overseer processMessage: queueSize: 1, message = {
   [junit4]   2>   "operation":"downnode",
   [junit4]   2>   "node_name":"127.0.0.1:59793_"} current state version: 3
   [junit4]   2> 1557854 INFO  (OverseerStateUpdate-95897013834416132-127.0.0.1:59787_-n_0000000000) [n:127.0.0.1:59787_    ] o.a.s.c.o.NodeMutator DownNode state invoked for node: 127.0.0.1:59793_
   [junit4]   2> 1557856 INFO  (zkCallback-1767-thread-1-processing-n:127.0.0.1:59793_) [n:127.0.0.1:59793_    ] o.a.s.c.c.ZkStateReader A cluster state change: [WatchedEvent state:SyncConnected type:NodeDataChanged path:/clusterstate.json], has occurred - updating... (live nodes size: [1])
   [junit4]   2> 1557856 INFO  (zkCallback-1757-thread-1-processing-n:127.0.0.1:59787_) [n:127.0.0.1:59787_    ] o.a.s.c.c.ZkStateReader A cluster state change: [WatchedEvent state:SyncConnected type:NodeDataChanged path:/clusterstate.json], has occurred - updating... (live nodes size: [1])
   [junit4]   2> 1557856 INFO  (zkCallback-1761-thread-1) [    ] o.a.s.c.c.ZkStateReader A cluster state change: [WatchedEvent state:SyncConnected type:NodeDataChanged path:/clusterstate.json], has occurred - updating... (live nodes size: [1])
   [junit4]   2> 1557962 INFO  (OverseerStateUpdate-95897013834416132-127.0.0.1:59787_-n_0000000000) [n:127.0.0.1:59787_    ] o.a.s.c.o.ZkStateWriter going to update_collection /collections/collection1/state.json version: 0
   [junit4]   2> 1558855 INFO  (TEST-DistribDocExpirationUpdateProcessorTest.test-seed#[9E6267C4443DD8E1]) [n:127.0.0.1:59793_    ] o.a.s.c.ZkController Register node as live in ZooKeeper:/live_nodes/127.0.0.1:59793_
   [junit4]   2> 1558856 INFO  (TEST-DistribDocExpirationUpdateProcessorTest.test-seed#[9E6267C4443DD8E1]) [n:127.0.0.1:59793_    ] o.a.s.c.c.SolrZkClient makePath: /live_nodes/127.0.0.1:59793_
   [junit4]   2> 1558858 INFO  (zkCallback-1761-thread-1) [    ] o.a.s.c.c.ZkStateReader A live node change: [WatchedEvent state:SyncConnected type:NodeChildrenChanged path:/live_nodes], has occurred - updating... (live nodes size: [1])
   [junit4]   2> 1558858 INFO  (zkCallback-1767-thread-1-processing-n:127.0.0.1:59793_) [n:127.0.0.1:59793_    ] o.a.s.c.c.ZkStateReader A live node change: [WatchedEvent state:SyncConnected type:NodeChildrenChanged path:/live_nodes], has occurred - updating... (live nodes size: [1])
   [junit4]   2> 1558858 INFO  (zkCallback-1757-thread-1-processing-n:127.0.0.1:59787_) [n:127.0.0.1:59787_    ] o.a.s.c.c.ZkStateReader A live node change: [WatchedEvent state:SyncConnected type:NodeChildrenChanged path:/live_nodes], has occurred - updating... (live nodes size: [1])
   [junit4]   2> 1558859 INFO  (zkCallback-1767-thread-1-processing-n:127.0.0.1:59793_) [n:127.0.0.1:59793_    ] o.a.s.c.c.ZkStateReader Updated live nodes from ZooKeeper... (1) -> (2)
   [junit4]   2> 1558859 INFO  (zkCallback-1757-thread-1-processing-n:127.0.0.1:59787_) [n:127.0.0.1:59787_    ] o.a.s.c.c.ZkStateReader Updated live nodes from ZooKeeper... (1) -> (2)
   [junit4]   2> 1558859 INFO  (zkCallback-1761-thread-1) [    ] o.a.s.c.c.ZkStateReader Updated live nodes from ZooKeeper... (1) -> (2)
   [junit4]   2> 1558867 INFO  (TEST-DistribDocExpirationUpdateProcessorTest.test-seed#[9E6267C4443DD8E1]) [n:127.0.0.1:59793_    ] o.a.s.c.CoreContainer Security conf doesn't exist. Skipping setup for authorization module.
   [junit4]   2> 1558868 INFO  (TEST-DistribDocExpirationUpdateProcessorTest.test-seed#[9E6267C4443DD8E1]) [n:127.0.0.1:59793_    ] o.a.s.c.CoreContainer No authentication plugin used.
   [junit4]   2> 1558872 INFO  (TEST-DistribDocExpirationUpdateProcessorTest.test-seed#[9E6267C4443DD8E1]) [n:127.0.0.1:59793_    ] o.a.s.c.CorePropertiesLocator Looking for core definitions underneath /Users/jenkins/workspace/Lucene-Solr-6.x-MacOSX/solr/build/solr-core/test/J1/temp/solr.cloud.DistribDocExpirationUpdateProcessorTest_9E6267C4443DD8E1-001/shard-1-001/cores
   [junit4]   2> 1558873 INFO  (TEST-DistribDocExpirationUpdateProcessorTest.test-seed#[9E6267C4443DD8E1]) [n:127.0.0.1:59793_    ] o.a.s.c.CoreDescriptor Created CoreDescriptor: {name=collection1, config=solrconfig.xml, transient=false, schema=schema.xml, loadOnStartup=true, configSetProperties=configsetprops.json, collection=collection1, coreNodeName=, dataDir=data/, shard=}
   [junit4]   2> 1558873 INFO  (TEST-DistribDocExpirationUpdateProcessorTest.test-seed#[9E6267C4443DD8E1]) [n:127.0.0.1:59793_    ] o.a.s.c.CorePropertiesLocator Found core collection1 in /Users/jenkins/workspace/Lucene-Solr-6.x-MacOSX/solr/build/solr-core/test/J1/temp/solr.cloud.DistribDocExpirationUpdateProcessorTest_9E6267C4443DD8E1-001/shard-1-001/cores/collection1
   [junit4]   2> 1558873 INFO  (TEST-DistribDocExpirationUpdateProcessorTest.test-seed#[9E6267C4443DD8E1]) [n:127.0.0.1:59793_    ] o.a.s.c.CorePropertiesLocator Found 1 core definitions
   [junit4]   2> 1558875 INFO  (TEST-DistribDocExpirationUpdateProcessorTest.test-seed#[9E6267C4443DD8E1]) [n:127.0.0.1:59793_    ] o.a.s.s.SolrDispatchFilter user.dir=/Users/jenkins/workspace/Lucene-Solr-6.x-MacOSX/solr/build/solr-core/test/J1
   [junit4]   2> 1558875 INFO  (TEST-DistribDocExpirationUpdateProcessorTest.test-seed#[9E6267C4443DD8E1]) [n:127.0.0.1:59793_    ] o.a.s.s.SolrDispatchFilter SolrDispatchFilter.init() done
   [junit4]   2> 1558875 INFO  (coreLoadExecutor-4746-thread-1-processing-n:127.0.0.1:59793_) [n:127.0.0.1:59793_ c:collection1   x:collection1] o.a.s.c.ZkController publishing state=down
   [junit4]   2> 1558875 INFO  (coreLoadExecutor-4746-thread-1-processing-n:127.0.0.1:59793_) [n:127.0.0.1:59793_ c:collection1   x:collection1] o.a.s.c.ZkController numShards not found on descriptor - reading it from system property
   [junit4]   2> 1558876 INFO  (coreLoadExecutor-4746-thread-1-processing-n:127.0.0.1:59793_) [n:127.0.0.1:59793_ c:collection1   x:collection1] o.a.s.c.ZkController Registering watch for collection collection1
   [junit4]   2> 1558877 INFO  (coreLoadExecutor-4746-thread-1-processing-n:127.0.0.1:59793_) [n:127.0.0.1:59793_ c:collection1   x:collection1] o.a.s.c.c.ZkStateReader Add data for [collection1] ver [1]
   [junit4]   2> 1558877 INFO  (OverseerStateUpdate-95897013834416132-127.0.0.1:59787_-n_0000000000) [n:127.0.0.1:59787_    ] o.a.s.c.Overseer processMessage: queueSize: 1, message = {
   [junit4]   2>   "core":"collection1",
   [junit4]   2>   "roles":null,
   [junit4]   2>   "base_url":"http://127.0.0.1:59793",
   [junit4]   2>   "node_name":"127.0.0.1:59793_",
   [junit4]   2>   "numShards":"2",
   [junit4]   2>   "state":"down",
   [junit4]   2>   "shard":null,
   [junit4]   2>   "collection":"collection1",
   [junit4]   2>   "operation":"state"} current state version: 4
   [junit4]   2> 1558877 INFO  (OverseerStateUpdate-95897013834416132-127.0.0.1:59787_-n_0000000000) [n:127.0.0.1:59787_    ] o.a.s.c.o.ReplicaMutator Update state numShards=2 message={
   [junit4]   2>   "core":"collection1",
   [junit4]   2>   "roles":null,
   [junit4]   2>   "base_url":"http://127.0.0.1:59793",
   [junit4]   2>   "node_name":"127.0.0.1:59793_",
   [junit4]   2>   "numShards":"2",
   [junit4]   2>   "state":"down",
   [junit4]   2>   "shard":null,
   [junit4]   2>   "collection":"collection1",
   [junit4]   2>   "operation":"state"}
   [junit4]   2> 1558877 INFO  (OverseerStateUpdate-95897013834416132-127.0.0.1:59787_-n_0000000000) [n:127.0.0.1:59787_    ] o.a.s.c.o.ReplicaMutator Collection already exists with numShards=2
   [junit4]   2> 1558877 INFO  (coreLoadExecutor-4746-thread-1-processing-n:127.0.0.1:59793_) [n:127.0.0.1:59793_ c:collection1   x:collection1] o.a.s.c.ZkController look for our core node name
   [junit4]   2> 1558877 INFO  (OverseerStateUpdate-95897013834416132-127.0.0.1:59787_-n_0000000000) [n:127.0.0.1:59787_    ] o.a.s.c.o.ReplicaMutator Assigning new node to shard shard=shard2
   [junit4]   2> 1558992 INFO  (OverseerStateUpdate-95897013834416132-127.0.0.1:59787_-n_0000000000) [n:127.0.0.1:59787_    ] o.a.s.c.o.ZkStateWriter going to update_collection /collections/collection1/state.json version: 1
   [junit4]   2> 1558993 INFO  (zkCallback-1767-thread-1-processing-n:127.0.0.1:59793_) [n:127.0.0.1:59793_    ] o.a.s.c.c.ZkStateReader A cluster state change: [WatchedEvent state:SyncConnected type:NodeDataChanged path:/collections/collection1/state.json] for collection [collection1] has occurred - updating... (live nodes size: [2])
   [junit4]   2> 1558993 INFO  (zkCallback-1767-thread-1-processing-n:127.0.0.1:59793_) [n:127.0.0.1:59793_    ] o.a.s.c.c.ZkStateReader Updating data for [collection1] from [1] to [2]
   [junit4]   2> 1559880 INFO  (coreLoadExecutor-4746-thread-1-processing-n:127.0.0.1:59793_) [n:127.0.0.1:59793_ c:collection1   x:collection1] o.a.s.c.ZkController waiting to find shard id in clusterstate for collection1
   [junit4]   2> 1559880 INFO  (coreLoadExecutor-4746-thread-1-processing-n:127.0.0.1:59793_) [n:127.0.0.1:59793_ c:collection1   x:collection1] o.a.s.c.ZkController Check for collection zkNode:collection1
   [junit4]   2> 1559880 INFO  (coreLoadExecutor-4746-thread-1-processing-n:127.0.0.1:59793_) [n:127.0.0.1:59793_ c:collection1   x:collection1] o.a.s.c.ZkController Collection zkNode exists
   [junit4]   2> 1559881 INFO  (coreLoadExecutor-4746-thread-1-processing-n:127.0.0.1:59793_) [n:127.0.0.1:59793_ c:collection1   x:collection1] o.a.s.c.c.ZkStateReader Load collection config from: [/collections/collection1]
   [junit4]   2> 1559882 INFO  (coreLoadExecutor-4746-thread-1-processing-n:127.0.0.1:59793_) [n:127.0.0.1:59793_ c:collection1   x:collection1] o.a.s.c.c.ZkStateReader path=[/collections/collection1] [configName]=[conf1] specified config exists in ZooKeeper
   [junit4]   2> 1559882 INFO  (coreLoadExecutor-4746-thread-1-processing-n:127.0.0.1:59793_) [n:127.0.0.1:59793_ c:collection1   x:collection1] o.a.s.c.SolrResourceLoader new SolrResourceLoader for directory: '/Users/jenkins/workspace/Lucene-Solr-6.x-MacOSX/solr/build/solr-core/test/J1/temp/solr.cloud.DistribDocExpirationUpdateProcessorTest_9E6267C4443DD8E1-001/shard-1-001/cores/collection1'
   [junit4]   2> 1559882 INFO  (coreLoadExecutor-4746-thread-1-processing-n:127.0.0.1:59793_) [n:127.0.0.1:59793_ c:collection1   x:collection1] o.a.s.c.SolrResourceLoader JNDI not configured for solr (NoInitialContextEx)
   [junit4]   2> 1559882 INFO  (coreLoadExecutor-4746-thread-1-processing-n:127.0.0.1:59793_) [n:127.0.0.1:59793_ c:collection1   x:collection1] o.a.s.c.SolrResourceLoader solr home defaulted to 'solr/' (could not find system property or JNDI)
   [junit4]   2> 1559913 INFO  (coreLoadExecutor-4746-thread-1-processing-n:127.0.0.1:59793_) [n:127.0.0.1:59793_ c:collection1   x:collection1] o.a.s.c.Config loaded config solrconfig.xml with version 0 
   [junit4]   2> 1559955 INFO  (coreLoadExecutor-4746-thread-1-processing-n:127.0.0.1:59793_) [n:127.0.0.1:59793_ c:collection1   x:collection1] o.a.s.c.SolrConfig current version of requestparams : -1
   [junit4]   2> 1559957 INFO  (coreLoadExecutor-4746-thread-1-processing-n:127.0.0.1:59793_) [n:127.0.0.1:59793_ c:collection1   x:collection1] o.a.s.c.SolrConfig Using Lucene MatchVersion: 6.1.0
   [junit4]   2> 1559962 INFO  (coreLoadExecutor-4746-thread-1-processing-n:127.0.0.1:59793_) [n:127.0.0.1:59793_ c:collection1   x:collection1] o.a.s.c.SolrConfig Loaded SolrConfig: solrconfig.xml
   [junit4]   2> 1559966 INFO  (coreLoadExecutor-4746-thread-1-processing-n:127.0.0.1:59793_) [n:127.0.0.1:59793_ c:collection1   x:collection1] o.a.s.s.IndexSchema [collection1] Schema name=test
   [junit4]   2> 1560039 INFO  (coreLoadExecutor-4746-thread-1-processing-n:127.0.0.1:59793_) [n:127.0.0.1:59793_ c:collection1   x:collection1] o.a.s.s.IndexSchema default search field in schema is text
   [junit4]   2> 1560040 INFO  (coreLoadExecutor-4746-thread-1-processing-n:127.0.0.1:59793_) [n:127.0.0.1:59793_ c:collection1   x:collection1] o.a.s.s.IndexSchema unique key field: id
   [junit4]   2> 1560041 INFO  (coreLoadExecutor-4746-thread-1-processing-n:127.0.0.1:59793_) [n:127.0.0.1:59793_ c:collection1   x:collection1] o.a.s.s.FileExchangeRateProvider Reloading exchange rates from file currency.xml
   [junit4]   2> 1560044 INFO  (coreLoadExecutor-4746-thread-1-processing-n:127.0.0.1:59793_) [n:127.0.0.1:59793_ c:collection1   x:collection1] o.a.s.s.FileExchangeRateProvider Reloading exchange rates from file currency.xml
   [junit4]   2> 1560075 INFO  (coreLoadExecutor-4746-thread-1-processing-n:127.0.0.1:59793_) [n:127.0.0.1:59793_ c:collection1   x:collection1] o.a.s.c.ConfigSetProperties Did not find ConfigSet properties, assuming default properties: Can't find resource 'configsetprops.json' in classpath or '/configs/conf1', cwd=/Users/jenkins/workspace/Lucene-Solr-6.x-MacOSX/solr/build/solr-core/test/J1
   [junit4]   2> 1560075 INFO  (coreLoadExecutor-4746-thread-1-processing-n:127.0.0.1:59793_) [n:127.0.0.1:59793_ c:collection1   x:collection1] o.a.s.c.CoreContainer Creating SolrCore 'collection1' using configuration from

[...truncated too long message...]

2> 1623136 INFO  (TEST-DistribDocExpirationUpdateProcessorTest.test-seed#[9E6267C4443DD8E1]) [    ] o.a.s.c.Overseer Overseer (id=95897013834416146-127.0.0.1:59818_-n_0000000004) closing
   [junit4]   2> 1623136 INFO  (OverseerStateUpdate-95897013834416146-127.0.0.1:59818_-n_0000000004) [n:127.0.0.1:59818_    ] o.a.s.c.Overseer Starting to work on the main queue
   [junit4]   2> 1623136 INFO  (OverseerStateUpdate-95897013834416146-127.0.0.1:59818_-n_0000000004) [n:127.0.0.1:59818_    ] o.a.s.c.Overseer Overseer Loop exiting : 127.0.0.1:59818_
   [junit4]   2> 1623136 INFO  (OverseerCollectionConfigSetProcessor-95897013834416146-127.0.0.1:59818_-n_0000000004) [n:127.0.0.1:59818_    ] o.a.s.c.OverseerTaskProcessor According to ZK I (id=95897013834416146-127.0.0.1:59818_-n_0000000004) am no longer a leader.
   [junit4]   2> 1623137 ERROR (OverseerCollectionConfigSetProcessor-95897013834416146-127.0.0.1:59818_-n_0000000004) [n:127.0.0.1:59818_    ] o.a.s.c.OverseerTaskProcessor Unable to prioritize overseer 
   [junit4]   2> java.lang.InterruptedException
   [junit4]   2> 	at org.apache.solr.common.cloud.ZkCmdExecutor.retryOperation(ZkCmdExecutor.java:67)
   [junit4]   2> 	at org.apache.solr.common.cloud.SolrZkClient.exists(SolrZkClient.java:311)
   [junit4]   2> 	at org.apache.solr.cloud.OverseerNodePrioritizer.prioritizeOverseerNodes(OverseerNodePrioritizer.java:60)
   [junit4]   2> 	at org.apache.solr.cloud.OverseerTaskProcessor.run(OverseerTaskProcessor.java:162)
   [junit4]   2> 	at java.lang.Thread.run(Thread.java:745)
   [junit4]   2> 1623139 INFO  (zkCallback-1786-thread-1-processing-n:127.0.0.1:59818_) [n:127.0.0.1:59818_    ] o.a.s.c.c.ZkStateReader A live node change: [WatchedEvent state:SyncConnected type:NodeChildrenChanged path:/live_nodes], has occurred - updating... (live nodes size: [1])
   [junit4]   2> 1623139 WARN  (zkCallback-1786-thread-1-processing-n:127.0.0.1:59818_) [n:127.0.0.1:59818_    ] o.a.s.c.c.ZkStateReader ZooKeeper watch triggered, but Solr cannot talk to ZK: [KeeperErrorCode = Session expired for /live_nodes]
   [junit4]   2> 1623141 INFO  (TEST-DistribDocExpirationUpdateProcessorTest.test-seed#[9E6267C4443DD8E1]) [    ] o.e.j.s.ServerConnector Stopped ServerConnector@3c4a17cf{HTTP/1.1,[http/1.1]}{127.0.0.1:0}
   [junit4]   2> 1623141 INFO  (TEST-DistribDocExpirationUpdateProcessorTest.test-seed#[9E6267C4443DD8E1]) [    ] o.e.j.s.h.ContextHandler Stopped o.e.j.s.ServletContextHandler@7844549c{/,null,UNAVAILABLE}
   [junit4]   2> 1623144 INFO  (TEST-DistribDocExpirationUpdateProcessorTest.test-seed#[9E6267C4443DD8E1]) [    ] o.a.s.c.ZkTestServer connecting to 127.0.0.1:59784 59784
   [junit4]   2> 1623161 INFO  (Thread-3349) [    ] o.a.s.c.ZkTestServer connecting to 127.0.0.1:59784 59784
   [junit4]   2> 1624428 WARN  (Thread-3349) [    ] o.a.s.c.ZkTestServer Watch limit violations: 
   [junit4]   2> Maximum concurrent create/delete watches above limit:
   [junit4]   2> 
   [junit4]   2> 	6	/solr/aliases.json
   [junit4]   2> 	6	/solr/clusterprops.json
   [junit4]   2> 	5	/solr/security.json
   [junit4]   2> 	5	/solr/configs/conf1
   [junit4]   2> 
   [junit4]   2> Maximum concurrent data watches above limit:
   [junit4]   2> 
   [junit4]   2> 	6	/solr/clusterstate.json
   [junit4]   2> 	4	/solr/collections/collection1/state.json
   [junit4]   2> 
   [junit4]   2> Maximum concurrent children watches above limit:
   [junit4]   2> 
   [junit4]   2> 	6	/solr/live_nodes
   [junit4]   2> 	6	/solr/collections
   [junit4]   2> 	4	/solr/overseer/queue
   [junit4]   2> 	4	/solr/overseer/collection-queue-work
   [junit4]   2> 
   [junit4]   2> NOTE: reproduce with: ant test  -Dtestcase=DistribDocExpirationUpdateProcessorTest -Dtests.method=test -Dtests.seed=9E6267C4443DD8E1 -Dtests.slow=true -Dtests.locale=th -Dtests.timezone=Pacific/Fiji -Dtests.asserts=true -Dtests.file.encoding=ISO-8859-1
   [junit4] FAILURE 69.0s J1 | DistribDocExpirationUpdateProcessorTest.test <<<
   [junit4]    > Throwable #1: java.lang.AssertionError: There are still nodes recoverying - waited for 45 seconds
   [junit4]    > 	at __randomizedtesting.SeedInfo.seed([9E6267C4443DD8E1:1636581EEAC1B519]:0)
   [junit4]    > 	at org.apache.solr.cloud.AbstractDistribZkTestBase.waitForRecoveriesToFinish(AbstractDistribZkTestBase.java:182)
   [junit4]    > 	at org.apache.solr.cloud.AbstractFullDistribZkTestBase.waitForRecoveriesToFinish(AbstractFullDistribZkTestBase.java:858)
   [junit4]    > 	at org.apache.solr.cloud.DistribDocExpirationUpdateProcessorTest.test(DistribDocExpirationUpdateProcessorTest.java:74)
   [junit4]    > 	at org.apache.solr.BaseDistributedSearchTestCase$ShardsRepeatRule$ShardsFixedStatement.callStatement(BaseDistributedSearchTestCase.java:992)
   [junit4]    > 	at org.apache.solr.BaseDistributedSearchTestCase$ShardsRepeatRule$ShardsStatement.evaluate(BaseDistributedSearchTestCase.java:967)
   [junit4]    > 	at java.lang.Thread.run(Thread.java:745)
   [junit4]   2> 1624431 INFO  (SUITE-DistribDocExpirationUpdateProcessorTest-seed#[9E6267C4443DD8E1]-worker) [    ] o.a.s.SolrTestCaseJ4 ###deleteCore
   [junit4]   2> NOTE: leaving temporary files on disk at: /Users/jenkins/workspace/Lucene-Solr-6.x-MacOSX/solr/build/solr-core/test/J1/temp/solr.cloud.DistribDocExpirationUpdateProcessorTest_9E6267C4443DD8E1-001
   [junit4]   2> NOTE: test params are: codec=Asserting(Lucene60), sim=RandomSimilarity(queryNorm=false,coord=no): {}, locale=th, timezone=Pacific/Fiji
   [junit4]   2> NOTE: Mac OS X 10.11.4 x86_64/Oracle Corporation 1.8.0_72 (64-bit)/cpus=3,threads=1,free=121009496,total=518979584
   [junit4]   2> NOTE: All tests run in this JVM: [TestRuleBasedAuthorizationPlugin, TestBulkSchemaAPI, ParsingFieldUpdateProcessorsTest, WrapperMergePolicyFactoryTest, HdfsTlogReplayBufferedWhileIndexingTest, TestDynamicFieldCollectionResource, TestJettySolrRunner, TlogReplayBufferedWhileIndexingTest, MultiThreadedOCPTest, TestSuggestSpellingConverter, SolrCloudExampleTest, TestBinaryField, TestRangeQuery, ForceLeaderTest, HighlighterConfigTest, TestManagedResourceStorage, TestExclusionRuleCollectionAccess, DeleteInactiveReplicaTest, LeaderInitiatedRecoveryOnShardRestartTest, SimpleMLTQParserTest, TestJoin, HdfsDirectoryTest, TestFastWriter, CoreAdminCreateDiscoverTest, TestUtils, CollectionTooManyReplicasTest, TestScoreJoinQPNoScore, TestHdfsUpdateLog, TestFieldTypeCollectionResource, CoreMergeIndexesAdminHandlerTest, TestIndexingPerformance, CdcrReplicationHandlerTest, TestCollapseQParserPlugin, OverseerRolesTest, BlockJoinFacetDistribTest, CSVRequestHandlerTest, TestAddFieldRealTimeGet, TestSolrXml, ChaosMonkeySafeLeaderTest, TestObjectReleaseTracker, DistributedQueryComponentOptimizationTest, OverseerTaskQueueTest, ResponseHeaderTest, TestDocBasedVersionConstraints, DistributedQueueTest, TestMinMaxOnMultiValuedField, HdfsSyncSliceTest, TestShortCircuitedRequests, BinaryUpdateRequestHandlerTest, TestSolrQueryParser, DistributedFacetPivotWhiteBoxTest, SignatureUpdateProcessorFactoryTest, DistributedTermsComponentTest, TestCSVResponseWriter, TestOmitPositions, TestSubQueryTransformerDistrib, TermVectorComponentDistributedTest, TestRTGBase, MinimalSchemaTest, CdcrVersionReplicationTest, TestReloadAndDeleteDocs, TestRandomRequestDistribution, TestIntervalFaceting, TestDistribIDF, TestLMJelinekMercerSimilarityFactory, CreateCollectionCleanupTest, ShardRoutingCustomTest, OverriddenZkACLAndCredentialsProvidersTest, TestClusterStateMutator, UpdateRequestProcessorFactoryTest, ClassificationUpdateProcessorFactoryTest, WordBreakSolrSpellCheckerTest, ZkStateWriterTest, BasicDistributedZk2Test, BasicAuthIntegrationTest, SpellingQueryConverterTest, TestRestoreCore, BaseCdcrDistributedZkTest, TestFoldingMultitermQuery, EchoParamsTest, RemoteQueryErrorTest, TestCoreDiscovery, TestReload, NotRequiredUniqueKeyTest, HdfsNNFailoverTest, ConfigSetsAPITest, CleanupOldIndexTest, LoggingHandlerTest, TestReplicaProperties, TestSolrIndexConfig, TestMiniSolrCloudClusterSSL, TestQueryUtils, NoCacheHeaderTest, VMParamsZkACLAndCredentialsProvidersTest, TestDistribDocBasedVersion, FileUtilsTest, TestFilteredDocIdSet, TestReversedWildcardFilterFactory, RankQueryTest, TestConfigSetsAPI, TestRandomFaceting, TestSortingResponseWriter, TestSortByMinMaxFunction, TestPerFieldSimilarityClassic, RequestHandlersTest, CollectionsAPIDistributedZkTest, TestRecovery, ConvertedLegacyTest, HdfsRecoveryZkTest, HdfsChaosMonkeySafeLeaderTest, TestSolrConfigHandler, TestBlobHandler, TestInitParams, TestFuzzyAnalyzedSuggestions, ZkNodePropsTest, SolrCmdDistributorTest, RestartWhileUpdatingTest, TestBadConfig, DistribDocExpirationUpdateProcessorTest]
   [junit4] Completed [249/598 (1!)] on J1 in 69.05s, 1 test, 1 failure <<< FAILURES!

[...truncated 1148 lines...]
BUILD FAILED
/Users/jenkins/workspace/Lucene-Solr-6.x-MacOSX/build.xml:740: The following error occurred while executing this line:
/Users/jenkins/workspace/Lucene-Solr-6.x-MacOSX/build.xml:684: The following error occurred while executing this line:
/Users/jenkins/workspace/Lucene-Solr-6.x-MacOSX/build.xml:59: The following error occurred while executing this line:
/Users/jenkins/workspace/Lucene-Solr-6.x-MacOSX/solr/build.xml:233: The following error occurred while executing this line:
/Users/jenkins/workspace/Lucene-Solr-6.x-MacOSX/solr/common-build.xml:529: The following error occurred while executing this line:
/Users/jenkins/workspace/Lucene-Solr-6.x-MacOSX/lucene/common-build.xml:1457: The following error occurred while executing this line:
/Users/jenkins/workspace/Lucene-Solr-6.x-MacOSX/lucene/common-build.xml:1014: There were test failures: 598 suites (10 ignored), 2420 tests, 1 failure, 121 ignored (71 assumptions) [seed: 9E6267C4443DD8E1]

Total time: 96 minutes 34 seconds
Build step 'Invoke Ant' marked build as failure
Archiving artifacts
[WARNINGS] Skipping publisher since build result is FAILURE
Recording test results
Email was triggered for: Failure - Any
Sending email for trigger: Failure - Any



Mime
View raw message