lucene-dev mailing list archives

Site index · List index
Message view « Date » · « Thread »
Top « Date » · « Thread »
From Policeman Jenkins Server <jenk...@thetaphi.de>
Subject [JENKINS] Lucene-Solr-6.x-Solaris (64bit/jdk1.8.0) - Build # 137 - Failure!
Date Mon, 16 May 2016 21:27:22 GMT
Build: http://jenkins.thetaphi.de/job/Lucene-Solr-6.x-Solaris/137/
Java: 64bit/jdk1.8.0 -XX:+UseCompressedOops -XX:+UseSerialGC

2 tests failed.
FAILED:  org.apache.solr.core.TestLazyCores.testLazyLoad

Error Message:
Test abandoned because suite timeout was reached.

Stack Trace:
java.lang.Exception: Test abandoned because suite timeout was reached.
	at __randomizedtesting.SeedInfo.seed([CFBC74B99B575894]:0)


FAILED:  junit.framework.TestSuite.org.apache.solr.core.TestLazyCores

Error Message:
Suite timeout exceeded (>= 7200000 msec).

Stack Trace:
java.lang.Exception: Suite timeout exceeded (>= 7200000 msec).
	at __randomizedtesting.SeedInfo.seed([CFBC74B99B575894]:0)




Build Log:
[...truncated 12527 lines...]
   [junit4] Suite: org.apache.solr.core.TestLazyCores
   [junit4]   2> Creating dataDir: /export/home/jenkins/workspace/Lucene-Solr-6.x-Solaris/solr/build/solr-core/test/J1/temp/solr.core.TestLazyCores_CFBC74B99B575894-001/init-core-data-001
   [junit4]   2> 2843884 INFO  (SUITE-TestLazyCores-seed#[CFBC74B99B575894]-worker) [    ] o.a.s.SolrTestCaseJ4 Randomized ssl (true) and clientAuth (false)
   [junit4]   2> 2843887 INFO  (TEST-TestLazyCores.testCachingLimit-seed#[CFBC74B99B575894]) [    ] o.a.s.SolrTestCaseJ4 ###Starting testCachingLimit
   [junit4]   2> 2843905 INFO  (TEST-TestLazyCores.testCachingLimit-seed#[CFBC74B99B575894]) [    ] o.a.s.c.SolrResourceLoader new SolrResourceLoader for directory: '/export/home/jenkins/workspace/Lucene-Solr-6.x-Solaris/solr/build/solr-core/test/J1/temp/solr.core.TestLazyCores_CFBC74B99B575894-001/tempDir-001'
   [junit4]   2> 2843905 INFO  (TEST-TestLazyCores.testCachingLimit-seed#[CFBC74B99B575894]) [    ] o.a.s.c.SolrResourceLoader JNDI not configured for solr (NoInitialContextEx)
   [junit4]   2> 2843905 INFO  (TEST-TestLazyCores.testCachingLimit-seed#[CFBC74B99B575894]) [    ] o.a.s.c.SolrResourceLoader solr home defaulted to 'solr/' (could not find system property or JNDI)
   [junit4]   2> 2843905 INFO  (TEST-TestLazyCores.testCachingLimit-seed#[CFBC74B99B575894]) [    ] o.a.s.c.CoreContainer New CoreContainer 707675950
   [junit4]   2> 2843905 INFO  (TEST-TestLazyCores.testCachingLimit-seed#[CFBC74B99B575894]) [    ] o.a.s.c.CoreContainer Loading cores into CoreContainer [instanceDir=/export/home/jenkins/workspace/Lucene-Solr-6.x-Solaris/solr/build/solr-core/test/J1/temp/solr.core.TestLazyCores_CFBC74B99B575894-001/tempDir-001]
   [junit4]   2> 2843906 WARN  (TEST-TestLazyCores.testCachingLimit-seed#[CFBC74B99B575894]) [    ] o.a.s.c.CoreContainer Couldn't add files from /export/home/jenkins/workspace/Lucene-Solr-6.x-Solaris/solr/build/solr-core/test/J1/temp/solr.core.TestLazyCores_CFBC74B99B575894-001/tempDir-001/lib to classpath: /export/home/jenkins/workspace/Lucene-Solr-6.x-Solaris/solr/build/solr-core/test/J1/temp/solr.core.TestLazyCores_CFBC74B99B575894-001/tempDir-001/lib
   [junit4]   2> 2843906 INFO  (TEST-TestLazyCores.testCachingLimit-seed#[CFBC74B99B575894]) [    ] o.a.s.h.c.HttpShardHandlerFactory created with socketTimeout : 600000,connTimeout : 60000,maxConnectionsPerHost : 20,maxConnections : 10000,corePoolSize : 0,maximumPoolSize : 2147483647,maxThreadIdleTime : 5,sizeOfQueue : -1,fairnessPolicy : false,useRetries : false,
   [junit4]   2> 2843907 INFO  (TEST-TestLazyCores.testCachingLimit-seed#[CFBC74B99B575894]) [    ] o.a.s.u.UpdateShardHandler Creating UpdateShardHandler HTTP client with params: socketTimeout=600000&connTimeout=60000&retry=true
   [junit4]   2> 2843907 INFO  (TEST-TestLazyCores.testCachingLimit-seed#[CFBC74B99B575894]) [    ] o.a.s.c.SolrCores Allocating transient cache for 4 transient cores
   [junit4]   2> 2843910 INFO  (TEST-TestLazyCores.testCachingLimit-seed#[CFBC74B99B575894]) [    ] o.a.s.l.LogWatcher SLF4J impl is org.slf4j.impl.Log4jLoggerFactory
   [junit4]   2> 2843910 INFO  (TEST-TestLazyCores.testCachingLimit-seed#[CFBC74B99B575894]) [    ] o.a.s.l.LogWatcher Registering Log Listener [Log4j (org.slf4j.impl.Log4jLoggerFactory)]
   [junit4]   2> 2843910 INFO  (TEST-TestLazyCores.testCachingLimit-seed#[CFBC74B99B575894]) [    ] o.a.s.c.CoreContainer Security conf doesn't exist. Skipping setup for authorization module.
   [junit4]   2> 2843910 INFO  (TEST-TestLazyCores.testCachingLimit-seed#[CFBC74B99B575894]) [    ] o.a.s.c.CoreContainer No authentication plugin used.
   [junit4]   2> 2843912 INFO  (TEST-TestLazyCores.testCachingLimit-seed#[CFBC74B99B575894]) [    ] o.a.s.c.CoreDescriptor Created CoreDescriptor: {name=collection1, config=solrconfig.xml, loadOnStartup=true, schema=schema.xml, configSetProperties=configsetprops.json, transient=false, dataDir=data/}
   [junit4]   2> 2843912 INFO  (TEST-TestLazyCores.testCachingLimit-seed#[CFBC74B99B575894]) [    ] o.a.s.c.CoreDescriptor Created CoreDescriptor: {name=collection2, config=solrconfig.xml, loadOnStartup=true, schema=schema.xml, configSetProperties=configsetprops.json, transient=true, dataDir=data/}
   [junit4]   2> 2843912 INFO  (TEST-TestLazyCores.testCachingLimit-seed#[CFBC74B99B575894]) [    ] o.a.s.c.CoreDescriptor Created CoreDescriptor: {name=collection3, config=solrconfig.xml, loadOnStartup=false, schema=schema.xml, configSetProperties=configsetprops.json, transient=on, dataDir=data/}
   [junit4]   2> 2843912 INFO  (TEST-TestLazyCores.testCachingLimit-seed#[CFBC74B99B575894]) [    ] o.a.s.c.CoreDescriptor Created CoreDescriptor: {name=collection4, config=solrconfig.xml, loadOnStartup=false, schema=schema.xml, configSetProperties=configsetprops.json, transient=false, dataDir=data/}
   [junit4]   2> 2843913 INFO  (TEST-TestLazyCores.testCachingLimit-seed#[CFBC74B99B575894]) [    ] o.a.s.c.CoreDescriptor Created CoreDescriptor: {name=collection5, config=solrconfig.xml, loadOnStartup=true, schema=schema.xml, configSetProperties=configsetprops.json, transient=false, dataDir=data/}
   [junit4]   2> 2843913 INFO  (TEST-TestLazyCores.testCachingLimit-seed#[CFBC74B99B575894]) [    ] o.a.s.c.CoreDescriptor Created CoreDescriptor: {name=collection6, config=solrconfig.xml, loadOnStartup=false, schema=schema.xml, configSetProperties=configsetprops.json, transient=true, dataDir=data/}
   [junit4]   2> 2843913 INFO  (TEST-TestLazyCores.testCachingLimit-seed#[CFBC74B99B575894]) [    ] o.a.s.c.CoreDescriptor Created CoreDescriptor: {name=collection7, config=solrconfig.xml, loadOnStartup=false, schema=schema.xml, configSetProperties=configsetprops.json, transient=true, dataDir=data/}
   [junit4]   2> 2843913 INFO  (TEST-TestLazyCores.testCachingLimit-seed#[CFBC74B99B575894]) [    ] o.a.s.c.CoreDescriptor Created CoreDescriptor: {name=collection8, config=solrconfig.xml, loadOnStartup=false, schema=schema.xml, configSetProperties=configsetprops.json, transient=true, dataDir=data/}
   [junit4]   2> 2843913 INFO  (TEST-TestLazyCores.testCachingLimit-seed#[CFBC74B99B575894]) [    ] o.a.s.c.CoreDescriptor Created CoreDescriptor: {name=collection9, config=solrconfig.xml, loadOnStartup=false, schema=schema.xml, configSetProperties=configsetprops.json, transient=true, dataDir=data/}
   [junit4]   2> 2843913 INFO  (coreLoadExecutor-6042-thread-1) [    ] o.a.s.c.SolrResourceLoader new SolrResourceLoader for directory: '/export/home/jenkins/workspace/Lucene-Solr-6.x-Solaris/solr/build/solr-core/test/J1/temp/solr.core.TestLazyCores_CFBC74B99B575894-001/tempDir-001/collection1'
   [junit4]   2> 2843914 INFO  (coreLoadExecutor-6042-thread-2) [    ] o.a.s.c.SolrResourceLoader new SolrResourceLoader for directory: '/export/home/jenkins/workspace/Lucene-Solr-6.x-Solaris/solr/build/solr-core/test/J1/temp/solr.core.TestLazyCores_CFBC74B99B575894-001/tempDir-001/collection2'
   [junit4]   2> 2843914 INFO  (coreLoadExecutor-6042-thread-1) [    ] o.a.s.c.SolrResourceLoader JNDI not configured for solr (NoInitialContextEx)
   [junit4]   2> 2843914 INFO  (coreLoadExecutor-6042-thread-2) [    ] o.a.s.c.SolrResourceLoader JNDI not configured for solr (NoInitialContextEx)
   [junit4]   2> 2843914 INFO  (coreLoadExecutor-6042-thread-1) [    ] o.a.s.c.SolrResourceLoader solr home defaulted to 'solr/' (could not find system property or JNDI)
   [junit4]   2> 2843914 INFO  (coreLoadExecutor-6042-thread-2) [    ] o.a.s.c.SolrResourceLoader solr home defaulted to 'solr/' (could not find system property or JNDI)
   [junit4]   2> 2843914 INFO  (coreLoadExecutor-6042-thread-3) [    ] o.a.s.c.SolrResourceLoader new SolrResourceLoader for directory: '/export/home/jenkins/workspace/Lucene-Solr-6.x-Solaris/solr/build/solr-core/test/J1/temp/solr.core.TestLazyCores_CFBC74B99B575894-001/tempDir-001/collection5'
   [junit4]   2> 2843914 INFO  (coreLoadExecutor-6042-thread-3) [    ] o.a.s.c.SolrResourceLoader JNDI not configured for solr (NoInitialContextEx)
   [junit4]   2> 2843914 INFO  (coreLoadExecutor-6042-thread-3) [    ] o.a.s.c.SolrResourceLoader solr home defaulted to 'solr/' (could not find system property or JNDI)
   [junit4]   2> 2843922 INFO  (coreLoadExecutor-6042-thread-2) [    ] o.a.s.c.SolrConfig current version of requestparams : -1
   [junit4]   2> 2843922 INFO  (coreLoadExecutor-6042-thread-3) [    ] o.a.s.c.SolrConfig current version of requestparams : -1
   [junit4]   2> 2843924 WARN  (coreLoadExecutor-6042-thread-2) [    ] o.a.s.c.Config Beginning with Solr 5.5, <mergePolicy> is deprecated, use <mergePolicyFactory> instead.
   [junit4]   2> 2843924 INFO  (coreLoadExecutor-6042-thread-1) [    ] o.a.s.c.SolrConfig current version of requestparams : -1
   [junit4]   2> 2843924 INFO  (coreLoadExecutor-6042-thread-2) [    ] o.a.s.c.SolrConfig Using Lucene MatchVersion: 6.1.0
   [junit4]   2> 2843925 WARN  (coreLoadExecutor-6042-thread-1) [    ] o.a.s.c.Config Beginning with Solr 5.5, <mergePolicy> is deprecated, use <mergePolicyFactory> instead.
   [junit4]   2> 2843925 INFO  (coreLoadExecutor-6042-thread-1) [    ] o.a.s.c.SolrConfig Using Lucene MatchVersion: 6.1.0
   [junit4]   2> 2843927 INFO  (coreLoadExecutor-6042-thread-2) [    ] o.a.s.c.SolrConfig Loaded SolrConfig: solrconfig.xml
   [junit4]   2> 2843928 INFO  (coreLoadExecutor-6042-thread-1) [    ] o.a.s.c.SolrConfig Loaded SolrConfig: solrconfig.xml
   [junit4]   2> 2843929 INFO  (coreLoadExecutor-6042-thread-2) [    ] o.a.s.s.IndexSchema [collection2] Schema name=tiny
   [junit4]   2> 2843931 INFO  (coreLoadExecutor-6042-thread-1) [    ] o.a.s.s.IndexSchema [collection1] Schema name=tiny
   [junit4]   2> 2843941 INFO  (coreLoadExecutor-6042-thread-2) [    ] o.a.s.s.IndexSchema unique key field: id
   [junit4]   2> 2843942 INFO  (coreLoadExecutor-6042-thread-1) [    ] o.a.s.s.IndexSchema unique key field: id
   [junit4]   2> 2843944 INFO  (coreLoadExecutor-6042-thread-1) [    ] o.a.s.c.ConfigSetProperties Did not find ConfigSet properties, assuming default properties: Can't find resource 'configsetprops.json' in classpath or '/export/home/jenkins/workspace/Lucene-Solr-6.x-Solaris/solr/build/solr-core/test/J1/temp/solr.core.TestLazyCores_CFBC74B99B575894-001/tempDir-001/collection1'
   [junit4]   2> 2843944 INFO  (coreLoadExecutor-6042-thread-1) [    ] o.a.s.c.CoreContainer Creating SolrCore 'collection1' using configuration from instancedir /export/home/jenkins/workspace/Lucene-Solr-6.x-Solaris/solr/build/solr-core/test/J1/temp/solr.core.TestLazyCores_CFBC74B99B575894-001/tempDir-001/collection1
   [junit4]   2> 2843944 INFO  (coreLoadExecutor-6042-thread-2) [    ] o.a.s.c.ConfigSetProperties Did not find ConfigSet properties, assuming default properties: Can't find resource 'configsetprops.json' in classpath or '/export/home/jenkins/workspace/Lucene-Solr-6.x-Solaris/solr/build/solr-core/test/J1/temp/solr.core.TestLazyCores_CFBC74B99B575894-001/tempDir-001/collection2'
   [junit4]   2> 2843944 INFO  (coreLoadExecutor-6042-thread-2) [    ] o.a.s.c.CoreContainer Creating SolrCore 'collection2' using configuration from instancedir /export/home/jenkins/workspace/Lucene-Solr-6.x-Solaris/solr/build/solr-core/test/J1/temp/solr.core.TestLazyCores_CFBC74B99B575894-001/tempDir-001/collection2
   [junit4]   2> 2843945 INFO  (coreLoadExecutor-6042-thread-1) [    x:collection1] o.a.s.c.SolrCore org.apache.solr.core.MockDirectoryFactory
   [junit4]   2> 2843945 INFO  (coreLoadExecutor-6042-thread-2) [    x:collection2] o.a.s.c.SolrCore org.apache.solr.core.MockDirectoryFactory
   [junit4]   2> 2843945 INFO  (coreLoadExecutor-6042-thread-1) [    x:collection1] o.a.s.c.SolrCore [[collection1] ] Opening new SolrCore at [/export/home/jenkins/workspace/Lucene-Solr-6.x-Solaris/solr/build/solr-core/test/J1/temp/solr.core.TestLazyCores_CFBC74B99B575894-001/tempDir-001/collection1], dataDir=[/export/home/jenkins/workspace/Lucene-Solr-6.x-Solaris/solr/build/solr-core/test/J1/temp/solr.core.TestLazyCores_CFBC74B99B575894-001/tempDir-001/collection1/data/]
   [junit4]   2> 2843945 INFO  (coreLoadExecutor-6042-thread-2) [    x:collection2] o.a.s.c.SolrCore [[collection2] ] Opening new SolrCore at [/export/home/jenkins/workspace/Lucene-Solr-6.x-Solaris/solr/build/solr-core/test/J1/temp/solr.core.TestLazyCores_CFBC74B99B575894-001/tempDir-001/collection2], dataDir=[/export/home/jenkins/workspace/Lucene-Solr-6.x-Solaris/solr/build/solr-core/test/J1/temp/solr.core.TestLazyCores_CFBC74B99B575894-001/tempDir-001/collection2/data/]
   [junit4]   2> 2843945 INFO  (coreLoadExecutor-6042-thread-1) [    x:collection1] o.a.s.c.SolrCore JMX monitoring not detected for core: collection1
   [junit4]   2> 2843945 INFO  (coreLoadExecutor-6042-thread-2) [    x:collection2] o.a.s.c.SolrCore JMX monitoring not detected for core: collection2
   [junit4]   2> 2843945 INFO  (coreLoadExecutor-6042-thread-2) [    x:collection2] o.a.s.c.CachingDirectoryFactory return new directory for /export/home/jenkins/workspace/Lucene-Solr-6.x-Solaris/solr/build/solr-core/test/J1/temp/solr.core.TestLazyCores_CFBC74B99B575894-001/tempDir-001/collection2/data
   [junit4]   2> 2843945 INFO  (coreLoadExecutor-6042-thread-2) [    x:collection2] o.a.s.c.SolrCore New index directory detected: old=null new=/export/home/jenkins/workspace/Lucene-Solr-6.x-Solaris/solr/build/solr-core/test/J1/temp/solr.core.TestLazyCores_CFBC74B99B575894-001/tempDir-001/collection2/data/index/
   [junit4]   2> 2843945 WARN  (coreLoadExecutor-6042-thread-2) [    x:collection2] o.a.s.c.SolrCore [collection2] Solr index directory '/export/home/jenkins/workspace/Lucene-Solr-6.x-Solaris/solr/build/solr-core/test/J1/temp/solr.core.TestLazyCores_CFBC74B99B575894-001/tempDir-001/collection2/data/index' doesn't exist. Creating new index...
   [junit4]   2> 2843946 INFO  (coreLoadExecutor-6042-thread-2) [    x:collection2] o.a.s.c.CachingDirectoryFactory return new directory for /export/home/jenkins/workspace/Lucene-Solr-6.x-Solaris/solr/build/solr-core/test/J1/temp/solr.core.TestLazyCores_CFBC74B99B575894-001/tempDir-001/collection2/data/index
   [junit4]   2> 2843946 INFO  (coreLoadExecutor-6042-thread-2) [    x:collection2] o.a.s.u.RandomMergePolicy RandomMergePolicy wrapping class org.apache.lucene.index.LogDocMergePolicy: [LogDocMergePolicy: minMergeSize=1000, mergeFactor=30, maxMergeSize=9223372036854775807, maxMergeSizeForForcedMerge=9223372036854775807, calibrateSizeByDeletes=false, maxMergeDocs=2147483647, maxCFSSegmentSizeMB=8.796093022207999E12, noCFSRatio=0.0]
   [junit4]   2> 2843946 INFO  (coreLoadExecutor-6042-thread-2) [    x:collection2] o.a.s.c.SolrDeletionPolicy SolrDeletionPolicy.onCommit: commits: num=1
   [junit4]   2> 	commit{dir=MockDirectoryWrapper(RAMDirectory@37c95a2d lockFactory=org.apache.lucene.store.SingleInstanceLockFactory@63f6cc54),segFN=segments_1,generation=1}
   [junit4]   2> 2843946 INFO  (coreLoadExecutor-6042-thread-2) [    x:collection2] o.a.s.c.SolrDeletionPolicy newest commit generation = 1
   [junit4]   2> 2843946 WARN  (coreLoadExecutor-6042-thread-3) [    ] o.a.s.c.Config Beginning with Solr 5.5, <mergePolicy> is deprecated, use <mergePolicyFactory> instead.
   [junit4]   2> 2843946 INFO  (OldIndexDirectoryCleanupThreadForCore-collection2) [    x:collection2] o.a.s.c.SolrCore Looking for old index directories to cleanup for core collection2 in /export/home/jenkins/workspace/Lucene-Solr-6.x-Solaris/solr/build/solr-core/test/J1/temp/solr.core.TestLazyCores_CFBC74B99B575894-001/tempDir-001/collection2/data/
   [junit4]   2> 2843947 WARN  (OldIndexDirectoryCleanupThreadForCore-collection2) [    x:collection2] o.a.s.c.DirectoryFactory /export/home/jenkins/workspace/Lucene-Solr-6.x-Solaris/solr/build/solr-core/test/J1/temp/solr.core.TestLazyCores_CFBC74B99B575894-001/tempDir-001/collection2/data/ does not point to a valid data directory; skipping clean-up of old index directories.
   [junit4]   2> 2843947 INFO  (coreLoadExecutor-6042-thread-3) [    ] o.a.s.c.SolrConfig Using Lucene MatchVersion: 6.1.0
   [junit4]   2> 2843949 INFO  (coreLoadExecutor-6042-thread-2) [    x:collection2] o.a.s.c.SolrCore no updateRequestProcessorChain defined as default, creating implicit default
   [junit4]   2> 2843949 INFO  (coreLoadExecutor-6042-thread-3) [    ] o.a.s.c.SolrConfig Loaded SolrConfig: solrconfig.xml
   [junit4]   2> 2843951 INFO  (coreLoadExecutor-6042-thread-2) [    x:collection2] o.a.s.h.l.XMLLoader xsltCacheLifetimeSeconds=60
   [junit4]   2> 2843952 INFO  (coreLoadExecutor-6042-thread-2) [    x:collection2] o.a.s.h.l.XMLLoader xsltCacheLifetimeSeconds=60
   [junit4]   2> 2843952 INFO  (coreLoadExecutor-6042-thread-3) [    ] o.a.s.s.IndexSchema [collection5] Schema name=tiny
   [junit4]   2> 2843953 INFO  (coreLoadExecutor-6042-thread-2) [    x:collection2] o.a.s.h.l.XMLLoader xsltCacheLifetimeSeconds=60
   [junit4]   2> 2843954 INFO  (coreLoadExecutor-6042-thread-2) [    x:collection2] o.a.s.h.l.XMLLoader xsltCacheLifetimeSeconds=60
   [junit4]   2> 2843954 INFO  (coreLoadExecutor-6042-thread-3) [    ] o.a.s.s.IndexSchema unique key field: id
   [junit4]   2> 2843955 INFO  (coreLoadExecutor-6042-thread-3) [    ] o.a.s.c.ConfigSetProperties Did not find ConfigSet properties, assuming default properties: Can't find resource 'configsetprops.json' in classpath or '/export/home/jenkins/workspace/Lucene-Solr-6.x-Solaris/solr/build/solr-core/test/J1/temp/solr.core.TestLazyCores_CFBC74B99B575894-001/tempDir-001/collection5'
   [junit4]   2> 2843955 INFO  (coreLoadExecutor-6042-thread-3) [    ] o.a.s.c.CoreContainer Creating SolrCore 'collection5' using configuration from instancedir /export/home/jenkins/workspace/Lucene-Solr-6.x-Solaris/solr/build/solr-core/test/J1/temp/solr.core.TestLazyCores_CFBC74B99B575894-001/tempDir-001/collection5
   [junit4]   2> 2843955 INFO  (coreLoadExecutor-6042-thread-3) [    x:collection5] o.a.s.c.SolrCore org.apache.solr.core.MockDirectoryFactory
   [junit4]   2> 2843955 INFO  (coreLoadExecutor-6042-thread-3) [    x:collection5] o.a.s.c.SolrCore [[collection5] ] Opening new SolrCore at [/export/home/jenkins/workspace/Lucene-Solr-6.x-Solaris/solr/build/solr-core/test/J1/temp/solr.core.TestLazyCores_CFBC74B99B575894-001/tempDir-001/collection5], dataDir=[/export/home/jenkins/workspace/Lucene-Solr-6.x-Solaris/solr/build/solr-core/test/J1/temp/solr.core.TestLazyCores_CFBC74B99B575894-001/tempDir-001/collection5/data/]
   [junit4]   2> 2843955 INFO  (coreLoadExecutor-6042-thread-3) [    x:collection5] o.a.s.c.SolrCore JMX monitoring not detected for core: collection5
   [junit4]   2> 2843955 INFO  (coreLoadExecutor-6042-thread-2) [    x:collection2] o.a.s.c.RequestHandlers Registered paths: /admin/mbeans,/update/csv,/sql,/update/json/docs,/admin/luke,/graph,/export,/select,/admin/segments,/get,/admin/system,/replication,/admin/properties,/config,/stream,/schema,/admin/plugins,/admin/logging,/update/json,/admin/ping,/admin/threads,/update,/admin/file
   [junit4]   2> 2843955 INFO  (coreLoadExecutor-6042-thread-2) [    x:collection2] o.a.s.c.SolrCore Using default statsCache cache: org.apache.solr.search.stats.LocalStatsCache
   [junit4]   2> 2843955 INFO  (coreLoadExecutor-6042-thread-3) [    x:collection5] o.a.s.c.CachingDirectoryFactory return new directory for /export/home/jenkins/workspace/Lucene-Solr-6.x-Solaris/solr/build/solr-core/test/J1/temp/solr.core.TestLazyCores_CFBC74B99B575894-001/tempDir-001/collection5/data
   [junit4]   2> 2843955 INFO  (coreLoadExecutor-6042-thread-1) [    x:collection1] o.a.s.c.CachingDirectoryFactory return new directory for /export/home/jenkins/workspace/Lucene-Solr-6.x-Solaris/solr/build/solr-core/test/J1/temp/solr.core.TestLazyCores_CFBC74B99B575894-001/tempDir-001/collection1/data
   [junit4]   2> 2843956 INFO  (coreLoadExecutor-6042-thread-1) [    x:collection1] o.a.s.c.SolrCore New index directory detected: old=null new=/export/home/jenkins/workspace/Lucene-Solr-6.x-Solaris/solr/build/solr-core/test/J1/temp/solr.core.TestLazyCores_CFBC74B99B575894-001/tempDir-001/collection1/data/index/
   [junit4]   2> 2843956 INFO  (coreLoadExecutor-6042-thread-2) [    x:collection2] o.a.s.u.CommitTracker Hard AutoCommit: disabled
   [junit4]   2> 2843956 INFO  (coreLoadExecutor-6042-thread-3) [    x:collection5] o.a.s.c.SolrCore New index directory detected: old=null new=/export/home/jenkins/workspace/Lucene-Solr-6.x-Solaris/solr/build/solr-core/test/J1/temp/solr.core.TestLazyCores_CFBC74B99B575894-001/tempDir-001/collection5/data/index/
   [junit4]   2> 2843956 INFO  (coreLoadExecutor-6042-thread-2) [    x:collection2] o.a.s.u.CommitTracker Soft AutoCommit: disabled
   [junit4]   2> 2843956 WARN  (coreLoadExecutor-6042-thread-3) [    x:collection5] o.a.s.c.SolrCore [collection5] Solr index directory '/export/home/jenkins/workspace/Lucene-Solr-6.x-Solaris/solr/build/solr-core/test/J1/temp/solr.core.TestLazyCores_CFBC74B99B575894-001/tempDir-001/collection5/data/index' doesn't exist. Creating new index...
   [junit4]   2> 2843956 INFO  (coreLoadExecutor-6042-thread-2) [    x:collection2] o.a.s.u.RandomMergePolicy RandomMergePolicy wrapping class org.apache.lucene.index.AlcoholicMergePolicy: [AlcoholicMergePolicy: minMergeSize=0, mergeFactor=10, maxMergeSize=770394091, maxMergeSizeForForcedMerge=9223372036854775807, calibrateSizeByDeletes=true, maxMergeDocs=2147483647, maxCFSSegmentSizeMB=8.796093022207999E12, noCFSRatio=0.1]
   [junit4]   2> 2843956 INFO  (coreLoadExecutor-6042-thread-3) [    x:collection5] o.a.s.c.CachingDirectoryFactory return new directory for /export/home/jenkins/workspace/Lucene-Solr-6.x-Solaris/solr/build/solr-core/test/J1/temp/solr.core.TestLazyCores_CFBC74B99B575894-001/tempDir-001/collection5/data/index
   [junit4]   2> 2843956 INFO  (coreLoadExecutor-6042-thread-2) [    x:collection2] o.a.s.c.SolrDeletionPolicy SolrDeletionPolicy.onInit: commits: num=1
   [junit4]   2> 	commit{dir=MockDirectoryWrapper(RAMDirectory@37c95a2d lockFactory=org.apache.lucene.store.SingleInstanceLockFactory@63f6cc54),segFN=segments_1,generation=1}
   [junit4]   2> 2843956 INFO  (coreLoadExecutor-6042-thread-3) [    x:collection5] o.a.s.u.RandomMergePolicy RandomMergePolicy wrapping class org.apache.lucene.index.LogDocMergePolicy: [LogDocMergePolicy: minMergeSize=1000, mergeFactor=30, maxMergeSize=9223372036854775807, maxMergeSizeForForcedMerge=9223372036854775807, calibrateSizeByDeletes=false, maxMergeDocs=2147483647, maxCFSSegmentSizeMB=8.796093022207999E12, noCFSRatio=0.0]
   [junit4]   2> 2843956 INFO  (coreLoadExecutor-6042-thread-3) [    x:collection5] o.a.s.c.SolrDeletionPolicy SolrDeletionPolicy.onCommit: commits: num=1
   [junit4]   2> 	commit{dir=MockDirectoryWrapper(RAMDirectory@5abc8ac0 lockFactory=org.apache.lucene.store.SingleInstanceLockFactory@3889fc33),segFN=segments_1,generation=1}
   [junit4]   2> 2843957 INFO  (coreLoadExecutor-6042-thread-3) [    x:collection5] o.a.s.c.SolrDeletionPolicy newest commit generation = 1
   [junit4]   2> 2843957 INFO  (OldIndexDirectoryCleanupThreadForCore-collection5) [    x:collection5] o.a.s.c.SolrCore Looking for old index directories to cleanup for core collection5 in /export/home/jenkins/workspace/Lucene-Solr-6.x-Solaris/solr/build/solr-core/test/J1/temp/solr.core.TestLazyCores_CFBC74B99B575894-001/tempDir-001/collection5/data/
   [junit4]   2> 2843957 WARN  (OldIndexDirectoryCleanupThreadForCore-collection5) [    x:collection5] o.a.s.c.DirectoryFactory /export/home/jenkins/workspace/Lucene-Solr-6.x-Solaris/solr/build/solr-core/test/J1/temp/solr.core.TestLazyCores_CFBC74B99B575894-001/tempDir-001/collection5/data/ does not point to a valid data directory; skipping clean-up of old index directories.
   [junit4]   2> 2843956 WARN  (coreLoadExecutor-6042-thread-1) [    x:collection1] o.a.s.c.SolrCore [collection1] Solr index directory '/export/home/jenkins/workspace/Lucene-Solr-6.x-Solaris/solr/build/solr-core/test/J1/temp/solr.core.TestLazyCores_CFBC74B99B575894-001/tempDir-001/collection1/data/index' doesn't exist. Creating new index...
   [junit4]   2> 2843956 INFO  (coreLoadExecutor-6042-thread-2) [    x:collection2] o.a.s.c.SolrDeletionPolicy newest commit generation = 1
   [junit4]   2> 2843957 INFO  (coreLoadExecutor-6042-thread-1) [    x:collection1] o.a.s.c.CachingDirectoryFactory return new directory for /export/home/jenkins/workspace/Lucene-Solr-6.x-Solaris/solr/build/solr-core/test/J1/temp/solr.core.TestLazyCores_CFBC74B99B575894-001/tempDir-001/collection1/data/index
   [junit4]   2> 2843957 INFO  (coreLoadExecutor-6042-thread-2) [    x:collection2] o.a.s.s.SolrIndexSearcher Opening [Searcher@68b0d2fd[collection2] main]
   [junit4]   2> 2843957 INFO  (coreLoadExecutor-6042-thread-1) [    x:collection1] o.a.s.u.RandomMergePolicy RandomMergePolicy wrapping class org.apache.lucene.index.LogDocMergePolicy: [LogDocMergePolicy: minMergeSize=1000, mergeFactor=30, maxMergeSize=9223372036854775807, maxMergeSizeForForcedMerge=9223372036854775807, calibrateSizeByDeletes=false, maxMergeDocs=2147483647, maxCFSSegmentSizeMB=8.796093022207999E12, noCFSRatio=0.0]
   [junit4]   2> 2843957 INFO  (coreLoadExecutor-6042-thread-2) [    x:collection2] o.a.s.r.ManagedResourceStorage File-based storage initialized to use dir: /export/home/jenkins/workspace/Lucene-Solr-6.x-Solaris/solr/build/solr-core/test/J1/temp/solr.core.TestLazyCores_CFBC74B99B575894-001/tempDir-001/collection2/conf
   [junit4]   2> 2843957 INFO  (coreLoadExecutor-6042-thread-2) [    x:collection2] o.a.s.r.RestManager Initializing RestManager with initArgs: {storageDir=/export/home/jenkins/workspace/Lucene-Solr-6.x-Solaris/solr/build/solr-core/test/J1/temp/solr.core.TestLazyCores_CFBC74B99B575894-001/tempDir-001/collection2/conf}
   [junit4]   2> 2843958 INFO  (coreLoadExecutor-6042-thread-1) [    x:collection1] o.a.s.c.SolrDeletionPolicy SolrDeletionPolicy.onCommit: commits: num=1
   [junit4]   2> 	commit{dir=MockDirectoryWrapper(RAMDirectory@8d77162 lockFactory=org.apache.lucene.store.SingleInstanceLockFactory@2aa44eae),segFN=segments_1,generation=1}
   [junit4]   2> 2843958 INFO  (coreLoadExecutor-6042-thread-2) [    x:collection2] o.a.s.r.ManagedResourceStorage Reading _rest_managed.json using file:dir=/export/home/jenkins/workspace/Lucene-Solr-6.x-Solaris/solr/build/solr-core/test/J1/temp/solr.core.TestLazyCores_CFBC74B99B575894-001/tempDir-001/collection2/conf
   [junit4]   2> 2843958 INFO  (coreLoadExecutor-6042-thread-1) [    x:collection1] o.a.s.c.SolrDeletionPolicy newest commit generation = 1
   [junit4]   2> 2843958 INFO  (coreLoadExecutor-6042-thread-2) [    x:collection2] o.a.s.r.RestManager Initializing 0 registered ManagedResources
   [junit4]   2> 2843958 INFO  (OldIndexDirectoryCleanupThreadForCore-collection1) [    x:collection1] o.a.s.c.SolrCore Looking for old index directories to cleanup for core collection1 in /export/home/jenkins/workspace/Lucene-Solr-6.x-Solaris/solr/build/solr-core/test/J1/temp/solr.core.TestLazyCores_CFBC74B99B575894-001/tempDir-001/collection1/data/
   [junit4]   2> 2843958 INFO  (coreLoadExecutor-6042-thread-2) [    x:collection2] o.a.s.h.ReplicationHandler Commits will be reserved for  10000
   [junit4]   2> 2843958 WARN  (OldIndexDirectoryCleanupThreadForCore-collection1) [    x:collection1] o.a.s.c.DirectoryFactory /export/home/jenkins/workspace/Lucene-Solr-6.x-Solaris/solr/build/solr-core/test/J1/temp/solr.core.TestLazyCores_CFBC74B99B575894-001/tempDir-001/collection1/data/ does not point to a valid data directory; skipping clean-up of old index directories.
   [junit4]   2> 2843958 INFO  (searcherExecutor-6044-thread-1-processing-x:collection2) [    x:collection2] o.a.s.c.SolrCore [collection2] Registered new searcher Searcher@68b0d2fd[collection2] main{ExitableDirectoryReader(UninvertingDirectoryReader())}
   [junit4]   2> 2843960 INFO  (coreLoadExecutor-6042-thread-1) [    x:collection1] o.a.s.c.SolrCore no updateRequestProcessorChain defined as default, creating implicit default
   [junit4]   2> 2843961 INFO  (coreLoadExecutor-6042-thread-1) [    x:collection1] o.a.s.h.l.XMLLoader xsltCacheLifetimeSeconds=60
   [junit4]   2> 2843961 INFO  (coreLoadExecutor-6042-thread-1) [    x:collection1] o.a.s.h.l.XMLLoader xsltCacheLifetimeSeconds=60
   [junit4]   2> 2843962 INFO  (coreLoadExecutor-6042-thread-1) [    x:collection1] o.a.s.h.l.XMLLoader xsltCacheLifetimeSeconds=60
   [junit4]   2> 2843963 INFO  (coreLoadExecutor-6042-thread-2) [    x:collection2] o.a.s.c.SolrCores Opening transient core collection2
   [junit4]   2> 2843963 INFO  (coreLoadExecutor-6042-thread-1) [    x:collection1] o.a.s.h.l.XMLLoader xsltCacheLifetimeSeconds=60
   [junit4]   2> 2843963 INFO  (coreLoadExecutor-6042-thread-2) [    x:collection2] o.a.s.c.CoreContainer registering core: collection2
   [junit4]   2> 2843965 INFO  (coreLoadExecutor-6042-thread-3) [    x:collection5] o.a.s.c.SolrCore no updateRequestProcessorChain defined as default, creating implicit default
   [junit4]   2> 2843965 INFO  (coreLoadExecutor-6042-thread-1) [    x:collection1] o.a.s.c.RequestHandlers Registered paths: /admin/mbeans,/update/csv,/sql,/update/json/docs,/admin/luke,/graph,/export,/select,/admin/segments,/get,/admin/system,/replication,/admin/properties,/config,/stream,/schema,/admin/plugins,/admin/logging,/update/json,/admin/ping,/admin/threads,/update,/admin/file
   [junit4]   2> 2843965 INFO  (coreLoadExecutor-6042-thread-1) [    x:collection1] o.a.s.c.SolrCore Using default statsCache cache: org.apache.solr.search.stats.LocalStatsCache
   [junit4]   2> 2843965 INFO  (coreLoadExecutor-6042-thread-1) [    x:collection1] o.a.s.u.CommitTracker Hard AutoCommit: disabled
   [junit4]   2> 2843965 INFO  (coreLoadExecutor-6042-thread-1) [    x:collection1] o.a.s.u.CommitTracker Soft AutoCommit: disabled
   [junit4]   2> 2843977 INFO  (coreLoadExecutor-6042-thread-1) [    x:collection1] o.a.s.u.RandomMergePolicy RandomMergePolicy wrapping class org.apache.lucene.index.AlcoholicMergePolicy: [AlcoholicMergePolicy: minMergeSize=0, mergeFactor=10, maxMergeSize=770394091, maxMergeSizeForForcedMerge=9223372036854775807, calibrateSizeByDeletes=true, maxMergeDocs=2147483647, maxCFSSegmentSizeMB=8.796093022207999E12, noCFSRatio=0.1]
   [junit4]   2> 2843977 INFO  (coreLoadExecutor-6042-thread-1) [    x:collection1] o.a.s.c.SolrDeletionPolicy SolrDeletionPolicy.onInit: commits: num=1
   [junit4]   2> 	commit{dir=MockDirectoryWrapper(RAMDirectory@8d77162 lockFactory=org.apache.lucene.store.SingleInstanceLockFactory@2aa44eae),segFN=segments_1,generation=1}
   [junit4]   2> 2843977 INFO  (coreLoadExecutor-6042-thread-1) [    x:collection1] o.a.s.c.SolrDeletionPolicy newest commit generation = 1
   [junit4]   2> 2843977 INFO  (coreLoadExecutor-6042-thread-1) [    x:collection1] o.a.s.s.SolrIndexSearcher Opening [Searcher@3ebba0c0[collection1] main]
   [junit4]   2> 2843978 INFO  (coreLoadExecutor-6042-thread-3) [    x:collection5] o.a.s.h.l.XMLLoader xsltCacheLifetimeSeconds=60
   [junit4]   2> 2843978 INFO  (coreLoadExecutor-6042-thread-1) [    x:collection1] o.a.s.r.ManagedResourceStorage File-based storage initialized to use dir: /export/home/jenkins/workspace/Lucene-Solr-6.x-Solaris/solr/build/solr-core/test/J1/temp/solr.core.TestLazyCores_CFBC74B99B575894-001/tempDir-001/collection1/conf
   [junit4]   2> 2843978 INFO  (coreLoadExecutor-6042-thread-1) [    x:collection1] o.a.s.r.RestManager Initializing RestManager with initArgs: {storageDir=/export/home/jenkins/workspace/Lucene-Solr-6.x-Solaris/solr/build/solr-core/test/J1/temp/solr.core.TestLazyCores_CFBC74B99B575894-001/tempDir-001/collection1/conf}
   [junit4]   2> 2843978 INFO  (coreLoadExecutor-6042-thread-1) [    x:collection1] o.a.s.r.ManagedResourceStorage Reading _rest_managed.json using file:dir=/export/home/jenkins/workspace/Lucene-Solr-6.x-Solaris/solr/build/solr-core/test/J1/temp/solr.core.TestLazyCores_CFBC74B99B575894-001/tempDir-001/collection1/conf
   [junit4]   2> 2843978 INFO  (coreLoadExecutor-6042-thread-1) [    x:collection1] o.a.s.r.RestManager Initializing 0 registered ManagedResources
   [junit4]   2> 2843978 INFO  (coreLoadExecutor-6042-thread-1) [    x:collection1] o.a.s.h.ReplicationHandler Commits will be reserved for  10000
   [junit4]   2> 2843978 INFO  (coreLoadExecutor-6042-thread-1) [    x:collection1] o.a.s.c.CoreContainer registering core: collection1
   [junit4]   2> 2843979 INFO  (searcherExecutor-6043-thread-1-processing-x:collection1) [    x:collection1] o.a.s.c.SolrCore [collection1] Registered new searcher Searcher@3ebba0c0[collection1] main{ExitableDirectoryReader(UninvertingDirectoryReader())}
   [junit4]   2> 2843979 INFO  (coreLoadExecutor-6042-thread-3) [    x:collection5] o.a.s.h.l.XMLLoader xsltCacheLifetimeSeconds=60
   [junit4]   2> 2843980 INFO  (coreLoadExecutor-6042-thread-3) [    x:collection5] o.a.s.h.l.XMLLoader xsltCacheLifetimeSeconds=60
   [junit4]   2> 2843980 INFO  (coreLoadExecutor-6042-thread-3) [    x:collection5] o.a.s.h.l.XMLLoader xsltCacheLifetimeSeconds=60
   [junit4]   2> 2843982 INFO  (coreLoadExecutor-6042-thread-3) [    x:collection5] o.a.s.c.RequestHandlers Registered paths: /admin/mbeans,/update/csv,/sql,/update/json/docs,/admin/luke,/graph,/export,/select,/admin/segments,/get,/admin/system,/replication,/admin/properties,/config,/stream,/schema,/admin/plugins,/admin/logging,/update/json,/admin/ping,/admin/threads,/update,/admin/file
   [junit4]   2> 2843982 INFO  (coreLoadExecutor-6042-thread-3) [    x:collection5] o.a.s.c.SolrCore Using default statsCache cache: org.apache.solr.search.stats.LocalStatsCache
   [junit4]   2> 2843982 INFO  (coreLoadExecutor-6042-thread-3) [    x:collection5] o.a.s.u.CommitTracker Hard AutoCommit: disabled
   [junit4]   2> 2843982 INFO  (coreLoadExecutor-6042-thread-3) [    x:collection5] o.a.s.u.CommitTracker Soft AutoCommit: disabled
   [junit4]   2> 2843982 INFO  (coreLoadExecutor-6042-thread-3) [    x:collection5] o.a.s.u.RandomMergePolicy RandomMergePolicy wrapping class org.apache.lucene.index.AlcoholicMergePolicy: [AlcoholicMergePolicy: minMergeSize=0, mergeFactor=10, maxMergeSize=770394091, maxMergeSizeForForcedMerge=9223372036854775807, calibrateSizeByDeletes=true, maxMergeDocs=2147483647, maxCFSSegmentSizeMB=8.796093022207999E12, noCFSRatio=0.1]
   [junit4]   2> 2843983 INFO  (coreLoadExecutor-6042-thread-3) [    x:collection5] o.a.s.c.SolrDeletionPolicy SolrDeletionPolicy.onInit: commits: num=1
   [junit4]   2> 	commit{dir=MockDirectoryWrapper(RAMDirectory@5abc8ac0 lockFactory=org.apache.lucene.store.SingleInstanceLockFactory@3889fc33),segFN=segments_1,generation=1}
   [junit4]   2> 2843983 INFO  (coreLoadExecutor-6042-thread-3) [    x:collection5] o.a.s.c.SolrDeletionPolicy newest commit generation = 1
   [junit4]   2> 2843983 INFO  (coreLoadExecutor-6042-thread-3) [    x:collection5] o.a.s.s.SolrIndexSearcher Opening [Searcher@7c631ce5[collection5] main]
   [junit4]   2> 2843983 INFO  (coreLoadExecutor-6042-thread-3) [    x:collection5] o.a.s.r.ManagedResourceStorage File-based storage initialized to use dir: /export/home/jenkins/workspace/Lucene-Solr-6.x-Solaris/solr/build/solr-core/test/J1/temp/solr.core.TestLazyCores_CFBC74B99B575894-001/tempDir-001/collection5/conf
   [junit4]   2> 2843983 INFO  (coreLoadExecutor-6042-thread-3) [    x:collection5] o.a.s.r.RestManager Initializing RestManager with initArgs: {storageDir=/export/home/jenkins/workspace/Lucene-Solr-6.x-Solaris/solr/build/solr-core/test/J1/temp/solr.core.TestLazyCores_CFBC74B99B575894-001/tempDir-001/collection5/conf}
   [junit4]   2> 2843983 INFO  (coreLoadExecutor-6042-thread-3) [    x:collection5] o.a.s.r.ManagedResourceStorage Reading _rest_managed.json using file:dir=/export/home/jenkins/workspace/Lucene-Solr-6.x-Solaris/solr/build/solr-core/test/J1/temp/solr.core.TestLazyCores_CFBC74B99B575894-001/tempDir-001/collection5/conf
   [junit4]   2> 2843983 INFO  (coreLoadExecutor-6042-thread-3) [    x:collection5] o.a.s.r.RestManager Initializing 0 registered ManagedResources
   [junit4]   2> 2843983 INFO  (coreLoadExecutor-6042-thread-3) [    x:collection5] o.a.s.h.ReplicationHandler Commits will be reserved for  10000
   [junit4]   2> 2843983 INFO  (searcherExecutor-6046-thread-1-processing-x:collection5) [    x:collection5] o.a.s.c.SolrCore [collection5] Registered new searcher Searcher@7c631ce5[collection5] main{ExitableDirectoryReader(UninvertingDirectoryReader())}
   [junit4]   2> 2843983 INFO  (coreLoadExecutor-6042-thread-3) [    x:collection5] o.a.s.c.CoreContainer registering core: collection5
   [junit4]   2> 2843985 INFO  (TEST-TestLazyCores.testCachingLimit-seed#[CFBC74B99B575894]) [    ] o.a.s.c.SolrResourceLoader new SolrResourceLoader for directory: '/export/home/jenkins/workspace/Lucene-Solr-6.x-Solaris/solr/build/solr-core/test/J1/temp/solr.core.TestLazyCores_CFBC74B99B575894-001/tempDir-001/collection3'
   [junit4]   2> 2843985 INFO  (TEST-TestLazyCores.testCachingLimit-seed#[CFBC74B99B575894]) [    ] o.a.s.c.SolrResourceLoader JNDI not configured for solr (NoInitialContextEx)
   [junit4]   2> 2843985 INFO  (TEST-TestLazyCores.testCachingLimit-seed#[CFBC74B99B575894]) [    ] o.a.s.c.SolrResourceLoader solr home defaulted to 'solr/' (could not find system property or JNDI)
   [junit4]   2> 2843989 INFO  (TEST-TestLazyCores.testCachingLimit-seed#[CFBC74B99B575894]) [    ] o.a.s.c.SolrConfig current version of requestparams : -1
   [junit4]   2> 2843990 WARN  (TEST-TestLazyCores.testCachingLimit-seed#[CFBC74B99B575894]) [    ] o.a.s.c.Config Beginning with Solr 5.5, <mergePolicy> is deprecated, use <mergePolicyFactory> instead.
   [junit4]   2> 2843991 INFO  (TEST-TestLazyCores.testCachingLimit-seed#[CFBC74B99B575894]) [    ] o.a.s.c.SolrConfig Using Lucene MatchVersion: 6.1.0
   [junit4]   2> 2843995 INFO  (TEST-TestLazyCores.testCachingLimit-seed#[CFBC74B99B575894]) [    ] o.a.s.c.SolrConfig Loaded SolrConfig: solrconfig.xml
   [junit4]   2> 2843997 INFO  (TEST-TestLazyCores.testCachingLimit-seed#[CFBC74B99B575894]) [    ] o.a.s.s.IndexSchema [collection3] Schema name=tiny
   [junit4]   2> 2843999 INFO  (TEST-TestLazyCores.testCachingLimit-seed#[CFBC74B99B575894]) [    ] o.a.s.s.IndexSchema unique key field: id
   [junit4]   2> 2844000 INFO  (TEST-TestLazyCores.testCachingLimit-seed#[CFBC74B99B575894]) [    ] o.a.s.c.ConfigSetProperties Did not find ConfigSet properties, assuming default properties: Can't find resource 'configsetprops.json' in classpath or '/export/home/jenkins/workspace/Lucene-Solr-6.x-Solaris/solr/build/solr-core/test/J1/temp/solr.core.TestLazyCores_CFBC74B99B575894-001/tempDir-001/collection3'
   [junit4]   2> 2844000 INFO  (TEST-TestLazyCores.testCachingLimit-seed#[CFBC74B99B575894]) [    ] o.a.s.c.CoreContainer Creating SolrCore 'collection3' using configuration from instancedir /export/home/jenkins/workspace/Lucene-Solr-6.x-Solaris/solr/build/solr-core/test/J1/temp/solr.core.TestLazyCores_CFBC74B99B575894-001/tempDir-001/collection3
   [junit4]   2> 2844000 INFO  (TEST-TestLazyCores.testCachingLimit-seed#[CFBC74B99B575894]) [    x:collection3] o.a.s.c.SolrCore org.apache.solr.core.MockDirectoryFactory
   [junit4]   2> 2844001 INFO  (TEST-TestLazyCores.testCachingLimit-seed#[CFBC74B99B575894]) [    x:collection3] o.a.s.c.SolrCore [[collection3] ] Opening new SolrCore at [/export/home/jenkins/workspace/Lucene-Solr-6.x-Solaris/solr/build/solr-core/test/J1/temp/solr.core.TestLazyCores_CFBC74B99B575894-001/tempDir-001/collection3], dataDir=[/export/home/jenkins/workspace/Lucene-Solr-6.x-Solaris/solr/build/solr-core/test/J1/temp/solr.core.TestLazyCores_CFBC74B99B575894-001/tempDir-001/collection3/data/]
   [junit4]   2> 2844001 INFO  (TEST-TestLazyCores.testCachingLimit-seed#[CFBC74B99B575894]) [    x:collection3] o.a.s.c.SolrCore JMX monitoring not detected for core: collection3
   [junit4]   2> 2844001 INFO  (TEST-TestLazyCores.testCachingLimit-seed#[CFBC74B99B575894]) [    x:collection3] o.a.s.c.CachingDirectoryFactory return new directory for /export/home/jenkins/workspace/Lucene-Solr-6.x-Solaris/solr/build/solr-core/test/J1/temp/solr.core.TestLazyCores_CFBC74B99B575894-001/tempDir-001/collection3/data
   [junit4]   2> 2844001 INFO  (TEST-TestLazyCores.testCachingLimit-seed#[CFBC74B99B575894]) [    x:collection3] o.a.s.c.SolrCore New index directory detected: old=null new=/export/home/jenkins/workspace/Lucene-Solr-6.x-Solaris/solr/build/solr-core/test/J1/temp/solr.core.TestLazyCores_CFBC74B99B575894-001/tempDir-001/collection3/data/index/
   [junit4]   2> 2844001 WARN  (TEST-TestLazyCores.testCachingLimit-seed#[CFBC74B99B575894]) [    x:collection3] o.a.s.c.SolrCore [collection3] Solr index directory '/export/home/jenkins/workspace/Lucene-Solr-6.x-Solaris/solr/build/solr-core/test/J1/temp/solr.core.TestLazyCores_CFBC74B99B575894-001/tempDir-001/collection3/data/index' doesn't exist. Creating new index...
   [junit4]   2> 2844002 INFO  (TEST-TestLazyCores.testCachingLimit-seed#[CFBC74B99B575894]) [    x:collection3] o.a.s.c.CachingDirectoryFactory return new directory for /export/home/jenkins/workspace/Lucene-Solr-6.x-Solaris/solr/build/solr-core/test/J1/temp/solr.core.TestLazyCores_CFBC74B99B575894-001/tempDir-001/collection3/data/index
   [junit4]   2> 2844002 INFO  (TEST-TestLazyCores.testCachingLimit-seed#[CFBC74B99B575894]) [    x:collection3] o.a.s.u.RandomMergePolicy RandomMergePolicy wrapping class org.apache.lucene.index.TieredMergePolicy: [TieredMergePolicy: maxMergeAtOnce=38, maxMergeAtOnceExplicit=15, maxMergedSegmentMB=11.9501953125, floorSegmentMB=2.1162109375, forceMergeDeletesPctAllowed=15.267121827389937, segmentsPerTier=25.0, maxCFSSegmentSizeMB=8.796093022207999E12, noCFSRatio=1.0
   [junit4]   2> 2844002 INFO  (TEST-TestLazyCores.testCachingLimit-seed#[CFBC74B99B575894]) [    x:collection3] o.a.s.c.SolrDeletionPolicy SolrDeletionPolicy.onCommit: commits: num=1
   [junit4]   2> 	commit{dir=MockDirectoryWrapper(RAMDirectory@6b892e8c lockFactory=org.apache.lucene.store.SingleInstanceLockFactory@2b90001e),segFN=segments_1,generation=1}
   [junit4]   2> 2844002 INFO  (TEST-TestLazyCores.testCachingLimit-seed#[CFBC74B99B575894]) [    x:collection3] o.a.s.c.SolrDeletionPolicy newest commit generation = 1
   [junit4]   2> 2844004 INFO  (TEST-TestLazyCores.testCachingLimit-seed#[CFBC74B99B575894]) [    x:collection3] o.a.s.c.SolrCore no updateRequestProcessorChain defined as default, creating implicit default
   [junit4]   2> 2844005 INFO  (TEST-TestLazyCores.testCachingLimit-seed#[CFBC74B99B575894]) [    x:collection3] o.a.s.h.l.XMLLoader xsltCacheLifetimeSeconds=60
   [junit4]   2> 2844006 INFO  (TEST-TestLazyCores.testCachingLimit-seed#[CFBC74B99B575894]) [    x:collection3] o.a.s.h.l.XMLLoader xsltCacheLifetimeSeconds=60
   [junit4]   2> 2844007 INFO  (TEST-TestLazyCores.testCachingLimit-seed#[CFBC74B99B575894]) [    x:collection3] o.a.s.h.l.XMLLoader xsltCacheLifetimeSeconds=60
   [junit4]   2> 2844008 INFO  (TEST-TestLazyCores.testCachingLimit-seed#[CFBC74B99B575894]) [    x:collection3] o.a.s.h.l.XMLLoader xsltCacheLifetimeSeconds=60
   [junit4]   2> 2844009 INFO  (TEST-TestLazyCores.testCachingLimit-seed#[CFBC74B99B575894]) [    x:collection3] o.a.s.c.RequestHandlers Registered paths: /admin/mbeans,/update/csv,/sql,/update/json/docs,/admin/luke,/graph,/export,/select,/admin/segments,/get,/admin/system,/replication,/admin/properties,/config,/stream,/schema,/admin/plugins,/admin/logging,/update/json,/admin/ping,/admin/threads,/update,/admin/file
   [junit4]   2> 2844009 INFO  (TEST-TestLazyCores.testCachingLimit-seed#[CFBC74B99B575894]) [    x:collection3] o.a.s.c.SolrCore Using default statsCache cache: org.apache.solr.search.stats.LocalStatsCache
   [junit4]   2> 2844009 INFO  (TEST-TestLazyCores.testCachingLimit-seed#[CFBC74B99B575894]) [    x:collection3] o.a.s.u.CommitTracker Hard AutoCommit: disabled
   [junit4]   2> 2844009 INFO  (TEST-TestLazyCores.testCachingLimit-seed#[CFBC74B99B575894]) [    x:collection3] o.a.s.u.CommitTracker Soft AutoCommit: disabled
   [junit4]   2> 2844009 INFO  (TEST-TestLazyCores.testCachingLimit-seed#[CFBC74B99B575894]) [    x:collection3] o.a.s.u.RandomMergePolicy RandomMergePolicy wrapping class org.apache.lucene.index.TieredMergePolicy: [TieredMergePolicy: maxMergeAtOnce=45, maxMergeAtOnceExplicit=19, maxMergedSegmentMB=39.5458984375, floorSegmentMB=0.5576171875, forceMergeDeletesPctAllowed=0.6015643938756587, segmentsPerTier=19.0, maxCFSSegmentSizeMB=8.796093022207999E12, noCFSRatio=0.4063237286017872
   [junit4]   2> 2844010 INFO  (TEST-TestLazyCores.testCachingLimit-seed#[CFBC74B99B575894]) [    x:collection3] o.a.s.c.SolrDeletionPolicy SolrDeletionPolicy.onInit: commits: num=1
   [junit4]   2> 	commit{dir=MockDirectoryWrapper(RAMDirectory@6b892e8c lockFactory=org.apache.lucene.store.SingleInstanceLockFactory@2b90001e),segFN=segments_1,generation=1}
   [junit4]   2> 2844010 INFO  (TEST-TestLazyCores.testCachingLimit-seed#[CFBC74B99B575894]) [    x:collection3] o.a.s.c.SolrDeletionPolicy newest commit generation = 1
   [junit4]   2> 2844010 INFO  (TEST-TestLazyCores.testCachingLimit-seed#[CFBC74B99B575894]) [    x:collection3] o.a.s.s.SolrIndexSearcher Opening [Searcher@5fbee753[collection3] main]
   [junit4]   2> 2844010 INFO  (TEST-TestLazyCores.testCachingLimit-seed#[CFBC74B99B575894]) [    x:collection3] o.a.s.r.ManagedResourceStorage File-based storage initialized to use dir: /export/home/jenkins/workspace/Lucene-Solr-6.x-Solaris/solr/build/solr-core/test/J1/temp/solr.core.TestLazyCores_CFBC74B99B575894-001/tempDir-001/collection3/conf
   [junit4]   2> 2844010 INFO  (TEST-TestLazyCores.testCachingLimit-seed#[CFBC74B99B575894]) [    x:collection3] o.a.s.r.RestManager Initializing RestManager with initArgs: {storageDir=/export/home/jenkins/workspace/Lucene-Solr-6.x-Solaris/solr/build/solr-core/test/J1/temp/solr.core.TestLazyCores_CFBC74B99B575894-001/tempDir-001/collection3/conf}
   [junit4]   2> 2844010 INFO  (TEST-TestLazyCores.testCachingLimit-seed#[CFBC74B99B575894]) [    x:collection3] o.a.s.r.ManagedResourceStorage Reading _rest_managed.json using file:dir=/export/home/jenkins/workspace/Lucene-Solr-6.x-Solaris/solr/build/solr-core/test/J1/temp/solr.core.TestLazyCores_CFBC74B99B575894-001/tempDir-001/collection3/conf
   [junit4]   2> 2844011 INFO  (TEST-TestLazyCores.testCachingLimit-seed#[CFBC74B99B575894]) [    x:collection3] o.a.s.r.RestManager Initializing 0 registered ManagedResources
   [junit4]   2> 2844011 INFO  (TEST-TestLazyCores.testCachingLimit-seed#[CFBC74B99B575894]) [    x:collection3] o.a.s.h.ReplicationHandler Commits will be reserved for  10000
   [junit4]   2> 2844011 INFO  (TEST-TestLazyCores.testCachingLimit-seed#[CFBC74B99B575894]) [    x:collection3] o.a.s.c.SolrCores Opening transient core collection3
   [junit4]   2> 2844011 INFO  (TEST-TestLazyCores.testCachingLimit-seed#[CFBC74B99B575894]) [    x:collection3] o.a.s.c.CoreContainer registering core: collection3
   [junit4]   2> 2844011 INFO  (TEST-TestLazyCores.testCachingLimit-seed#[CFBC74B99B575894]) [    x:collection3] o.a.s.c.SolrResourceLoader new SolrResourceLoader for directory: '/export/home/jenkins/workspace/Lucene-Solr-6.x-Solaris/solr/build/solr-core/test/J1/temp/solr.core.TestLazyCores_CFBC74B99B575894-001/tempDir-001/collection4'
   [junit4]   2> 2844011 INFO  (TEST-TestLazyCores.testCachingLimit-seed#[CFBC74B99B575894]) [    x:collection3] o.a.s.c.SolrResourceLoader JNDI not configured for solr (NoInitialContextEx)
   [junit4]   2> 2844011 INFO  (TEST-TestLazyCores.testCachingLimit-seed#[CFBC74B99B575894]) [    x:collection3] o.a.s.c.SolrResourceLoader solr home defaulted to 'solr/' (could not find system property or JNDI)
   [junit4]   2> 2844017 INFO  (TEST-TestLazyCores.testCachingLimit-seed#[CFBC74B99B575894]) [    x:collection3] o.a.s.c.SolrConfig current version of requestparams : -1
   [junit4]   2> 2844018 WARN  (TEST-TestLazyCores.testCachingLimit-seed#[CFBC74B99B575894]) [    x:collection3] o.a.s.c.Config Beginning with Solr 5.5, <mergePolicy> is deprecated, use <mergePolicyFactory> instead.
   [junit4]   2> 2844018 INFO  (TEST-TestLazyCores.testCachingLimit-seed#[CFBC74B99B575894]) [    x:collection3] o.a.s.c.SolrConfig Using Lucene MatchVersion: 6.1.0
   [junit4]   2> 2844040 INFO  (TEST-TestLazyCores.testCachingLimit-seed#[CFBC74B99B575894]) [    x:collection3] o.a.s.c.SolrConfig Loaded SolrConfig: solrconfig.xml
   [junit4]   2> 2844043 INFO  (TEST-TestLazyCores.testCachingLimit-seed#[CFBC74B99B575894]) [    x:collection3] o.a.s.s.IndexSchema [collection4] Schema name=tiny
   [junit4]   2> 2844045 INFO  (TEST-TestLazyCores.testCachingLimit-seed#[CFBC74B99B575894]) [    x:collection3] o.a.s.s.IndexSchema unique key field: id
   [junit4]   2> 2844046 INFO  (TEST-TestLazyCores.testCachingLimit-seed#[CFBC74B99B575894]) [    x:collection3] o.a.s.c.ConfigSetProperties Did not find ConfigSet properties, assuming default properties: Can't find resource 'configsetprops.json' in classpath or '/export/home/jenkins/workspace/Lucene-Solr-6.x-Solaris/solr/build/solr-core/test/J1/temp/solr.core.TestLazyCores_CFBC74B99B575894-001/tempDir-001/collection4'
   [junit4]   2> 2844046 INFO  (TEST-TestLazyCores.testCachingLimit-seed#[CFBC74B99B575894]) [    x:collection3] o.a.s.c.CoreContainer Creating SolrCore 'collection4' using configuration from instancedir /export/home/jenkins/workspace/Lucene-Solr-6.x-Solaris/solr/build/solr-core/test/J1/temp/solr.core.TestLazyCores_CFBC74B99B575894-001/tempDir-001/collection4
   [junit4]   2> 2844047 INFO  (TEST-TestLazyCores.testCachingLimit-seed#[CFBC74B99B575894]) [    x:collection4] o.a.s.c.SolrCore org.apache.solr.core.MockDirectoryFactory
   [junit4]   2> 2844047 INFO  (TEST-TestLazyCores.testCachingLimit-seed#[CFBC74B99B575894]) [    x:collection4] o.a.s.c.SolrCore [[collection4] ] Opening new SolrCore at [/export/home/jenkins/workspace/Lucene-Solr-6.x-Solaris/solr/build/solr-core/test/J1/temp/solr.core.TestLazyCores_CFBC74B99B575894-001/tempDir-001/collection4], dataDir=[/export/home/jenkins/workspace/Lucene-Solr-6.x-Solaris/solr/build/solr-core/test/J1/temp/solr.core.TestLazyCores_CFBC74B99B575894-001/tempDir-001/collection4/data/]
   [junit4]   2> 2844047 INFO  (TEST-TestLazyCores.testCachingLimit-seed#[CFBC74B99B575894]) [    x:collection4] o.a.s.c.SolrCore JMX monitoring not detected for core: collection4
   [junit4]   2> 2844047 INFO  (TEST-TestLazyCores.testCachingLimit-seed#[CFBC74B99B575894]) [    x:collection4] o.a.s.c.CachingDirectoryFactory return new directory for /export/home/jenkins/workspace/Lucene-Solr-6.x-Solaris/solr/build/solr-core/test/J1/temp/solr.core.TestLazyCores_CFBC74B99B575894-001/tempDir-001/collection4/data
   [junit4]   2> 2844048 INFO  (searcherExecutor-6055-thread-1-processing-x:collection3) [    x:collection3] o.a.s.c.SolrCore [collection3] Registered new searcher Searcher@5fbee753[collection3] main{ExitableDirectoryReader(UninvertingDirectoryReader())}
   [junit4]   2> 2844048 INFO  (TEST-TestLazyCores.testCachingLimit-seed#[CFBC74B99B575894]) [    x:collection4] o.a.s.c.SolrCore New index directory detected: old=null new=/export/home/jenkins/workspace/Lucene-Solr-6.x-Solaris/solr/build/solr-core/test/J1/temp/solr.core.TestLazyCores_CFBC74B99B575894-001/tempDir-001/collection4/data/index/
   [junit4]   2> 2844048 WARN  (TEST-TestLazyCores.testCachingLimit-seed#[CFBC74B99B575894]) [    x:collection4] o.a.s.c.SolrCore [collection4] Solr index directory '/export/home/jenkins/workspace/Lucene-Solr-6.x-Solaris/solr/build/solr-core/test/J1/temp/solr.core.TestLazyCores_CFBC74B99B575894-001/tempDir-001/collection4/data/index' doesn't exist. Creating new index...
   [junit4]   2> 2844048 INFO  (TEST-TestLazyCores.testCachingLimit-seed#[CFBC74B99B575894]) [    x:collection4] o.a.s.c.CachingDirectoryFactory return new directory for /export/home/jenkins/workspace/Lucene-Solr-6.x-Solaris/solr/build/solr-core/test/J1/temp/solr.core.TestLazyCores_CFBC74B99B575894-001/tempDir-001/collection4/data/index
   [junit4]   2> 2844048 INFO  (TEST-TestLazyCores.testCachingLimit-seed#[CFBC74B99B575894]) [    x:collection4] o.a.s.u.RandomMergePolicy RandomMergePolicy wrapping class org.apache.lucene.index.LogByteSizeMergePolicy: [LogByteSizeMergePolicy: minMergeSize=1677721, mergeFactor=40, maxMergeSize=2147483648, maxMergeSizeForForcedMerge=9223372036854775807, calibrateSizeByDeletes=false, maxMergeDocs=2147483647, maxCFSSegmentSizeMB=8.796093022207999E12, noCFSRatio=1.0]
   [junit4]   2> 2844049 INFO  (TEST-TestLazyCores.testCachingLimit-seed#[CFBC74B99B575894]) [    x:collection4] o.a.s.c.SolrDeletionPolicy SolrDeletionPolicy.onCommit: commits: num=1
   [junit4]   2> 	commit{dir=MockDirectoryWrapper(RAMDirectory@46da2c7d lockFactory=org.apache.lucene.store.SingleInstanceLockFactory@47b9219a),segFN=segments_1,generation=1}
   [junit4]   2> 2844049 INFO  (TEST-TestLazyCores.testCachingLimit-seed#[CFBC74B99B575894]) [    x:collection4] o.a.s.c.SolrDeletionPolicy newest commit generation = 1
   [junit4]   2> 2844049 INFO  (OldIndexDirectoryCleanupThreadForCore-collection4) [    x:collection4] o.a.s.c.SolrCore Looking for old index directories to cleanup for core collection4 in /export/home/jenkins/workspace/Lucene-Solr-6.x-Solaris/solr/build/solr-core/test/J1/temp/solr.core.TestLazyCores_CFBC74B99B575894-001/tempDir-001/collection4/data/
   [junit4]   2> 2844049 WARN  (OldIndexDirectoryCleanupThreadForCore-collection4) [    x:collection4] o.a.s.c.DirectoryFactory /export/home/jenkins/workspace/Lucene-Solr-6.x-Solaris/solr/build/solr-core/test/J1/temp/solr.core.TestLazyCores_CFBC74B99B575894-001/tempDir-001/collection4/data/ does not point to a valid data directory; skipping clean-up of old index directories.
   [junit4]   2> 2844051 INFO  (TEST-TestLazyCores.testCachingLimit-seed#[CFBC74B99B575894]) [    x:collection4] o.a.s.c.SolrCore no updateRequestProcessorChain defined as default, creating implicit default
   [junit4]   2> 2844052 INFO  (TEST-TestLazyCores.testCachingLimit-seed#[CFBC74B99B575894]) [    x:collection4] o.a.s.h.l.XMLLoader xsltCacheLifetimeSeconds=60
   [junit4]   2> 2844053 INFO  (TEST-TestLazyCores.testCachingLimit-seed#[CFBC74B99B575894]) [    x:collection4] o.a.s.h.l.XMLLoader xsltCacheLifetimeSeconds=60
   [junit4]   2> 2844054 INFO  (TEST-TestLazyCores.testCachingLimit-seed#[CFBC74B99B575894]) [    x:collection4] o.a.s.h.l.XMLLoader xsltCacheLifetimeSeconds=60
   [junit4]   2> 2844054 INFO  (TEST-TestLazyCores.testCachingLimit-seed#[CFBC74B99B575894]) [    x:collection4] o.a.s.h.l.XMLLoader xsltCacheLifetimeSeconds=60
   [junit4]   2> 2844056 INFO  (TEST-TestLazyCores.testCachingLimit-seed#[CFBC74B99B575894]) [    x:collection4] o.a.s.c.RequestHandlers Registered paths: /admin/mbeans,/update/csv,/sql,/update/json/docs,/admin/luke,/graph,/export,/select,/admin/segments,/get,/admin/system,/replication,/admin/properties,/config,/stream,/schema,/admin/plugins,/admin/logging,/update/json,/admin/ping,/admin/threads,/update,/admin/file
   [junit4]   2> 2844056 INFO  (TEST-TestLazyCores.testCachingLimit-seed#[CFBC74B99B575894]) [    x:collection4] o.a.s.c.SolrCore Using default statsCache cache: org.apache.solr.search.stats.LocalStatsCache
   [junit4]   2> 2844056 INFO  (TEST-TestLazyCores.testCachingLimit-seed#[CFBC74B99B575894]) [    x:collection4] o.a.s.u.CommitTracker Hard AutoCommit: disabled
   [junit4]   2> 2844056 INFO  (TEST-TestLazyCores.testCachingLimit-seed#[CFBC74B99B575894]) [    x:collection4] o.a.s.u.CommitTracker Soft AutoCommit: disabled
   [junit4]   2> 2844056 INFO  (TEST-TestLazyCores.testCachingLimit-seed#[CFBC74B99B575894]) [    x:collection4] o.a.s.u.RandomMergePolicy RandomMergePolicy wrapping class org.apache.lucene.index.LogByteSizeMergePolicy: [LogByteSizeMergePolicy: minMergeSize=1677721, mergeFactor=33, maxMergeSize=2147483648, maxMergeSizeForForcedMerge=9223372036854775807, calibrateSizeByDeletes=true, maxMergeDocs=2147483647, maxCFSSegmentSizeMB=8.796093022207999E12, noCFSRatio=0.46933189853220714]
   [junit4]   2> 2844056 INFO  (TEST-TestLazyCores.testCachingLimit-seed#[CFBC74B99B575894]) [    x:collection4] o.a.s.c.SolrDeletionPolicy SolrDeletionPolicy.onInit: commits: num=1
   [junit4]   2> 	commit{dir=MockDirectoryWrapper(RAMDirectory@46da2c7d lockFactory=org.apache.lucene.store.SingleInstanceLockFactory@47b9219a),segFN=segments_1,generation=1}
   [junit4]   2> 2844057 INFO  (TEST-TestLazyCores.testCachingLimit-seed#[CFBC74B99B575894]) [    x:collection4] o.a.s.c.SolrDeletionPolicy newest commit generation = 1
   [junit4]   2> 2844057 INFO  (TEST-TestLazyCores.testCachingLimit-seed#[CFBC74B99B575894]) [    x:collection4] o.a.s.s.SolrIndexSearcher Opening [Searcher@1b82a506[collection4] main]
   [junit4]   2> 2844057 INFO  (TEST-TestLazyCores.testCachingLimit-seed#[CFBC74B99B575894]) [    x:collection4] o.a.s.r.ManagedResourceStorage File-based storage initialized to use dir: /export/home/jenkins/workspace/Lucene-Solr-6.x-Solaris/solr/build/solr-core/test/J1/temp/solr.core.TestLazyCores_CFBC74B99B575894-001/tempDir-001/collection4/conf
   [junit4]   2> 2844057 INFO  (TEST-TestLazyCores.testCachingLimit-seed#[CFBC74B99B575894]) [    x:collection4] o.a.s.r.RestManager Initializing RestManager with initArgs: {storageDir=/export/home/jenkins/workspace/Lucene-Solr-6.x-Solaris/solr/build/solr-core/test/J1/temp/solr.core.TestLazyCores_CFBC74B99B575894-001/tempDir-001/collection4/conf}
   [junit4]   2> 2844057 INFO  (TEST-TestLazyCores.testCachingLimit-seed#[CFBC74B99B575894]) [    x:collection4] o.a.s.r.ManagedResourceStorage Reading _rest_managed.json using file:dir=/export/home/jenkins/workspace/Lucene-Solr-6.x-Solaris/solr/build/solr-core/test/J1/temp/solr.core.TestLazyCores_CFBC74B99B575894-001/tempDir-001/collection4/conf
   [junit4]   2> 2844057 INFO  (TEST-TestLazyCores.testCachingLimit-seed#[CFBC74B99B575894]) [    x:collection4] o.a.s.r.RestManager Initializing 0 registered ManagedResources
   [junit4]   2> 2844057 INFO  (TEST-TestLazyCores.testCachingLimit-seed#[CFBC74B99B575894]) [    x:collection4] o.a.s.h.ReplicationHandler Commits will be reserved for  10000
   [junit4]   2> 2844057 INFO  (searcherExecutor-6059-thread-1-processing-x:collection4) [    x:collection4] o.a.s.c.SolrCore [collection4] Registered new searcher Searcher@1b82a506[collection4] main{ExitableDirectoryReader(UninvertingDirectoryReader())}
   [junit4]   2> 2844058 INFO  (TEST-TestLazyCores.testCachingLimit-seed#[CFBC74B99B575894]) [    x:collection4] o.a.s.c.CoreContainer registering core: collection4
   [junit4]   2> 2844058 INFO  (TEST-TestLazyCores.testCachingLimit-seed#[CFBC74B99B575894]) [    x:collection4] o.a.s.c.SolrResourceLoader new SolrResourceLoader for directory: '/export/home/jenkins/workspace/Lucene-Solr-6.x-Solaris/solr/build/solr-core/test/J1/temp/solr.core.TestLazyCores_CFBC74B99B575894-001/tempDir-001/collection6'
   [junit4]   2> 2844058 INFO  (TEST-TestLazyCores.testCachingLimit-seed#[CFBC74B99B575894]) [    x:collection4] o.a.s.c.SolrResourceLoader JNDI not configured for solr (NoInitialContextEx)
   [junit4]   2> 2844058 INFO  (TEST-TestLazyCores.testCachingLimit-seed#[CFBC74B99B575894]) [    x:collection4] o.a.s.c.SolrResourceLoader solr home defaulted to 'solr/' (could not find system property or JNDI)
   [junit4]   2> 2844063 INFO  (TEST-TestLazyCores.testCachingLimit-seed#[CFBC74B99B575894]) [    x:collection4] o.a.s.c.SolrConfig current version of requestparams : -1
   [junit4]   2> 2844064 WARN  (TEST-TestLazyCores.testCachingLimit-seed#[CFBC74B99B575894]) [    x:collection4] o.a.s.c.Config Beginning with Solr 5.5, <mergePolicy> is deprecated, use <mergePolicyFactory> instead.
   [junit4]   2> 2844065 INFO  (TEST-TestLazyCores.testCachingLimit-seed#[CFBC74B99B575894]) [    x:collection4] o.a.s.c.SolrConfig Using Lucene MatchVersion: 6.1.0
   [junit4]   2> 2844067 INFO  (TEST-TestLazyCores.testCachingLimit-seed#[CFBC74B99B575894]) [    x:collection4] o.a.s.c.SolrConfig Loaded SolrConfig: solrconfig.xml
   [junit4]   2> 2844070 INFO  (TEST-TestLazyCores.testCachingLimit-seed#[CFBC74B99B575894]) [    x:collection4] o.a.s.s.IndexSchema [collection6] Schema name=tiny
   [junit4]   2> 2844072 INFO  (TEST-TestLazyCores.testCachingLimit-seed#[CFBC74B99B575894]) [    x:collection4] o.a.s.s.IndexSchema unique key field: id
   [junit4]   2> 2844073 INFO  (TEST-TestLazyCores.testCachingLimit-seed#[CFBC74B99B575894]) [    x:collection4] o.a.s.c.ConfigSetProperties Did not find ConfigSet properties, assuming default properties: Can't find resource 'configsetprops.json' in classpath or '/export/home/jenkins/workspace/Lucene-Solr-6.x-Solaris/solr/build/solr-core/test/J1/temp/solr.core.TestLazyCores_CFBC74B99B575894-001/tempDir-001/collection6'
   [junit4]   2> 2844073 INFO  (TEST-TestLazyCores.testCachingLimit-seed#[CFBC74B99B575894]) [    x:collection4] o.a.s.c.CoreContainer Creating SolrCore 'collection6' using configuration from instancedir /export/home/jenkins/workspace/Lucene-Solr-6.x-Solaris/solr/build/solr-core/test/J1/temp/solr.core.TestLazyCores_CFBC74B99B575894-001/tempDir-001/collection6
   [junit4]   2> 2844073 INFO  (TEST-TestLazyCores.testCachingLimit-seed#[CFBC74B99B575894]) [    x:collection6] o.a.s.c.SolrCore org.apache.solr.core.MockDirectoryFactory
   [junit4]   2> 2844073 INFO  (TEST-TestLazyCores.testCachingLimit-seed#[CFBC74B99B575894]) [    x:collection6] o.a.s.c.SolrCore [[collection6] ] Opening new SolrCore at [/export/home/jenkins/workspace/Lucene-Solr-6.x-Solaris/solr/build/solr-core/test/J1/temp/solr.core.TestLazyCores_CFBC74B99B575894-001/tempDir-001/collection6], dataDir=[/export/home/jenkins/workspace/Lucene-Solr-6.x-Solaris/solr/build/solr-core/test/J1/temp/solr.core.TestLazyCores_CFBC74B99B575894-001/tempDir-001/collection6/data/]
   [junit4]   2> 2844074 INFO  (TEST-TestLazyCores.testCachingLimit-seed#[CFBC74B99B575894]) [    x:collection6] o.a.s.c.SolrCore JMX monitoring not detected for core: collection6
   [junit4]   2> 2844074 INFO  (TEST-TestLazyCores.testCachingLimit-seed#[CFBC74B99B575894]) [    x:collection6] o.a.s.c.CachingDirectoryFactory return new directory for /export/home/jenkins/workspace/Lucene-Solr-6.x-Solaris/solr/build/solr-core/test/J1/temp/solr.core.TestLazyCores_CFBC74B99B575894-001/tempDir-001/collection6/data
   [junit4]   2> 2844074 INFO  (OldIndexDirectoryCleanupThreadForCore-collection3) [    x:collection3] o.a.s.c.SolrCore Looking for old index directories to cleanup for core collection3 in /export/home/jenkins/workspace/Lucene-Solr-6.x-Solaris/solr/build/solr-core/test/J1/temp/solr.core.TestLazyCores_CFBC74B99B575894-001/tempDir-001/collection3/data/
   [junit4]   2> 2844103 WARN  (OldIndexDirectoryCleanupThreadForCore-collection3) [    x:collection3] o.a.s.c.DirectoryFactory /export/home/jenkins/workspace/Lucene-Solr-6.x-Solaris/solr/build/solr-core/test/J1/temp/solr.core.TestLazyCores_CFBC74B99B575894-001/tempDir-001/collection3/data/ does not point to a valid data directory; skipping clean-up of old index directories.
   [junit4]   2> 2844103 INFO  (TEST-TestLazyCores.testCachingLimit-seed#[CFBC74B99B575894]) [    x:collection6] o.a.s.c.SolrCore New index directory detected: old=null new=/export/home/jenkins/workspace/Lucene-Solr-6.x-Solaris/solr/build/solr-core/test/J1/temp/solr.core.TestLazyCores_CFBC74B99B575894-001/tempDir-001/collection6/data/index/
   [junit4]   2> 2844103 WARN  (TEST-TestLazyCores.testCachingLimit-seed#[CFBC74B99B575894]) [    x:collection6] o.a.s.c.SolrCore [collection6] Solr index directory '/export/home/jenkins/workspace/Lucene-Solr-6.x-Solaris/solr/build/solr-core/test/J1/temp/solr.core.TestLazyCores_CFBC74B99B575894-001/tempDir-001/collection6/data/index' doesn't exist. Creating new index...
   [junit4]   2> 2844104 INFO  (TEST-TestLazyCores.testCachingLimit-seed#[CFBC74B99B575894]) [    x:collection6] o.a.s.c.CachingDirectoryFactory return new directory for /export/home/jenkins/workspace/Lucene-Solr-6.x-Solaris/solr/build/solr-core/test/J1/temp/solr.core.TestLazyCores_CFBC74B99B575894-001/tempDir-001/collection6/data/index
   [junit4]   2> 2844104 INFO  (TEST-TestLazyCores.testCachingLimit-seed#[CFBC74B99B575894]) [    x:collection6] o.a.s.u.RandomMergePolicy RandomMergePolicy wrapping class org.apache.lucene.index.LogByteSizeMergePolicy: [LogByteSizeMergePolicy: minMergeSize=1677721, mergeFactor=50, maxMergeSize=2147483648, maxMergeSizeForForcedMerge=9223372036854775807, calibrateSizeByDeletes=false, maxMergeDocs=2147483647, maxCFSSegmentSizeMB=8.796093022207999E12, noCFSRatio=0.6788898889461248]
   [junit4]   2> 2844104 INFO  (TEST-TestLazyCores.testCachingLimit-seed#[CFBC74B99B575894]) [    x:collection6] o.a.s.c.SolrDeletionPolicy SolrDeletionPolicy.onCommit: commits: num=1
   [junit4]   2> 	commit{dir=MockDirectoryWrapper(RAMDirectory@15561963 lockFactory=org.apache.lucene.store.SingleInstanceLockFactory@922ac7d),segFN=segments_1,generation=1}
   [junit4]   2> 2844104 INFO  (TEST-TestLazyCores.testCachingLimit-seed#[CFBC74B99B575894]) [    x:collection6] o.a.s.c.SolrDeletionPolicy newest commit generation = 1
   [junit4]   2> 2844105 INFO  (OldIndexDirectoryCleanupThreadForCore-collection6) [    x:collection6] o.a.s.c.SolrCore Looking for old index directories to cleanup for core collection6 in /export/home/jenkins/workspace/Lucene-Solr-6.x-Solaris/solr/build/solr-core/test/J1/temp/solr.core.TestLazyCores_CFBC74B99B575894-001/tempDir-001/collection6/data/
   [junit4]   2> 2844105 WARN  (OldIndexDirectoryCleanupThreadForCore-collection6) [    x:collection6] o.a.s.c.DirectoryFactory /export/home/jenkins/workspace/Lucene-Solr-6.x-Solaris/solr/build/solr-core/test/J1/temp/solr.core.TestLazyCores_CFBC74B99B575894-001/tempDir-001/collection6/data/ does not point to a valid data directory; skipping clean-up of old index directories.
   [junit4]   2> 2844106 INFO  (TEST-TestLazyCores.testCachingLimit-seed#[CFBC74B99B575894]) [    x:collection6] o.a.s.c.SolrCore no updateRequestProcessorChain defined as default, creating implicit default
   [junit4]   2> 2844108 INFO  (TEST-TestLazyCores.testCachingLimit-seed#[CFBC74B99B575894]) [    x:collection6] o.a.s.h.l.XMLLoader xsltCacheLifetimeSeconds=60
   [junit4]   2> 2844108 INFO  (TEST-TestLazyCores.testCachingLimit-seed#[CFBC74B99B575894]) [    x:collection6] o.a.s.h.l.XMLLoader xsltCacheLifetimeSeconds=60
   [junit4]   2> 2844109 INFO  (TEST-TestLazyCores.testCachingLimit-seed#[CFBC74B99B575894]) [    x:collection6] o.a.s.h.l.XMLLoader xsltCacheLifetimeSeconds=60
   [junit4]   2> 2844110 INFO  (TEST-TestLazyCores.testCachingLimit-seed#[CFBC74B99B575894]) [    x:collection6] o.a.s.h.l.XMLLoader xsltCacheLifetimeSeconds=60
   [junit4]   2> 2844111 INFO  (TEST-TestLazyCores.testCachingLimit-seed#[CFBC74B99B575894]) [    x:collection6] o.a.s.c.RequestHandlers Registered paths: /admin/mbeans,/update/csv,/sql,/update/json/docs,/admin/luke,/graph,/export,/select,/admin/segments,/get,/admin/system,/replication,/admin/properties,/config,/stream,/schema,/admin/plugins,/admin/logging,/update/json,/admin/ping,/admin/threads,/update,/admin/file
   [junit4]   2> 2844111 INFO  (TEST-TestLazyCores.testCachingLimit-seed#[CFBC74B99B575894]) [    x:collection6] o.a.s.c.SolrCore Using default statsCache cache: org.apache.solr.search.stats.LocalStatsCache
   [junit4]   2> 2844111 INFO  (TEST-TestLazyCores.testCachingLimit-seed#[CFBC74B99B575894]) [    x:collection6] o.a.s.u.CommitTracker Hard AutoCommit: disabled
   [junit4]   2> 2844111 INFO  (TEST-TestLazyCores.testCachingLimit-seed#[CFBC74B99B575894]) [    x:collection6] o.a.s.u.CommitTracker Soft AutoCommit: disabled
   [junit4]   2> 2844112 INFO  (TEST-TestLazyCores.testCachingLimit-seed#[CFBC74B99B575894]) [    x:collection6] o.a.s.u.RandomMergePolicy RandomMergePolicy wrapping class org.apache.lucene.index.TieredMergePolicy: [TieredMergePolicy: maxMergeAtOnce=18, maxMergeAtOnceExplicit=33, maxMergedSegmentMB=69.94140625, floorSegmentMB=0.36328125, forceMergeDeletesPctAllowed=24.09519583438494, segmentsPerTier=37.0, maxCFSSegmentSizeMB=8.796093022207999E12, noCFSRatio=0.7057959388848213
   [junit4]   2> 2844112 INFO  (TEST-TestLazyCores.testCachingLimit-seed#[CFBC74B99B575894]) [    x:collection6] o.a.s.c.SolrDeletionPolicy SolrDeletionPolicy.onInit: commits: num=1
   [junit4]   2> 	commit{dir=MockDirectoryWrapper(RAMDirectory@15561963 lockFactory=org.apache.lucene.store.SingleInstanceLockFactory@922ac7d),segFN=segments_1,generation=1}
   [junit4]   2> 2844112 INFO  (TEST-TestLazyCores.testCachingLimit-seed#[CFBC74B99B575894]) [    x:collection6] o.a.s.c.SolrDeletionPolicy newest commit generation = 1
   [junit4]   2> 2844112 INFO  (TEST-TestLazyCores.testCachingLimit-seed#[CFBC74B99B575894]) [    x:collection6] o.a.s.s.SolrIndexSearcher Opening [Searcher@76cc18ea[collection6] main]
   [junit4]   2> 2844112 INFO  (TEST-TestLazyCores.testCachingLimit-seed#[CFBC74B99B575894]) [    x:collection6] o.a.s.r.ManagedResourceStorage File-based storage initialized to use dir: /export/home/jenkins/workspace/Lucene-Solr-6.x-Solaris/solr/build/solr-core/test/J1/temp/solr.core.TestLazyCores_CFBC74B99B575894-001/tempDir-001/collection6/conf
   [junit4]   2> 2844112 INFO  (TEST-TestLazyCores.testCachingLimit-seed#[CFBC74B99B575894]) [    x:collection6] o.a.s.r.RestManager Initializing RestManager with initArgs: {storageDir=/export/home/jenkins/workspace/Lucene-Solr-6.x-Solaris/solr/build/solr-core/test/J1/temp/solr.core.TestLazyCores_CFBC74B99B575894-001/tempDir-001/collection6/conf}
   [junit4]   2> 2844112 INFO  (TEST-TestLazyCores.testCachingLimit-seed#[CFBC74B99B575894]) [    x:collection6] o.a.s.r.ManagedResourceStorage Reading _rest_managed.json using file:dir=/export/home/jenkins/workspace/Lucene-Solr-6.x-Solaris/solr/build/solr-core/test/J1/temp/solr.core.TestLazyCores_CFBC74B99B575894-001/tempDir-001/collection6/conf
   [junit4]   2> 2844112 INFO  (TEST-TestLazyCores.testCachingLimit-seed#[CFBC74B99B575894]) [    x:collection6] o.a.s.r.RestManager Initializing 0 registered ManagedResources
   [junit4]   2> 2844112 INFO  (TEST-TestLazyCores.testCachingLimit-seed#[CFBC74B99B575894]) [    x:collection6] o.a.s.h.ReplicationHandler Commits will be reserved for  10000
   [junit4]   2> 2844113 INFO  (searcherExecutor-6063-thread-1-processing-x:collection6) [    x:collection6] o.a.s.c.SolrCore [collection6] Registered new searcher Searcher@76cc18ea[collection6] main{ExitableDirectoryReader(UninvertingDirectoryReader())}
   [junit4]   2> 2844113 INFO  (TEST-TestLazyCores.testCachingLimit-seed#[CFBC74B99B575894]) [    x:collection6] o.a.s.c.SolrCores Opening transient core collection6
   [junit4]   2> 2844113 INFO  (TEST-TestLazyCores.testCachingLimit-seed#[CFBC74B99B575894]) [    x:collection6] o.a.s.c.CoreContainer registering core: collection6
   [junit4]   2> 2844113 INFO  (TEST-TestLazyCores.testCachingLimit-seed#[CFBC74B99B575894]) [    x:collection6] o.a.s.c.SolrResourceLoader new SolrResourceLoader for directory: '/export/home/jenkins/workspace/Lucene-Solr-6.x-Solaris/solr/build/solr-core/test/J1/temp/solr.core.TestLazyCores_CFBC74B99B575894-001/tempDir-001/collection7'
   [junit4]   2> 2844113 INFO  (TEST-TestLazyCores.testCachingLimit-seed#[CFBC74B99B575894]) [    x:collection6] o.a.s.c.SolrResourceLoader JNDI not configured for solr (NoInitialContextEx)
   [junit4]   2> 2844113 INFO  (TEST-TestLazyCores.testCachingLimit-seed#[CFBC74B99B575894]) [    x:collection6] o.a.s.c.SolrResourceLoader solr home defaulted to 'solr/' (could not find system property or JNDI)
   [junit4]   2> 2844118 INFO  (TEST-TestLazyCores.testCachingLimit-seed#[CFBC74B99B575894]) [    x:collection6] o.a.s.c.SolrConfig current version of requestparams : -1
   [junit4]   2> 2844119 WARN  (TEST-TestLazyCores.testCachingLimit-seed#[CFBC74B99B575894]) [    x:collection6] o.a.s.c.Config Beginning with Solr 5.5, <mergePolicy> is deprecated, use <mergePolicyFactory> instead.
   [junit4]   2> 2844120 INFO  (TEST-TestLazyCores.testCachingLimit-seed#[CFBC74B99B575894]) [    x:collection6] o.a.s.c.SolrConfig Using Lucene MatchVersion: 6.1.0
   [junit4]   2> 2844123 INFO  (TEST-TestLazyCores.testCachingLimit-seed#[CFBC74B99B575894]) [    x:collection6] o.a.s.c.SolrConfig Loaded SolrConfig: solrconfig.xml
   [junit4]   2> 2844125 INFO  (TEST-TestLazyCores.testCachingLimit-seed#[CFBC74B99B575894]) [    x:collection6] o.a.s.s.IndexSchema [collection7] Schema name=tiny
   [junit4]   2> 2844127 INFO  (TEST-TestLazyCores.testCachingLimit-seed#[CFBC74B99B575894]) [    x:collection6] o.a.s.s.IndexSchema unique key field: id
   [junit4]   2> 2844128 INFO  (TEST-TestLazyCores.testCachingLimit-seed#[CFBC74B99B575894]) [    x:collection6] o.a.s.c.ConfigSetProperties Did not find ConfigSet properties, assuming default properties: Can't find resource 'configsetprops.json' in classpath or '/export/home/jenkins/workspace/Lucene-Solr-6.x-Solaris/solr/build/solr-core/test/J1/temp/solr.core.TestLazyCores_CFBC74B99B575894-001/tempDir-001/collection7'
   [junit4]   2> 2844128 INFO  (TEST-TestLazyCores.testCachingLimit-seed#[CFBC74B99B575894]) [    x:collection6] o.a.s.c.CoreContainer Creating SolrCore 'collection7' using configuration from instancedir /export/home/jenkins/workspace/Lucene-Solr-6.x-Solaris/solr/build/solr-core/test/J1/temp/solr.core.TestLazyCores_CFBC74B99B575894-001/tempDir-001/collection7
   [junit4]   2> 2844129 INFO  (TEST-TestLazyCores.testCachingLimit-seed#[CFBC74B99B575894]) [    x:collection7] o.a.s.c.SolrCore org.apache.solr.core.MockDirectoryFactory
   [junit4]   2> 2844129 INFO  (TEST-TestLazyCores.testCachingLimit-seed#[CFBC74B99B575894]) [    x:collection7] o.a.s.c.SolrCore [[collection7] ] Opening new SolrCore at [/export/home/jenkins/workspace/Lucene-Solr-6.x-Solaris/solr/build/solr-core/test/J1/temp/solr.core.TestLazyCores_CFBC74B99B575894-001/tempDir-001/collection7], dataDir=[/export/home/jenkins/workspace/Lucene-Solr-6.x-Solaris/solr/build/solr-core/test/J1/temp/solr.core.TestLazyCores_CFBC74B99B575894-001/tempDir-001/collection7/data/]
   [junit4]   2> 2844129 INFO  (TEST-TestLazyCores.testCachingLimit-seed#[CFBC74B99B575894]) [    x:collection7] o.a.s.c.SolrCore JMX monitoring not detected for core: collection7
   [junit4]   2> 2844129 INFO  (TEST-TestLazyCores.testCachingLimit-seed#[CFBC74B99B575894]) [    x:collection7] o.a.s.c.CachingDirectoryFactory return new directory for /export/home/jenkins/workspace/Lucene-Solr-6.x-Solaris/solr/build/solr-core/test/J1/temp/solr.core.TestLazyCores_CFBC74B99B575894-001/tempDir-001/collection7/data
   [junit4]   2> 2844129 INFO  (TEST-TestLazyCores.testCachingLimit-seed#[CFBC74B99B575894]) [    x:collection7] o.a.s.c.SolrCore New index directory detected: old=null new=/export/home/jenkins/workspace/Lucene-Solr-6.x-Solaris/solr/build/solr-core/test/J1/temp/solr.core.TestLazyCores_CFBC74B99B575894-001/tempDir-001/collection7/data/index/
   [junit4]   2> 2844129 WARN  (TEST-TestLazyCores.testCachingLimit-seed#[CFBC74B99B575894]) [    x:collection7] o.a.s.c.SolrCore [collection7] Solr index directory '/export/home/jenkins/workspace/Lucene-Solr-6.x-Solaris/solr/build/solr-core/test/J1/temp/solr.core.TestLazyCores_CFBC74B99B575894-001/tempDir-001/collection7/data/index' doesn't exist. Creating new index...
   [junit4]   2> 2844130 INFO  (TEST-TestLazyCores.testCachingLimit-seed#[CFBC74B99B575894]) [    x:collection7] o.a.s.c.CachingDirectoryFactory return new directory for /export/home/jenkins/workspace/Lucene-Solr-6.x-Solaris/solr/build/solr-core/test/J1/temp/solr.core.TestLazyCores_CFBC74B99B575894-001/tempDir-001/collection7/data/index
   [junit4]   2> 2844130 INFO  (TEST-TestLazyCores.testCachingLimit-seed#[CFBC74B99B575894]) [    x:collection7] o.a.s.u.RandomMergePolicy RandomMergePolicy wrapping class org.apache.lucene.index.TieredMergePolicy: [TieredMergePolicy: maxMergeAtOnce=28, maxMergeAtOnceExplicit=37, maxMergedSegmentMB=85.638671875, floorSegmentMB=1.6865234375, forceMergeDeletesPctAllowed=26.810893139273187, segmentsPerTier=16.0, maxCFSSegmentSizeMB=8.796093022207999E12, noCFSRatio=0.3734168566462911
   [junit4]   2> 2844130 INFO  (TEST-TestLazyCores.testCachingLimit-seed#[CFBC74B99B575894]) [    x:collection7] o.a.s.c.SolrDeletionPolicy SolrDeletionPolicy.onCommit: commits: num=1
   [junit4]   2> 	commit{dir=MockDirectoryWrapper(RAMDirectory@7b561355 lockFactory=org.apache.lucene.store.SingleInstanceLockFactory@3769f3d9),segFN=segments_1,generation=1}
   [junit4]   2> 2844130 INFO  (TEST-TestLazyCores.testCachingLimit-seed#[CFBC74B99B575894]) [    x:collection7] o.a.s.c.SolrDeletionPolicy newest commit generation = 1
   [junit4]   2> 2844131 INFO  (OldIndexDirectoryCleanupThreadForCore-collection7) [    x:collection7] o.a.s.c.SolrCore Looking for old index directories to cleanup for core collection7 in /export/home/jenkins/workspace/Lucene-Solr-6.x-Solaris/solr/build/solr-core/test/J1/temp/solr.core.TestLazyCores_CFBC74B99B575894-001/tempDir-001/collection7/data/
   [junit4]   2> 2844131 WARN  (OldIndexDirectoryCleanupThreadForCore-collection7) [    x:collection7] o.a.s.c.DirectoryFactory /export/home/jenkins/workspace/Lucene-Solr-6.x-Solaris/solr/build/solr-core/test/J1/temp/solr.core.TestLazyCores_CFBC74B99B575894-001/tempDir-001/collection7/data/ does not point to a valid data directory; skipping clean-up of old index directories.
   [junit4]   2> 2844133 INFO  (TEST-TestLazyCores.testCachingLimit-seed#[CFBC74B99B575894]) [    x:collection7] o.a.s.c.SolrCore no updateRequestProcessorChain defined as default, creating implicit default
   [junit4]   2> 2844134 INFO  (TEST-TestLazyCores.testCachingLimit-seed#[CFBC74B99B575894]) [    x:collection7] o.a.s.h.l.XMLLoader xsltCacheLifetimeSeconds=60
   [junit4]   2> 2844135 INFO  (TEST-TestLazyCores.testCachingLimit-seed#[CFBC74B99B575894]) [    x:collection7] o.a.s.h.l.XMLLoader xsltCacheLifetimeSeconds=60
   [junit4]   2> 2844136 INFO  (TEST-TestLazyCores.testCachingLimit-seed#[CFBC74B99B575894]) [    x:collection7] o.a.s.h.l.XMLLoader xsltCacheLifetimeSeconds=60
   [junit4]   2> 2844137 INFO  (TEST-TestLazyCores.testCachingLimit-seed#[CFBC74B99B575894]) [    x:collection7] o.a.s.h.l.XMLLoader xsltCacheLifetimeSeconds=60
   [junit4]   2> 2844138 INFO  (TEST-TestLazyCores.testCachingLimit-seed#[CFBC74B99B575894]) [    x:collection7] o.a.s.c.RequestHandlers Registered paths: /admin/mbeans,/update/csv,/sql,/update/json/docs,/admin/luke,/graph,/export,/select,/admin/segments,/get,/admin/system,/replication,/admin/properties,/config,/stream,/schema,/admin/plugins,/admin/logging,/update/json,/admin/ping,/admin/threads,/update,/admin/file
   [junit4]   2> 2844138 INFO  (TEST-TestLazyCores.testCachingLimit-seed#[CFBC74B99B575894]) [    x:collection7] o.a.s.c.SolrCore Using default statsCache cache: org.apache.solr.search.stats.LocalStatsCache
   [junit4]   2> 2844138 INFO  (TEST-TestLazyCores.testCachingLimit-seed#[CFBC74B99B575894]) [    x:collection7] o.a.s.u.CommitTracker Hard AutoCommit: disabled
   [junit4]   2> 2844138 INFO  (TEST-TestLazyCores.testCachingLimit-seed#[CFBC74B99B575894]) [    x:collection7] o.a.s.u.CommitTracker Soft AutoCommit: disabled
   [junit4]   2> 2844146 INFO  (TEST-TestLazyCores.testCachingLimit-seed#[CFBC74B99B575894]) [    x:collection7] o.a.s.u.RandomMergePolicy RandomMergePolicy wrapping class org.apache.lucene.index.LogDocMergePolicy: [LogDocMergePolicy: minMergeSize=1000, mergeFactor=19, maxMergeSize=9223372036854775807, maxMergeSizeForForcedMerge=9223372036854775807, calibrateSizeByDeletes=false, maxMergeDocs=2147483647, maxCFSSegmentSizeMB=8.796093022207999E12, noCFSRatio=1.0]
   [junit4]   2> 2844146 INFO  (TEST-TestLazyCores.testCachingLimit-seed#[CFBC74B99B575894]) [    x:collection7] o.a.s.c.SolrDeletionPolicy SolrDeletionPolicy.onInit: commits: num=1
   [junit4]   2> 	commit{dir=MockDirectoryWrapper(RAMDirectory@7b561355 lockFactory=org.apache.lucene.store.SingleInstanceLockFactory@3769f3d9),segFN=segments_1,generation=1}
   [junit4]   2> 2844146 INFO  (TEST-TestLazyCores.testCachingLimit-seed#[CFBC74B99B575894]) [    x:collection7] o.a.s.c.SolrDeletionPolicy newest commit generation = 1
   [junit4]   2> 2844146 INFO  (TEST-TestLazyCores.testCachingLimit-seed#[CFBC74B99B575894]) [    x:collection7] o.a.s.s.SolrIndexSearcher Opening [Searcher@475fade1[collection7] main]
   [junit4]   2> 2844149 INFO  (TEST-TestLazyCores.testCachingLimit-seed#[CFBC74B99B575894]) [    x:collection7] o.a.s.r.ManagedResourceStorage File-based storage initialized to use dir: /export/home/jenkins/workspace/Lucene-Solr-6.x-Solaris/solr/build/solr-core/test/J1/temp/solr.core.TestLazyCores_CFBC74B99B575894-001/tempDir-001/collection7/conf
   [junit4]   2> 2844149 INFO  (TEST-TestLazyCores.testCachingLimit-seed#[CFBC74B99B575894]) [    x:collection7] o.a.s.r.RestManager Initializing RestManager with initArgs: {storageDir=/export/home/jenkins/workspace/Lucene-Solr-6.x-Solaris/solr/build/solr-core/test/J1/temp/solr.core.TestLazyCores_CFBC74B99B575894-001/tempDir-001/collection7/conf}
   [junit4]   2> 2844149 INFO  (TEST-TestLazyCores.testCachingLimit-seed#[CFBC74B99B575894]) [    x:collection7] o.a.s.r.ManagedResourceStorage Reading _rest_managed.json using file:dir=/export/home/jenkins/workspace/Lucene-Solr-6.x-Solaris/solr/build/solr-core/test/J1/temp/solr.core.TestLazyCores_CFBC74B99B575894-001/tempDir-001/collection7/conf
   [junit4]   2> 2844149 INFO  (TEST-TestLazyCores.testCachingLimit-seed#[CFBC74B99B575894]) [    x:collection7] o.a.s.r.RestManager Initializing 0 registered ManagedResources
   [junit4]   2> 2844149 INFO  (TEST-TestLazyCores.testCachingLimit-seed#[CFBC74B99B575894]) [    x:collection7] o.a.s.h.ReplicationHandler Commits will be reserved for  10000
   [junit4]   2> 2844150 INFO  (TEST-TestLazyCores.testCachingLimit-seed#[CFBC74B99B575894]) [    x:collection7] o.a.s.c.SolrCores Opening transient core collection7
   [junit4]   2> 2844150 INFO  (TEST-TestLazyCores.testCachingLimit-seed#[CFBC74B99B575894]) [    x:collection7] o.a.s.c.CoreContainer registering core: collection7
   [junit4]   2> 2844150 INFO  (TEST-TestLazyCores.testCachingLimit-seed#[CFBC74B99B575894]) [    x:collection7] o.a.s.c.SolrResourceLoader new SolrResourceLoader for directory: '/export/home/jenkins/workspace/Lucene-Solr-6.x-Solaris/solr/build/solr-core/test/J1/temp/solr.core.TestLazyCores_CFBC74B99B575894-001/tempDir-001/collection8'
   [junit4]   2> 2844150 INFO  (TEST-TestLazyCores.testCachingLimit-seed#[CFBC74B99B575894]) [    x:collection7] o.a.s.c.SolrResourceLoader JNDI not configured for solr (NoInitialContextEx)
   [junit4]   2> 2844150 INFO  (TEST-TestLazyCores.testCachingLimit-seed#[CFBC74B99B575894]) [    x:collection7] o.a.s.c.SolrResourceLoader solr home defaulted to 'solr/' (could not find system property or JNDI)
   [junit4]   2> 2844150 INFO  (searcherExecutor-6067-thread-1-processing-x:collection7) [    x:collection7] o.a.s.c.SolrCore [collection7] Registered new searcher Searcher@475fade1[collection7] main{ExitableDirectoryReader(UninvertingDirectoryReader())}
   [junit4]   2> 2844155 INFO  (TEST-TestLazyCores.testCachingLimit-seed#[CFBC74B99B575894]) [    x:collection7] o.a.s.c.SolrConfig current version of requestparams : -1
   [junit4]   2> 2844156 WARN  (TEST-TestLazyCores.testCachingLimit-seed#[CFBC74B99B575894]) [    x:collection7] o.a.s.c.Config Beginning with Solr 5.5, <mergePolicy> is deprecated, use <mergePolicyFactory> instead.
   [junit4]   2> 2844156 INFO  (TEST-TestLazyCores.testCachingLimit-seed#[CFBC74B99B575894]) [    x:collection7] o.a.s.c.SolrConfig Using Lucene MatchVersion: 6.1.0
   [junit4]   2> 2844159 INFO  (TEST-TestLazyCores.testCachingLimit-seed#[CFBC74B99B575894]) [    x:collection7] o.a.s.c.SolrConfig Loaded SolrConfig: solrconfig.xml
   [junit4]   2> 2844162 INFO  (TEST-TestLazyCores.testCachingLimit-seed#[CFBC74B99B575894]) [    x:collection7] o.a.s.s.IndexSchema [collection8] Schema name=tiny
   [junit4]   2> 2844164 INFO  (TEST-TestLazyCores.testCachingLimit-seed#[CFBC74B99B575894]) [    x:collection7] o.a.s.s.IndexSchema unique key field: id
   [junit4]   2> 2844165 INFO  (TEST-TestLazyCores.testCachingLimit-seed#[CFBC74B99B575894]) [    x:collection7] o.a.s.c.ConfigSetProperties Did not find ConfigSet properties, assuming default properties: Can't find resource 'configsetprops.json' in classpath or '/export/home/jenkins/workspace/Lucene-Solr-6.x-Solaris/solr/build/solr-core/test/J1/temp/solr.core.TestLazyCores_CFBC74B99B575894-001/tempDir-001/collection8'
   [junit4]   2> 2844165 INFO  (TEST-TestLazyCores.testCachingLimit-seed#[CFBC74B99B575894]) [    x:collection7] o.a.s.c.CoreContainer Creating SolrCore 'collection8' using configuration from instancedir /export/home/jenkins/workspace/Lucene-Solr-6.x-Solaris/solr/build/solr-core/test/J1/temp/solr.core.TestLazyCores_CFBC74B99B575894-001/tempDir-001/collection8
   [junit4]   2> 2844165 INFO  (TEST-TestLazyCores.testCachingLimit-seed#[CFBC74B99B575894]) [    x:collection8] o.a.s.c.SolrCore org.apache.solr.core.MockDirectoryFactory
   [junit4]   2> 2844165 INFO  (TEST-TestLazyCores.testCachingLimit-seed#[CFBC74B99B575894]) [    x:collection8] o.a.s.c.SolrCore [[collection8] ] Opening new SolrCore at [/export/home/jenkins/workspace/Lucene-Solr-6.x-Solaris/solr/build/solr-core/test/J1/temp/solr.core.TestLazyCores_CFBC74B99B575894-001/tempDir-001/collection8], dataDir=[/export/home/jenkins/workspace/Lucene-Solr-6.x-Solaris/solr/build/solr-core/test/J1/temp/solr.core.TestLazyCores_CFBC74B99B575894-001/tempDir-001/collection8/data/]
   [junit4]   2> 2844165 INFO  (TEST-TestLazyCores.testCachingLimit-seed#[CFBC74B99B575894]) [    x:collection8] o.a.s.c.SolrCore JMX monitoring not detected for core: collection8
   [junit4]   2> 2844165 INFO  (TEST-TestLazyCores.testCachingLimit-seed#[CFBC74B99B575894]) [    x:collection8] o.a.s.c.CachingDirectoryFactory return new directory for /export/home/jenkins/workspace/Lucene-Solr-6.x-Solaris/solr/build/solr-core/test/J1/temp/solr.core.TestLazyCores_CFBC74B99B575894-001/tempDir-001/collection8/data
   [junit4]   2> 2844166 INFO  (TEST-TestLazyCores.testCachingLimit-seed#[CFBC74B99B575894]) [    x:collection8] o.a.s.c.SolrCore New index directory detected: old=null new=/export/home/jenkins/workspace/Lucene-Solr-6.x-Solaris/solr/build/solr-core/test/J1/temp/solr.core.TestLazyCores_CFBC74B99B575894-001/tempDir-001/collection8/data/index/
   [junit4]   2> 2844166 WARN  (TEST-TestLazyCores.testCachingLimit-seed#[CFBC74B99B575894]) [    x:collection8] o.a.s.c.SolrCore [collection8] Solr index directory '/export/home/jenkins/workspace/Lucene-Solr-6.x-Solaris/solr/build/solr-core/test/J1/temp/solr.core.TestLazyCores_CFBC74B99B575894-001/tempDir-001/collection8/data/index' doesn't exist. Creating new index...
   [junit4]   2> 2844166 INFO  (TEST-TestLazyCores.testCachingLimit-seed#[CFBC74B99B575894]) [    x:collection8] o.a.s.c.CachingDirectoryFactory return new directory for /export/home/jenkins/workspace/Lucene-Solr-6.x-Solaris/solr/build/solr-core/test/J1/temp/solr.core.TestLazyCores_CFBC74B99B575894-001/tempDir-001/collection8/data/index
   [junit4]   2> 2844166 INFO  (TEST-TestLazyCores.testCachingLimit-seed#[CFBC74B99B575894]) [    x:collection8] o.a.s.u.RandomMergePolicy RandomMergePolicy wrapping class org.apache.lucene.index.TieredMergePolicy: [TieredMergePolicy: maxMergeAtOnce=22, maxMergeAtOnceExplicit=19, maxMergedSegmentMB=5.0478515625, floorSegmentMB=1.5927734375, forceMergeDeletesPctAllowed=16.79401191007075, segmentsPerTier=14.0, maxCFSSegmentSizeMB=8.796093022207999E12, noCFSRatio=1.0
   [junit4]   2> 2844166 INFO  (TEST-TestLazyCores.testCachingLimit-seed#[CFBC74B99B575894]) [    x:collection8] o.a.s.c.SolrDeletionPolicy SolrDeletionPolicy.onCommit: commits: num=1
   [junit4]   2> 	commit{dir=MockDirectoryWrapper(RAMDirectory@295e3b91 lockFactory=org.apache.lucene.store.SingleInstanceLockFactory@e63801d),segFN=segments_1,generation=1}
   [junit4]   2> 2844167 INFO  (TEST-TestLazyCores.testCachingLimit-seed#[CFBC74B99B575894]) [    x:collection8] o.a.s.c.SolrDeletionPolicy newest commit generation = 1
   [junit4]   2> 2844167 INFO  (OldIndexDirectoryCleanupThreadForCore-collection8) [    x:collection8] o.a.s.c.SolrCore Looking for old index directories to cleanup for core collection8 in /export/home/jenkins/workspace/Lucene-Solr-6.x-Solaris/solr/build/solr-core/test/J1/temp/solr.core.TestLazyCores_CFBC74B99B575894-001/tempDir-001/collection8/data/
   [junit4]   2> 2844167 WARN  (OldIndexDirectoryCleanupThreadForCore-collection8) [    x:collection8] o.a.s.c.DirectoryFactory /export/home/jenkins/workspace/Lucene-Solr-6.x-Solaris/solr/build/solr-core/test/J1/temp/solr.core.TestLazyCores_CFBC74B99B575894-001/tempDir-001/collection8/data/ does not point to a valid data directory; skipping clean-up of old index directories.
   [junit4]   2> 2844168 INFO  (TEST-TestLazyCores.testCachingLimit-seed#[CFBC74B99B575894]) [    x:collection8] o.a.s.c.SolrCore no updateRequestProcessorChain defined as default, creating implicit default
   [junit4]   2> 2844170 INFO  (TEST-TestLazyCores.testCachingLimit-seed#[CFBC74B99B575894]) [    x:collection8] o.a.s.h.l.XMLLoader xsltCacheLifetimeSeconds=60
   [junit4]   2> 2844171 INFO  (TEST-TestLazyCores.testCachingLimit-seed#[CFBC74B99B575894]) [    

[...truncated too long message...]

         at java.lang.Thread.sleep(Native Method)
   [junit4]   2>         at org.apache.solr.SolrTestCaseJ4.endTrackingSearchers(SolrTestCaseJ4.java:474)
   [junit4]   2>         at org.apache.solr.SolrTestCaseJ4.afterClass(SolrTestCaseJ4.java:254)
   [junit4]   2>         at sun.reflect.GeneratedMethodAccessor40.invoke(Unknown Source)
   [junit4]   2>         at sun.reflect.DelegatingMethodAccessorImpl.invoke(DelegatingMethodAccessorImpl.java:43)
   [junit4]   2>         at java.lang.reflect.Method.invoke(Method.java:498)
   [junit4]   2>         at com.carrotsearch.randomizedtesting.RandomizedRunner.invoke(RandomizedRunner.java:1764)
   [junit4]   2>         at com.carrotsearch.randomizedtesting.RandomizedRunner$7.evaluate(RandomizedRunner.java:834)
   [junit4]   2>         at com.carrotsearch.randomizedtesting.rules.StatementAdapter.evaluate(StatementAdapter.java:36)
   [junit4]   2>         at com.carrotsearch.randomizedtesting.rules.SystemPropertiesRestoreRule$1.evaluate(SystemPropertiesRestoreRule.java:57)
   [junit4]   2>         at org.apache.lucene.util.AbstractBeforeAfterRule$1.evaluate(AbstractBeforeAfterRule.java:45)
   [junit4]   2>         at com.carrotsearch.randomizedtesting.rules.StatementAdapter.evaluate(StatementAdapter.java:36)
   [junit4]   2>         at org.apache.lucene.util.TestRuleStoreClassName$1.evaluate(TestRuleStoreClassName.java:41)
   [junit4]   2>         at com.carrotsearch.randomizedtesting.rules.NoShadowingOrOverridesOnMethodsRule$1.evaluate(NoShadowingOrOverridesOnMethodsRule.java:40)
   [junit4]   2>         at com.carrotsearch.randomizedtesting.rules.NoShadowingOrOverridesOnMethodsRule$1.evaluate(NoShadowingOrOverridesOnMethodsRule.java:40)
   [junit4]   2>         at com.carrotsearch.randomizedtesting.rules.StatementAdapter.evaluate(StatementAdapter.java:36)
   [junit4]   2>         at com.carrotsearch.randomizedtesting.rules.StatementAdapter.evaluate(StatementAdapter.java:36)
   [junit4]   2>         at com.carrotsearch.randomizedtesting.rules.StatementAdapter.evaluate(StatementAdapter.java:36)
   [junit4]   2>         at org.apache.lucene.util.TestRuleAssertionsRequired$1.evaluate(TestRuleAssertionsRequired.java:53)
   [junit4]   2>         at org.apache.lucene.util.TestRuleMarkFailure$1.evaluate(TestRuleMarkFailure.java:47)
   [junit4]   2>         at org.apache.lucene.util.TestRuleIgnoreAfterMaxFailures$1.evaluate(TestRuleIgnoreAfterMaxFailures.java:64)
   [junit4]   2>         at org.apache.lucene.util.TestRuleIgnoreTestSuites$1.evaluate(TestRuleIgnoreTestSuites.java:54)
   [junit4]   2>         at com.carrotsearch.randomizedtesting.rules.StatementAdapter.evaluate(StatementAdapter.java:36)
   [junit4]   2>         at com.carrotsearch.randomizedtesting.ThreadLeakControl$StatementRunner.run(ThreadLeakControl.java:367)
   [junit4]   2>         at java.lang.Thread.run(Thread.java:745)
   [junit4]   2>    2) Thread[id=14368, name=searcherExecutor-6055-thread-1, state=WAITING, group=TGRP-TestLazyCores]
   [junit4]   2>         at sun.misc.Unsafe.park(Native Method)
   [junit4]   2>         at java.util.concurrent.locks.LockSupport.park(LockSupport.java:175)
   [junit4]   2>         at java.util.concurrent.locks.AbstractQueuedSynchronizer$ConditionObject.await(AbstractQueuedSynchronizer.java:2039)
   [junit4]   2>         at java.util.concurrent.LinkedBlockingQueue.take(LinkedBlockingQueue.java:442)
   [junit4]   2>         at java.util.concurrent.ThreadPoolExecutor.getTask(ThreadPoolExecutor.java:1067)
   [junit4]   2>         at java.util.concurrent.ThreadPoolExecutor.runWorker(ThreadPoolExecutor.java:1127)
   [junit4]   2>         at java.util.concurrent.ThreadPoolExecutor$Worker.run(ThreadPoolExecutor.java:617)
   [junit4]   2>         at java.lang.Thread.run(Thread.java:745)
   [junit4]   2> NOTE: test params are: codec=Asserting(Lucene60): {}, docValues:{}, maxPointsInLeafNode=1267, maxMBSortInHeap=7.277617417863768, sim=RandomSimilarity(queryNorm=true,coord=crazy): {}, locale=ko, timezone=Australia/North
   [junit4]   2> NOTE: SunOS 5.11 amd64/Oracle Corporation 1.8.0_92 (64-bit)/cpus=3,threads=3,free=107612248,total=352845824
   [junit4]   2> NOTE: All tests run in this JVM: [TestUtils, TestFieldCollectionResource, TestSolrIndexConfig, TestRuleBasedAuthorizationPlugin, TestStressUserVersions, TestDFISimilarityFactory, ClassificationUpdateProcessorFactoryTest, CollectionReloadTest, TestJoin, DistributedFacetPivotLargeTest, DistributedTermsComponentTest, TestCollationFieldDocValues, ResourceLoaderTest, DistributedFacetPivotSmallAdvancedTest, BigEndianAscendingWordDeserializerTest, TestObjectReleaseTracker, WrapperMergePolicyFactoryTest, TestSolrConfigHandlerCloud, SuggesterTest, TestAnalyzeInfixSuggestions, TestExclusionRuleCollectionAccess, VMParamsZkACLAndCredentialsProvidersTest, TestCharFilters, AddSchemaFieldsUpdateProcessorFactoryTest, NotRequiredUniqueKeyTest, FacetPivotSmallTest, TestCloudDeleteByQuery, CoreMergeIndexesAdminHandlerTest, UpdateRequestProcessorFactoryTest, HLLUtilTest, OpenCloseCoreStressTest, AnalyticsMergeStrategyTest, TestLeaderInitiatedRecoveryThread, TestBinaryField, TlogReplayBufferedWhileIndexingTest, RestartWhileUpdatingTest, ExitableDirectoryReaderTest, TestJsonRequest, TestPHPSerializedResponseWriter, TestSimpleTrackingShardHandler, SolrIndexSplitterTest, TestDistribIDF, WordBreakSolrSpellCheckerTest, BasicDistributedZk2Test, TestSchemaNameResource, TestCustomSort, NoCacheHeaderTest, HdfsWriteToMultipleCollectionsTest, CoreAdminHandlerTest, IndexSchemaRuntimeFieldTest, FileUtilsTest, TestAtomicUpdateErrorCases, HdfsDirectoryTest, DateFieldTest, DebugComponentTest, ForceLeaderTest, SecurityConfHandlerTest, HighlighterConfigTest, TestSerializedLuceneMatchVersion, TestTrie, CdcrReplicationHandlerTest, SignatureUpdateProcessorFactoryTest, OpenExchangeRatesOrgProviderTest, RuleEngineTest, TestBulkSchemaConcurrent, RequestHandlersTest, ConvertedLegacyTest, CollectionTooManyReplicasTest, TestIndexingPerformance, TestCollationField, TestSearcherReuse, OverseerTaskQueueTest, TestReplicaProperties, AsyncCallRequestStatusResponseTest, TestSolrQueryParser, CreateCollectionCleanupTest, TestDocBasedVersionConstraints, ChaosMonkeySafeLeaderTest, StatsComponentTest, TestDistribDocBasedVersion, SpellCheckComponentTest, HdfsChaosMonkeySafeLeaderTest, TestSubQueryTransformerDistrib, TestIntervalFaceting, ConfigSetsAPITest, TestInitParams, BlockJoinFacetDistribTest, SuggesterTSTTest, UUIDUpdateProcessorFallbackTest, TestDistributedGrouping, TestPerFieldSimilarity, DateRangeFieldTest, TestFieldTypeCollectionResource, SynonymTokenizerTest, DeleteStatusTest, TestMinMaxOnMultiValuedField, TestSortingResponseWriter, TestScoreJoinQPNoScore, TestCSVResponseWriter, TestDistributedStatsComponentCardinality, AliasIntegrationTest, SolrPluginUtilsTest, ConnectionReuseTest, TestRandomRequestDistribution, TestSolrCoreProperties, ShardRoutingCustomTest, OutputWriterTest, SearchHandlerTest, TestConfigSetsAPI, TestConfigSets, SimpleMLTQParserTest, LeaderElectionIntegrationTest, TestBulkSchemaAPI, TestStressRecovery, TestAddFieldRealTimeGet, DistribDocExpirationUpdateProcessorTest, CdcrVersionReplicationTest, AutoCommitTest, FieldAnalysisRequestHandlerTest, TestSolrFieldCacheMBean, TestRequestStatusCollectionAPI, TestPerFieldSimilarityClassic, TestCopyFieldCollectionResource, BlobRepositoryCloudTest, TestCrossCoreJoin, TestReloadAndDeleteDocs, UniqFieldsUpdateProcessorFactoryTest, DistributedQueueTest, TestDistributedMissingSort, TestQueryUtils, TestAuthorizationFramework, DeleteInactiveReplicaTest, DistributedMLTComponentTest, HdfsRecoveryZkTest, TestHdfsUpdateLog, TestConfigSetImmutable, TestRealTimeGet, PluginInfoTest, LeaderInitiatedRecoveryOnShardRestartTest, DeleteReplicaTest, AddBlockUpdateTest, DistributedQueryComponentOptimizationTest, OverriddenZkACLAndCredentialsProvidersTest, DirectUpdateHandlerOptimizeTest, ZkSolrClientTest, TermVectorComponentDistributedTest, TestStressReorder, TestReload, TestStressVersions, TestCoreContainer, TestSolr4Spatial, QueryElevationComponentTest, BadIndexSchemaTest, TestFiltering, TestLazyCores]
   [junit4]   2> NOTE: reproduce with: ant test  -Dtestcase=TestLazyCores -Dtests.seed=CFBC74B99B575894 -Dtests.slow=true -Dtests.locale=ko -Dtests.timezone=Australia/North -Dtests.asserts=true -Dtests.file.encoding=ISO-8859-1
   [junit4] ERROR   0.00s J1 | TestLazyCores (suite) <<<
   [junit4]    > Throwable #1: java.lang.Exception: Suite timeout exceeded (>= 7200000 msec).
   [junit4]    > 	at __randomizedtesting.SeedInfo.seed([CFBC74B99B575894]:0)
   [junit4] Completed [598/598 (1!)] on J1 in 7225.26s, 2 tests, 2 errors <<< FAILURES!

[...truncated 11 lines...]
BUILD FAILED
/export/home/jenkins/workspace/Lucene-Solr-6.x-Solaris/build.xml:740: The following error occurred while executing this line:
/export/home/jenkins/workspace/Lucene-Solr-6.x-Solaris/build.xml:684: The following error occurred while executing this line:
/export/home/jenkins/workspace/Lucene-Solr-6.x-Solaris/build.xml:59: The following error occurred while executing this line:
/export/home/jenkins/workspace/Lucene-Solr-6.x-Solaris/solr/build.xml:233: The following error occurred while executing this line:
/export/home/jenkins/workspace/Lucene-Solr-6.x-Solaris/solr/common-build.xml:529: The following error occurred while executing this line:
/export/home/jenkins/workspace/Lucene-Solr-6.x-Solaris/lucene/common-build.xml:1457: The following error occurred while executing this line:
/export/home/jenkins/workspace/Lucene-Solr-6.x-Solaris/lucene/common-build.xml:1014: There were test failures: 598 suites (10 ignored), 2414 tests, 1 suite-level error, 1 error, 87 ignored (72 assumptions) [seed: CFBC74B99B575894]

Total time: 187 minutes 50 seconds
Build step 'Invoke Ant' marked build as failure
Archiving artifacts
[WARNINGS] Skipping publisher since build result is FAILURE
Recording test results
Email was triggered for: Failure - Any
Sending email for trigger: Failure - Any



Mime
View raw message