lucene-dev mailing list archives

Site index · List index
Message view « Date » · « Thread »
Top « Date » · « Thread »
From Policeman Jenkins Server <jenk...@thetaphi.de>
Subject [JENKINS] Lucene-Solr-master-Solaris (64bit/jdk1.8.0) - Build # 553 - Still Failing!
Date Sun, 01 May 2016 06:46:38 GMT
Build: http://jenkins.thetaphi.de/job/Lucene-Solr-master-Solaris/553/
Java: 64bit/jdk1.8.0 -XX:+UseCompressedOops -XX:+UseConcMarkSweepGC

1 tests failed.
FAILED:  org.apache.solr.cloud.DistribDocExpirationUpdateProcessorTest.test

Error Message:
There are still nodes recoverying - waited for 45 seconds

Stack Trace:
java.lang.AssertionError: There are still nodes recoverying - waited for 45 seconds
	at __randomizedtesting.SeedInfo.seed([80AF3CD2FDE8256F:8FB030853144897]:0)
	at org.junit.Assert.fail(Assert.java:93)
	at org.apache.solr.cloud.AbstractDistribZkTestBase.waitForRecoveriesToFinish(AbstractDistribZkTestBase.java:173)
	at org.apache.solr.cloud.AbstractFullDistribZkTestBase.waitForRecoveriesToFinish(AbstractFullDistribZkTestBase.java:858)
	at org.apache.solr.cloud.DistribDocExpirationUpdateProcessorTest.test(DistribDocExpirationUpdateProcessorTest.java:74)
	at sun.reflect.NativeMethodAccessorImpl.invoke0(Native Method)
	at sun.reflect.NativeMethodAccessorImpl.invoke(NativeMethodAccessorImpl.java:62)
	at sun.reflect.DelegatingMethodAccessorImpl.invoke(DelegatingMethodAccessorImpl.java:43)
	at java.lang.reflect.Method.invoke(Method.java:498)
	at com.carrotsearch.randomizedtesting.RandomizedRunner.invoke(RandomizedRunner.java:1764)
	at com.carrotsearch.randomizedtesting.RandomizedRunner$8.evaluate(RandomizedRunner.java:871)
	at com.carrotsearch.randomizedtesting.RandomizedRunner$9.evaluate(RandomizedRunner.java:907)
	at com.carrotsearch.randomizedtesting.RandomizedRunner$10.evaluate(RandomizedRunner.java:921)
	at org.apache.solr.BaseDistributedSearchTestCase$ShardsRepeatRule$ShardsFixedStatement.callStatement(BaseDistributedSearchTestCase.java:985)
	at org.apache.solr.BaseDistributedSearchTestCase$ShardsRepeatRule$ShardsStatement.evaluate(BaseDistributedSearchTestCase.java:960)
	at com.carrotsearch.randomizedtesting.rules.SystemPropertiesRestoreRule$1.evaluate(SystemPropertiesRestoreRule.java:57)
	at org.apache.lucene.util.TestRuleSetupTeardownChained$1.evaluate(TestRuleSetupTeardownChained.java:49)
	at org.apache.lucene.util.AbstractBeforeAfterRule$1.evaluate(AbstractBeforeAfterRule.java:45)
	at org.apache.lucene.util.TestRuleThreadAndTestName$1.evaluate(TestRuleThreadAndTestName.java:48)
	at org.apache.lucene.util.TestRuleIgnoreAfterMaxFailures$1.evaluate(TestRuleIgnoreAfterMaxFailures.java:64)
	at org.apache.lucene.util.TestRuleMarkFailure$1.evaluate(TestRuleMarkFailure.java:47)
	at com.carrotsearch.randomizedtesting.rules.StatementAdapter.evaluate(StatementAdapter.java:36)
	at com.carrotsearch.randomizedtesting.ThreadLeakControl$StatementRunner.run(ThreadLeakControl.java:367)
	at com.carrotsearch.randomizedtesting.ThreadLeakControl.forkTimeoutingTask(ThreadLeakControl.java:809)
	at com.carrotsearch.randomizedtesting.ThreadLeakControl$3.evaluate(ThreadLeakControl.java:460)
	at com.carrotsearch.randomizedtesting.RandomizedRunner.runSingleTest(RandomizedRunner.java:880)
	at com.carrotsearch.randomizedtesting.RandomizedRunner$5.evaluate(RandomizedRunner.java:781)
	at com.carrotsearch.randomizedtesting.RandomizedRunner$6.evaluate(RandomizedRunner.java:816)
	at com.carrotsearch.randomizedtesting.RandomizedRunner$7.evaluate(RandomizedRunner.java:827)
	at com.carrotsearch.randomizedtesting.rules.StatementAdapter.evaluate(StatementAdapter.java:36)
	at com.carrotsearch.randomizedtesting.rules.SystemPropertiesRestoreRule$1.evaluate(SystemPropertiesRestoreRule.java:57)
	at org.apache.lucene.util.AbstractBeforeAfterRule$1.evaluate(AbstractBeforeAfterRule.java:45)
	at com.carrotsearch.randomizedtesting.rules.StatementAdapter.evaluate(StatementAdapter.java:36)
	at org.apache.lucene.util.TestRuleStoreClassName$1.evaluate(TestRuleStoreClassName.java:41)
	at com.carrotsearch.randomizedtesting.rules.NoShadowingOrOverridesOnMethodsRule$1.evaluate(NoShadowingOrOverridesOnMethodsRule.java:40)
	at com.carrotsearch.randomizedtesting.rules.NoShadowingOrOverridesOnMethodsRule$1.evaluate(NoShadowingOrOverridesOnMethodsRule.java:40)
	at com.carrotsearch.randomizedtesting.rules.StatementAdapter.evaluate(StatementAdapter.java:36)
	at com.carrotsearch.randomizedtesting.rules.StatementAdapter.evaluate(StatementAdapter.java:36)
	at com.carrotsearch.randomizedtesting.rules.StatementAdapter.evaluate(StatementAdapter.java:36)
	at org.apache.lucene.util.TestRuleAssertionsRequired$1.evaluate(TestRuleAssertionsRequired.java:53)
	at org.apache.lucene.util.TestRuleMarkFailure$1.evaluate(TestRuleMarkFailure.java:47)
	at org.apache.lucene.util.TestRuleIgnoreAfterMaxFailures$1.evaluate(TestRuleIgnoreAfterMaxFailures.java:64)
	at org.apache.lucene.util.TestRuleIgnoreTestSuites$1.evaluate(TestRuleIgnoreTestSuites.java:54)
	at com.carrotsearch.randomizedtesting.rules.StatementAdapter.evaluate(StatementAdapter.java:36)
	at com.carrotsearch.randomizedtesting.ThreadLeakControl$StatementRunner.run(ThreadLeakControl.java:367)
	at java.lang.Thread.run(Thread.java:745)




Build Log:
[...truncated 11907 lines...]
   [junit4] Suite: org.apache.solr.cloud.DistribDocExpirationUpdateProcessorTest
   [junit4]   2> Creating dataDir: /export/home/jenkins/workspace/Lucene-Solr-master-Solaris/solr/build/solr-core/test/J0/temp/solr.cloud.DistribDocExpirationUpdateProcessorTest_80AF3CD2FDE8256F-001/init-core-data-001
   [junit4]   2> 2295821 INFO  (SUITE-DistribDocExpirationUpdateProcessorTest-seed#[80AF3CD2FDE8256F]-worker) [    ] o.a.s.SolrTestCaseJ4 Randomized ssl (false) and clientAuth (false)
   [junit4]   2> 2295822 INFO  (SUITE-DistribDocExpirationUpdateProcessorTest-seed#[80AF3CD2FDE8256F]-worker) [    ] o.a.s.BaseDistributedSearchTestCase Setting hostContext system property: /
   [junit4]   2> 2295823 INFO  (TEST-DistribDocExpirationUpdateProcessorTest.test-seed#[80AF3CD2FDE8256F]) [    ] o.a.s.c.ZkTestServer STARTING ZK TEST SERVER
   [junit4]   2> 2295824 INFO  (Thread-5148) [    ] o.a.s.c.ZkTestServer client port:0.0.0.0/0.0.0.0:0
   [junit4]   2> 2295824 INFO  (Thread-5148) [    ] o.a.s.c.ZkTestServer Starting server
   [junit4]   2> 2295924 INFO  (TEST-DistribDocExpirationUpdateProcessorTest.test-seed#[80AF3CD2FDE8256F]) [    ] o.a.s.c.ZkTestServer start zk server on port:34719
   [junit4]   2> 2295924 INFO  (TEST-DistribDocExpirationUpdateProcessorTest.test-seed#[80AF3CD2FDE8256F]) [    ] o.a.s.c.c.SolrZkClient Using default ZkCredentialsProvider
   [junit4]   2> 2295925 INFO  (TEST-DistribDocExpirationUpdateProcessorTest.test-seed#[80AF3CD2FDE8256F]) [    ] o.a.s.c.c.ConnectionManager Waiting for client to connect to ZooKeeper
   [junit4]   2> 2295928 INFO  (zkCallback-2041-thread-1) [    ] o.a.s.c.c.ConnectionManager Watcher org.apache.solr.common.cloud.ConnectionManager@7245f60b name:ZooKeeperConnection Watcher:127.0.0.1:34719 got event WatchedEvent state:SyncConnected type:None path:null path:null type:None
   [junit4]   2> 2295929 INFO  (TEST-DistribDocExpirationUpdateProcessorTest.test-seed#[80AF3CD2FDE8256F]) [    ] o.a.s.c.c.ConnectionManager Client is connected to ZooKeeper
   [junit4]   2> 2295930 INFO  (TEST-DistribDocExpirationUpdateProcessorTest.test-seed#[80AF3CD2FDE8256F]) [    ] o.a.s.c.c.SolrZkClient Using default ZkACLProvider
   [junit4]   2> 2295930 INFO  (TEST-DistribDocExpirationUpdateProcessorTest.test-seed#[80AF3CD2FDE8256F]) [    ] o.a.s.c.c.SolrZkClient makePath: /solr
   [junit4]   2> 2295933 INFO  (TEST-DistribDocExpirationUpdateProcessorTest.test-seed#[80AF3CD2FDE8256F]) [    ] o.a.s.c.c.SolrZkClient Using default ZkCredentialsProvider
   [junit4]   2> 2295933 INFO  (TEST-DistribDocExpirationUpdateProcessorTest.test-seed#[80AF3CD2FDE8256F]) [    ] o.a.s.c.c.ConnectionManager Waiting for client to connect to ZooKeeper
   [junit4]   2> 2295936 INFO  (zkCallback-2042-thread-1) [    ] o.a.s.c.c.ConnectionManager Watcher org.apache.solr.common.cloud.ConnectionManager@407d7cbf name:ZooKeeperConnection Watcher:127.0.0.1:34719/solr got event WatchedEvent state:SyncConnected type:None path:null path:null type:None
   [junit4]   2> 2295936 INFO  (TEST-DistribDocExpirationUpdateProcessorTest.test-seed#[80AF3CD2FDE8256F]) [    ] o.a.s.c.c.ConnectionManager Client is connected to ZooKeeper
   [junit4]   2> 2295936 INFO  (TEST-DistribDocExpirationUpdateProcessorTest.test-seed#[80AF3CD2FDE8256F]) [    ] o.a.s.c.c.SolrZkClient Using default ZkACLProvider
   [junit4]   2> 2295936 INFO  (TEST-DistribDocExpirationUpdateProcessorTest.test-seed#[80AF3CD2FDE8256F]) [    ] o.a.s.c.c.SolrZkClient makePath: /collections/collection1
   [junit4]   2> 2295939 INFO  (TEST-DistribDocExpirationUpdateProcessorTest.test-seed#[80AF3CD2FDE8256F]) [    ] o.a.s.c.c.SolrZkClient makePath: /collections/collection1/shards
   [junit4]   2> 2295941 INFO  (TEST-DistribDocExpirationUpdateProcessorTest.test-seed#[80AF3CD2FDE8256F]) [    ] o.a.s.c.c.SolrZkClient makePath: /collections/control_collection
   [junit4]   2> 2295943 INFO  (TEST-DistribDocExpirationUpdateProcessorTest.test-seed#[80AF3CD2FDE8256F]) [    ] o.a.s.c.c.SolrZkClient makePath: /collections/control_collection/shards
   [junit4]   2> 2295946 INFO  (TEST-DistribDocExpirationUpdateProcessorTest.test-seed#[80AF3CD2FDE8256F]) [    ] o.a.s.c.AbstractZkTestCase put /export/home/jenkins/workspace/Lucene-Solr-master-Solaris/solr/core/src/test-files/solr/collection1/conf/solrconfig-doc-expire-update-processor.xml to /configs/conf1/solrconfig.xml
   [junit4]   2> 2295946 INFO  (TEST-DistribDocExpirationUpdateProcessorTest.test-seed#[80AF3CD2FDE8256F]) [    ] o.a.s.c.c.SolrZkClient makePath: /configs/conf1/solrconfig.xml
   [junit4]   2> 2295951 INFO  (TEST-DistribDocExpirationUpdateProcessorTest.test-seed#[80AF3CD2FDE8256F]) [    ] o.a.s.c.AbstractZkTestCase put /export/home/jenkins/workspace/Lucene-Solr-master-Solaris/solr/core/src/test-files/solr/collection1/conf/schema15.xml to /configs/conf1/schema.xml
   [junit4]   2> 2295951 INFO  (TEST-DistribDocExpirationUpdateProcessorTest.test-seed#[80AF3CD2FDE8256F]) [    ] o.a.s.c.c.SolrZkClient makePath: /configs/conf1/schema.xml
   [junit4]   2> 2295954 INFO  (TEST-DistribDocExpirationUpdateProcessorTest.test-seed#[80AF3CD2FDE8256F]) [    ] o.a.s.c.AbstractZkTestCase put /export/home/jenkins/workspace/Lucene-Solr-master-Solaris/solr/core/src/test-files/solr/collection1/conf/solrconfig.snippet.randomindexconfig.xml to /configs/conf1/solrconfig.snippet.randomindexconfig.xml
   [junit4]   2> 2295954 INFO  (TEST-DistribDocExpirationUpdateProcessorTest.test-seed#[80AF3CD2FDE8256F]) [    ] o.a.s.c.c.SolrZkClient makePath: /configs/conf1/solrconfig.snippet.randomindexconfig.xml
   [junit4]   2> 2295957 INFO  (TEST-DistribDocExpirationUpdateProcessorTest.test-seed#[80AF3CD2FDE8256F]) [    ] o.a.s.c.AbstractZkTestCase put /export/home/jenkins/workspace/Lucene-Solr-master-Solaris/solr/core/src/test-files/solr/collection1/conf/stopwords.txt to /configs/conf1/stopwords.txt
   [junit4]   2> 2295957 INFO  (TEST-DistribDocExpirationUpdateProcessorTest.test-seed#[80AF3CD2FDE8256F]) [    ] o.a.s.c.c.SolrZkClient makePath: /configs/conf1/stopwords.txt
   [junit4]   2> 2295960 INFO  (TEST-DistribDocExpirationUpdateProcessorTest.test-seed#[80AF3CD2FDE8256F]) [    ] o.a.s.c.AbstractZkTestCase put /export/home/jenkins/workspace/Lucene-Solr-master-Solaris/solr/core/src/test-files/solr/collection1/conf/protwords.txt to /configs/conf1/protwords.txt
   [junit4]   2> 2295961 INFO  (TEST-DistribDocExpirationUpdateProcessorTest.test-seed#[80AF3CD2FDE8256F]) [    ] o.a.s.c.c.SolrZkClient makePath: /configs/conf1/protwords.txt
   [junit4]   2> 2295963 INFO  (TEST-DistribDocExpirationUpdateProcessorTest.test-seed#[80AF3CD2FDE8256F]) [    ] o.a.s.c.AbstractZkTestCase put /export/home/jenkins/workspace/Lucene-Solr-master-Solaris/solr/core/src/test-files/solr/collection1/conf/currency.xml to /configs/conf1/currency.xml
   [junit4]   2> 2295964 INFO  (TEST-DistribDocExpirationUpdateProcessorTest.test-seed#[80AF3CD2FDE8256F]) [    ] o.a.s.c.c.SolrZkClient makePath: /configs/conf1/currency.xml
   [junit4]   2> 2295966 INFO  (TEST-DistribDocExpirationUpdateProcessorTest.test-seed#[80AF3CD2FDE8256F]) [    ] o.a.s.c.AbstractZkTestCase put /export/home/jenkins/workspace/Lucene-Solr-master-Solaris/solr/core/src/test-files/solr/collection1/conf/enumsConfig.xml to /configs/conf1/enumsConfig.xml
   [junit4]   2> 2295967 INFO  (TEST-DistribDocExpirationUpdateProcessorTest.test-seed#[80AF3CD2FDE8256F]) [    ] o.a.s.c.c.SolrZkClient makePath: /configs/conf1/enumsConfig.xml
   [junit4]   2> 2295969 INFO  (TEST-DistribDocExpirationUpdateProcessorTest.test-seed#[80AF3CD2FDE8256F]) [    ] o.a.s.c.AbstractZkTestCase put /export/home/jenkins/workspace/Lucene-Solr-master-Solaris/solr/core/src/test-files/solr/collection1/conf/open-exchange-rates.json to /configs/conf1/open-exchange-rates.json
   [junit4]   2> 2295970 INFO  (TEST-DistribDocExpirationUpdateProcessorTest.test-seed#[80AF3CD2FDE8256F]) [    ] o.a.s.c.c.SolrZkClient makePath: /configs/conf1/open-exchange-rates.json
   [junit4]   2> 2295972 INFO  (TEST-DistribDocExpirationUpdateProcessorTest.test-seed#[80AF3CD2FDE8256F]) [    ] o.a.s.c.AbstractZkTestCase put /export/home/jenkins/workspace/Lucene-Solr-master-Solaris/solr/core/src/test-files/solr/collection1/conf/mapping-ISOLatin1Accent.txt to /configs/conf1/mapping-ISOLatin1Accent.txt
   [junit4]   2> 2295972 INFO  (TEST-DistribDocExpirationUpdateProcessorTest.test-seed#[80AF3CD2FDE8256F]) [    ] o.a.s.c.c.SolrZkClient makePath: /configs/conf1/mapping-ISOLatin1Accent.txt
   [junit4]   2> 2295975 INFO  (TEST-DistribDocExpirationUpdateProcessorTest.test-seed#[80AF3CD2FDE8256F]) [    ] o.a.s.c.AbstractZkTestCase put /export/home/jenkins/workspace/Lucene-Solr-master-Solaris/solr/core/src/test-files/solr/collection1/conf/old_synonyms.txt to /configs/conf1/old_synonyms.txt
   [junit4]   2> 2295975 INFO  (TEST-DistribDocExpirationUpdateProcessorTest.test-seed#[80AF3CD2FDE8256F]) [    ] o.a.s.c.c.SolrZkClient makePath: /configs/conf1/old_synonyms.txt
   [junit4]   2> 2295977 INFO  (TEST-DistribDocExpirationUpdateProcessorTest.test-seed#[80AF3CD2FDE8256F]) [    ] o.a.s.c.AbstractZkTestCase put /export/home/jenkins/workspace/Lucene-Solr-master-Solaris/solr/core/src/test-files/solr/collection1/conf/synonyms.txt to /configs/conf1/synonyms.txt
   [junit4]   2> 2295977 INFO  (TEST-DistribDocExpirationUpdateProcessorTest.test-seed#[80AF3CD2FDE8256F]) [    ] o.a.s.c.c.SolrZkClient makePath: /configs/conf1/synonyms.txt
   [junit4]   2> 2296801 INFO  (TEST-DistribDocExpirationUpdateProcessorTest.test-seed#[80AF3CD2FDE8256F]) [    ] o.a.s.SolrTestCaseJ4 Writing core.properties file to /export/home/jenkins/workspace/Lucene-Solr-master-Solaris/solr/build/solr-core/test/J0/temp/solr.cloud.DistribDocExpirationUpdateProcessorTest_80AF3CD2FDE8256F-001/control-001/cores/collection1
   [junit4]   2> 2296810 INFO  (TEST-DistribDocExpirationUpdateProcessorTest.test-seed#[80AF3CD2FDE8256F]) [    ] o.e.j.s.Server jetty-9.3.8.v20160314
   [junit4]   2> 2296813 INFO  (TEST-DistribDocExpirationUpdateProcessorTest.test-seed#[80AF3CD2FDE8256F]) [    ] o.e.j.s.h.ContextHandler Started o.e.j.s.ServletContextHandler@1848c292{/,null,AVAILABLE}
   [junit4]   2> 2296814 INFO  (TEST-DistribDocExpirationUpdateProcessorTest.test-seed#[80AF3CD2FDE8256F]) [    ] o.e.j.s.ServerConnector Started ServerConnector@a1473c0{HTTP/1.1,[http/1.1]}{127.0.0.1:48001}
   [junit4]   2> 2296814 INFO  (TEST-DistribDocExpirationUpdateProcessorTest.test-seed#[80AF3CD2FDE8256F]) [    ] o.e.j.s.Server Started @2301607ms
   [junit4]   2> 2296814 INFO  (TEST-DistribDocExpirationUpdateProcessorTest.test-seed#[80AF3CD2FDE8256F]) [    ] o.a.s.c.s.e.JettySolrRunner Jetty properties: {solr.data.dir=/export/home/jenkins/workspace/Lucene-Solr-master-Solaris/solr/build/solr-core/test/J0/temp/solr.cloud.DistribDocExpirationUpdateProcessorTest_80AF3CD2FDE8256F-001/tempDir-001/control/data, hostContext=/, hostPort=48001, coreRootDirectory=/export/home/jenkins/workspace/Lucene-Solr-master-Solaris/solr/build/solr-core/test/J0/../../../../../../../../../../export/home/jenkins/workspace/Lucene-Solr-master-Solaris/solr/build/solr-core/test/J0/temp/solr.cloud.DistribDocExpirationUpdateProcessorTest_80AF3CD2FDE8256F-001/control-001/cores}
   [junit4]   2> 2296815 INFO  (TEST-DistribDocExpirationUpdateProcessorTest.test-seed#[80AF3CD2FDE8256F]) [    ] o.a.s.s.SolrDispatchFilter SolrDispatchFilter.init(): sun.misc.Launcher$AppClassLoader@6d06d69c
   [junit4]   2> 2296815 INFO  (TEST-DistribDocExpirationUpdateProcessorTest.test-seed#[80AF3CD2FDE8256F]) [    ] o.a.s.c.SolrResourceLoader new SolrResourceLoader for directory: '/export/home/jenkins/workspace/Lucene-Solr-master-Solaris/solr/build/solr-core/test/J0/temp/solr.cloud.DistribDocExpirationUpdateProcessorTest_80AF3CD2FDE8256F-001/control-001'
   [junit4]   2> 2296815 INFO  (TEST-DistribDocExpirationUpdateProcessorTest.test-seed#[80AF3CD2FDE8256F]) [    ] o.a.s.c.SolrResourceLoader JNDI not configured for solr (NoInitialContextEx)
   [junit4]   2> 2296815 INFO  (TEST-DistribDocExpirationUpdateProcessorTest.test-seed#[80AF3CD2FDE8256F]) [    ] o.a.s.c.SolrResourceLoader solr home defaulted to 'solr/' (could not find system property or JNDI)
   [junit4]   2> 2296816 INFO  (TEST-DistribDocExpirationUpdateProcessorTest.test-seed#[80AF3CD2FDE8256F]) [    ] o.a.s.c.c.SolrZkClient Using default ZkCredentialsProvider
   [junit4]   2> 2296816 INFO  (TEST-DistribDocExpirationUpdateProcessorTest.test-seed#[80AF3CD2FDE8256F]) [    ] o.a.s.c.c.ConnectionManager Waiting for client to connect to ZooKeeper
   [junit4]   2> 2296818 INFO  (zkCallback-2043-thread-1) [    ] o.a.s.c.c.ConnectionManager Watcher org.apache.solr.common.cloud.ConnectionManager@59660637 name:ZooKeeperConnection Watcher:127.0.0.1:34719/solr got event WatchedEvent state:SyncConnected type:None path:null path:null type:None
   [junit4]   2> 2296819 INFO  (TEST-DistribDocExpirationUpdateProcessorTest.test-seed#[80AF3CD2FDE8256F]) [    ] o.a.s.c.c.ConnectionManager Client is connected to ZooKeeper
   [junit4]   2> 2296820 INFO  (TEST-DistribDocExpirationUpdateProcessorTest.test-seed#[80AF3CD2FDE8256F]) [    ] o.a.s.c.c.SolrZkClient Using default ZkACLProvider
   [junit4]   2> 2296826 INFO  (TEST-DistribDocExpirationUpdateProcessorTest.test-seed#[80AF3CD2FDE8256F]) [    ] o.a.s.s.SolrDispatchFilter Loading solr.xml from SolrHome (not found in ZooKeeper)
   [junit4]   2> 2296826 INFO  (TEST-DistribDocExpirationUpdateProcessorTest.test-seed#[80AF3CD2FDE8256F]) [    ] o.a.s.c.SolrXmlConfig Loading container configuration from /export/home/jenkins/workspace/Lucene-Solr-master-Solaris/solr/build/solr-core/test/J0/temp/solr.cloud.DistribDocExpirationUpdateProcessorTest_80AF3CD2FDE8256F-001/control-001/solr.xml
   [junit4]   2> 2296832 INFO  (TEST-DistribDocExpirationUpdateProcessorTest.test-seed#[80AF3CD2FDE8256F]) [    ] o.a.s.c.CorePropertiesLocator Config-defined core root directory: /export/home/jenkins/workspace/Lucene-Solr-master-Solaris/solr/build/solr-core/test/J0/../../../../../../../../../../export/home/jenkins/workspace/Lucene-Solr-master-Solaris/solr/build/solr-core/test/J0/temp/solr.cloud.DistribDocExpirationUpdateProcessorTest_80AF3CD2FDE8256F-001/control-001/cores
   [junit4]   2> 2296836 INFO  (TEST-DistribDocExpirationUpdateProcessorTest.test-seed#[80AF3CD2FDE8256F]) [    ] o.a.s.c.CoreContainer New CoreContainer 1763101494
   [junit4]   2> 2296836 INFO  (TEST-DistribDocExpirationUpdateProcessorTest.test-seed#[80AF3CD2FDE8256F]) [    ] o.a.s.c.CoreContainer Loading cores into CoreContainer [instanceDir=/export/home/jenkins/workspace/Lucene-Solr-master-Solaris/solr/build/solr-core/test/J0/temp/solr.cloud.DistribDocExpirationUpdateProcessorTest_80AF3CD2FDE8256F-001/control-001]
   [junit4]   2> 2296836 WARN  (TEST-DistribDocExpirationUpdateProcessorTest.test-seed#[80AF3CD2FDE8256F]) [    ] o.a.s.c.CoreContainer Couldn't add files from /export/home/jenkins/workspace/Lucene-Solr-master-Solaris/solr/build/solr-core/test/J0/temp/solr.cloud.DistribDocExpirationUpdateProcessorTest_80AF3CD2FDE8256F-001/control-001/lib to classpath: /export/home/jenkins/workspace/Lucene-Solr-master-Solaris/solr/build/solr-core/test/J0/temp/solr.cloud.DistribDocExpirationUpdateProcessorTest_80AF3CD2FDE8256F-001/control-001/lib
   [junit4]   2> 2296837 INFO  (TEST-DistribDocExpirationUpdateProcessorTest.test-seed#[80AF3CD2FDE8256F]) [    ] o.a.s.h.c.HttpShardHandlerFactory created with socketTimeout : 90000,urlScheme : ,connTimeout : 15000,maxConnectionsPerHost : 20,maxConnections : 10000,corePoolSize : 0,maximumPoolSize : 2147483647,maxThreadIdleTime : 5,sizeOfQueue : -1,fairnessPolicy : false,
   [junit4]   2> 2296838 INFO  (TEST-DistribDocExpirationUpdateProcessorTest.test-seed#[80AF3CD2FDE8256F]) [    ] o.a.s.u.UpdateShardHandler Creating UpdateShardHandler HTTP client with params: 
   [junit4]   2> 2296840 INFO  (TEST-DistribDocExpirationUpdateProcessorTest.test-seed#[80AF3CD2FDE8256F]) [    ] o.a.s.l.LogWatcher SLF4J impl is org.slf4j.impl.Log4jLoggerFactory
   [junit4]   2> 2296840 INFO  (TEST-DistribDocExpirationUpdateProcessorTest.test-seed#[80AF3CD2FDE8256F]) [    ] o.a.s.l.LogWatcher Registering Log Listener [Log4j (org.slf4j.impl.Log4jLoggerFactory)]
   [junit4]   2> 2296840 INFO  (TEST-DistribDocExpirationUpdateProcessorTest.test-seed#[80AF3CD2FDE8256F]) [    ] o.a.s.c.ZkContainer Zookeeper client=127.0.0.1:34719/solr
   [junit4]   2> 2296840 INFO  (TEST-DistribDocExpirationUpdateProcessorTest.test-seed#[80AF3CD2FDE8256F]) [    ] o.a.s.c.ZkController zkHost includes chroot
   [junit4]   2> 2296840 INFO  (TEST-DistribDocExpirationUpdateProcessorTest.test-seed#[80AF3CD2FDE8256F]) [    ] o.a.s.c.c.SolrZkClient Using default ZkCredentialsProvider
   [junit4]   2> 2296841 INFO  (TEST-DistribDocExpirationUpdateProcessorTest.test-seed#[80AF3CD2FDE8256F]) [    ] o.a.s.c.c.ConnectionManager Waiting for client to connect to ZooKeeper
   [junit4]   2> 2296851 INFO  (zkCallback-2046-thread-1) [    ] o.a.s.c.c.ConnectionManager Watcher org.apache.solr.common.cloud.ConnectionManager@642ebadc name:ZooKeeperConnection Watcher:127.0.0.1:34719 got event WatchedEvent state:SyncConnected type:None path:null path:null type:None
   [junit4]   2> 2296851 INFO  (TEST-DistribDocExpirationUpdateProcessorTest.test-seed#[80AF3CD2FDE8256F]) [    ] o.a.s.c.c.ConnectionManager Client is connected to ZooKeeper
   [junit4]   2> 2296851 INFO  (TEST-DistribDocExpirationUpdateProcessorTest.test-seed#[80AF3CD2FDE8256F]) [    ] o.a.s.c.c.SolrZkClient Using default ZkACLProvider
   [junit4]   2> 2296853 INFO  (TEST-DistribDocExpirationUpdateProcessorTest.test-seed#[80AF3CD2FDE8256F]) [n:127.0.0.1:48001_    ] o.a.s.c.ZkController Added new OnReconnect listener org.apache.solr.cloud.ZkController$$Lambda$45/1826964701@37fee801
   [junit4]   2> 2296854 INFO  (TEST-DistribDocExpirationUpdateProcessorTest.test-seed#[80AF3CD2FDE8256F]) [n:127.0.0.1:48001_    ] o.a.s.c.c.ConnectionManager Waiting for client to connect to ZooKeeper
   [junit4]   2> 2296856 INFO  (zkCallback-2047-thread-1-processing-n:127.0.0.1:48001_) [n:127.0.0.1:48001_    ] o.a.s.c.c.ConnectionManager Watcher org.apache.solr.common.cloud.ConnectionManager@73b73abe name:ZooKeeperConnection Watcher:127.0.0.1:34719/solr got event WatchedEvent state:SyncConnected type:None path:null path:null type:None
   [junit4]   2> 2296856 INFO  (TEST-DistribDocExpirationUpdateProcessorTest.test-seed#[80AF3CD2FDE8256F]) [n:127.0.0.1:48001_    ] o.a.s.c.c.ConnectionManager Client is connected to ZooKeeper
   [junit4]   2> 2296858 INFO  (TEST-DistribDocExpirationUpdateProcessorTest.test-seed#[80AF3CD2FDE8256F]) [n:127.0.0.1:48001_    ] o.a.s.c.c.SolrZkClient makePath: /overseer/queue
   [junit4]   2> 2296862 INFO  (TEST-DistribDocExpirationUpdateProcessorTest.test-seed#[80AF3CD2FDE8256F]) [n:127.0.0.1:48001_    ] o.a.s.c.c.SolrZkClient makePath: /overseer/collection-queue-work
   [junit4]   2> 2296866 INFO  (TEST-DistribDocExpirationUpdateProcessorTest.test-seed#[80AF3CD2FDE8256F]) [n:127.0.0.1:48001_    ] o.a.s.c.c.SolrZkClient makePath: /overseer/collection-map-running
   [junit4]   2> 2296869 INFO  (TEST-DistribDocExpirationUpdateProcessorTest.test-seed#[80AF3CD2FDE8256F]) [n:127.0.0.1:48001_    ] o.a.s.c.c.SolrZkClient makePath: /overseer/collection-map-completed
   [junit4]   2> 2296875 INFO  (TEST-DistribDocExpirationUpdateProcessorTest.test-seed#[80AF3CD2FDE8256F]) [n:127.0.0.1:48001_    ] o.a.s.c.c.SolrZkClient makePath: /overseer/collection-map-failure
   [junit4]   2> 2297205 INFO  (TEST-DistribDocExpirationUpdateProcessorTest.test-seed#[80AF3CD2FDE8256F]) [n:127.0.0.1:48001_    ] o.a.s.c.c.SolrZkClient makePath: /live_nodes
   [junit4]   2> 2297207 INFO  (TEST-DistribDocExpirationUpdateProcessorTest.test-seed#[80AF3CD2FDE8256F]) [n:127.0.0.1:48001_    ] o.a.s.c.c.SolrZkClient makePath: /aliases.json
   [junit4]   2> 2297211 INFO  (TEST-DistribDocExpirationUpdateProcessorTest.test-seed#[80AF3CD2FDE8256F]) [n:127.0.0.1:48001_    ] o.a.s.c.c.SolrZkClient makePath: /clusterstate.json
   [junit4]   2> 2297213 INFO  (TEST-DistribDocExpirationUpdateProcessorTest.test-seed#[80AF3CD2FDE8256F]) [n:127.0.0.1:48001_    ] o.a.s.c.c.SolrZkClient makePath: /security.json
   [junit4]   2> 2297214 INFO  (TEST-DistribDocExpirationUpdateProcessorTest.test-seed#[80AF3CD2FDE8256F]) [n:127.0.0.1:48001_    ] o.a.s.c.c.ZkStateReader Updating cluster state from ZooKeeper... 
   [junit4]   2> 2297217 INFO  (TEST-DistribDocExpirationUpdateProcessorTest.test-seed#[80AF3CD2FDE8256F]) [n:127.0.0.1:48001_    ] o.a.s.c.c.ZkStateReader Updated live nodes from ZooKeeper... (0) -> (0)
   [junit4]   2> 2297220 INFO  (TEST-DistribDocExpirationUpdateProcessorTest.test-seed#[80AF3CD2FDE8256F]) [n:127.0.0.1:48001_    ] o.a.s.c.c.SolrZkClient makePath: /overseer_elect
   [junit4]   2> 2297223 INFO  (TEST-DistribDocExpirationUpdateProcessorTest.test-seed#[80AF3CD2FDE8256F]) [n:127.0.0.1:48001_    ] o.a.s.c.c.SolrZkClient makePath: /overseer_elect/election
   [junit4]   2> 2297225 INFO  (TEST-DistribDocExpirationUpdateProcessorTest.test-seed#[80AF3CD2FDE8256F]) [n:127.0.0.1:48001_    ] o.a.s.c.Overseer Overseer (id=null) closing
   [junit4]   2> 2297226 INFO  (TEST-DistribDocExpirationUpdateProcessorTest.test-seed#[80AF3CD2FDE8256F]) [n:127.0.0.1:48001_    ] o.a.s.c.LeaderElector Joined leadership election with path: /overseer_elect/election/95819104925646852-127.0.0.1:48001_-n_0000000000
   [junit4]   2> 2297226 INFO  (TEST-DistribDocExpirationUpdateProcessorTest.test-seed#[80AF3CD2FDE8256F]) [n:127.0.0.1:48001_    ] o.a.s.c.OverseerElectionContext I am going to be the leader 127.0.0.1:48001_
   [junit4]   2> 2297226 INFO  (TEST-DistribDocExpirationUpdateProcessorTest.test-seed#[80AF3CD2FDE8256F]) [n:127.0.0.1:48001_    ] o.a.s.c.c.SolrZkClient makePath: /overseer_elect/leader
   [junit4]   2> 2297228 INFO  (TEST-DistribDocExpirationUpdateProcessorTest.test-seed#[80AF3CD2FDE8256F]) [n:127.0.0.1:48001_    ] o.a.s.c.Overseer Overseer (id=95819104925646852-127.0.0.1:48001_-n_0000000000) starting
   [junit4]   2> 2297232 INFO  (TEST-DistribDocExpirationUpdateProcessorTest.test-seed#[80AF3CD2FDE8256F]) [n:127.0.0.1:48001_    ] o.a.s.c.c.SolrZkClient makePath: /overseer/queue-work
   [junit4]   2> 2297247 INFO  (TEST-DistribDocExpirationUpdateProcessorTest.test-seed#[80AF3CD2FDE8256F]) [n:127.0.0.1:48001_    ] o.a.s.c.OverseerAutoReplicaFailoverThread Starting OverseerAutoReplicaFailoverThread autoReplicaFailoverWorkLoopDelay=10000 autoReplicaFailoverWaitAfterExpiration=30000 autoReplicaFailoverBadNodeExpiration=60000
   [junit4]   2> 2297248 INFO  (OverseerCollectionConfigSetProcessor-95819104925646852-127.0.0.1:48001_-n_0000000000) [n:127.0.0.1:48001_    ] o.a.s.c.OverseerTaskProcessor Process current queue of overseer operations
   [junit4]   2> 2297250 INFO  (TEST-DistribDocExpirationUpdateProcessorTest.test-seed#[80AF3CD2FDE8256F]) [n:127.0.0.1:48001_    ] o.a.s.c.ZkController Register node as live in ZooKeeper:/live_nodes/127.0.0.1:48001_
   [junit4]   2> 2297251 INFO  (OverseerStateUpdate-95819104925646852-127.0.0.1:48001_-n_0000000000) [n:127.0.0.1:48001_    ] o.a.s.c.Overseer Starting to work on the main queue
   [junit4]   2> 2297254 INFO  (TEST-DistribDocExpirationUpdateProcessorTest.test-seed#[80AF3CD2FDE8256F]) [n:127.0.0.1:48001_    ] o.a.s.c.c.SolrZkClient makePath: /live_nodes/127.0.0.1:48001_
   [junit4]   2> 2297257 INFO  (OverseerStateUpdate-95819104925646852-127.0.0.1:48001_-n_0000000000) [n:127.0.0.1:48001_    ] o.a.s.c.c.ZkStateReader Updated live nodes from ZooKeeper... (0) -> (0)
   [junit4]   2> 2297262 INFO  (zkCallback-2047-thread-1-processing-n:127.0.0.1:48001_) [n:127.0.0.1:48001_    ] o.a.s.c.c.ZkStateReader A live node change: [WatchedEvent state:SyncConnected type:NodeChildrenChanged path:/live_nodes], has occurred - updating... (live nodes size: [0])
   [junit4]   2> 2297263 INFO  (zkCallback-2047-thread-1-processing-n:127.0.0.1:48001_) [n:127.0.0.1:48001_    ] o.a.s.c.c.ZkStateReader Updated live nodes from ZooKeeper... (0) -> (1)
   [junit4]   2> 2297312 INFO  (TEST-DistribDocExpirationUpdateProcessorTest.test-seed#[80AF3CD2FDE8256F]) [n:127.0.0.1:48001_    ] o.a.s.c.CoreContainer Security conf doesn't exist. Skipping setup for authorization module.
   [junit4]   2> 2297313 INFO  (TEST-DistribDocExpirationUpdateProcessorTest.test-seed#[80AF3CD2FDE8256F]) [n:127.0.0.1:48001_    ] o.a.s.c.CoreContainer No authentication plugin used.
   [junit4]   2> 2297314 INFO  (TEST-DistribDocExpirationUpdateProcessorTest.test-seed#[80AF3CD2FDE8256F]) [n:127.0.0.1:48001_    ] o.a.s.c.CorePropertiesLocator Looking for core definitions underneath /export/home/jenkins/workspace/Lucene-Solr-master-Solaris/solr/build/solr-core/test/J0/../../../../../../../../../../export/home/jenkins/workspace/Lucene-Solr-master-Solaris/solr/build/solr-core/test/J0/temp/solr.cloud.DistribDocExpirationUpdateProcessorTest_80AF3CD2FDE8256F-001/control-001/cores
   [junit4]   2> 2297316 INFO  (TEST-DistribDocExpirationUpdateProcessorTest.test-seed#[80AF3CD2FDE8256F]) [n:127.0.0.1:48001_    ] o.a.s.c.CoreDescriptor Created CoreDescriptor: {name=collection1, config=solrconfig.xml, transient=false, schema=schema.xml, loadOnStartup=true, configSetProperties=configsetprops.json, collection=control_collection, coreNodeName=, dataDir=data/, shard=}
   [junit4]   2> 2297316 INFO  (TEST-DistribDocExpirationUpdateProcessorTest.test-seed#[80AF3CD2FDE8256F]) [n:127.0.0.1:48001_    ] o.a.s.c.CorePropertiesLocator Found core collection1 in /export/home/jenkins/workspace/Lucene-Solr-master-Solaris/solr/build/solr-core/test/J0/../../../../../../../../../../export/home/jenkins/workspace/Lucene-Solr-master-Solaris/solr/build/solr-core/test/J0/temp/solr.cloud.DistribDocExpirationUpdateProcessorTest_80AF3CD2FDE8256F-001/control-001/cores/collection1
   [junit4]   2> 2297316 INFO  (TEST-DistribDocExpirationUpdateProcessorTest.test-seed#[80AF3CD2FDE8256F]) [n:127.0.0.1:48001_    ] o.a.s.c.CorePropertiesLocator Found 1 core definitions
   [junit4]   2> 2297318 INFO  (TEST-DistribDocExpirationUpdateProcessorTest.test-seed#[80AF3CD2FDE8256F]) [n:127.0.0.1:48001_    ] o.a.s.s.SolrDispatchFilter user.dir=/export/home/jenkins/workspace/Lucene-Solr-master-Solaris/solr/build/solr-core/test/J0
   [junit4]   2> 2297318 INFO  (TEST-DistribDocExpirationUpdateProcessorTest.test-seed#[80AF3CD2FDE8256F]) [n:127.0.0.1:48001_    ] o.a.s.s.SolrDispatchFilter SolrDispatchFilter.init() done
   [junit4]   2> 2297319 INFO  (coreLoadExecutor-7489-thread-1-processing-n:127.0.0.1:48001_) [n:127.0.0.1:48001_ c:control_collection   x:collection1] o.a.s.c.ZkController publishing state=down
   [junit4]   2> 2297319 INFO  (coreLoadExecutor-7489-thread-1-processing-n:127.0.0.1:48001_) [n:127.0.0.1:48001_ c:control_collection   x:collection1] o.a.s.c.ZkController numShards not found on descriptor - reading it from system property
   [junit4]   2> 2297320 INFO  (coreLoadExecutor-7489-thread-1-processing-n:127.0.0.1:48001_) [n:127.0.0.1:48001_ c:control_collection   x:collection1] o.a.s.c.ZkController Collection control_collection not visible yet, but flagging it so a watch is registered when it becomes visible
   [junit4]   2> 2297321 INFO  (coreLoadExecutor-7489-thread-1-processing-n:127.0.0.1:48001_) [n:127.0.0.1:48001_ c:control_collection   x:collection1] o.a.s.c.c.ZkStateReader addZkWatch [control_collection]
   [junit4]   2> 2297321 INFO  (OverseerStateUpdate-95819104925646852-127.0.0.1:48001_-n_0000000000) [n:127.0.0.1:48001_    ] o.a.s.c.Overseer processMessage: queueSize: 1, message = {
   [junit4]   2>   "core":"collection1",
   [junit4]   2>   "roles":null,
   [junit4]   2>   "base_url":"http://127.0.0.1:48001",
   [junit4]   2>   "node_name":"127.0.0.1:48001_",
   [junit4]   2>   "numShards":"1",
   [junit4]   2>   "state":"down",
   [junit4]   2>   "shard":null,
   [junit4]   2>   "collection":"control_collection",
   [junit4]   2>   "operation":"state"} current state version: 0
   [junit4]   2> 2297323 INFO  (OverseerStateUpdate-95819104925646852-127.0.0.1:48001_-n_0000000000) [n:127.0.0.1:48001_    ] o.a.s.c.o.ReplicaMutator Update state numShards=1 message={
   [junit4]   2>   "core":"collection1",
   [junit4]   2>   "roles":null,
   [junit4]   2>   "base_url":"http://127.0.0.1:48001",
   [junit4]   2>   "node_name":"127.0.0.1:48001_",
   [junit4]   2>   "numShards":"1",
   [junit4]   2>   "state":"down",
   [junit4]   2>   "shard":null,
   [junit4]   2>   "collection":"control_collection",
   [junit4]   2>   "operation":"state"}
   [junit4]   2> 2297327 INFO  (OverseerStateUpdate-95819104925646852-127.0.0.1:48001_-n_0000000000) [n:127.0.0.1:48001_    ] o.a.s.c.o.ClusterStateMutator building a new cName: control_collection
   [junit4]   2> 2297328 INFO  (OverseerStateUpdate-95819104925646852-127.0.0.1:48001_-n_0000000000) [n:127.0.0.1:48001_    ] o.a.s.c.o.ReplicaMutator Assigning new node to shard shard=shard1
   [junit4]   2> 2297329 INFO  (zkCallback-2047-thread-1-processing-n:127.0.0.1:48001_) [n:127.0.0.1:48001_    ] o.a.s.c.c.ZkStateReader A cluster state change: [WatchedEvent state:SyncConnected type:NodeDataChanged path:/clusterstate.json], has occurred - updating... (live nodes size: [1])
   [junit4]   2> 2297330 INFO  (coreLoadExecutor-7489-thread-1-processing-n:127.0.0.1:48001_) [n:127.0.0.1:48001_ c:control_collection   x:collection1] o.a.s.c.c.ZkStateReader Deleting data for [control_collection]
   [junit4]   2> 2297332 INFO  (coreLoadExecutor-7489-thread-1-processing-n:127.0.0.1:48001_) [n:127.0.0.1:48001_ c:control_collection   x:collection1] o.a.s.c.ZkController look for our core node name
   [junit4]   2> 2297332 INFO  (coreLoadExecutor-7489-thread-1-processing-n:127.0.0.1:48001_) [n:127.0.0.1:48001_ c:control_collection   x:collection1] o.a.s.c.ZkController waiting to find shard id in clusterstate for collection1
   [junit4]   2> 2297332 INFO  (coreLoadExecutor-7489-thread-1-processing-n:127.0.0.1:48001_) [n:127.0.0.1:48001_ c:control_collection   x:collection1] o.a.s.c.ZkController Check for collection zkNode:control_collection
   [junit4]   2> 2297337 INFO  (coreLoadExecutor-7489-thread-1-processing-n:127.0.0.1:48001_) [n:127.0.0.1:48001_ c:control_collection   x:collection1] o.a.s.c.ZkController Collection zkNode exists
   [junit4]   2> 2297337 INFO  (coreLoadExecutor-7489-thread-1-processing-n:127.0.0.1:48001_) [n:127.0.0.1:48001_ c:control_collection   x:collection1] o.a.s.c.c.ZkStateReader Load collection config from: [/collections/control_collection]
   [junit4]   2> 2297344 INFO  (coreLoadExecutor-7489-thread-1-processing-n:127.0.0.1:48001_) [n:127.0.0.1:48001_ c:control_collection   x:collection1] o.a.s.c.c.ZkStateReader path=[/collections/control_collection] [configName]=[conf1] specified config exists in ZooKeeper
   [junit4]   2> 2297344 INFO  (coreLoadExecutor-7489-thread-1-processing-n:127.0.0.1:48001_) [n:127.0.0.1:48001_ c:control_collection   x:collection1] o.a.s.c.SolrResourceLoader new SolrResourceLoader for directory: '/export/home/jenkins/workspace/Lucene-Solr-master-Solaris/solr/build/solr-core/test/J0/temp/solr.cloud.DistribDocExpirationUpdateProcessorTest_80AF3CD2FDE8256F-001/control-001/cores/collection1'
   [junit4]   2> 2297347 INFO  (coreLoadExecutor-7489-thread-1-processing-n:127.0.0.1:48001_) [n:127.0.0.1:48001_ c:control_collection   x:collection1] o.a.s.c.SolrResourceLoader JNDI not configured for solr (NoInitialContextEx)
   [junit4]   2> 2297347 INFO  (coreLoadExecutor-7489-thread-1-processing-n:127.0.0.1:48001_) [n:127.0.0.1:48001_ c:control_collection   x:collection1] o.a.s.c.SolrResourceLoader solr home defaulted to 'solr/' (could not find system property or JNDI)
   [junit4]   2> 2297354 INFO  (coreLoadExecutor-7489-thread-1-processing-n:127.0.0.1:48001_) [n:127.0.0.1:48001_ c:control_collection   x:collection1] o.a.s.c.Config loaded config solrconfig.xml with version 0 
   [junit4]   2> 2297365 INFO  (coreLoadExecutor-7489-thread-1-processing-n:127.0.0.1:48001_) [n:127.0.0.1:48001_ c:control_collection   x:collection1] o.a.s.c.SolrConfig current version of requestparams : -1
   [junit4]   2> 2297381 INFO  (coreLoadExecutor-7489-thread-1-processing-n:127.0.0.1:48001_) [n:127.0.0.1:48001_ c:control_collection   x:collection1] o.a.s.c.SolrConfig Using Lucene MatchVersion: 7.0.0
   [junit4]   2> 2297399 INFO  (coreLoadExecutor-7489-thread-1-processing-n:127.0.0.1:48001_) [n:127.0.0.1:48001_ c:control_collection   x:collection1] o.a.s.c.SolrConfig Loaded SolrConfig: solrconfig.xml
   [junit4]   2> 2297414 INFO  (coreLoadExecutor-7489-thread-1-processing-n:127.0.0.1:48001_) [n:127.0.0.1:48001_ c:control_collection   x:collection1] o.a.s.s.IndexSchema [collection1] Schema name=test
   [junit4]   2> 2297690 INFO  (coreLoadExecutor-7489-thread-1-processing-n:127.0.0.1:48001_) [n:127.0.0.1:48001_ c:control_collection   x:collection1] o.a.s.s.IndexSchema default search field in schema is text
   [junit4]   2> 2297692 INFO  (coreLoadExecutor-7489-thread-1-processing-n:127.0.0.1:48001_) [n:127.0.0.1:48001_ c:control_collection   x:collection1] o.a.s.s.IndexSchema unique key field: id
   [junit4]   2> 2297692 INFO  (coreLoadExecutor-7489-thread-1-processing-n:127.0.0.1:48001_) [n:127.0.0.1:48001_ c:control_collection   x:collection1] o.a.s.s.FileExchangeRateProvider Reloading exchange rates from file currency.xml
   [junit4]   2> 2297696 INFO  (coreLoadExecutor-7489-thread-1-processing-n:127.0.0.1:48001_) [n:127.0.0.1:48001_ c:control_collection   x:collection1] o.a.s.s.FileExchangeRateProvider Reloading exchange rates from file currency.xml
   [junit4]   2> 2297736 INFO  (coreLoadExecutor-7489-thread-1-processing-n:127.0.0.1:48001_) [n:127.0.0.1:48001_ c:control_collection   x:collection1] o.a.s.c.ConfigSetProperties Did not find ConfigSet properties, assuming default properties: Can't find resource 'configsetprops.json' in classpath or '/configs/conf1', cwd=/export/home/jenkins/workspace/Lucene-Solr-master-Solaris/solr/build/solr-core/test/J0
   [junit4]   2> 2297736 INFO  (coreLoadExecutor-7489-thread-1-processing-n:127.0.0.1:48001_) [n:127.0.0.1:48001_ c:control_collection   x:collection1] o.a.s.c.CoreContainer Creating SolrCore 'collection1' using configuration from collection control_collection
   [junit4]   2> 2297736 INFO  (coreLoadExecutor-7489-thread-1-processing-n:127.0.0.1:48001_) [n:127.0.0.1:48001_ c:control_collection s:shard1 r:core_node1 x:collection1] o.a.s.c.SolrCore org.apache.solr.core.MockDirectoryFactory
   [junit4]   2> 2297737 INFO  (coreLoadExecutor-7489-thread-1-processing-n:127.0.0.1:48001_) [n:127.0.0.1:48001_ c:control_collection s:shard1 r:core_node1 x:collection1] o.a.s.c.SolrCore [[collection1] ] Opening new SolrCore at [/export/home/jenkins/workspace/Lucene-Solr-master-Solaris/solr/build/solr-core/test/J0/temp/solr.cloud.DistribDocExpirationUpdateProcessorTest_80AF3CD2FDE8256F-001/control-001/cores/collection1], dataDir=[/export/home/jenkins/workspace/Lucene-Solr-master-Solaris/solr/build/solr-core/test/J0/../../../../../../../../../../export/home/jenkins/workspace/Lucene-Solr-master-Solaris/solr/build/solr-core/test/J0/temp/solr.cloud.DistribDocExpirationUpdateProcessorTest_80AF3CD2FDE8256F-001/control-001/cores/collection1/data/]
   [junit4]   2> 2297737 INFO  (coreLoadExecutor-7489-thread-1-processing-n:127.0.0.1:48001_) [n:127.0.0.1:48001_ c:control_collection s:shard1 r:core_node1 x:collection1] o.a.s.c.SolrCore JMX monitoring not detected for core: collection1
   [junit4]   2> 2297737 INFO  (coreLoadExecutor-7489-thread-1-processing-n:127.0.0.1:48001_) [n:127.0.0.1:48001_ c:control_collection s:shard1 r:core_node1 x:collection1] o.a.s.c.CachingDirectoryFactory return new directory for /export/home/jenkins/workspace/Lucene-Solr-master-Solaris/solr/build/solr-core/test/J0/../../../../../../../../../../export/home/jenkins/workspace/Lucene-Solr-master-Solaris/solr/build/solr-core/test/J0/temp/solr.cloud.DistribDocExpirationUpdateProcessorTest_80AF3CD2FDE8256F-001/control-001/cores/collection1/data
   [junit4]   2> 2297737 INFO  (coreLoadExecutor-7489-thread-1-processing-n:127.0.0.1:48001_) [n:127.0.0.1:48001_ c:control_collection s:shard1 r:core_node1 x:collection1] o.a.s.c.SolrCore New index directory detected: old=null new=/export/home/jenkins/workspace/Lucene-Solr-master-Solaris/solr/build/solr-core/test/J0/../../../../../../../../../../export/home/jenkins/workspace/Lucene-Solr-master-Solaris/solr/build/solr-core/test/J0/temp/solr.cloud.DistribDocExpirationUpdateProcessorTest_80AF3CD2FDE8256F-001/control-001/cores/collection1/data/index/
   [junit4]   2> 2297737 WARN  (coreLoadExecutor-7489-thread-1-processing-n:127.0.0.1:48001_) [n:127.0.0.1:48001_ c:control_collection s:shard1 r:core_node1 x:collection1] o.a.s.c.SolrCore [collection1] Solr index directory '/export/home/jenkins/workspace/Lucene-Solr-master-Solaris/solr/build/solr-core/test/J0/../../../../../../../../../../export/home/jenkins/workspace/Lucene-Solr-master-Solaris/solr/build/solr-core/test/J0/temp/solr.cloud.DistribDocExpirationUpdateProcessorTest_80AF3CD2FDE8256F-001/control-001/cores/collection1/data/index' doesn't exist. Creating new index...
   [junit4]   2> 2297738 INFO  (coreLoadExecutor-7489-thread-1-processing-n:127.0.0.1:48001_) [n:127.0.0.1:48001_ c:control_collection s:shard1 r:core_node1 x:collection1] o.a.s.c.CachingDirectoryFactory return new directory for /export/home/jenkins/workspace/Lucene-Solr-master-Solaris/solr/build/solr-core/test/J0/../../../../../../../../../../export/home/jenkins/workspace/Lucene-Solr-master-Solaris/solr/build/solr-core/test/J0/temp/solr.cloud.DistribDocExpirationUpdateProcessorTest_80AF3CD2FDE8256F-001/control-001/cores/collection1/data/index
   [junit4]   2> 2297738 INFO  (coreLoadExecutor-7489-thread-1-processing-n:127.0.0.1:48001_) [n:127.0.0.1:48001_ c:control_collection s:shard1 r:core_node1 x:collection1] o.a.s.u.RandomMergePolicy RandomMergePolicy wrapping class org.apache.lucene.index.TieredMergePolicy: [TieredMergePolicy: maxMergeAtOnce=26, maxMergeAtOnceExplicit=34, maxMergedSegmentMB=75.2548828125, floorSegmentMB=2.125, forceMergeDeletesPctAllowed=14.909459380763282, segmentsPerTier=28.0, maxCFSSegmentSizeMB=8.796093022207999E12, noCFSRatio=0.0
   [junit4]   2> 2297738 INFO  (coreLoadExecutor-7489-thread-1-processing-n:127.0.0.1:48001_) [n:127.0.0.1:48001_ c:control_collection s:shard1 r:core_node1 x:collection1] o.a.s.c.SolrDeletionPolicy SolrDeletionPolicy.onCommit: commits: num=1
   [junit4]   2> 	commit{dir=MockDirectoryWrapper(RAMDirectory@53fe02c4 lockFactory=org.apache.lucene.store.SingleInstanceLockFactory@2f48cde6),segFN=segments_1,generation=1}
   [junit4]   2> 2297738 INFO  (coreLoadExecutor-7489-thread-1-processing-n:127.0.0.1:48001_) [n:127.0.0.1:48001_ c:control_collection s:shard1 r:core_node1 x:collection1] o.a.s.c.SolrDeletionPolicy newest commit generation = 1
   [junit4]   2> 2297739 INFO  (OldIndexDirectoryCleanupThreadForCore-collection1) [n:127.0.0.1:48001_ c:control_collection s:shard1 r:core_node1 x:collection1] o.a.s.c.SolrCore Looking for old index directories to cleanup for core collection1 in /export/home/jenkins/workspace/Lucene-Solr-master-Solaris/solr/build/solr-core/test/J0/../../../../../../../../../../export/home/jenkins/workspace/Lucene-Solr-master-Solaris/solr/build/solr-core/test/J0/temp/solr.cloud.DistribDocExpirationUpdateProcessorTest_80AF3CD2FDE8256F-001/control-001/cores/collection1/data/
   [junit4]   2> 2297739 WARN  (OldIndexDirectoryCleanupThreadForCore-collection1) [n:127.0.0.1:48001_ c:control_collection s:shard1 r:core_node1 x:collection1] o.a.s.c.DirectoryFactory /export/home/jenkins/workspace/Lucene-Solr-master-Solaris/solr/build/solr-core/test/J0/../../../../../../../../../../export/home/jenkins/workspace/Lucene-Solr-master-Solaris/solr/build/solr-core/test/J0/temp/solr.cloud.DistribDocExpirationUpdateProcessorTest_80AF3CD2FDE8256F-001/control-001/cores/collection1/data/ does not point to a valid data directory; skipping clean-up of old index directories.
   [junit4]   2> 2297740 INFO  (coreLoadExecutor-7489-thread-1-processing-n:127.0.0.1:48001_) [n:127.0.0.1:48001_ c:control_collection s:shard1 r:core_node1 x:collection1] o.a.s.u.p.UpdateRequestProcessorChain creating updateRequestProcessorChain "convert-ttl-defaults"
   [junit4]   2> 2297863 INFO  (coreLoadExecutor-7489-thread-1-processing-n:127.0.0.1:48001_) [n:127.0.0.1:48001_ c:control_collection s:shard1 r:core_node1 x:collection1] o.a.s.u.p.UpdateRequestProcessorChain creating updateRequestProcessorChain "convert-ttl-field"
   [junit4]   2> 2297864 INFO  (coreLoadExecutor-7489-thread-1-processing-n:127.0.0.1:48001_) [n:127.0.0.1:48001_ c:control_collection s:shard1 r:core_node1 x:collection1] o.a.s.u.p.UpdateRequestProcessorChain creating updateRequestProcessorChain "convert-ttl-param"
   [junit4]   2> 2297864 INFO  (coreLoadExecutor-7489-thread-1-processing-n:127.0.0.1:48001_) [n:127.0.0.1:48001_ c:control_collection s:shard1 r:core_node1 x:collection1] o.a.s.u.p.UpdateRequestProcessorChain creating updateRequestProcessorChain "convert-ttl-field-with-param-default"
   [junit4]   2> 2297864 INFO  (coreLoadExecutor-7489-thread-1-processing-n:127.0.0.1:48001_) [n:127.0.0.1:48001_ c:control_collection s:shard1 r:core_node1 x:collection1] o.a.s.u.p.UpdateRequestProcessorChain creating updateRequestProcessorChain "scheduled-delete" (default)
   [junit4]   2> 2297920 INFO  (coreLoadExecutor-7489-thread-1-processing-n:127.0.0.1:48001_) [n:127.0.0.1:48001_ c:control_collection s:shard1 r:core_node1 x:collection1] o.a.s.u.p.UpdateRequestProcessorChain inserting DistributedUpdateProcessorFactory into updateRequestProcessorChain "scheduled-delete" (default)
   [junit4]   2> 2297922 INFO  (coreLoadExecutor-7489-thread-1-processing-n:127.0.0.1:48001_) [n:127.0.0.1:48001_ c:control_collection s:shard1 r:core_node1 x:collection1] o.a.s.h.l.XMLLoader xsltCacheLifetimeSeconds=60
   [junit4]   2> 2297923 INFO  (coreLoadExecutor-7489-thread-1-processing-n:127.0.0.1:48001_) [n:127.0.0.1:48001_ c:control_collection s:shard1 r:core_node1 x:collection1] o.a.s.h.l.XMLLoader xsltCacheLifetimeSeconds=60
   [junit4]   2> 2297924 INFO  (coreLoadExecutor-7489-thread-1-processing-n:127.0.0.1:48001_) [n:127.0.0.1:48001_ c:control_collection s:shard1 r:core_node1 x:collection1] o.a.s.h.l.XMLLoader xsltCacheLifetimeSeconds=60
   [junit4]   2> 2297925 INFO  (coreLoadExecutor-7489-thread-1-processing-n:127.0.0.1:48001_) [n:127.0.0.1:48001_ c:control_collection s:shard1 r:core_node1 x:collection1] o.a.s.h.l.XMLLoader xsltCacheLifetimeSeconds=60
   [junit4]   2> 2297928 INFO  (coreLoadExecutor-7489-thread-1-processing-n:127.0.0.1:48001_) [n:127.0.0.1:48001_ c:control_collection s:shard1 r:core_node1 x:collection1] o.a.s.c.RequestHandlers Registered paths: /admin/mbeans,,/update/csv,/sql,/update/json/docs,/admin/luke,/export,/select,/admin/segments,/get,/admin/system,/replication,/admin/properties,/config,/stream,/schema,/admin/plugins,/admin/logging,/update/json,/admin/ping,/admin/threads,/update,/admin/file
   [junit4]   2> 2297928 INFO  (coreLoadExecutor-7489-thread-1-processing-n:127.0.0.1:48001_) [n:127.0.0.1:48001_ c:control_collection s:shard1 r:core_node1 x:collection1] o.a.s.c.SolrCore Using default statsCache cache: org.apache.solr.search.stats.LocalStatsCache
   [junit4]   2> 2297929 INFO  (coreLoadExecutor-7489-thread-1-processing-n:127.0.0.1:48001_) [n:127.0.0.1:48001_ c:control_collection s:shard1 r:core_node1 x:collection1] o.a.s.u.UpdateHandler Using UpdateLog implementation: org.apache.solr.update.UpdateLog
   [junit4]   2> 2297929 INFO  (coreLoadExecutor-7489-thread-1-processing-n:127.0.0.1:48001_) [n:127.0.0.1:48001_ c:control_collection s:shard1 r:core_node1 x:collection1] o.a.s.u.UpdateLog Initializing UpdateLog: dataDir= defaultSyncLevel=FLUSH numRecordsToKeep=100 maxNumLogsToKeep=10 numVersionBuckets=65536
   [junit4]   2> 2297964 INFO  (coreLoadExecutor-7489-thread-1-processing-n:127.0.0.1:48001_) [n:127.0.0.1:48001_ c:control_collection s:shard1 r:core_node1 x:collection1] o.a.s.u.CommitTracker Hard AutoCommit: disabled
   [junit4]   2> 2297964 INFO  (coreLoadExecutor-7489-thread-1-processing-n:127.0.0.1:48001_) [n:127.0.0.1:48001_ c:control_collection s:shard1 r:core_node1 x:collection1] o.a.s.u.CommitTracker Soft AutoCommit: disabled
   [junit4]   2> 2297965 INFO  (coreLoadExecutor-7489-thread-1-processing-n:127.0.0.1:48001_) [n:127.0.0.1:48001_ c:control_collection s:shard1 r:core_node1 x:collection1] o.a.s.u.RandomMergePolicy RandomMergePolicy wrapping class org.apache.lucene.index.LogDocMergePolicy: [LogDocMergePolicy: minMergeSize=1000, mergeFactor=14, maxMergeSize=9223372036854775807, maxMergeSizeForForcedMerge=9223372036854775807, calibrateSizeByDeletes=true, maxMergeDocs=2147483647, maxCFSSegmentSizeMB=8.796093022207999E12, noCFSRatio=0.1537470040317248]
   [junit4]   2> 2297965 INFO  (coreLoadExecutor-7489-thread-1-processing-n:127.0.0.1:48001_) [n:127.0.0.1:48001_ c:control_collection s:shard1 r:core_node1 x:collection1] o.a.s.c.SolrDeletionPolicy SolrDeletionPolicy.onInit: commits: num=1
   [junit4]   2> 	commit{dir=MockDirectoryWrapper(RAMDirectory@53fe02c4 lockFactory=org.apache.lucene.store.SingleInstanceLockFactory@2f48cde6),segFN=segments_1,generation=1}
   [junit4]   2> 2297965 INFO  (coreLoadExecutor-7489-thread-1-processing-n:127.0.0.1:48001_) [n:127.0.0.1:48001_ c:control_collection s:shard1 r:core_node1 x:collection1] o.a.s.c.SolrDeletionPolicy newest commit generation = 1
   [junit4]   2> 2297965 INFO  (coreLoadExecutor-7489-thread-1-processing-n:127.0.0.1:48001_) [n:127.0.0.1:48001_ c:control_collection s:shard1 r:core_node1 x:collection1] o.a.s.s.SolrIndexSearcher Opening [Searcher@400cdc95[collection1] main]
   [junit4]   2> 2297965 INFO  (coreLoadExecutor-7489-thread-1-processing-n:127.0.0.1:48001_) [n:127.0.0.1:48001_ c:control_collection s:shard1 r:core_node1 x:collection1] o.a.s.c.c.ZkStateReader Load collection config from: [/collections/control_collection]
   [junit4]   2> 2297966 INFO  (coreLoadExecutor-7489-thread-1-processing-n:127.0.0.1:48001_) [n:127.0.0.1:48001_ c:control_collection s:shard1 r:core_node1 x:collection1] o.a.s.c.c.ZkStateReader path=[/collections/control_collection] [configName]=[conf1] specified config exists in ZooKeeper
   [junit4]   2> 2297966 INFO  (coreLoadExecutor-7489-thread-1-processing-n:127.0.0.1:48001_) [n:127.0.0.1:48001_ c:control_collection s:shard1 r:core_node1 x:collection1] o.a.s.r.ManagedResourceStorage Setting up ZooKeeper-based storage for the RestManager with znodeBase: /configs/conf1
   [junit4]   2> 2297967 INFO  (coreLoadExecutor-7489-thread-1-processing-n:127.0.0.1:48001_) [n:127.0.0.1:48001_ c:control_collection s:shard1 r:core_node1 x:collection1] o.a.s.r.ManagedResourceStorage Configured ZooKeeperStorageIO with znodeBase: /configs/conf1
   [junit4]   2> 2297967 INFO  (coreLoadExecutor-7489-thread-1-processing-n:127.0.0.1:48001_) [n:127.0.0.1:48001_ c:control_collection s:shard1 r:core_node1 x:collection1] o.a.s.r.RestManager Initializing RestManager with initArgs: {}
   [junit4]   2> 2297967 INFO  (coreLoadExecutor-7489-thread-1-processing-n:127.0.0.1:48001_) [n:127.0.0.1:48001_ c:control_collection s:shard1 r:core_node1 x:collection1] o.a.s.r.ManagedResourceStorage Reading _rest_managed.json using ZooKeeperStorageIO:path=/configs/conf1
   [junit4]   2> 2297968 INFO  (coreLoadExecutor-7489-thread-1-processing-n:127.0.0.1:48001_) [n:127.0.0.1:48001_ c:control_collection s:shard1 r:core_node1 x:collection1] o.a.s.r.ManagedResourceStorage No data found for znode /configs/conf1/_rest_managed.json
   [junit4]   2> 2297968 INFO  (coreLoadExecutor-7489-thread-1-processing-n:127.0.0.1:48001_) [n:127.0.0.1:48001_ c:control_collection s:shard1 r:core_node1 x:collection1] o.a.s.r.ManagedResourceStorage Loaded null at path _rest_managed.json using ZooKeeperStorageIO:path=/configs/conf1
   [junit4]   2> 2297968 INFO  (coreLoadExecutor-7489-thread-1-processing-n:127.0.0.1:48001_) [n:127.0.0.1:48001_ c:control_collection s:shard1 r:core_node1 x:collection1] o.a.s.r.RestManager Initializing 0 registered ManagedResources
   [junit4]   2> 2297995 INFO  (coreLoadExecutor-7489-thread-1-processing-n:127.0.0.1:48001_) [n:127.0.0.1:48001_ c:control_collection s:shard1 r:core_node1 x:collection1] o.a.s.h.ReplicationHandler Commits will be reserved for  10000
   [junit4]   2> 2297995 INFO  (coreLoadExecutor-7489-thread-1-processing-n:127.0.0.1:48001_) [n:127.0.0.1:48001_ c:control_collection s:shard1 r:core_node1 x:collection1] o.a.s.u.UpdateLog Looking up max value of version field to seed version buckets
   [junit4]   2> 2297995 INFO  (coreLoadExecutor-7489-thread-1-processing-n:127.0.0.1:48001_) [n:127.0.0.1:48001_ c:control_collection s:shard1 r:core_node1 x:collection1] o.a.s.u.VersionInfo Refreshing highest value of _version_ for 65536 version buckets from index
   [junit4]   2> 2297995 INFO  (coreLoadExecutor-7489-thread-1-processing-n:127.0.0.1:48001_) [n:127.0.0.1:48001_ c:control_collection s:shard1 r:core_node1 x:collection1] o.a.s.u.VersionInfo No terms found for _version_, cannot seed version bucket highest value from index
   [junit4]   2> 2297995 INFO  (coreLoadExecutor-7489-thread-1-processing-n:127.0.0.1:48001_) [n:127.0.0.1:48001_ c:control_collection s:shard1 r:core_node1 x:collection1] o.a.s.u.UpdateLog Could not find max version in index or recent updates, using new clock 1533105681083662336
   [junit4]   2> 2297997 INFO  (coreLoadExecutor-7489-thread-1-processing-n:127.0.0.1:48001_) [n:127.0.0.1:48001_ c:control_collection s:shard1 r:core_node1 x:collection1] o.a.s.u.UpdateLog Took 1.0ms to seed version buckets with highest version 1533105681083662336
   [junit4]   2> 2297997 INFO  (coreLoadExecutor-7489-thread-1-processing-n:127.0.0.1:48001_) [n:127.0.0.1:48001_ c:control_collection s:shard1 r:core_node1 x:collection1] o.a.s.c.ZkController watch zkdir /configs/conf1
   [junit4]   2> 2297999 INFO  (coreLoadExecutor-7489-thread-1-processing-n:127.0.0.1:48001_) [n:127.0.0.1:48001_ c:control_collection s:shard1 r:core_node1 x:collection1] o.a.s.c.CoreContainer registering core: collection1
   [junit4]   2> 2297999 INFO  (searcherExecutor-7490-thread-1-processing-n:127.0.0.1:48001_ x:collection1 s:shard1 c:control_collection r:core_node1) [n:127.0.0.1:48001_ c:control_collection s:shard1 r:core_node1 x:collection1] o.a.s.c.SolrCore [collection1] Registered new searcher Searcher@400cdc95[collection1] main{ExitableDirectoryReader(UninvertingDirectoryReader())}
   [junit4]   2> 2298000 INFO  (coreZkRegister-7483-thread-1-processing-n:127.0.0.1:48001_ x:collection1 s:shard1 c:control_collection r:core_node1) [n:127.0.0.1:48001_ c:control_collection s:shard1 r:core_node1 x:collection1] o.a.s.c.ZkController Register replica - core:collection1 address:http://127.0.0.1:48001 collection:control_collection shard:shard1
   [junit4]   2> 2298007 INFO  (coreZkRegister-7483-thread-1-processing-n:127.0.0.1:48001_ x:collection1 s:shard1 c:control_collection r:core_node1) [n:127.0.0.1:48001_ c:control_collection s:shard1 r:core_node1 x:collection1] o.a.s.c.c.SolrZkClient makePath: /collections/control_collection/leader_elect/shard1/election
   [junit4]   2> 2298031 INFO  (coreZkRegister-7483-thread-1-processing-n:127.0.0.1:48001_ x:collection1 s:shard1 c:control_collection r:core_node1) [n:127.0.0.1:48001_ c:control_collection s:shard1 r:core_node1 x:collection1] o.a.s.c.LeaderElector Joined leadership election with path: /collections/control_collection/leader_elect/shard1/election/95819104925646852-core_node1-n_0000000000
   [junit4]   2> 2298032 INFO  (coreZkRegister-7483-thread-1-processing-n:127.0.0.1:48001_ x:collection1 s:shard1 c:control_collection r:core_node1) [n:127.0.0.1:48001_ c:control_collection s:shard1 r:core_node1 x:collection1] o.a.s.c.ShardLeaderElectionContext Running the leader process for shard=shard1 and weAreReplacement=false and leaderVoteWait=10000
   [junit4]   2> 2298036 INFO  (OverseerStateUpdate-95819104925646852-127.0.0.1:48001_-n_0000000000) [n:127.0.0.1:48001_    ] o.a.s.c.Overseer processMessage: queueSize: 1, message = {
   [junit4]   2>   "operation":"leader",
   [junit4]   2>   "shard":"shard1",
   [junit4]   2>   "collection":"control_collection"} current state version: 1
   [junit4]   2> 2298040 INFO  (coreZkRegister-7483-thread-1-processing-n:127.0.0.1:48001_ x:collection1 s:shard1 c:control_collection r:core_node1) [n:127.0.0.1:48001_ c:control_collection s:shard1 r:core_node1 x:collection1] o.a.s.c.ShardLeaderElectionContext Enough replicas found to continue.
   [junit4]   2> 2298040 INFO  (coreZkRegister-7483-thread-1-processing-n:127.0.0.1:48001_ x:collection1 s:shard1 c:control_collection r:core_node1) [n:127.0.0.1:48001_ c:control_collection s:shard1 r:core_node1 x:collection1] o.a.s.c.ShardLeaderElectionContext I may be the new leader - try and sync
   [junit4]   2> 2298040 INFO  (coreZkRegister-7483-thread-1-processing-n:127.0.0.1:48001_ x:collection1 s:shard1 c:control_collection r:core_node1) [n:127.0.0.1:48001_ c:control_collection s:shard1 r:core_node1 x:collection1] o.a.s.c.SyncStrategy Sync replicas to http://127.0.0.1:48001/collection1/
   [junit4]   2> 2298040 INFO  (coreZkRegister-7483-thread-1-processing-n:127.0.0.1:48001_ x:collection1 s:shard1 c:control_collection r:core_node1) [n:127.0.0.1:48001_ c:control_collection s:shard1 r:core_node1 x:collection1] o.a.s.c.SyncStrategy Sync Success - now sync replicas to me
   [junit4]   2> 2298040 INFO  (coreZkRegister-7483-thread-1-processing-n:127.0.0.1:48001_ x:collection1 s:shard1 c:control_collection r:core_node1) [n:127.0.0.1:48001_ c:control_collection s:shard1 r:core_node1 x:collection1] o.a.s.c.SyncStrategy http://127.0.0.1:48001/collection1/ has no replicas
   [junit4]   2> 2298041 INFO  (coreZkRegister-7483-thread-1-processing-n:127.0.0.1:48001_ x:collection1 s:shard1 c:control_collection r:core_node1) [n:127.0.0.1:48001_ c:control_collection s:shard1 r:core_node1 x:collection1] o.a.s.c.c.SolrZkClient makePath: /collections/control_collection/leaders/shard1
   [junit4]   2> 2298049 INFO  (coreZkRegister-7483-thread-1-processing-n:127.0.0.1:48001_ x:collection1 s:shard1 c:control_collection r:core_node1) [n:127.0.0.1:48001_ c:control_collection s:shard1 r:core_node1 x:collection1] o.a.s.c.ShardLeaderElectionContextBase Creating leader registration node /collections/control_collection/leaders/shard1/leader after winning as /collections/control_collection/leader_elect/shard1/election/95819104925646852-core_node1-n_0000000000
   [junit4]   2> 2298052 INFO  (coreZkRegister-7483-thread-1-processing-n:127.0.0.1:48001_ x:collection1 s:shard1 c:control_collection r:core_node1) [n:127.0.0.1:48001_ c:control_collection s:shard1 r:core_node1 x:collection1] o.a.s.c.ShardLeaderElectionContext I am the new leader: http://127.0.0.1:48001/collection1/ shard1
   [junit4]   2> 2298055 INFO  (OverseerStateUpdate-95819104925646852-127.0.0.1:48001_-n_0000000000) [n:127.0.0.1:48001_    ] o.a.s.c.Overseer processMessage: queueSize: 1, message = {
   [junit4]   2>   "operation":"leader",
   [junit4]   2>   "shard":"shard1",
   [junit4]   2>   "collection":"control_collection",
   [junit4]   2>   "base_url":"http://127.0.0.1:48001",
   [junit4]   2>   "core":"collection1",
   [junit4]   2>   "state":"active"} current state version: 1
   [junit4]   2> 2298162 INFO  (zkCallback-2047-thread-2-processing-n:127.0.0.1:48001_) [n:127.0.0.1:48001_    ] o.a.s.c.c.ZkStateReader A cluster state change: [WatchedEvent state:SyncConnected type:NodeDataChanged path:/clusterstate.json], has occurred - updating... (live nodes size: [1])
   [junit4]   2> 2298213 INFO  (coreZkRegister-7483-thread-1-processing-n:127.0.0.1:48001_ x:collection1 s:shard1 c:control_collection r:core_node1) [n:127.0.0.1:48001_ c:control_collection s:shard1 r:core_node1 x:collection1] o.a.s.c.ZkController We are http://127.0.0.1:48001/collection1/ and leader is http://127.0.0.1:48001/collection1/
   [junit4]   2> 2298215 INFO  (coreZkRegister-7483-thread-1-processing-n:127.0.0.1:48001_ x:collection1 s:shard1 c:control_collection r:core_node1) [n:127.0.0.1:48001_ c:control_collection s:shard1 r:core_node1 x:collection1] o.a.s.c.ZkController No LogReplay needed for core=collection1 baseURL=http://127.0.0.1:48001
   [junit4]   2> 2298215 INFO  (coreZkRegister-7483-thread-1-processing-n:127.0.0.1:48001_ x:collection1 s:shard1 c:control_collection r:core_node1) [n:127.0.0.1:48001_ c:control_collection s:shard1 r:core_node1 x:collection1] o.a.s.c.ZkController I am the leader, no recovery necessary
   [junit4]   2> 2298215 INFO  (coreZkRegister-7483-thread-1-processing-n:127.0.0.1:48001_ x:collection1 s:shard1 c:control_collection r:core_node1) [n:127.0.0.1:48001_ c:control_collection s:shard1 r:core_node1 x:collection1] o.a.s.c.ZkController publishing state=active
   [junit4]   2> 2298215 INFO  (coreZkRegister-7483-thread-1-processing-n:127.0.0.1:48001_ x:collection1 s:shard1 c:control_collection r:core_node1) [n:127.0.0.1:48001_ c:control_collection s:shard1 r:core_node1 x:collection1] o.a.s.c.ZkController numShards not found on descriptor - reading it from system property
   [junit4]   2> 2298231 INFO  (OverseerStateUpdate-95819104925646852-127.0.0.1:48001_-n_0000000000) [n:127.0.0.1:48001_    ] o.a.s.c.Overseer processMessage: queueSize: 1, message = {
   [junit4]   2>   "core":"collection1",
   [junit4]   2>   "core_node_name":"core_node1",
   [junit4]   2>   "roles":null,
   [junit4]   2>   "base_url":"http://127.0.0.1:48001",
   [junit4]   2>   "node_name":"127.0.0.1:48001_",
   [junit4]   2>   "numShards":"1",
   [junit4]   2>   "state":"active",
   [junit4]   2>   "shard":"shard1",
   [junit4]   2>   "collection":"control_collection",
   [junit4]   2>   "operation":"state"} current state version: 2
   [junit4]   2> 2298232 INFO  (OverseerStateUpdate-95819104925646852-127.0.0.1:48001_-n_0000000000) [n:127.0.0.1:48001_    ] o.a.s.c.o.ReplicaMutator Update state numShards=1 message={
   [junit4]   2>   "core":"collection1",
   [junit4]   2>   "core_node_name":"core_node1",
   [junit4]   2>   "roles":null,
   [junit4]   2>   "base_url":"http://127.0.0.1:48001",
   [junit4]   2>   "node_name":"127.0.0.1:48001_",
   [junit4]   2>   "numShards":"1",
   [junit4]   2>   "state":"active",
   [junit4]   2>   "shard":"shard1",
   [junit4]   2>   "collection":"control_collection",
   [junit4]   2>   "operation":"state"}
   [junit4]   2> 2298323 INFO  (TEST-DistribDocExpirationUpdateProcessorTest.test-seed#[80AF3CD2FDE8256F]) [    ] o.a.s.c.s.i.CloudSolrClient Final constructed zkHost string: 127.0.0.1:34719/solr
   [junit4]   2> 2298324 INFO  (TEST-DistribDocExpirationUpdateProcessorTest.test-seed#[80AF3CD2FDE8256F]) [    ] o.a.s.c.c.SolrZkClient Using default ZkCredentialsProvider
   [junit4]   2> 2298325 INFO  (TEST-DistribDocExpirationUpdateProcessorTest.test-seed#[80AF3CD2FDE8256F]) [    ] o.a.s.c.c.ConnectionManager Waiting for client to connect to ZooKeeper
   [junit4]   2> 2298328 INFO  (zkCallback-2049-thread-1) [    ] o.a.s.c.c.ConnectionManager Watcher org.apache.solr.common.cloud.ConnectionManager@f5e4282 name:ZooKeeperConnection Watcher:127.0.0.1:34719/solr got event WatchedEvent state:SyncConnected type:None path:null path:null type:None
   [junit4]   2> 2298328 INFO  (TEST-DistribDocExpirationUpdateProcessorTest.test-seed#[80AF3CD2FDE8256F]) [    ] o.a.s.c.c.ConnectionManager Client is connected to ZooKeeper
   [junit4]   2> 2298329 INFO  (TEST-DistribDocExpirationUpdateProcessorTest.test-seed#[80AF3CD2FDE8256F]) [    ] o.a.s.c.c.SolrZkClient Using default ZkACLProvider
   [junit4]   2> 2298329 INFO  (TEST-DistribDocExpirationUpdateProcessorTest.test-seed#[80AF3CD2FDE8256F]) [    ] o.a.s.c.c.ZkStateReader Updating cluster state from ZooKeeper... 
   [junit4]   2> 2298331 INFO  (TEST-DistribDocExpirationUpdateProcessorTest.test-seed#[80AF3CD2FDE8256F]) [    ] o.a.s.c.c.ZkStateReader Updated live nodes from ZooKeeper... (0) -> (1)
   [junit4]   2> 2298331 INFO  (TEST-DistribDocExpirationUpdateProcessorTest.test-seed#[80AF3CD2FDE8256F]) [    ] o.a.s.c.ChaosMonkey monkey: init - expire sessions:false cause connection loss:false
   [junit4]   2> 2298344 INFO  (zkCallback-2047-thread-2-processing-n:127.0.0.1:48001_) [n:127.0.0.1:48001_    ] o.a.s.c.c.ZkStateReader A cluster state change: [WatchedEvent state:SyncConnected type:NodeDataChanged path:/clusterstate.json], has occurred - updating... (live nodes size: [1])
   [junit4]   2> 2298362 INFO  (zkCallback-2049-thread-1) [    ] o.a.s.c.c.ZkStateReader A cluster state change: [WatchedEvent state:SyncConnected type:NodeDataChanged path:/clusterstate.json], has occurred - updating... (live nodes size: [1])
   [junit4]   2> 2298968 INFO  (TEST-DistribDocExpirationUpdateProcessorTest.test-seed#[80AF3CD2FDE8256F]) [    ] o.a.s.SolrTestCaseJ4 Writing core.properties file to /export/home/jenkins/workspace/Lucene-Solr-master-Solaris/solr/build/solr-core/test/J0/temp/solr.cloud.DistribDocExpirationUpdateProcessorTest_80AF3CD2FDE8256F-001/shard-1-001/cores/collection1
   [junit4]   2> 2299421 INFO  (TEST-DistribDocExpirationUpdateProcessorTest.test-seed#[80AF3CD2FDE8256F]) [    ] o.a.s.c.AbstractFullDistribZkTestBase create jetty 1 in directory /export/home/jenkins/workspace/Lucene-Solr-master-Solaris/solr/build/solr-core/test/J0/temp/solr.cloud.DistribDocExpirationUpdateProcessorTest_80AF3CD2FDE8256F-001/shard-1-001
   [junit4]   2> 2299427 INFO  (TEST-DistribDocExpirationUpdateProcessorTest.test-seed#[80AF3CD2FDE8256F]) [    ] o.e.j.s.Server jetty-9.3.8.v20160314
   [junit4]   2> 2299438 INFO  (TEST-DistribDocExpirationUpdateProcessorTest.test-seed#[80AF3CD2FDE8256F]) [    ] o.e.j.s.h.ContextHandler Started o.e.j.s.ServletContextHandler@40eb4eda{/,null,AVAILABLE}
   [junit4]   2> 2299439 INFO  (TEST-DistribDocExpirationUpdateProcessorTest.test-seed#[80AF3CD2FDE8256F]) [    ] o.e.j.s.ServerConnector Started ServerConnector@19994155{HTTP/1.1,[http/1.1]}{127.0.0.1:37991}
   [junit4]   2> 2299439 INFO  (TEST-DistribDocExpirationUpdateProcessorTest.test-seed#[80AF3CD2FDE8256F]) [    ] o.e.j.s.Server Started @2304233ms
   [junit4]   2> 2299439 INFO  (TEST-DistribDocExpirationUpdateProcessorTest.test-seed#[80AF3CD2FDE8256F]) [    ] o.a.s.c.s.e.JettySolrRunner Jetty properties: {solr.data.dir=/export/home/jenkins/workspace/Lucene-Solr-master-Solaris/solr/build/solr-core/test/J0/temp/solr.cloud.DistribDocExpirationUpdateProcessorTest_80AF3CD2FDE8256F-001/tempDir-001/jetty1, solrconfig=solrconfig.xml, hostContext=/, hostPort=37991, coreRootDirectory=/export/home/jenkins/workspace/Lucene-Solr-master-Solaris/solr/build/solr-core/test/J0/../../../../../../../../../../export/home/jenkins/workspace/Lucene-Solr-master-Solaris/solr/build/solr-core/test/J0/temp/solr.cloud.DistribDocExpirationUpdateProcessorTest_80AF3CD2FDE8256F-001/shard-1-001/cores}
   [junit4]   2> 2299439 INFO  (TEST-DistribDocExpirationUpdateProcessorTest.test-seed#[80AF3CD2FDE8256F]) [    ] o.a.s.s.SolrDispatchFilter SolrDispatchFilter.init(): sun.misc.Launcher$AppClassLoader@6d06d69c
   [junit4]   2> 2299440 INFO  (TEST-DistribDocExpirationUpdateProcessorTest.test-seed#[80AF3CD2FDE8256F]) [    ] o.a.s.c.SolrResourceLoader new SolrResourceLoader for directory: '/export/home/jenkins/workspace/Lucene-Solr-master-Solaris/solr/build/solr-core/test/J0/temp/solr.cloud.DistribDocExpirationUpdateProcessorTest_80AF3CD2FDE8256F-001/shard-1-001'
   [junit4]   2> 2299450 INFO  (TEST-DistribDocExpirationUpdateProcessorTest.test-seed#[80AF3CD2FDE8256F]) [    ] o.a.s.c.SolrResourceLoader JNDI not configured for solr (NoInitialContextEx)
   [junit4]   2> 2299451 INFO  (TEST-DistribDocExpirationUpdateProcessorTest.test-seed#[80AF3CD2FDE8256F]) [    ] o.a.s.c.SolrResourceLoader solr home defaulted to 'solr/' (could not find system property or JNDI)
   [junit4]   2> 2299451 INFO  (TEST-DistribDocExpirationUpdateProcessorTest.test-seed#[80AF3CD2FDE8256F]) [    ] o.a.s.c.c.SolrZkClient Using default ZkCredentialsProvider
   [junit4]   2> 2299497 INFO  (TEST-DistribDocExpirationUpdateProcessorTest.test-seed#[80AF3CD2FDE8256F]) [    ] o.a.s.c.c.ConnectionManager Waiting for client to connect to ZooKeeper
   [junit4]   2> 2299506 INFO  (zkCallback-2050-thread-1) [    ] o.a.s.c.c.ConnectionManager Watcher org.apache.solr.common.cloud.ConnectionManager@385618ae name:ZooKeeperConnection Watcher:127.0.0.1:34719/solr got event WatchedEvent state:SyncConnected type:None path:null path:null type:None
   [junit4]   2> 2299507 INFO  (TEST-DistribDocExpirationUpdateProcessorTest.test-seed#[80AF3CD2FDE8256F]) [    ] o.a.s.c.c.ConnectionManager Client is connected to ZooKeeper
   [junit4]   2> 2299507 INFO  (TEST-DistribDocExpirationUpdateProcessorTest.test-seed#[80AF3CD2FDE8256F]) [    ] o.a.s.c.c.SolrZkClient Using default ZkACLProvider
   [junit4]   2> 2299509 INFO  (TEST-DistribDocExpirationUpdateProcessorTest.test-seed#[80AF3CD2FDE8256F]) [    ] o.a.s.s.SolrDispatchFilter Loading solr.xml from SolrHome (not found in ZooKeeper)
   [junit4]   2> 2299510 INFO  (TEST-DistribDocExpirationUpdateProcessorTest.test-seed#[80AF3CD2FDE8256F]) [    ] o.a.s.c.SolrXmlConfig Loading container configuration from /export/home/jenkins/workspace/Lucene-Solr-master-Solaris/solr/build/solr-core/test/J0/temp/solr.cloud.DistribDocExpirationUpdateProcessorTest_80AF3CD2FDE8256F-001/shard-1-001/solr.xml
   [junit4]   2> 2299517 INFO  (TEST-DistribDocExpirationUpdateProcessorTest.test-seed#[80AF3CD2FDE8256F]) [    ] o.a.s.c.CorePropertiesLocator Config-defined core root directory: /export/home/jenkins/workspace/Lucene-Solr-master-Solaris/solr/build/solr-core/test/J0/../../../../../../../../../../export/home/jenkins/workspace/Lucene-Solr-master-Solaris/solr/build/solr-core/test/J0/temp/solr.cloud.DistribDocExpirationUpdateProcessorTest_80AF3CD2FDE8256F-001/shard-1-001/cores
   [junit4]   2> 2299518 INFO  (TEST-DistribDocExpirationUpdateProcessorTest.test-seed#[80AF3CD2FDE8256F]) [    ] o.a.s.c.CoreContainer New CoreContainer 192176857
   [junit4]   2> 2299518 INFO  (TEST-DistribDocExpirationUpdateProcessorTest.test-seed#[80AF3CD2FDE8256F]) [    ] o.a.s.c.CoreContainer Loading cores into CoreContainer [instanceDir=/export/home/jenkins/workspace/Lucene-Solr-master-Solaris/solr/build/solr-core/test/J0/temp/solr.cloud.DistribDocExpirationUpdateProcessorTest_80AF3CD2FDE8256F-001/shard-1-001]
   [junit4]   2> 2299519 WARN  (TEST-DistribDocExpirationUpdateProcessorTest.test-seed#[80AF3CD2FDE8256F]) [    ] o.a.s.c.CoreContainer Couldn't add files from /export/home/jenkins/workspace/Lucene-Solr-master-Solaris/solr/build/solr-core/test/J0/temp/solr.cloud.DistribDocExpirationUpdateProcessorTest_80AF3CD2FDE8256F-001/shard-1-001/lib to classpath: /export/home/jenkins/workspace/Lucene-Solr-master-Solaris/solr/build/solr-core/test/J0/temp/solr.cloud.DistribDocExpirationUpdateProcessorTest_80AF3CD2FDE8256F-001/shard-1-001/lib
   [junit4]   2> 2299519 INFO  (TEST-DistribDocExpirationUpdateProcessorTest.test-seed#[80AF3CD2FDE8256F]) [    ] o.a.s.h.c.HttpShardHandlerFactory created with socketTimeout : 90000,urlScheme : ,connTimeout : 15000,maxConnectionsPerHost : 20,maxConnections : 10000,corePoolSize : 0,maximumPoolSize : 2147483647,maxThreadIdleTime : 5,sizeOfQueue : -1,fairnessPolicy : false,
   [junit4]   2> 2299520 INFO  (TEST-DistribDocExpirationUpdateProcessorTest.test-seed#[80AF3CD2FDE8256F]) [    ] o.a.s.u.UpdateShardHandler Creating UpdateShardHandler HTTP client with params: 
   [junit4]   2> 2299521 INFO  (TEST-DistribDocExpirationUpdateProcessorTest.test-seed#[80AF3CD2FDE8256F]) [    ] o.a.s.l.LogWatcher SLF4J impl is org.slf4j.impl.Log4jLoggerFactory
   [junit4]   2> 2299521 INFO  (TEST-DistribDocExpirationUpdateProcessorTest.test-seed#[80AF3CD2FDE8256F]) [    ] o.a.s.l.LogWatcher Registering Log Listener [Log4j (org.slf4j.impl.Log4jLoggerFactory)]
   [junit4]   2> 2299521 INFO  (TEST-DistribDocExpirationUpdateProcessorTest.test-seed#[80AF3CD2FDE8256F]) [    ] o.a.s.c.ZkContainer Zookeeper client=127.0.0.1:34719/solr
   [junit4]   2> 2299521 INFO  (TEST-DistribDocExpirationUpdateProcessorTest.test-seed#[80AF3CD2FDE8256F]) [    ] o.a.s.c.ZkController zkHost includes chroot
   [junit4]   2> 2299522 INFO  (TEST-DistribDocExpirationUpdateProcessorTest.test-seed#[80AF3CD2FDE8256F]) [    ] o.a.s.c.c.SolrZkClient Using default ZkCredentialsProvider
   [junit4]   2> 2299523 INFO  (TEST-DistribDocExpirationUpdateProcessorTest.test-seed#[80AF3CD2FDE8256F]) [    ] o.a.s.c.c.ConnectionManager Waiting for client to connect to ZooKeeper
   [junit4]   2> 2299582 INFO  (zkCallback-2053-thread-1) [    ] o.a.s.c.c.ConnectionManager Watcher org.apache.solr.common.cloud.ConnectionManager@3e07b240 name:ZooKeeperConnection Watcher:127.0.0.1:34719 got event WatchedEvent state:SyncConnected type:None path:null path:null type:None
   [junit4]   2> 2299583 INFO  (TEST-DistribDocExpirationUpdateProcessorTest.test-seed#[80AF3CD2FDE8256F]) [    ] o.a.s.c.c.ConnectionManager Client is connected to ZooKeeper
   [junit4]   2> 2299584 INFO  (TEST-DistribDocExpirationUpdateProcessorTest.test-seed#[80AF3CD2FDE8256F]) [    ] o.a.s.c.c.SolrZkClient Using default ZkACLProvider
   [junit4]   2> 2299587 INFO  (TEST-DistribDocExpirationUpdateProcessorTest.test-seed#[80AF3CD2FDE8256F]) [n:127.0.0.1:37991_    ] o.a.s.c.ZkController Added new OnReconnect listener org.apache.solr.cloud.ZkController$$Lambda$45/1826964701@70fd3ee2
   [junit4]   2> 2299587 INFO  (TEST-DistribDocExpirationUpdateProcessorTest.test-seed#[80AF3CD2FDE8256F]) [n:127.0.0.1:37991_    ] o.a.s.c.c.ConnectionManager Waiting for client to connect to ZooKeeper
   [junit4]   2> 2299589 INFO  (zkCallback-2054-thread-1-processing-n:127.0.0.1:37991_) [n:127.0.0.1:37991_    ] o.a.s.c.c.ConnectionManager Watcher org.apache.solr.common.cloud.ConnectionManager@591eff1a name:ZooKeeperConnection Watcher:127.0.0.1:34719/solr got event WatchedEvent state:SyncConnected type:None path:null path:null type:None
   [junit4]   2> 2299590 INFO  (TEST-DistribDocExpirationUpdateProcessorTest.test-seed#[80AF3CD2FDE8256F]) [n:127.0.0.1:37991_    ] o.a.s.c.c.ConnectionManager Client is connected to ZooKeeper
   [junit4]   2> 2299604 INFO  (TEST-DistribDocExpirationUpdateProcessorTest.test-seed#[80AF3CD2FDE8256F]) [n:127.0.0.1:37991_    ] o.a.s.c.c.ZkStateReader Updating cluster state from ZooKeeper... 
   [junit4]   2> 2299608 INFO  (TEST-DistribDocExpirationUpdateProcessorTest.test-seed#[80AF3CD2FDE8256F]) [n:127.0.0.1:37991_    ] o.a.s.c.c.ZkStateReader Updated live nodes from ZooKeeper... (0) -> (1)
   [junit4]   2> 2299616 INFO  (TEST-DistribDocExpirationUpdateProcessorTest.test-seed#[80AF3CD2FDE8256F]) [n:127.0.0.1:37991_    ] o.a.s.c.Overseer Overseer (id=null) closing
   [junit4]   2> 2299617 INFO  (TEST-DistribDocExpirationUpdateProcessorTest.test-seed#[80AF3CD2FDE8256F]) [n:127.0.0.1:37991_    ] o.a.s.c.LeaderElector Joined leadership election with path: /overseer_elect/election/95819104925646856-127.0.0.1:37991_-n_0000000001
   [junit4]   2> 2299618 INFO  (TEST-DistribDocExpirationUpdateProcessorTest.test-seed#[80AF3CD2FDE8256F]) [n:127.0.0.1:37991_    ] o.a.s.c.LeaderElector Watching path /overseer_elect/election/95819104925646852-127.0.0.1:48001_-n_0000000000 to know if I could be the leader
   [junit4]   2> 2299619 INFO  (TEST-DistribDocExpirationUpdateProcessorTest.test-seed#[80AF3CD2FDE8256F]) [n:127.0.0.1:37991_    ] o.a.s.c.ZkController Publish node=127.0.0.1:37991_ as DOWN
   [junit4]   2> 2299623 INFO  (OverseerStateUpdate-95819104925646852-127.0.0.1:48001_-n_0000000000) [n:127.0.0.1:48001_    ] o.a.s.c.Overseer processMessage: queueSize: 1, message = {
   [junit4]   2>   "operation":"downnode",
   [junit4]   2>   "node_name":"127.0.0.1:37991_"} current state version: 3
   [junit4]   2> 2299624 INFO  (OverseerStateUpdate-95819104925646852-127.0.0.1:48001_-n_0000000000) [n:127.0.0.1:48001_    ] o.a.s.c.o.NodeMutator DownNode state invoked for node: 127.0.0.1:37991_
   [junit4]   2> 2299728 INFO  (zkCallback-2049-thread-1) [    ] o.a.s.c.c.ZkStateReader A cluster state change: [WatchedEvent state:SyncConnected type:NodeDataChanged path:/clusterstate.json], has occurred - updating... (live nodes size: [1])
   [junit4]   2> 2299728 INFO  (zkCallback-2047-thread-2-processing-n:127.0.0.1:48001_) [n:127.0.0.1:48001_    ] o.a.s.c.c.ZkStateReader A cluster state change: [WatchedEvent state:SyncConnected type:NodeDataChanged path:/clusterstate.json], has occurred - updating... (live nodes size: [1])
   [junit4]   2> 2299728 INFO  (zkCallback-2054-thread-1-processing-n:127.0.0.1:37991_) [n:127.0.0.1:37991_    ] o.a.s.c.c.ZkStateReader A cluster state change: [WatchedEvent state:SyncConnected type:NodeDataChanged path:/clusterstate.json], has occurred - updating... (live nodes size: [1])
   [junit4]   2> 2300628 INFO  (TEST-DistribDocExpirationUpdateProcessorTest.test-seed#[80AF3CD2FDE8256F]) [n:127.0.0.1:37991_    ] o.a.s.c.ZkController Register node as live in ZooKeeper:/live_nodes/127.0.0.1:37991_
   [junit4]   2> 2300628 INFO  (TEST-DistribDocExpirationUpdateProcessorTest.test-seed#[80AF3CD2FDE8256F]) [n:127.0.0.1:37991_    ] o.a.s.c.c.SolrZkClient makePath: /live_nodes/127.0.0.1:37991_
   [junit4]   2> 2300630 INFO  (zkCallback-2047-thread-2-processing-n:127.0.0.1:48001_) [n:127.0.0.1:48001_    ] o.a.s.c.c.ZkStateReader A live node change: [WatchedEvent state:SyncConnected type:NodeChildrenChanged path:/live_nodes], has occurred - updating... (live nodes size: [1])
   [junit4]   2> 2300630 INFO  (zkCallback-2054-thread-1-processing-n:127.0.0.1:37991_) [n:127.0.0.1:37991_    ] o.a.s.c.c.ZkStateReader A live node change: [WatchedEvent state:SyncConnected type:NodeChildrenChanged path:/live_nodes], has occurred - updating... (live nodes size: [1])
   [junit4]   2> 2300631 INFO  (zkCallback-2047-thread-2-processing-n:127.0.0.1:48001_) [n:127.0.0.1:48001_    ] o.a.s.c.c.ZkStateReader Updated live nodes from ZooKeeper... (1) -> (2)
   [junit4]   2> 2300631 INFO  (zkCallback-2054-thread-1-processing-n:127.0.0.1:37991_) [n:127.0.0.1:37991_    ] o.a.s.c.c.ZkStateReader Updated live nodes from ZooKeeper... (1) -> (2)
   [junit4]   2> 2300632 INFO  (zkCallback-2049-thread-1) [    ] o.a.s.c.c.ZkStateReader A live node change: [WatchedEvent state:SyncConnected type:NodeChildrenChanged path:/live_nodes], has occurred - updating... (live nodes size: [1])
   [junit4]   2> 2300633 INFO  (zkCallback-2049-thread-1) [    ] o.a.s.c.c.ZkStateReader Updated live nodes from ZooKeeper... (1) -> (2)
   [junit4]   2> 2300666 INFO  (TEST-DistribDocExpirationUpdateProcessorTest.test-seed#[80AF3CD2FDE8256F]) [n:127.0.0.1:37991_    ] o.a.s.c.CoreContainer Security conf doesn't exist. Skipping setup for authorization module.
   [junit4]   2> 2300666 INFO  (TEST-DistribDocExpirationUpdateProcessorTest.test-seed#[80AF3CD2FDE8256F]) [n:127.0.0.1:37991_    ] o.a.s.c.CoreContainer No authentication plugin used.
   [junit4]   2> 2300667 INFO  (TEST-DistribDocExpirationUpdateProcessorTest.test-seed#[80AF3CD2FDE8256F]) [n:127.0.0.1:37991_    ] o.a.s.c.CorePropertiesLocator Looking for core definitions underneath /export/home/jenkins/workspace/Lucene-Solr-master-Solaris/solr/build/solr-core/test/J0/../../../../../../../../../../export/home/jenkins/workspace/Lucene-Solr-master-Solaris/solr/build/solr-core/test/J0/temp/solr.cloud.DistribDocExpirationUpdateProcessorTest_80AF3CD2FDE8256F-001/shard-1-001/cores
   [junit4]   2> 2300668 INFO  (TEST-DistribDocExpirationUpdateProcessorTest.test-seed#[80AF3CD2FDE8256F]) [n:127.0.0.1:37991_    ] o.a.s.c.CoreDescriptor Created CoreDescriptor: {name=collection1, config=solrconfig.xml, transient=false, schema=schema.xml, loadOnStartup=true, configSetProperties=configsetprops.json, collection=collection1, coreNodeName=, dataDir=data/, shard=}
   [junit4]   2> 2300668 INFO  (TEST-DistribDocExpirationUpdateProcessorTest.test-seed#[80AF3CD2FDE8256F]) [n:127.0.0.1:37991_    ] o.a.s.c.CorePropertiesLocator Found core collection1 in /export/home/jenkins/workspace/Lucene-Solr-master-Solaris/solr/build/solr-core/test/J0/../../../../../../../../../../export/home/jenkins/workspace/Lucene-Solr-master-Solaris/solr/build/solr-core/test/J0/temp/solr.cloud.DistribDocExpirationUpdateProcessorTest_80AF3CD2FDE8256F-001/shard-1-001/cores/collection1
   [junit4]   2> 2300669 INFO  (TEST-DistribDocExpirationUpdateProcessorTest.test-seed#[80AF3CD2FDE8256F]) [n:127.0.0.1:37991_    ] o.a.s.c.CorePropertiesLocator Found 1 core definitions
   [junit4]   2> 2300670 INFO  (TEST-DistribDocExpirationUpdateProcessorTest.test-seed#[80AF3CD2FDE8256F]) [n:127.0.0.1:37991_    ] o.a.s.s.SolrDispatchFilter user.dir=/export/home/jenkins/workspace/Lucene-Solr-master-Solaris/solr/build/solr-core/test/J0
   [junit4]   2> 2300670 INFO  (TEST-DistribDocExpirationUpdateProcessorTest.test-seed#[80AF3CD2FDE8256F]) [n:127.0.0.1:37991_    ] o.a.s.s.SolrDispatchFilter SolrDispatchFilter.init() done
   [junit4]   2> 2300672 INFO  (coreLoadExecutor-7501-thread-1-processing-n:127.0.0.1:37991_) [n:127.0.0.1:37991_ c:collection1   x:collection1] o.a.s.c.ZkController publishing state=down
   [junit4]   2> 2300672 INFO  (coreLoadExecutor-7501-thread-1-processing-n:127.0.0.1:37991_) [n:127.0.0.1:37991_ c:collection1   x:collection1] o.a.s.c.ZkController numShards not found on descriptor - reading it from system property
   [junit4]   2> 2300675 INFO  (coreLoadExecutor-7501-thread-1-processing-n:127.0.0.1:37991_) [n:127.0.0.1:37991_ c:collection1   x:collection1] o.a.s.c.ZkController Collection collection1 not visible yet, but flagging it so a watch is registered when it becomes visible
   [junit4]   2> 2300675 INFO  (coreLoadExecutor-7501-thread-1-processing-n:127.0.0.1:37991_) [n:127.0.0.1:37991_ c:collection1   x:collection1] o.a.s.c.c.ZkStateReader addZkWatch [collection1]
   [junit4]   2> 2300675 INFO  (OverseerStateUpdate-95819104925646852-127.0.0.1:48001_-n_0000000000) [n:127.0.0.1:48001_    ] o.a.s.c.Overseer processMessage: queueSize: 1, message = {
   [junit4]   2>   "core":"collection1",
   [junit4]   2>   "roles":null,
   [junit4]   2>   "base_url":"http://127.0.0.1:37991",
   [junit4]   2>   "node_name":"127.0.0.1:37991_",
   [junit4]   2>   "numShards":"2",
   [junit4]   2>   "state":"down",
   [junit4]   2>   "shard":null,
   [junit4]   2>   "collection":"collection1",
   [junit4]   2>   "operation":"state"} current state version: 4
   [junit4]   2> 2300676 INFO  (OverseerStateUpdate-95819104925646852-127.0.0.1:48001_-n_0000000000) [n:127.0.0.1:48001_    ] o.a.s.c.o.ReplicaMutator Update state numShards=2 message={
   [junit4]   2>   "core":"collection1",
   [junit4]   2>   "roles":null,
   [junit4]   2>   "base_url":"http://127.0.0.1:37991",
   [junit4]   2>   "node_name":"127.0.0.1:37991_",
   [junit4]   2>   "numShards":"2",
   [junit4]   2>   "state":"down",
   [junit4]   2>   "shard":null,
   [junit4]   2>   "collection":"collection1",
   [junit4]   2>   "operation":"state"}
   [junit4]   2> 2300676 INFO  (OverseerStateUpdate-95819104925646852-127.0.0.1:48001_-n_0000000000) [n:127.0.0.1:48001_    ] o.a.s.c.o.ClusterStateMutator building a new cName: collection1
   [junit4]   2> 2300676 INFO  (OverseerStateUpdate-95819104925646852-127.0.0.1:48001_-n_0000000000) [n:127.0.0.1:48001_    ] o.a.s.c.o.ReplicaMutator Assigning new node to shard shard=shard2
   [junit4]   2> 2300677 INFO  (coreLoadExecutor-7501-thread-1-processing-n:127.0.0.1:37991_) [n:127.0.0.1:37991_ c:collection1   x:collection1] o.a.s.c.c.ZkStateReader Deleting data for [collection1]
   [junit4]   2> 2300679 INFO  (coreLoadExecutor-7501-thread-1-processing-n:127.0.0.1:37991_) [n:127.0.0.1:37991_ c:collection1   x:collection1] o.a.s.c.ZkController look for our core node name
   [junit4]   2> 2300786 INFO  (zkCallback-2054-thread-1-processing-n:127.0.0.1:37991_) [n:127.0.0.1:37991_    ] o.a.s.c.c.ZkStateReader A cluster state change: [WatchedEvent state:SyncConnected type:NodeDataChanged path:/clusterstate.json], has occurred - updating... (live nodes size: [2])
   [junit4]   2> 2300798 INFO  (zkCallback-2047-thread-2-processing-n:127.0.0.1:48001_) [n:127.0.0.1:48001_    ] o.a.s.c.c.ZkStateReader A cluster state change: [WatchedEvent state:SyncConnected type:NodeDataChanged path:/clusterstate.json], has occurred - updating... (live nodes size: [2])
   [junit4]   2> 2300789 INFO  (zkCallback-2049-thread-1) [    ] o.a.s.c.c.ZkStateReader A cluster state change: [WatchedEvent state:SyncConnected type:NodeDataChanged path:/clusterstate.json], has occurred - updating... (live nodes size: [2])
   [junit4]   2> 2300996 INFO  (autoExpireDocs-7495-thread-1) [n:127.0.0.1:48001_ c:control_collection s:shard1 r:core_node1 x:collection1] o.a.s.u.p.DocExpirationUpdateProcessorFactory Begining periodic deletion of expired docs
   [junit4]   2> 2301000 INFO  (autoExpireDocs-7495-thread-1) [n:127.0.0.1:48001_ c:control_collection s:shard1 r:core_node1 x:collection1] o.a.s.u.DirectUpdateHandler2 start commit{,optimize=false,openSearcher=true,waitSearcher=true,expungeDeletes=false,softCommit=true,prepareCommit=false}
   [junit4]   2> 2301001 INFO  (autoExpireDocs-7495-thread-1) [n:127.0.0.1:48001_ c:control_collection s:shard1 r:core_node1 x:collection1] o.a.s.c.SolrCore SolrIndexSearcher has not changed - not re-opening: org.apache.solr.search.SolrIndexSearcher
   [junit4]   2> 2301001 INFO  (autoExpireDocs-7495-thread-1) [n:127.0.0.1:48001_ c:control_collection s:shard1 r:core_node1 x:collection1] o.a.s.u.DirectUpdateHandler2 end_commit_flush
   [junit4]   2> 2301001 INFO  (autoExpireDocs-7495-thread-1) [n:127.0.0.1:48001_ c:control_collection s:shard1 r:core_node1 x:collection1] o.a.s.u.p.LogUpdateProcessorFactory [collection1] {deleteByQuery={!cache=false}eXpField_tdt:[* TO 2016-05-01T06:18:35.387Z] (-1533105684231487488),commit=} 0 5
   [junit4]   2> 2301001 INFO  (autoExpireDocs-7495-thread-1) [n:127.0.0.1:48001_ c:control_collection s:shard1 r:core_node1 x:collection1] o.a.s.u.p.DocExpirationUpdateProcessorFactory Finished periodic deletion of expired docs
   [junit4]   2> 2301680 INFO  (coreLoadExecutor-7501-thread-1-processing-n:127.0.0.1:37991_) [n:127.0.0.1:37991_ c:collection1   x:collection1] o.a.s.c.ZkController waiting to find shard id in clusterstate for collection1
   [junit4]   2> 2301680 INFO  (coreLoadExecutor-7501-thread-1-processing-n:127.0.0.1:37991_) [n:127.0.0.1:37991_ c:collection1   x:collection1] o.a.s.c.ZkController Check for collection zkNode:collection1
   [junit4]   2> 2301681 INFO  (coreLoadExecutor-7501-thread-1-processing-n:127.0.0.1:37991_) [n:127.0.0.1:37991_ c:collection1   x:collection1] o.a.s.c.ZkController Collection zkNode exists
   [junit4]   2> 2301681 INFO  (coreLoadExecutor-7501-thread-1-processing-n:127.0.0.1:37991_) [n:127.0.0.1:37991_ c:collection1   x:collection1] o.a.s.c.c.ZkStateReader Load collection config from: [/collections/collection1]
   [junit4]   2> 2301682 INFO  (coreLoadExecutor-7501-thread-1-processing-n:127.0.0.1:37991_) [n:127.0.0.1:37991_ c:collection1   x:collection1] o.a.s.c.c.ZkStateReader path=[/collections/collection1] [configName]=[conf1] specified config exists in ZooKeeper
   [junit4]   2> 2301682 INFO  (coreLoadExecutor-7501-thread-1-processing-n:127.0.0.1:37991_) [n:127.0.0.1:37991_ c:collection1   x:collection1] o.a.s.c.SolrResourceLoader new SolrResourceLoader for directory: '/export/home/jenkins/workspace/Lucene-Solr-master-Solaris/solr/build/solr-core/test/J0/temp/solr.cloud.DistribDocExpirationUpdateProcessorTest_80AF3CD2FDE8256F-001/shard-1-001/cores/collection1'
   [junit4]   2> 2301683 INFO  (coreLoadExecutor-7501-thread-1-processing-n:127.0.0.1:37991_) [n:127.0.0.1:37991_ c:collection1   x:collection1] o.a.s.c.SolrResourceLoader JNDI not configured for solr (NoInitialContextEx)
   [junit4]   2> 2301683 INFO  (coreLoadExecutor-7501-thread-1-processing-n:127.0.0.1:37991_) [n:127.0.0.1:37991_ c:collection1   x:collection1] o.a.s.c.SolrResourceLoader solr home defaulted to 'solr/' (could not find system property or JNDI)
   [junit4]   2> 2301685 INFO  (coreLoadExecutor-7501-thread-1-processing-n:127.0.0.1:37991_) [n:127.0.0.1:37991_ c:collection1   x:collection1] o.a.s.c.Config loaded config solrconfig.xml with version 0 
   [junit4]   2> 2301691 INFO  (coreLoadExecutor-7501-thread-1-processing-n:127.0.0.1:37991_) [n:127.0.0.1:37991_ c:collection1   x:collection1] o.a.s.c.SolrConfig current version of requestparams : -1
   [junit4]   2> 2301693 INFO  (coreLoadExecutor-7501-thread-1-processing-n:127.0.0.1:37991_) [n:127.0.0.1:37991_ c:collection1   x:collection1] o.a.s.c.SolrConfig Using Lucene MatchVersion: 7.0.0
   [junit4]   2> 2301873 INFO  (coreLoadExecutor-7501-thread-1-processing-n:127.0.0.1:37991_) [n:127.0.0.1:37991_ c:collection1   x:collection1] o.a.s.c.SolrConfig Loaded SolrConfig: solrconfig.xml
   [junit4]   2> 2301879 INFO  (coreLoadExecutor-7501-thread-1-processing-n:

[...truncated too long message...]

orTest.test-seed#[80AF3CD2FDE8256F]) [    ] o.a.s.c.ZkTestServer connecting to 127.0.0.1:34719 34719
   [junit4]   2> 2365477 INFO  (Thread-5148) [    ] o.a.s.c.ZkTestServer connecting to 127.0.0.1:34719 34719
   [junit4]   2> 2365478 WARN  (Thread-5148) [    ] o.a.s.c.ZkTestServer Watch limit violations: 
   [junit4]   2> Maximum concurrent create/delete watches above limit:
   [junit4]   2> 
   [junit4]   2> 	6	/solr/aliases.json
   [junit4]   2> 	5	/solr/security.json
   [junit4]   2> 	5	/solr/configs/conf1
   [junit4]   2> 	4	/solr/collections/collection1/state.json
   [junit4]   2> 
   [junit4]   2> Maximum concurrent data watches above limit:
   [junit4]   2> 
   [junit4]   2> 	6	/solr/clusterstate.json
   [junit4]   2> 
   [junit4]   2> Maximum concurrent children watches above limit:
   [junit4]   2> 
   [junit4]   2> 	6	/solr/live_nodes
   [junit4]   2> 	6	/solr/collections
   [junit4]   2> 	4	/solr/overseer/queue
   [junit4]   2> 	4	/solr/overseer/collection-queue-work
   [junit4]   2> 
   [junit4]   2> NOTE: reproduce with: ant test  -Dtestcase=DistribDocExpirationUpdateProcessorTest -Dtests.method=test -Dtests.seed=80AF3CD2FDE8256F -Dtests.slow=true -Dtests.locale=und -Dtests.timezone=Atlantic/Stanley -Dtests.asserts=true -Dtests.file.encoding=ISO-8859-1
   [junit4] FAILURE 69.7s J0 | DistribDocExpirationUpdateProcessorTest.test <<<
   [junit4]    > Throwable #1: java.lang.AssertionError: There are still nodes recoverying - waited for 45 seconds
   [junit4]    > 	at __randomizedtesting.SeedInfo.seed([80AF3CD2FDE8256F:8FB030853144897]:0)
   [junit4]    > 	at org.apache.solr.cloud.AbstractDistribZkTestBase.waitForRecoveriesToFinish(AbstractDistribZkTestBase.java:173)
   [junit4]    > 	at org.apache.solr.cloud.AbstractFullDistribZkTestBase.waitForRecoveriesToFinish(AbstractFullDistribZkTestBase.java:858)
   [junit4]    > 	at org.apache.solr.cloud.DistribDocExpirationUpdateProcessorTest.test(DistribDocExpirationUpdateProcessorTest.java:74)
   [junit4]    > 	at org.apache.solr.BaseDistributedSearchTestCase$ShardsRepeatRule$ShardsFixedStatement.callStatement(BaseDistributedSearchTestCase.java:985)
   [junit4]    > 	at org.apache.solr.BaseDistributedSearchTestCase$ShardsRepeatRule$ShardsStatement.evaluate(BaseDistributedSearchTestCase.java:960)
   [junit4]    > 	at java.lang.Thread.run(Thread.java:745)
   [junit4]   2> 2365523 INFO  (SUITE-DistribDocExpirationUpdateProcessorTest-seed#[80AF3CD2FDE8256F]-worker) [    ] o.a.s.SolrTestCaseJ4 ###deleteCore
   [junit4]   2> NOTE: leaving temporary files on disk at: /export/home/jenkins/workspace/Lucene-Solr-master-Solaris/solr/build/solr-core/test/J0/temp/solr.cloud.DistribDocExpirationUpdateProcessorTest_80AF3CD2FDE8256F-001
   [junit4]   2> May 01, 2016 6:19:39 AM com.carrotsearch.randomizedtesting.ThreadLeakControl checkThreadLeaks
   [junit4]   2> WARNING: Will linger awaiting termination of 1 leaked thread(s).
   [junit4]   2> NOTE: test params are: codec=Asserting(Lucene60): {_version_=PostingsFormat(name=Memory doPackFST= true), id=FST50}, docValues:{}, maxPointsInLeafNode=565, maxMBSortInHeap=6.518924314642957, sim=RandomSimilarity(queryNorm=false,coord=crazy): {}, locale=und, timezone=Atlantic/Stanley
   [junit4]   2> NOTE: SunOS 5.11 amd64/Oracle Corporation 1.8.0_92 (64-bit)/cpus=3,threads=1,free=73369576,total=378077184
   [junit4]   2> NOTE: All tests run in this JVM: [DisMaxRequestHandlerTest, AtomicUpdatesTest, TermsComponentTest, TestRTimerTree, TestLeaderInitiatedRecoveryThread, RankQueryTest, BlockJoinFacetSimpleTest, TestFieldCollectionResource, TlogReplayBufferedWhileIndexingTest, JSONWriterTest, TestInitParams, TestChildDocTransformer, ExitableDirectoryReaderTest, BadComponentTest, StatelessScriptUpdateProcessorFactoryTest, TestCollapseQParserPlugin, TestFaceting, HdfsBasicDistributedZkTest, UUIDFieldTest, TestManagedStopFilterFactory, TestManagedResourceStorage, DOMUtilTest, SystemInfoHandlerTest, DistributedFacetPivotLargeTest, HardAutoCommitTest, TolerantUpdateProcessorTest, TestConfigSetsAPIZkFailure, AssignTest, SliceStateTest, TestReloadAndDeleteDocs, RecoveryZkTest, ExternalFileFieldSortTest, DistributedDebugComponentTest, TestConfigSets, SparseHLLTest, DistribJoinFromCollectionTest, TestQuerySenderNoQuery, TestConfigSetImmutable, DistanceUnitsTest, TestSortingResponseWriter, TestSearcherReuse, HLLSerializationTest, TestMinMaxOnMultiValuedField, ConcurrentDeleteAndCreateCollectionTest, IndexSchemaTest, HighlighterTest, SimpleFacetsTest, TestClusterStateMutator, DocValuesMultiTest, AnalysisErrorHandlingTest, TestTestInjection, TestEmbeddedSolrServerConstructors, BufferStoreTest, WrapperMergePolicyFactoryTest, TestMergePolicyConfig, MBeansHandlerTest, TestBlendedInfixSuggestions, DistributedFacetPivotSmallAdvancedTest, TestReplicaProperties, CircularListTest, BlobRepositoryCloudTest, TestFieldTypeCollectionResource, TestDistribDocBasedVersion, TestCopyFieldCollectionResource, TestLRUCache, SchemaVersionSpecificBehaviorTest, HdfsRecoveryZkTest, SuggestComponentContextFilterQueryTest, RollingRestartTest, TestRawTransformer, TestDefaultStatsCache, HdfsLockFactoryTest, CurrencyFieldXmlFileTest, RecoveryAfterSoftCommitTest, JsonLoaderTest, SOLR749Test, SuggesterFSTTest, ZkCLITest, HdfsSyncSliceTest, TestMaxScoreQueryParser, TestStressReorder, SharedFSAutoReplicaFailoverTest, ClusterStateUpdateTest, TestExactSharedStatsCache, JavabinLoaderTest, TestLMDirichletSimilarityFactory, TestCollationFieldDocValues, TestFunctionQuery, BasicDistributedZkTest, TestCSVLoader, DataDrivenBlockJoinTest, TestPivotHelperCode, BigEndianAscendingWordSerializerTest, CollectionsAPIAsyncDistributedZkTest, TestXIncludeConfig, OutOfBoxZkACLAndCredentialsProvidersTest, ChaosMonkeyNothingIsSafeTest, TestIBSimilarityFactory, TestBlobHandler, TestDistributedSearch, XmlUpdateRequestHandlerTest, TestDFISimilarityFactory, TestStressVersions, TestSolrXml, TestAddFieldRealTimeGet, IgnoreCommitOptimizeUpdateProcessorFactoryTest, SyncSliceTest, TestDocumentBuilder, TestLFUCache, TestCloudPivotFacet, TestNoOpRegenerator, TestPKIAuthenticationPlugin, TestCustomSort, TestHighlightDedupGrouping, TestSolrCloudWithKerberosAlt, DateRangeFieldTest, RegexBoostProcessorTest, SimpleMLTQParserTest, DistributedVersionInfoTest, TestConfig, TestSha256AuthenticationProvider, TestFastLRUCache, TestMiniSolrCloudClusterSSL, TestRandomRequestDistribution, TestElisionMultitermQuery, VMParamsZkACLAndCredentialsProvidersTest, XsltUpdateRequestHandlerTest, StandardRequestHandlerTest, TestUseDocValuesAsStored, TestStressUserVersions, TestLuceneMatchVersion, MigrateRouteKeyTest, HdfsWriteToMultipleCollectionsTest, ExplicitHLLTest, AlternateDirectoryTest, TestPostingsSolrHighlighter, TestGroupingSearch, DistributedFacetPivotWhiteBoxTest, TestPartialUpdateDeduplication, LeaderElectionTest, SampleTest, PathHierarchyTokenizerFactoryTest, UnloadDistributedZkTest, CollectionsAPIDistributedZkTest, OpenCloseCoreStressTest, OverseerTest, ShardRoutingTest, BasicZkTest, TestReplicationHandler, TestRandomFaceting, TestZkChroot, TestRandomDVFaceting, TestHashPartitioner, DistributedSpellCheckComponentTest, TermVectorComponentDistributedTest, ZkControllerTest, TestRealTimeGet, TestJoin, TestCoreContainer, TestSolr4Spatial, SolrCoreTest, QueryElevationComponentTest, PeerSyncTest, ConvertedLegacyTest, TestSort, TestFiltering, BasicFunctionalityTest, TestLazyCores, DirectUpdateHandlerTest, TestBadConfig, TestIndexSearcher, SoftAutoCommitTest, ShowFileRequestHandlerTest, CurrencyFieldOpenExchangeTest, DistributedQueryElevationComponentTest, SolrIndexSplitterTest, SimplePostToolTest, AnalysisAfterCoreReloadTest, TestExtendedDismaxParser, CoreAdminHandlerTest, SolrRequestParserTest, DocValuesTest, PolyFieldTest, WordBreakSolrSpellCheckerTest, TestWordDelimiterFilterFactory, DirectUpdateHandlerOptimizeTest, TestRemoteStreaming, DebugComponentTest, IndexBasedSpellCheckerTest, TestQueryUtils, DirectSolrSpellCheckerTest, TestReversedWildcardFilterFactory, PrimitiveFieldTypeTest, DocumentBuilderTest, TermVectorComponentTest, RequiredFieldsTest, TestArbitraryIndexDir, TestCollationField, ReturnFieldsTest, TestPHPSerializedResponseWriter, PingRequestHandlerTest, RAMDirectoryFactoryTest, TestUtils, CursorPagingTest, AsyncCallRequestStatusResponseTest, BaseCdcrDistributedZkTest, CdcrReplicationDistributedZkTest, CdcrReplicationHandlerTest, CdcrRequestHandlerTest, CdcrVersionReplicationTest, CleanupOldIndexTest, CollectionStateFormat2Test, ConfigSetsAPITest, ConnectionManagerTest, CustomCollectionTest, DistribDocExpirationUpdateProcessorTest]
   [junit4] Completed [450/592 (1!)] on J0 in 69.98s, 1 test, 1 failure <<< FAILURES!

[...truncated 492 lines...]
BUILD FAILED
/export/home/jenkins/workspace/Lucene-Solr-master-Solaris/build.xml:740: The following error occurred while executing this line:
/export/home/jenkins/workspace/Lucene-Solr-master-Solaris/build.xml:684: The following error occurred while executing this line:
/export/home/jenkins/workspace/Lucene-Solr-master-Solaris/build.xml:59: The following error occurred while executing this line:
/export/home/jenkins/workspace/Lucene-Solr-master-Solaris/solr/build.xml:233: The following error occurred while executing this line:
/export/home/jenkins/workspace/Lucene-Solr-master-Solaris/solr/common-build.xml:529: The following error occurred while executing this line:
/export/home/jenkins/workspace/Lucene-Solr-master-Solaris/lucene/common-build.xml:1457: The following error occurred while executing this line:
/export/home/jenkins/workspace/Lucene-Solr-master-Solaris/lucene/common-build.xml:1014: There were test failures: 592 suites (10 ignored), 2394 tests, 1 failure, 86 ignored (71 assumptions) [seed: 80AF3CD2FDE8256F]

Total time: 87 minutes 15 seconds
Build step 'Invoke Ant' marked build as failure
Archiving artifacts
[WARNINGS] Skipping publisher since build result is FAILURE
Recording test results
Email was triggered for: Failure - Any
Sending email for trigger: Failure - Any



Mime
View raw message