lucene-dev mailing list archives

Site index · List index
Message view « Date » · « Thread »
Top « Date » · « Thread »
From Policeman Jenkins Server <jenk...@thetaphi.de>
Subject [JENKINS] Lucene-Solr-6.x-MacOSX (64bit/jdk1.8.0) - Build # 138 - Still Failing!
Date Sat, 14 May 2016 16:31:28 GMT
Build: http://jenkins.thetaphi.de/job/Lucene-Solr-6.x-MacOSX/138/
Java: 64bit/jdk1.8.0 -XX:+UseCompressedOops -XX:+UseSerialGC

3 tests failed.
FAILED:  org.apache.solr.cloud.LeaderElectionTest.testStressElection

Error Message:
Could not get leader props

Stack Trace:
java.lang.RuntimeException: Could not get leader props
	at __randomizedtesting.SeedInfo.seed([42D22A74A9578763:BD84FEDACE199670]:0)
	at org.apache.solr.cloud.LeaderElectionTest.getLeaderUrl(LeaderElectionTest.java:255)
	at org.apache.solr.cloud.LeaderElectionTest.getLeaderThread(LeaderElectionTest.java:408)
	at org.apache.solr.cloud.LeaderElectionTest.testStressElection(LeaderElectionTest.java:517)
	at sun.reflect.NativeMethodAccessorImpl.invoke0(Native Method)
	at sun.reflect.NativeMethodAccessorImpl.invoke(NativeMethodAccessorImpl.java:62)
	at sun.reflect.DelegatingMethodAccessorImpl.invoke(DelegatingMethodAccessorImpl.java:43)
	at java.lang.reflect.Method.invoke(Method.java:498)
	at com.carrotsearch.randomizedtesting.RandomizedRunner.invoke(RandomizedRunner.java:1764)
	at com.carrotsearch.randomizedtesting.RandomizedRunner$8.evaluate(RandomizedRunner.java:871)
	at com.carrotsearch.randomizedtesting.RandomizedRunner$9.evaluate(RandomizedRunner.java:907)
	at com.carrotsearch.randomizedtesting.RandomizedRunner$10.evaluate(RandomizedRunner.java:921)
	at com.carrotsearch.randomizedtesting.rules.SystemPropertiesRestoreRule$1.evaluate(SystemPropertiesRestoreRule.java:57)
	at org.apache.lucene.util.TestRuleSetupTeardownChained$1.evaluate(TestRuleSetupTeardownChained.java:49)
	at org.apache.lucene.util.AbstractBeforeAfterRule$1.evaluate(AbstractBeforeAfterRule.java:45)
	at org.apache.lucene.util.TestRuleThreadAndTestName$1.evaluate(TestRuleThreadAndTestName.java:48)
	at org.apache.lucene.util.TestRuleIgnoreAfterMaxFailures$1.evaluate(TestRuleIgnoreAfterMaxFailures.java:64)
	at org.apache.lucene.util.TestRuleMarkFailure$1.evaluate(TestRuleMarkFailure.java:47)
	at com.carrotsearch.randomizedtesting.rules.StatementAdapter.evaluate(StatementAdapter.java:36)
	at com.carrotsearch.randomizedtesting.ThreadLeakControl$StatementRunner.run(ThreadLeakControl.java:367)
	at com.carrotsearch.randomizedtesting.ThreadLeakControl.forkTimeoutingTask(ThreadLeakControl.java:809)
	at com.carrotsearch.randomizedtesting.ThreadLeakControl$3.evaluate(ThreadLeakControl.java:460)
	at com.carrotsearch.randomizedtesting.RandomizedRunner.runSingleTest(RandomizedRunner.java:880)
	at com.carrotsearch.randomizedtesting.RandomizedRunner$5.evaluate(RandomizedRunner.java:781)
	at com.carrotsearch.randomizedtesting.RandomizedRunner$6.evaluate(RandomizedRunner.java:816)
	at com.carrotsearch.randomizedtesting.RandomizedRunner$7.evaluate(RandomizedRunner.java:827)
	at com.carrotsearch.randomizedtesting.rules.StatementAdapter.evaluate(StatementAdapter.java:36)
	at com.carrotsearch.randomizedtesting.rules.SystemPropertiesRestoreRule$1.evaluate(SystemPropertiesRestoreRule.java:57)
	at org.apache.lucene.util.AbstractBeforeAfterRule$1.evaluate(AbstractBeforeAfterRule.java:45)
	at com.carrotsearch.randomizedtesting.rules.StatementAdapter.evaluate(StatementAdapter.java:36)
	at org.apache.lucene.util.TestRuleStoreClassName$1.evaluate(TestRuleStoreClassName.java:41)
	at com.carrotsearch.randomizedtesting.rules.NoShadowingOrOverridesOnMethodsRule$1.evaluate(NoShadowingOrOverridesOnMethodsRule.java:40)
	at com.carrotsearch.randomizedtesting.rules.NoShadowingOrOverridesOnMethodsRule$1.evaluate(NoShadowingOrOverridesOnMethodsRule.java:40)
	at com.carrotsearch.randomizedtesting.rules.StatementAdapter.evaluate(StatementAdapter.java:36)
	at com.carrotsearch.randomizedtesting.rules.StatementAdapter.evaluate(StatementAdapter.java:36)
	at com.carrotsearch.randomizedtesting.rules.StatementAdapter.evaluate(StatementAdapter.java:36)
	at org.apache.lucene.util.TestRuleAssertionsRequired$1.evaluate(TestRuleAssertionsRequired.java:53)
	at org.apache.lucene.util.TestRuleMarkFailure$1.evaluate(TestRuleMarkFailure.java:47)
	at org.apache.lucene.util.TestRuleIgnoreAfterMaxFailures$1.evaluate(TestRuleIgnoreAfterMaxFailures.java:64)
	at org.apache.lucene.util.TestRuleIgnoreTestSuites$1.evaluate(TestRuleIgnoreTestSuites.java:54)
	at com.carrotsearch.randomizedtesting.rules.StatementAdapter.evaluate(StatementAdapter.java:36)
	at com.carrotsearch.randomizedtesting.ThreadLeakControl$StatementRunner.run(ThreadLeakControl.java:367)
	at java.lang.Thread.run(Thread.java:745)


FAILED:  org.apache.solr.cloud.overseer.ZkStateReaderTest.testStateFormatUpdateWithExplicitRefresh

Error Message:


Stack Trace:
java.lang.NullPointerException
	at __randomizedtesting.SeedInfo.seed([42D22A74A9578763:5D685B83793741A6]:0)
	at org.apache.solr.common.cloud.ZkStateReader.refreshLegacyClusterState(ZkStateReader.java:522)
	at org.apache.solr.common.cloud.ZkStateReader.forceUpdateCollection(ZkStateReader.java:296)
	at org.apache.solr.cloud.overseer.ZkStateReaderTest.testStateFormatUpdate(ZkStateReaderTest.java:127)
	at org.apache.solr.cloud.overseer.ZkStateReaderTest.testStateFormatUpdateWithExplicitRefresh(ZkStateReaderTest.java:42)
	at sun.reflect.NativeMethodAccessorImpl.invoke0(Native Method)
	at sun.reflect.NativeMethodAccessorImpl.invoke(NativeMethodAccessorImpl.java:62)
	at sun.reflect.DelegatingMethodAccessorImpl.invoke(DelegatingMethodAccessorImpl.java:43)
	at java.lang.reflect.Method.invoke(Method.java:498)
	at com.carrotsearch.randomizedtesting.RandomizedRunner.invoke(RandomizedRunner.java:1764)
	at com.carrotsearch.randomizedtesting.RandomizedRunner$8.evaluate(RandomizedRunner.java:871)
	at com.carrotsearch.randomizedtesting.RandomizedRunner$9.evaluate(RandomizedRunner.java:907)
	at com.carrotsearch.randomizedtesting.RandomizedRunner$10.evaluate(RandomizedRunner.java:921)
	at com.carrotsearch.randomizedtesting.rules.SystemPropertiesRestoreRule$1.evaluate(SystemPropertiesRestoreRule.java:57)
	at org.apache.lucene.util.TestRuleSetupTeardownChained$1.evaluate(TestRuleSetupTeardownChained.java:49)
	at org.apache.lucene.util.AbstractBeforeAfterRule$1.evaluate(AbstractBeforeAfterRule.java:45)
	at org.apache.lucene.util.TestRuleThreadAndTestName$1.evaluate(TestRuleThreadAndTestName.java:48)
	at org.apache.lucene.util.TestRuleIgnoreAfterMaxFailures$1.evaluate(TestRuleIgnoreAfterMaxFailures.java:64)
	at org.apache.lucene.util.TestRuleMarkFailure$1.evaluate(TestRuleMarkFailure.java:47)
	at com.carrotsearch.randomizedtesting.rules.StatementAdapter.evaluate(StatementAdapter.java:36)
	at com.carrotsearch.randomizedtesting.ThreadLeakControl$StatementRunner.run(ThreadLeakControl.java:367)
	at com.carrotsearch.randomizedtesting.ThreadLeakControl.forkTimeoutingTask(ThreadLeakControl.java:809)
	at com.carrotsearch.randomizedtesting.ThreadLeakControl$3.evaluate(ThreadLeakControl.java:460)
	at com.carrotsearch.randomizedtesting.RandomizedRunner.runSingleTest(RandomizedRunner.java:880)
	at com.carrotsearch.randomizedtesting.RandomizedRunner$5.evaluate(RandomizedRunner.java:781)
	at com.carrotsearch.randomizedtesting.RandomizedRunner$6.evaluate(RandomizedRunner.java:816)
	at com.carrotsearch.randomizedtesting.RandomizedRunner$7.evaluate(RandomizedRunner.java:827)
	at com.carrotsearch.randomizedtesting.rules.StatementAdapter.evaluate(StatementAdapter.java:36)
	at com.carrotsearch.randomizedtesting.rules.SystemPropertiesRestoreRule$1.evaluate(SystemPropertiesRestoreRule.java:57)
	at org.apache.lucene.util.AbstractBeforeAfterRule$1.evaluate(AbstractBeforeAfterRule.java:45)
	at com.carrotsearch.randomizedtesting.rules.StatementAdapter.evaluate(StatementAdapter.java:36)
	at org.apache.lucene.util.TestRuleStoreClassName$1.evaluate(TestRuleStoreClassName.java:41)
	at com.carrotsearch.randomizedtesting.rules.NoShadowingOrOverridesOnMethodsRule$1.evaluate(NoShadowingOrOverridesOnMethodsRule.java:40)
	at com.carrotsearch.randomizedtesting.rules.NoShadowingOrOverridesOnMethodsRule$1.evaluate(NoShadowingOrOverridesOnMethodsRule.java:40)
	at com.carrotsearch.randomizedtesting.rules.StatementAdapter.evaluate(StatementAdapter.java:36)
	at com.carrotsearch.randomizedtesting.rules.StatementAdapter.evaluate(StatementAdapter.java:36)
	at com.carrotsearch.randomizedtesting.rules.StatementAdapter.evaluate(StatementAdapter.java:36)
	at org.apache.lucene.util.TestRuleAssertionsRequired$1.evaluate(TestRuleAssertionsRequired.java:53)
	at org.apache.lucene.util.TestRuleMarkFailure$1.evaluate(TestRuleMarkFailure.java:47)
	at org.apache.lucene.util.TestRuleIgnoreAfterMaxFailures$1.evaluate(TestRuleIgnoreAfterMaxFailures.java:64)
	at org.apache.lucene.util.TestRuleIgnoreTestSuites$1.evaluate(TestRuleIgnoreTestSuites.java:54)
	at com.carrotsearch.randomizedtesting.rules.StatementAdapter.evaluate(StatementAdapter.java:36)
	at com.carrotsearch.randomizedtesting.ThreadLeakControl$StatementRunner.run(ThreadLeakControl.java:367)
	at java.lang.Thread.run(Thread.java:745)


FAILED:  org.apache.solr.cloud.overseer.ZkStateReaderTest.testStateFormatUpdateWithTimeDelay

Error Message:
expected:<2> but was:<1>

Stack Trace:
java.lang.AssertionError: expected:<2> but was:<1>
	at __randomizedtesting.SeedInfo.seed([42D22A74A9578763:3D4C9DF1C035AAE9]:0)
	at org.junit.Assert.fail(Assert.java:93)
	at org.junit.Assert.failNotEquals(Assert.java:647)
	at org.junit.Assert.assertEquals(Assert.java:128)
	at org.junit.Assert.assertEquals(Assert.java:472)
	at org.junit.Assert.assertEquals(Assert.java:456)
	at org.apache.solr.cloud.overseer.ZkStateReaderTest.testStateFormatUpdate(ZkStateReaderTest.java:138)
	at org.apache.solr.cloud.overseer.ZkStateReaderTest.testStateFormatUpdateWithTimeDelay(ZkStateReaderTest.java:52)
	at sun.reflect.NativeMethodAccessorImpl.invoke0(Native Method)
	at sun.reflect.NativeMethodAccessorImpl.invoke(NativeMethodAccessorImpl.java:62)
	at sun.reflect.DelegatingMethodAccessorImpl.invoke(DelegatingMethodAccessorImpl.java:43)
	at java.lang.reflect.Method.invoke(Method.java:498)
	at com.carrotsearch.randomizedtesting.RandomizedRunner.invoke(RandomizedRunner.java:1764)
	at com.carrotsearch.randomizedtesting.RandomizedRunner$8.evaluate(RandomizedRunner.java:871)
	at com.carrotsearch.randomizedtesting.RandomizedRunner$9.evaluate(RandomizedRunner.java:907)
	at com.carrotsearch.randomizedtesting.RandomizedRunner$10.evaluate(RandomizedRunner.java:921)
	at com.carrotsearch.randomizedtesting.rules.SystemPropertiesRestoreRule$1.evaluate(SystemPropertiesRestoreRule.java:57)
	at org.apache.lucene.util.TestRuleSetupTeardownChained$1.evaluate(TestRuleSetupTeardownChained.java:49)
	at org.apache.lucene.util.AbstractBeforeAfterRule$1.evaluate(AbstractBeforeAfterRule.java:45)
	at org.apache.lucene.util.TestRuleThreadAndTestName$1.evaluate(TestRuleThreadAndTestName.java:48)
	at org.apache.lucene.util.TestRuleIgnoreAfterMaxFailures$1.evaluate(TestRuleIgnoreAfterMaxFailures.java:64)
	at org.apache.lucene.util.TestRuleMarkFailure$1.evaluate(TestRuleMarkFailure.java:47)
	at com.carrotsearch.randomizedtesting.rules.StatementAdapter.evaluate(StatementAdapter.java:36)
	at com.carrotsearch.randomizedtesting.ThreadLeakControl$StatementRunner.run(ThreadLeakControl.java:367)
	at com.carrotsearch.randomizedtesting.ThreadLeakControl.forkTimeoutingTask(ThreadLeakControl.java:809)
	at com.carrotsearch.randomizedtesting.ThreadLeakControl$3.evaluate(ThreadLeakControl.java:460)
	at com.carrotsearch.randomizedtesting.RandomizedRunner.runSingleTest(RandomizedRunner.java:880)
	at com.carrotsearch.randomizedtesting.RandomizedRunner$5.evaluate(RandomizedRunner.java:781)
	at com.carrotsearch.randomizedtesting.RandomizedRunner$6.evaluate(RandomizedRunner.java:816)
	at com.carrotsearch.randomizedtesting.RandomizedRunner$7.evaluate(RandomizedRunner.java:827)
	at com.carrotsearch.randomizedtesting.rules.StatementAdapter.evaluate(StatementAdapter.java:36)
	at com.carrotsearch.randomizedtesting.rules.SystemPropertiesRestoreRule$1.evaluate(SystemPropertiesRestoreRule.java:57)
	at org.apache.lucene.util.AbstractBeforeAfterRule$1.evaluate(AbstractBeforeAfterRule.java:45)
	at com.carrotsearch.randomizedtesting.rules.StatementAdapter.evaluate(StatementAdapter.java:36)
	at org.apache.lucene.util.TestRuleStoreClassName$1.evaluate(TestRuleStoreClassName.java:41)
	at com.carrotsearch.randomizedtesting.rules.NoShadowingOrOverridesOnMethodsRule$1.evaluate(NoShadowingOrOverridesOnMethodsRule.java:40)
	at com.carrotsearch.randomizedtesting.rules.NoShadowingOrOverridesOnMethodsRule$1.evaluate(NoShadowingOrOverridesOnMethodsRule.java:40)
	at com.carrotsearch.randomizedtesting.rules.StatementAdapter.evaluate(StatementAdapter.java:36)
	at com.carrotsearch.randomizedtesting.rules.StatementAdapter.evaluate(StatementAdapter.java:36)
	at com.carrotsearch.randomizedtesting.rules.StatementAdapter.evaluate(StatementAdapter.java:36)
	at org.apache.lucene.util.TestRuleAssertionsRequired$1.evaluate(TestRuleAssertionsRequired.java:53)
	at org.apache.lucene.util.TestRuleMarkFailure$1.evaluate(TestRuleMarkFailure.java:47)
	at org.apache.lucene.util.TestRuleIgnoreAfterMaxFailures$1.evaluate(TestRuleIgnoreAfterMaxFailures.java:64)
	at org.apache.lucene.util.TestRuleIgnoreTestSuites$1.evaluate(TestRuleIgnoreTestSuites.java:54)
	at com.carrotsearch.randomizedtesting.rules.StatementAdapter.evaluate(StatementAdapter.java:36)
	at com.carrotsearch.randomizedtesting.ThreadLeakControl$StatementRunner.run(ThreadLeakControl.java:367)
	at java.lang.Thread.run(Thread.java:745)




Build Log:
[...truncated 10993 lines...]
   [junit4] Suite: org.apache.solr.cloud.overseer.ZkStateReaderTest
   [junit4]   2> Creating dataDir: /Users/jenkins/workspace/Lucene-Solr-6.x-MacOSX/solr/build/solr-core/test/J0/temp/solr.cloud.overseer.ZkStateReaderTest_42D22A74A9578763-001/init-core-data-001
   [junit4]   2> 1373803 INFO  (SUITE-ZkStateReaderTest-seed#[42D22A74A9578763]-worker) [    ] o.a.s.SolrTestCaseJ4 Randomized ssl (false) and clientAuth (false)
   [junit4]   2> 1373805 INFO  (TEST-ZkStateReaderTest.testWatchedCollectionCreation-seed#[42D22A74A9578763]) [    ] o.a.s.SolrTestCaseJ4 ###Starting testWatchedCollectionCreation
   [junit4]   2> 1373805 INFO  (TEST-ZkStateReaderTest.testWatchedCollectionCreation-seed#[42D22A74A9578763]) [    ] o.a.s.c.ZkTestServer STARTING ZK TEST SERVER
   [junit4]   2> 1373806 INFO  (Thread-2678) [    ] o.a.s.c.ZkTestServer client port:0.0.0.0/0.0.0.0:0
   [junit4]   2> 1373806 INFO  (Thread-2678) [    ] o.a.s.c.ZkTestServer Starting server
   [junit4]   2> 1373908 INFO  (TEST-ZkStateReaderTest.testWatchedCollectionCreation-seed#[42D22A74A9578763]) [    ] o.a.s.c.ZkTestServer start zk server on port:56666
   [junit4]   2> 1373908 INFO  (TEST-ZkStateReaderTest.testWatchedCollectionCreation-seed#[42D22A74A9578763]) [    ] o.a.s.c.c.SolrZkClient Using default ZkCredentialsProvider
   [junit4]   2> 1373909 INFO  (TEST-ZkStateReaderTest.testWatchedCollectionCreation-seed#[42D22A74A9578763]) [    ] o.a.s.c.c.ConnectionManager Waiting for client to connect to ZooKeeper
   [junit4]   2> 1374273 INFO  (zkCallback-1530-thread-1) [    ] o.a.s.c.c.ConnectionManager Watcher org.apache.solr.common.cloud.ConnectionManager@52a60f6a name:ZooKeeperConnection Watcher:127.0.0.1:56666 got event WatchedEvent state:SyncConnected type:None path:null path:null type:None
   [junit4]   2> 1374274 INFO  (TEST-ZkStateReaderTest.testWatchedCollectionCreation-seed#[42D22A74A9578763]) [    ] o.a.s.c.c.ConnectionManager Client is connected to ZooKeeper
   [junit4]   2> 1374274 INFO  (TEST-ZkStateReaderTest.testWatchedCollectionCreation-seed#[42D22A74A9578763]) [    ] o.a.s.c.c.SolrZkClient Using default ZkACLProvider
   [junit4]   2> 1374275 INFO  (TEST-ZkStateReaderTest.testWatchedCollectionCreation-seed#[42D22A74A9578763]) [    ] o.a.s.c.c.SolrZkClient Using default ZkCredentialsProvider
   [junit4]   2> 1374276 INFO  (TEST-ZkStateReaderTest.testWatchedCollectionCreation-seed#[42D22A74A9578763]) [    ] o.a.s.c.c.ConnectionManager Waiting for client to connect to ZooKeeper
   [junit4]   2> 1374278 INFO  (zkCallback-1531-thread-1) [    ] o.a.s.c.c.ConnectionManager Watcher org.apache.solr.common.cloud.ConnectionManager@68cf8cd2 name:ZooKeeperConnection Watcher:127.0.0.1:56666 got event WatchedEvent state:SyncConnected type:None path:null path:null type:None
   [junit4]   2> 1374278 INFO  (TEST-ZkStateReaderTest.testWatchedCollectionCreation-seed#[42D22A74A9578763]) [    ] o.a.s.c.c.ConnectionManager Client is connected to ZooKeeper
   [junit4]   2> 1374278 INFO  (TEST-ZkStateReaderTest.testWatchedCollectionCreation-seed#[42D22A74A9578763]) [    ] o.a.s.c.c.SolrZkClient Using default ZkACLProvider
   [junit4]   2> 1374278 INFO  (TEST-ZkStateReaderTest.testWatchedCollectionCreation-seed#[42D22A74A9578763]) [    ] o.a.s.c.c.SolrZkClient makePath: /solr
   [junit4]   2> 1374294 INFO  (TEST-ZkStateReaderTest.testWatchedCollectionCreation-seed#[42D22A74A9578763]) [    ] o.a.s.c.c.SolrZkClient Using default ZkCredentialsProvider
   [junit4]   2> 1374294 INFO  (TEST-ZkStateReaderTest.testWatchedCollectionCreation-seed#[42D22A74A9578763]) [    ] o.a.s.c.c.ConnectionManager Waiting for client to connect to ZooKeeper
   [junit4]   2> 1374296 INFO  (zkCallback-1532-thread-1) [    ] o.a.s.c.c.ConnectionManager Watcher org.apache.solr.common.cloud.ConnectionManager@8e6300c name:ZooKeeperConnection Watcher:127.0.0.1:56666/solr got event WatchedEvent state:SyncConnected type:None path:null path:null type:None
   [junit4]   2> 1374296 INFO  (TEST-ZkStateReaderTest.testWatchedCollectionCreation-seed#[42D22A74A9578763]) [    ] o.a.s.c.c.ConnectionManager Client is connected to ZooKeeper
   [junit4]   2> 1374297 INFO  (TEST-ZkStateReaderTest.testWatchedCollectionCreation-seed#[42D22A74A9578763]) [    ] o.a.s.c.c.SolrZkClient Using default ZkACLProvider
   [junit4]   2> 1374297 INFO  (TEST-ZkStateReaderTest.testWatchedCollectionCreation-seed#[42D22A74A9578763]) [    ] o.a.s.c.c.SolrZkClient makePath: /live_nodes
   [junit4]   2> 1374300 INFO  (TEST-ZkStateReaderTest.testWatchedCollectionCreation-seed#[42D22A74A9578763]) [    ] o.a.s.c.c.SolrZkClient makePath: /collections
   [junit4]   2> 1374302 INFO  (TEST-ZkStateReaderTest.testWatchedCollectionCreation-seed#[42D22A74A9578763]) [    ] o.a.s.c.c.SolrZkClient makePath: /aliases.json
   [junit4]   2> 1374305 INFO  (TEST-ZkStateReaderTest.testWatchedCollectionCreation-seed#[42D22A74A9578763]) [    ] o.a.s.c.c.SolrZkClient makePath: /clusterstate.json
   [junit4]   2> 1374307 INFO  (TEST-ZkStateReaderTest.testWatchedCollectionCreation-seed#[42D22A74A9578763]) [    ] o.a.s.c.c.SolrZkClient makePath: /security.json
   [junit4]   2> 1374308 INFO  (TEST-ZkStateReaderTest.testWatchedCollectionCreation-seed#[42D22A74A9578763]) [    ] o.a.s.c.c.ZkStateReader Updating cluster state from ZooKeeper... 
   [junit4]   2> 1374309 INFO  (TEST-ZkStateReaderTest.testWatchedCollectionCreation-seed#[42D22A74A9578763]) [    ] o.a.s.c.c.ZkStateReader Loaded empty cluster properties
   [junit4]   2> 1374310 INFO  (TEST-ZkStateReaderTest.testWatchedCollectionCreation-seed#[42D22A74A9578763]) [    ] o.a.s.c.c.ZkStateReader Updated live nodes from ZooKeeper... (0) -> (0)
   [junit4]   2> 1374314 INFO  (TEST-ZkStateReaderTest.testWatchedCollectionCreation-seed#[42D22A74A9578763]) [    ] o.a.s.c.c.ZkStateReader Deleting data for [c1]
   [junit4]   2> 1374314 INFO  (TEST-ZkStateReaderTest.testWatchedCollectionCreation-seed#[42D22A74A9578763]) [    ] o.a.s.c.c.SolrZkClient makePath: /collections/c1
   [junit4]   2> 1374316 INFO  (zkCallback-1532-thread-1) [    ] o.a.s.c.c.ZkStateReader A collections change: [WatchedEvent state:SyncConnected type:NodeChildrenChanged path:/collections], has occurred - updating...
   [junit4]   2> 1374320 INFO  (TEST-ZkStateReaderTest.testWatchedCollectionCreation-seed#[42D22A74A9578763]) [    ] o.a.s.c.o.ZkStateWriter going to create_collection /collections/c1/state.json
   [junit4]   2> 1374320 INFO  (zkCallback-1532-thread-1) [    ] o.a.s.c.c.ZkStateReader A cluster state change: [WatchedEvent state:SyncConnected type:NodeCreated path:/collections/c1/state.json] for collection [c1] has occurred - updating... (live nodes size: [0])
   [junit4]   2> 1374321 INFO  (zkCallback-1532-thread-1) [    ] o.a.s.c.c.ZkStateReader Add data for [c1] ver [0]
   [junit4]   2> 1374379 INFO  (TEST-ZkStateReaderTest.testWatchedCollectionCreation-seed#[42D22A74A9578763]) [    ] o.a.s.c.ZkTestServer connecting to 127.0.0.1:56666 56666
   [junit4]   2> 1374473 INFO  (Thread-2678) [    ] o.a.s.c.ZkTestServer connecting to 127.0.0.1:56666 56666
   [junit4]   2> 1376494 INFO  (TEST-ZkStateReaderTest.testWatchedCollectionCreation-seed#[42D22A74A9578763]) [    ] o.a.s.SolrTestCaseJ4 ###Ending testWatchedCollectionCreation
   [junit4]   2> 1376496 INFO  (TEST-ZkStateReaderTest.testStateFormatUpdateWithExplicitRefresh-seed#[42D22A74A9578763]) [    ] o.a.s.SolrTestCaseJ4 ###Starting testStateFormatUpdateWithExplicitRefresh
   [junit4]   2> 1376496 INFO  (TEST-ZkStateReaderTest.testStateFormatUpdateWithExplicitRefresh-seed#[42D22A74A9578763]) [    ] o.a.s.c.ZkTestServer STARTING ZK TEST SERVER
   [junit4]   2> 1376497 INFO  (Thread-2679) [    ] o.a.s.c.ZkTestServer client port:0.0.0.0/0.0.0.0:0
   [junit4]   2> 1376497 INFO  (Thread-2679) [    ] o.a.s.c.ZkTestServer Starting server
   [junit4]   2> 1376605 INFO  (TEST-ZkStateReaderTest.testStateFormatUpdateWithExplicitRefresh-seed#[42D22A74A9578763]) [    ] o.a.s.c.ZkTestServer start zk server on port:56692
   [junit4]   2> 1376606 INFO  (TEST-ZkStateReaderTest.testStateFormatUpdateWithExplicitRefresh-seed#[42D22A74A9578763]) [    ] o.a.s.c.c.SolrZkClient Using default ZkCredentialsProvider
   [junit4]   2> 1376606 INFO  (TEST-ZkStateReaderTest.testStateFormatUpdateWithExplicitRefresh-seed#[42D22A74A9578763]) [    ] o.a.s.c.c.ConnectionManager Waiting for client to connect to ZooKeeper
   [junit4]   2> 1376624 INFO  (zkCallback-1534-thread-1) [    ] o.a.s.c.c.ConnectionManager Watcher org.apache.solr.common.cloud.ConnectionManager@29ddd78 name:ZooKeeperConnection Watcher:127.0.0.1:56692 got event WatchedEvent state:SyncConnected type:None path:null path:null type:None
   [junit4]   2> 1376624 INFO  (TEST-ZkStateReaderTest.testStateFormatUpdateWithExplicitRefresh-seed#[42D22A74A9578763]) [    ] o.a.s.c.c.ConnectionManager Client is connected to ZooKeeper
   [junit4]   2> 1376625 INFO  (TEST-ZkStateReaderTest.testStateFormatUpdateWithExplicitRefresh-seed#[42D22A74A9578763]) [    ] o.a.s.c.c.SolrZkClient Using default ZkACLProvider
   [junit4]   2> 1376627 INFO  (TEST-ZkStateReaderTest.testStateFormatUpdateWithExplicitRefresh-seed#[42D22A74A9578763]) [    ] o.a.s.c.c.SolrZkClient Using default ZkCredentialsProvider
   [junit4]   2> 1376628 INFO  (TEST-ZkStateReaderTest.testStateFormatUpdateWithExplicitRefresh-seed#[42D22A74A9578763]) [    ] o.a.s.c.c.ConnectionManager Waiting for client to connect to ZooKeeper
   [junit4]   2> 1376628 WARN  (NIOServerCxn.Factory:0.0.0.0/0.0.0.0:0) [    ] o.a.z.s.NIOServerCnxn caught end of stream exception
   [junit4]   2> EndOfStreamException: Unable to read additional data from client sessionid 0x154aff2fe650000, likely client has closed socket
   [junit4]   2> 	at org.apache.zookeeper.server.NIOServerCnxn.doIO(NIOServerCnxn.java:228)
   [junit4]   2> 	at org.apache.zookeeper.server.NIOServerCnxnFactory.run(NIOServerCnxnFactory.java:208)
   [junit4]   2> 	at java.lang.Thread.run(Thread.java:745)
   [junit4]   2> 1376629 INFO  (zkCallback-1535-thread-1) [    ] o.a.s.c.c.ConnectionManager Watcher org.apache.solr.common.cloud.ConnectionManager@69dcc7ed name:ZooKeeperConnection Watcher:127.0.0.1:56692 got event WatchedEvent state:SyncConnected type:None path:null path:null type:None
   [junit4]   2> 1376630 INFO  (TEST-ZkStateReaderTest.testStateFormatUpdateWithExplicitRefresh-seed#[42D22A74A9578763]) [    ] o.a.s.c.c.ConnectionManager Client is connected to ZooKeeper
   [junit4]   2> 1376630 INFO  (TEST-ZkStateReaderTest.testStateFormatUpdateWithExplicitRefresh-seed#[42D22A74A9578763]) [    ] o.a.s.c.c.SolrZkClient Using default ZkACLProvider
   [junit4]   2> 1376630 INFO  (TEST-ZkStateReaderTest.testStateFormatUpdateWithExplicitRefresh-seed#[42D22A74A9578763]) [    ] o.a.s.c.c.SolrZkClient makePath: /solr
   [junit4]   2> 1376651 INFO  (TEST-ZkStateReaderTest.testStateFormatUpdateWithExplicitRefresh-seed#[42D22A74A9578763]) [    ] o.a.s.c.c.SolrZkClient Using default ZkCredentialsProvider
   [junit4]   2> 1376652 INFO  (TEST-ZkStateReaderTest.testStateFormatUpdateWithExplicitRefresh-seed#[42D22A74A9578763]) [    ] o.a.s.c.c.ConnectionManager Waiting for client to connect to ZooKeeper
   [junit4]   2> 1376652 WARN  (NIOServerCxn.Factory:0.0.0.0/0.0.0.0:0) [    ] o.a.z.s.NIOServerCnxn caught end of stream exception
   [junit4]   2> EndOfStreamException: Unable to read additional data from client sessionid 0x154aff2fe650001, likely client has closed socket
   [junit4]   2> 	at org.apache.zookeeper.server.NIOServerCnxn.doIO(NIOServerCnxn.java:228)
   [junit4]   2> 	at org.apache.zookeeper.server.NIOServerCnxnFactory.run(NIOServerCnxnFactory.java:208)
   [junit4]   2> 	at java.lang.Thread.run(Thread.java:745)
   [junit4]   2> 1376668 INFO  (zkCallback-1536-thread-1) [    ] o.a.s.c.c.ConnectionManager Watcher org.apache.solr.common.cloud.ConnectionManager@77e3482a name:ZooKeeperConnection Watcher:127.0.0.1:56692/solr got event WatchedEvent state:SyncConnected type:None path:null path:null type:None
   [junit4]   2> 1376668 INFO  (TEST-ZkStateReaderTest.testStateFormatUpdateWithExplicitRefresh-seed#[42D22A74A9578763]) [    ] o.a.s.c.c.ConnectionManager Client is connected to ZooKeeper
   [junit4]   2> 1376668 INFO  (TEST-ZkStateReaderTest.testStateFormatUpdateWithExplicitRefresh-seed#[42D22A74A9578763]) [    ] o.a.s.c.c.SolrZkClient Using default ZkACLProvider
   [junit4]   2> 1376672 INFO  (TEST-ZkStateReaderTest.testStateFormatUpdateWithExplicitRefresh-seed#[42D22A74A9578763]) [    ] o.a.s.c.c.SolrZkClient makePath: /live_nodes
   [junit4]   2> 1376683 INFO  (TEST-ZkStateReaderTest.testStateFormatUpdateWithExplicitRefresh-seed#[42D22A74A9578763]) [    ] o.a.s.c.c.SolrZkClient makePath: /collections
   [junit4]   2> 1376711 INFO  (TEST-ZkStateReaderTest.testStateFormatUpdateWithExplicitRefresh-seed#[42D22A74A9578763]) [    ] o.a.s.c.c.SolrZkClient makePath: /aliases.json
   [junit4]   2> 1376713 INFO  (TEST-ZkStateReaderTest.testStateFormatUpdateWithExplicitRefresh-seed#[42D22A74A9578763]) [    ] o.a.s.c.c.SolrZkClient makePath: /clusterstate.json
   [junit4]   2> 1376741 INFO  (TEST-ZkStateReaderTest.testStateFormatUpdateWithExplicitRefresh-seed#[42D22A74A9578763]) [    ] o.a.s.c.c.SolrZkClient makePath: /security.json
   [junit4]   2> 1376747 INFO  (TEST-ZkStateReaderTest.testStateFormatUpdateWithExplicitRefresh-seed#[42D22A74A9578763]) [    ] o.a.s.c.c.ZkStateReader Updating cluster state from ZooKeeper... 
   [junit4]   2> 1376748 INFO  (TEST-ZkStateReaderTest.testStateFormatUpdateWithExplicitRefresh-seed#[42D22A74A9578763]) [    ] o.a.s.c.c.ZkStateReader Loaded empty cluster properties
   [junit4]   2> 1376750 INFO  (TEST-ZkStateReaderTest.testStateFormatUpdateWithExplicitRefresh-seed#[42D22A74A9578763]) [    ] o.a.s.c.c.ZkStateReader Updated live nodes from ZooKeeper... (0) -> (0)
   [junit4]   2> 1376753 INFO  (TEST-ZkStateReaderTest.testStateFormatUpdateWithExplicitRefresh-seed#[42D22A74A9578763]) [    ] o.a.s.c.c.ZkStateReader Deleting data for [c1]
   [junit4]   2> 1376753 INFO  (TEST-ZkStateReaderTest.testStateFormatUpdateWithExplicitRefresh-seed#[42D22A74A9578763]) [    ] o.a.s.c.c.SolrZkClient makePath: /collections/c1
   [junit4]   2> 1376755 INFO  (zkCallback-1536-thread-1) [    ] o.a.s.c.c.ZkStateReader A collections change: [WatchedEvent state:SyncConnected type:NodeChildrenChanged path:/collections], has occurred - updating...
   [junit4]   2> 1376757 INFO  (zkCallback-1536-thread-1) [    ] o.a.s.c.c.ZkStateReader A cluster state change: [WatchedEvent state:SyncConnected type:NodeDataChanged path:/clusterstate.json], has occurred - updating... (live nodes size: [0])
   [junit4]   2> 1376759 INFO  (TEST-ZkStateReaderTest.testStateFormatUpdateWithExplicitRefresh-seed#[42D22A74A9578763]) [    ] o.a.s.c.o.ZkStateWriter going to create_collection /collections/c1/state.json
   [junit4]   2> 1376760 INFO  (zkCallback-1536-thread-1) [    ] o.a.s.c.c.ZkStateReader A cluster state change: [WatchedEvent state:SyncConnected type:NodeCreated path:/collections/c1/state.json] for collection [c1] has occurred - updating... (live nodes size: [0])
   [junit4]   2> 1376760 INFO  (zkCallback-1536-thread-2) [    ] o.a.s.c.c.ZkStateReader A cluster state change: [WatchedEvent state:SyncConnected type:NodeDataChanged path:/clusterstate.json], has occurred - updating... (live nodes size: [0])
   [junit4]   2> 1376761 INFO  (zkCallback-1536-thread-1) [    ] o.a.s.c.c.ZkStateReader Add data for [c1] ver [0]
   [junit4]   2> 1376764 INFO  (TEST-ZkStateReaderTest.testStateFormatUpdateWithExplicitRefresh-seed#[42D22A74A9578763]) [    ] o.a.s.c.ZkTestServer connecting to 127.0.0.1:56692 56692
   [junit4]   2> 1377886 INFO  (Thread-2679) [    ] o.a.s.c.ZkTestServer connecting to 127.0.0.1:56692 56692
   [junit4]   2> 1379453 INFO  (TEST-ZkStateReaderTest.testStateFormatUpdateWithExplicitRefresh-seed#[42D22A74A9578763]) [    ] o.a.s.SolrTestCaseJ4 ###Ending testStateFormatUpdateWithExplicitRefresh
   [junit4]   2> NOTE: reproduce with: ant test  -Dtestcase=ZkStateReaderTest -Dtests.method=testStateFormatUpdateWithExplicitRefresh -Dtests.seed=42D22A74A9578763 -Dtests.slow=true -Dtests.locale=de -Dtests.timezone=America/Argentina/San_Juan -Dtests.asserts=true -Dtests.file.encoding=UTF-8
   [junit4] ERROR   2.97s J0 | ZkStateReaderTest.testStateFormatUpdateWithExplicitRefresh <<<
   [junit4]    > Throwable #1: java.lang.NullPointerException
   [junit4]    > 	at __randomizedtesting.SeedInfo.seed([42D22A74A9578763:5D685B83793741A6]:0)
   [junit4]    > 	at org.apache.solr.common.cloud.ZkStateReader.refreshLegacyClusterState(ZkStateReader.java:522)
   [junit4]    > 	at org.apache.solr.common.cloud.ZkStateReader.forceUpdateCollection(ZkStateReader.java:296)
   [junit4]    > 	at org.apache.solr.cloud.overseer.ZkStateReaderTest.testStateFormatUpdate(ZkStateReaderTest.java:127)
   [junit4]    > 	at org.apache.solr.cloud.overseer.ZkStateReaderTest.testStateFormatUpdateWithExplicitRefresh(ZkStateReaderTest.java:42)
   [junit4]    > 	at java.lang.Thread.run(Thread.java:745)
   [junit4]   2> 1379462 INFO  (TEST-ZkStateReaderTest.testStateFormatUpdateWithTimeDelayLazy-seed#[42D22A74A9578763]) [    ] o.a.s.SolrTestCaseJ4 ###Starting testStateFormatUpdateWithTimeDelayLazy
   [junit4]   2> 1379463 INFO  (TEST-ZkStateReaderTest.testStateFormatUpdateWithTimeDelayLazy-seed#[42D22A74A9578763]) [    ] o.a.s.c.ZkTestServer STARTING ZK TEST SERVER
   [junit4]   2> 1379463 INFO  (Thread-2680) [    ] o.a.s.c.ZkTestServer client port:0.0.0.0/0.0.0.0:0
   [junit4]   2> 1379463 INFO  (Thread-2680) [    ] o.a.s.c.ZkTestServer Starting server
   [junit4]   2> 1379565 INFO  (TEST-ZkStateReaderTest.testStateFormatUpdateWithTimeDelayLazy-seed#[42D22A74A9578763]) [    ] o.a.s.c.ZkTestServer start zk server on port:56737
   [junit4]   2> 1379566 INFO  (TEST-ZkStateReaderTest.testStateFormatUpdateWithTimeDelayLazy-seed#[42D22A74A9578763]) [    ] o.a.s.c.c.SolrZkClient Using default ZkCredentialsProvider
   [junit4]   2> 1379566 INFO  (TEST-ZkStateReaderTest.testStateFormatUpdateWithTimeDelayLazy-seed#[42D22A74A9578763]) [    ] o.a.s.c.c.ConnectionManager Waiting for client to connect to ZooKeeper
   [junit4]   2> 1379575 INFO  (zkCallback-1538-thread-1) [    ] o.a.s.c.c.ConnectionManager Watcher org.apache.solr.common.cloud.ConnectionManager@64ed0997 name:ZooKeeperConnection Watcher:127.0.0.1:56737 got event WatchedEvent state:SyncConnected type:None path:null path:null type:None
   [junit4]   2> 1379575 INFO  (TEST-ZkStateReaderTest.testStateFormatUpdateWithTimeDelayLazy-seed#[42D22A74A9578763]) [    ] o.a.s.c.c.ConnectionManager Client is connected to ZooKeeper
   [junit4]   2> 1379575 INFO  (TEST-ZkStateReaderTest.testStateFormatUpdateWithTimeDelayLazy-seed#[42D22A74A9578763]) [    ] o.a.s.c.c.SolrZkClient Using default ZkACLProvider
   [junit4]   2> 1379576 INFO  (TEST-ZkStateReaderTest.testStateFormatUpdateWithTimeDelayLazy-seed#[42D22A74A9578763]) [    ] o.a.s.c.c.SolrZkClient Using default ZkCredentialsProvider
   [junit4]   2> 1379577 INFO  (TEST-ZkStateReaderTest.testStateFormatUpdateWithTimeDelayLazy-seed#[42D22A74A9578763]) [    ] o.a.s.c.c.ConnectionManager Waiting for client to connect to ZooKeeper
   [junit4]   2> 1379578 INFO  (zkCallback-1539-thread-1) [    ] o.a.s.c.c.ConnectionManager Watcher org.apache.solr.common.cloud.ConnectionManager@3d10998d name:ZooKeeperConnection Watcher:127.0.0.1:56737 got event WatchedEvent state:SyncConnected type:None path:null path:null type:None
   [junit4]   2> 1379578 INFO  (TEST-ZkStateReaderTest.testStateFormatUpdateWithTimeDelayLazy-seed#[42D22A74A9578763]) [    ] o.a.s.c.c.ConnectionManager Client is connected to ZooKeeper
   [junit4]   2> 1379579 INFO  (TEST-ZkStateReaderTest.testStateFormatUpdateWithTimeDelayLazy-seed#[42D22A74A9578763]) [    ] o.a.s.c.c.SolrZkClient Using default ZkACLProvider
   [junit4]   2> 1379579 INFO  (TEST-ZkStateReaderTest.testStateFormatUpdateWithTimeDelayLazy-seed#[42D22A74A9578763]) [    ] o.a.s.c.c.SolrZkClient makePath: /solr
   [junit4]   2> 1379582 INFO  (TEST-ZkStateReaderTest.testStateFormatUpdateWithTimeDelayLazy-seed#[42D22A74A9578763]) [    ] o.a.s.c.c.SolrZkClient Using default ZkCredentialsProvider
   [junit4]   2> 1379582 INFO  (TEST-ZkStateReaderTest.testStateFormatUpdateWithTimeDelayLazy-seed#[42D22A74A9578763]) [    ] o.a.s.c.c.ConnectionManager Waiting for client to connect to ZooKeeper
   [junit4]   2> 1379584 INFO  (zkCallback-1540-thread-1) [    ] o.a.s.c.c.ConnectionManager Watcher org.apache.solr.common.cloud.ConnectionManager@655e2947 name:ZooKeeperConnection Watcher:127.0.0.1:56737/solr got event WatchedEvent state:SyncConnected type:None path:null path:null type:None
   [junit4]   2> 1379584 INFO  (TEST-ZkStateReaderTest.testStateFormatUpdateWithTimeDelayLazy-seed#[42D22A74A9578763]) [    ] o.a.s.c.c.ConnectionManager Client is connected to ZooKeeper
   [junit4]   2> 1379584 INFO  (TEST-ZkStateReaderTest.testStateFormatUpdateWithTimeDelayLazy-seed#[42D22A74A9578763]) [    ] o.a.s.c.c.SolrZkClient Using default ZkACLProvider
   [junit4]   2> 1379584 INFO  (TEST-ZkStateReaderTest.testStateFormatUpdateWithTimeDelayLazy-seed#[42D22A74A9578763]) [    ] o.a.s.c.c.SolrZkClient makePath: /live_nodes
   [junit4]   2> 1379587 INFO  (TEST-ZkStateReaderTest.testStateFormatUpdateWithTimeDelayLazy-seed#[42D22A74A9578763]) [    ] o.a.s.c.c.SolrZkClient makePath: /collections
   [junit4]   2> 1379589 INFO  (TEST-ZkStateReaderTest.testStateFormatUpdateWithTimeDelayLazy-seed#[42D22A74A9578763]) [    ] o.a.s.c.c.SolrZkClient makePath: /aliases.json
   [junit4]   2> 1379591 INFO  (TEST-ZkStateReaderTest.testStateFormatUpdateWithTimeDelayLazy-seed#[42D22A74A9578763]) [    ] o.a.s.c.c.SolrZkClient makePath: /clusterstate.json
   [junit4]   2> 1379592 INFO  (TEST-ZkStateReaderTest.testStateFormatUpdateWithTimeDelayLazy-seed#[42D22A74A9578763]) [    ] o.a.s.c.c.SolrZkClient makePath: /security.json
   [junit4]   2> 1379594 INFO  (TEST-ZkStateReaderTest.testStateFormatUpdateWithTimeDelayLazy-seed#[42D22A74A9578763]) [    ] o.a.s.c.c.ZkStateReader Updating cluster state from ZooKeeper... 
   [junit4]   2> 1379595 INFO  (TEST-ZkStateReaderTest.testStateFormatUpdateWithTimeDelayLazy-seed#[42D22A74A9578763]) [    ] o.a.s.c.c.ZkStateReader Loaded empty cluster properties
   [junit4]   2> 1379596 INFO  (TEST-ZkStateReaderTest.testStateFormatUpdateWithTimeDelayLazy-seed#[42D22A74A9578763]) [    ] o.a.s.c.c.ZkStateReader Updated live nodes from ZooKeeper... (0) -> (0)
   [junit4]   2> 1379598 INFO  (TEST-ZkStateReaderTest.testStateFormatUpdateWithTimeDelayLazy-seed#[42D22A74A9578763]) [    ] o.a.s.c.c.SolrZkClient makePath: /collections/c1
   [junit4]   2> 1379600 INFO  (zkCallback-1540-thread-1) [    ] o.a.s.c.c.ZkStateReader A collections change: [WatchedEvent state:SyncConnected type:NodeChildrenChanged path:/collections], has occurred - updating...
   [junit4]   2> 1379601 INFO  (zkCallback-1540-thread-1) [    ] o.a.s.c.c.ZkStateReader A cluster state change: [WatchedEvent state:SyncConnected type:NodeDataChanged path:/clusterstate.json], has occurred - updating... (live nodes size: [0])
   [junit4]   2> 1379603 INFO  (TEST-ZkStateReaderTest.testStateFormatUpdateWithTimeDelayLazy-seed#[42D22A74A9578763]) [    ] o.a.s.c.o.ZkStateWriter going to create_collection /collections/c1/state.json
   [junit4]   2> 1379604 INFO  (zkCallback-1540-thread-1) [    ] o.a.s.c.c.ZkStateReader A cluster state change: [WatchedEvent state:SyncConnected type:NodeDataChanged path:/clusterstate.json], has occurred - updating... (live nodes size: [0])
   [junit4]   2> 1379608 INFO  (TEST-ZkStateReaderTest.testStateFormatUpdateWithTimeDelayLazy-seed#[42D22A74A9578763]) [    ] o.a.s.c.ZkTestServer connecting to 127.0.0.1:56737 56737
   [junit4]   2> 1379700 INFO  (Thread-2680) [    ] o.a.s.c.ZkTestServer connecting to 127.0.0.1:56737 56737
   [junit4]   2> 1381349 INFO  (TEST-ZkStateReaderTest.testStateFormatUpdateWithTimeDelayLazy-seed#[42D22A74A9578763]) [    ] o.a.s.SolrTestCaseJ4 ###Ending testStateFormatUpdateWithTimeDelayLazy
   [junit4]   2> 1381354 INFO  (TEST-ZkStateReaderTest.testExternalCollectionWatchedNotWatched-seed#[42D22A74A9578763]) [    ] o.a.s.SolrTestCaseJ4 ###Starting testExternalCollectionWatchedNotWatched
   [junit4]   2> 1381355 INFO  (TEST-ZkStateReaderTest.testExternalCollectionWatchedNotWatched-seed#[42D22A74A9578763]) [    ] o.a.s.c.ZkTestServer STARTING ZK TEST SERVER
   [junit4]   2> 1381356 INFO  (Thread-2681) [    ] o.a.s.c.ZkTestServer client port:0.0.0.0/0.0.0.0:0
   [junit4]   2> 1381356 INFO  (Thread-2681) [    ] o.a.s.c.ZkTestServer Starting server
   [junit4]   2> 1381466 INFO  (TEST-ZkStateReaderTest.testExternalCollectionWatchedNotWatched-seed#[42D22A74A9578763]) [    ] o.a.s.c.ZkTestServer start zk server on port:56741
   [junit4]   2> 1381466 INFO  (TEST-ZkStateReaderTest.testExternalCollectionWatchedNotWatched-seed#[42D22A74A9578763]) [    ] o.a.s.c.c.SolrZkClient Using default ZkCredentialsProvider
   [junit4]   2> 1381467 INFO  (TEST-ZkStateReaderTest.testExternalCollectionWatchedNotWatched-seed#[42D22A74A9578763]) [    ] o.a.s.c.c.ConnectionManager Waiting for client to connect to ZooKeeper
   [junit4]   2> 1381476 INFO  (zkCallback-1542-thread-1) [    ] o.a.s.c.c.ConnectionManager Watcher org.apache.solr.common.cloud.ConnectionManager@68c85482 name:ZooKeeperConnection Watcher:127.0.0.1:56741 got event WatchedEvent state:SyncConnected type:None path:null path:null type:None
   [junit4]   2> 1381476 INFO  (TEST-ZkStateReaderTest.testExternalCollectionWatchedNotWatched-seed#[42D22A74A9578763]) [    ] o.a.s.c.c.ConnectionManager Client is connected to ZooKeeper
   [junit4]   2> 1381476 INFO  (TEST-ZkStateReaderTest.testExternalCollectionWatchedNotWatched-seed#[42D22A74A9578763]) [    ] o.a.s.c.c.SolrZkClient Using default ZkACLProvider
   [junit4]   2> 1381478 INFO  (TEST-ZkStateReaderTest.testExternalCollectionWatchedNotWatched-seed#[42D22A74A9578763]) [    ] o.a.s.c.c.SolrZkClient Using default ZkCredentialsProvider
   [junit4]   2> 1381479 INFO  (TEST-ZkStateReaderTest.testExternalCollectionWatchedNotWatched-seed#[42D22A74A9578763]) [    ] o.a.s.c.c.ConnectionManager Waiting for client to connect to ZooKeeper
   [junit4]   2> 1381481 INFO  (zkCallback-1543-thread-1) [    ] o.a.s.c.c.ConnectionManager Watcher org.apache.solr.common.cloud.ConnectionManager@f41b5d7 name:ZooKeeperConnection Watcher:127.0.0.1:56741 got event WatchedEvent state:SyncConnected type:None path:null path:null type:None
   [junit4]   2> 1381482 INFO  (TEST-ZkStateReaderTest.testExternalCollectionWatchedNotWatched-seed#[42D22A74A9578763]) [    ] o.a.s.c.c.ConnectionManager Client is connected to ZooKeeper
   [junit4]   2> 1381482 INFO  (TEST-ZkStateReaderTest.testExternalCollectionWatchedNotWatched-seed#[42D22A74A9578763]) [    ] o.a.s.c.c.SolrZkClient Using default ZkACLProvider
   [junit4]   2> 1381482 INFO  (TEST-ZkStateReaderTest.testExternalCollectionWatchedNotWatched-seed#[42D22A74A9578763]) [    ] o.a.s.c.c.SolrZkClient makePath: /solr
   [junit4]   2> 1381487 INFO  (TEST-ZkStateReaderTest.testExternalCollectionWatchedNotWatched-seed#[42D22A74A9578763]) [    ] o.a.s.c.c.SolrZkClient Using default ZkCredentialsProvider
   [junit4]   2> 1381488 INFO  (TEST-ZkStateReaderTest.testExternalCollectionWatchedNotWatched-seed#[42D22A74A9578763]) [    ] o.a.s.c.c.ConnectionManager Waiting for client to connect to ZooKeeper
   [junit4]   2> 1381489 INFO  (zkCallback-1544-thread-1) [    ] o.a.s.c.c.ConnectionManager Watcher org.apache.solr.common.cloud.ConnectionManager@75d5fefc name:ZooKeeperConnection Watcher:127.0.0.1:56741/solr got event WatchedEvent state:SyncConnected type:None path:null path:null type:None
   [junit4]   2> 1381490 INFO  (TEST-ZkStateReaderTest.testExternalCollectionWatchedNotWatched-seed#[42D22A74A9578763]) [    ] o.a.s.c.c.ConnectionManager Client is connected to ZooKeeper
   [junit4]   2> 1381490 INFO  (TEST-ZkStateReaderTest.testExternalCollectionWatchedNotWatched-seed#[42D22A74A9578763]) [    ] o.a.s.c.c.SolrZkClient Using default ZkACLProvider
   [junit4]   2> 1381490 INFO  (TEST-ZkStateReaderTest.testExternalCollectionWatchedNotWatched-seed#[42D22A74A9578763]) [    ] o.a.s.c.c.SolrZkClient makePath: /live_nodes
   [junit4]   2> 1381493 INFO  (TEST-ZkStateReaderTest.testExternalCollectionWatchedNotWatched-seed#[42D22A74A9578763]) [    ] o.a.s.c.c.SolrZkClient makePath: /collections
   [junit4]   2> 1381496 INFO  (TEST-ZkStateReaderTest.testExternalCollectionWatchedNotWatched-seed#[42D22A74A9578763]) [    ] o.a.s.c.c.SolrZkClient makePath: /aliases.json
   [junit4]   2> 1381498 INFO  (TEST-ZkStateReaderTest.testExternalCollectionWatchedNotWatched-seed#[42D22A74A9578763]) [    ] o.a.s.c.c.SolrZkClient makePath: /clusterstate.json
   [junit4]   2> 1381500 INFO  (TEST-ZkStateReaderTest.testExternalCollectionWatchedNotWatched-seed#[42D22A74A9578763]) [    ] o.a.s.c.c.SolrZkClient makePath: /security.json
   [junit4]   2> 1381502 INFO  (TEST-ZkStateReaderTest.testExternalCollectionWatchedNotWatched-seed#[42D22A74A9578763]) [    ] o.a.s.c.c.ZkStateReader Updating cluster state from ZooKeeper... 
   [junit4]   2> 1381504 INFO  (TEST-ZkStateReaderTest.testExternalCollectionWatchedNotWatched-seed#[42D22A74A9578763]) [    ] o.a.s.c.c.ZkStateReader Loaded empty cluster properties
   [junit4]   2> 1381505 INFO  (TEST-ZkStateReaderTest.testExternalCollectionWatchedNotWatched-seed#[42D22A74A9578763]) [    ] o.a.s.c.c.ZkStateReader Updated live nodes from ZooKeeper... (0) -> (0)
   [junit4]   2> 1381507 INFO  (TEST-ZkStateReaderTest.testExternalCollectionWatchedNotWatched-seed#[42D22A74A9578763]) [    ] o.a.s.c.c.SolrZkClient makePath: /collections/c1
   [junit4]   2> 1381509 INFO  (zkCallback-1544-thread-1) [    ] o.a.s.c.c.ZkStateReader A collections change: [WatchedEvent state:SyncConnected type:NodeChildrenChanged path:/collections], has occurred - updating...
   [junit4]   2> 1381511 INFO  (TEST-ZkStateReaderTest.testExternalCollectionWatchedNotWatched-seed#[42D22A74A9578763]) [    ] o.a.s.c.o.ZkStateWriter going to create_collection /collections/c1/state.json
   [junit4]   2> 1381513 INFO  (TEST-ZkStateReaderTest.testExternalCollectionWatchedNotWatched-seed#[42D22A74A9578763]) [    ] o.a.s.c.c.ZkStateReader Add data for [c1] ver [0]
   [junit4]   2> 1381515 INFO  (TEST-ZkStateReaderTest.testExternalCollectionWatchedNotWatched-seed#[42D22A74A9578763]) [    ] o.a.s.c.ZkTestServer connecting to 127.0.0.1:56741 56741
   [junit4]   2> 1381531 INFO  (Thread-2681) [    ] o.a.s.c.ZkTestServer connecting to 127.0.0.1:56741 56741
   [junit4]   2> 1383518 INFO  (TEST-ZkStateReaderTest.testExternalCollectionWatchedNotWatched-seed#[42D22A74A9578763]) [    ] o.a.s.SolrTestCaseJ4 ###Ending testExternalCollectionWatchedNotWatched
   [junit4]   2> 1383521 INFO  (TEST-ZkStateReaderTest.testStateFormatUpdateWithExplicitRefreshLazy-seed#[42D22A74A9578763]) [    ] o.a.s.SolrTestCaseJ4 ###Starting testStateFormatUpdateWithExplicitRefreshLazy
   [junit4]   2> 1383521 INFO  (TEST-ZkStateReaderTest.testStateFormatUpdateWithExplicitRefreshLazy-seed#[42D22A74A9578763]) [    ] o.a.s.c.ZkTestServer STARTING ZK TEST SERVER
   [junit4]   2> 1383522 INFO  (Thread-2682) [    ] o.a.s.c.ZkTestServer client port:0.0.0.0/0.0.0.0:0
   [junit4]   2> 1383522 INFO  (Thread-2682) [    ] o.a.s.c.ZkTestServer Starting server
   [junit4]   2> 1383625 INFO  (TEST-ZkStateReaderTest.testStateFormatUpdateWithExplicitRefreshLazy-seed#[42D22A74A9578763]) [    ] o.a.s.c.ZkTestServer start zk server on port:56745
   [junit4]   2> 1383625 INFO  (TEST-ZkStateReaderTest.testStateFormatUpdateWithExplicitRefreshLazy-seed#[42D22A74A9578763]) [    ] o.a.s.c.c.SolrZkClient Using default ZkCredentialsProvider
   [junit4]   2> 1383626 INFO  (TEST-ZkStateReaderTest.testStateFormatUpdateWithExplicitRefreshLazy-seed#[42D22A74A9578763]) [    ] o.a.s.c.c.ConnectionManager Waiting for client to connect to ZooKeeper
   [junit4]   2> 1383635 INFO  (zkCallback-1546-thread-1) [    ] o.a.s.c.c.ConnectionManager Watcher org.apache.solr.common.cloud.ConnectionManager@3bced8b7 name:ZooKeeperConnection Watcher:127.0.0.1:56745 got event WatchedEvent state:SyncConnected type:None path:null path:null type:None
   [junit4]   2> 1383636 INFO  (TEST-ZkStateReaderTest.testStateFormatUpdateWithExplicitRefreshLazy-seed#[42D22A74A9578763]) [    ] o.a.s.c.c.ConnectionManager Client is connected to ZooKeeper
   [junit4]   2> 1383636 INFO  (TEST-ZkStateReaderTest.testStateFormatUpdateWithExplicitRefreshLazy-seed#[42D22A74A9578763]) [    ] o.a.s.c.c.SolrZkClient Using default ZkACLProvider
   [junit4]   2> 1383637 INFO  (TEST-ZkStateReaderTest.testStateFormatUpdateWithExplicitRefreshLazy-seed#[42D22A74A9578763]) [    ] o.a.s.c.c.SolrZkClient Using default ZkCredentialsProvider
   [junit4]   2> 1383638 INFO  (TEST-ZkStateReaderTest.testStateFormatUpdateWithExplicitRefreshLazy-seed#[42D22A74A9578763]) [    ] o.a.s.c.c.ConnectionManager Waiting for client to connect to ZooKeeper
   [junit4]   2> 1383640 INFO  (zkCallback-1547-thread-1) [    ] o.a.s.c.c.ConnectionManager Watcher org.apache.solr.common.cloud.ConnectionManager@1b31d0a8 name:ZooKeeperConnection Watcher:127.0.0.1:56745 got event WatchedEvent state:SyncConnected type:None path:null path:null type:None
   [junit4]   2> 1383640 INFO  (TEST-ZkStateReaderTest.testStateFormatUpdateWithExplicitRefreshLazy-seed#[42D22A74A9578763]) [    ] o.a.s.c.c.ConnectionManager Client is connected to ZooKeeper
   [junit4]   2> 1383640 INFO  (TEST-ZkStateReaderTest.testStateFormatUpdateWithExplicitRefreshLazy-seed#[42D22A74A9578763]) [    ] o.a.s.c.c.SolrZkClient Using default ZkACLProvider
   [junit4]   2> 1383640 INFO  (TEST-ZkStateReaderTest.testStateFormatUpdateWithExplicitRefreshLazy-seed#[42D22A74A9578763]) [    ] o.a.s.c.c.SolrZkClient makePath: /solr
   [junit4]   2> 1383643 INFO  (TEST-ZkStateReaderTest.testStateFormatUpdateWithExplicitRefreshLazy-seed#[42D22A74A9578763]) [    ] o.a.s.c.c.SolrZkClient Using default ZkCredentialsProvider
   [junit4]   2> 1383643 INFO  (TEST-ZkStateReaderTest.testStateFormatUpdateWithExplicitRefreshLazy-seed#[42D22A74A9578763]) [    ] o.a.s.c.c.ConnectionManager Waiting for client to connect to ZooKeeper
   [junit4]   2> 1383645 INFO  (zkCallback-1548-thread-1) [    ] o.a.s.c.c.ConnectionManager Watcher org.apache.solr.common.cloud.ConnectionManager@2f9d2b7d name:ZooKeeperConnection Watcher:127.0.0.1:56745/solr got event WatchedEvent state:SyncConnected type:None path:null path:null type:None
   [junit4]   2> 1383645 INFO  (TEST-ZkStateReaderTest.testStateFormatUpdateWithExplicitRefreshLazy-seed#[42D22A74A9578763]) [    ] o.a.s.c.c.ConnectionManager Client is connected to ZooKeeper
   [junit4]   2> 1383645 INFO  (TEST-ZkStateReaderTest.testStateFormatUpdateWithExplicitRefreshLazy-seed#[42D22A74A9578763]) [    ] o.a.s.c.c.SolrZkClient Using default ZkACLProvider
   [junit4]   2> 1383645 INFO  (TEST-ZkStateReaderTest.testStateFormatUpdateWithExplicitRefreshLazy-seed#[42D22A74A9578763]) [    ] o.a.s.c.c.SolrZkClient makePath: /live_nodes
   [junit4]   2> 1383648 INFO  (TEST-ZkStateReaderTest.testStateFormatUpdateWithExplicitRefreshLazy-seed#[42D22A74A9578763]) [    ] o.a.s.c.c.SolrZkClient makePath: /collections
   [junit4]   2> 1383650 INFO  (TEST-ZkStateReaderTest.testStateFormatUpdateWithExplicitRefreshLazy-seed#[42D22A74A9578763]) [    ] o.a.s.c.c.SolrZkClient makePath: /aliases.json
   [junit4]   2> 1383652 INFO  (TEST-ZkStateReaderTest.testStateFormatUpdateWithExplicitRefreshLazy-seed#[42D22A74A9578763]) [    ] o.a.s.c.c.SolrZkClient makePath: /clusterstate.json
   [junit4]   2> 1383654 INFO  (TEST-ZkStateReaderTest.testStateFormatUpdateWithExplicitRefreshLazy-seed#[42D22A74A9578763]) [    ] o.a.s.c.c.SolrZkClient makePath: /security.json
   [junit4]   2> 1383655 INFO  (TEST-ZkStateReaderTest.testStateFormatUpdateWithExplicitRefreshLazy-seed#[42D22A74A9578763]) [    ] o.a.s.c.c.ZkStateReader Updating cluster state from ZooKeeper... 
   [junit4]   2> 1383656 INFO  (TEST-ZkStateReaderTest.testStateFormatUpdateWithExplicitRefreshLazy-seed#[42D22A74A9578763]) [    ] o.a.s.c.c.ZkStateReader Loaded empty cluster properties
   [junit4]   2> 1383657 INFO  (TEST-ZkStateReaderTest.testStateFormatUpdateWithExplicitRefreshLazy-seed#[42D22A74A9578763]) [    ] o.a.s.c.c.ZkStateReader Updated live nodes from ZooKeeper... (0) -> (0)
   [junit4]   2> 1383660 INFO  (TEST-ZkStateReaderTest.testStateFormatUpdateWithExplicitRefreshLazy-seed#[42D22A74A9578763]) [    ] o.a.s.c.c.SolrZkClient makePath: /collections/c1
   [junit4]   2> 1383661 INFO  (zkCallback-1548-thread-1) [    ] o.a.s.c.c.ZkStateReader A collections change: [WatchedEvent state:SyncConnected type:NodeChildrenChanged path:/collections], has occurred - updating...
   [junit4]   2> 1383662 INFO  (zkCallback-1548-thread-1) [    ] o.a.s.c.c.ZkStateReader A cluster state change: [WatchedEvent state:SyncConnected type:NodeDataChanged path:/clusterstate.json], has occurred - updating... (live nodes size: [0])
   [junit4]   2> 1383665 INFO  (TEST-ZkStateReaderTest.testStateFormatUpdateWithExplicitRefreshLazy-seed#[42D22A74A9578763]) [    ] o.a.s.c.o.ZkStateWriter going to create_collection /collections/c1/state.json
   [junit4]   2> 1383666 INFO  (zkCallback-1548-thread-1) [    ] o.a.s.c.c.ZkStateReader A cluster state change: [WatchedEvent state:SyncConnected type:NodeDataChanged path:/clusterstate.json], has occurred - updating... (live nodes size: [0])
   [junit4]   2> 1383670 INFO  (TEST-ZkStateReaderTest.testStateFormatUpdateWithExplicitRefreshLazy-seed#[42D22A74A9578763]) [    ] o.a.s.c.ZkTestServer connecting to 127.0.0.1:56745 56745
   [junit4]   2> 1383810 INFO  (Thread-2682) [    ] o.a.s.c.ZkTestServer connecting to 127.0.0.1:56745 56745
   [junit4]   2> 1387808 INFO  (TEST-ZkStateReaderTest.testStateFormatUpdateWithExplicitRefreshLazy-seed#[42D22A74A9578763]) [    ] o.a.s.SolrTestCaseJ4 ###Ending testStateFormatUpdateWithExplicitRefreshLazy
   [junit4]   2> 1387810 INFO  (TEST-ZkStateReaderTest.testStateFormatUpdateWithTimeDelay-seed#[42D22A74A9578763]) [    ] o.a.s.SolrTestCaseJ4 ###Starting testStateFormatUpdateWithTimeDelay
   [junit4]   2> 1387811 INFO  (TEST-ZkStateReaderTest.testStateFormatUpdateWithTimeDelay-seed#[42D22A74A9578763]) [    ] o.a.s.c.ZkTestServer STARTING ZK TEST SERVER
   [junit4]   2> 1387811 INFO  (Thread-2683) [    ] o.a.s.c.ZkTestServer client port:0.0.0.0/0.0.0.0:0
   [junit4]   2> 1387811 INFO  (Thread-2683) [    ] o.a.s.c.ZkTestServer Starting server
   [junit4]   2> 1387921 INFO  (TEST-ZkStateReaderTest.testStateFormatUpdateWithTimeDelay-seed#[42D22A74A9578763]) [    ] o.a.s.c.ZkTestServer start zk server on port:56749
   [junit4]   2> 1387921 INFO  (TEST-ZkStateReaderTest.testStateFormatUpdateWithTimeDelay-seed#[42D22A74A9578763]) [    ] o.a.s.c.c.SolrZkClient Using default ZkCredentialsProvider
   [junit4]   2> 1387922 INFO  (TEST-ZkStateReaderTest.testStateFormatUpdateWithTimeDelay-seed#[42D22A74A9578763]) [    ] o.a.s.c.c.ConnectionManager Waiting for client to connect to ZooKeeper
   [junit4]   2> 1388070 INFO  (zkCallback-1550-thread-1) [    ] o.a.s.c.c.ConnectionManager Watcher org.apache.solr.common.cloud.ConnectionManager@7d995d20 name:ZooKeeperConnection Watcher:127.0.0.1:56749 got event WatchedEvent state:SyncConnected type:None path:null path:null type:None
   [junit4]   2> 1388070 INFO  (TEST-ZkStateReaderTest.testStateFormatUpdateWithTimeDelay-seed#[42D22A74A9578763]) [    ] o.a.s.c.c.ConnectionManager Client is connected to ZooKeeper
   [junit4]   2> 1388071 INFO  (TEST-ZkStateReaderTest.testStateFormatUpdateWithTimeDelay-seed#[42D22A74A9578763]) [    ] o.a.s.c.c.SolrZkClient Using default ZkACLProvider
   [junit4]   2> 1388073 INFO  (TEST-ZkStateReaderTest.testStateFormatUpdateWithTimeDelay-seed#[42D22A74A9578763]) [    ] o.a.s.c.c.SolrZkClient Using default ZkCredentialsProvider
   [junit4]   2> 1388073 INFO  (TEST-ZkStateReaderTest.testStateFormatUpdateWithTimeDelay-seed#[42D22A74A9578763]) [    ] o.a.s.c.c.ConnectionManager Waiting for client to connect to ZooKeeper
   [junit4]   2> 1388075 INFO  (zkCallback-1551-thread-1) [    ] o.a.s.c.c.ConnectionManager Watcher org.apache.solr.common.cloud.ConnectionManager@7d92a4a4 name:ZooKeeperConnection Watcher:127.0.0.1:56749 got event WatchedEvent state:SyncConnected type:None path:null path:null type:None
   [junit4]   2> 1388075 INFO  (TEST-ZkStateReaderTest.testStateFormatUpdateWithTimeDelay-seed#[42D22A74A9578763]) [    ] o.a.s.c.c.ConnectionManager Client is connected to ZooKeeper
   [junit4]   2> 1388075 INFO  (TEST-ZkStateReaderTest.testStateFormatUpdateWithTimeDelay-seed#[42D22A74A9578763]) [    ] o.a.s.c.c.SolrZkClient Using default ZkACLProvider
   [junit4]   2> 1388076 INFO  (TEST-ZkStateReaderTest.testStateFormatUpdateWithTimeDelay-seed#[42D22A74A9578763]) [    ] o.a.s.c.c.SolrZkClient makePath: /solr
   [junit4]   2> 1388080 INFO  (TEST-ZkStateReaderTest.testStateFormatUpdateWithTimeDelay-seed#[42D22A74A9578763]) [    ] o.a.s.c.c.SolrZkClient Using default ZkCredentialsProvider
   [junit4]   2> 1388081 INFO  (TEST-ZkStateReaderTest.testStateFormatUpdateWithTimeDelay-seed#[42D22A74A9578763]) [    ] o.a.s.c.c.ConnectionManager Waiting for client to connect to ZooKeeper
   [junit4]   2> 1388082 INFO  (zkCallback-1552-thread-1) [    ] o.a.s.c.c.ConnectionManager Watcher org.apache.solr.common.cloud.ConnectionManager@56291968 name:ZooKeeperConnection Watcher:127.0.0.1:56749/solr got event WatchedEvent state:SyncConnected type:None path:null path:null type:None
   [junit4]   2> 1388083 INFO  (TEST-ZkStateReaderTest.testStateFormatUpdateWithTimeDelay-seed#[42D22A74A9578763]) [    ] o.a.s.c.c.ConnectionManager Client is connected to ZooKeeper
   [junit4]   2> 1388083 INFO  (TEST-ZkStateReaderTest.testStateFormatUpdateWithTimeDelay-seed#[42D22A74A9578763]) [    ] o.a.s.c.c.SolrZkClient Using default ZkACLProvider
   [junit4]   2> 1388084 INFO  (TEST-ZkStateReaderTest.testStateFormatUpdateWithTimeDelay-seed#[42D22A74A9578763]) [    ] o.a.s.c.c.SolrZkClient makePath: /live_nodes
   [junit4]   2> 1388086 INFO  (TEST-ZkStateReaderTest.testStateFormatUpdateWithTimeDelay-seed#[42D22A74A9578763]) [    ] o.a.s.c.c.SolrZkClient makePath: /collections
   [junit4]   2> 1388088 INFO  (TEST-ZkStateReaderTest.testStateFormatUpdateWithTimeDelay-seed#[42D22A74A9578763]) [    ] o.a.s.c.c.SolrZkClient makePath: /aliases.json
   [junit4]   2> 1388090 INFO  (TEST-ZkStateReaderTest.testStateFormatUpdateWithTimeDelay-seed#[42D22A74A9578763]) [    ] o.a.s.c.c.SolrZkClient makePath: /clusterstate.json
   [junit4]   2> 1388094 INFO  (TEST-ZkStateReaderTest.testStateFormatUpdateWithTimeDelay-seed#[42D22A74A9578763]) [    ] o.a.s.c.c.SolrZkClient makePath: /security.json
   [junit4]   2> 1388096 INFO  (TEST-ZkStateReaderTest.testStateFormatUpdateWithTimeDelay-seed#[42D22A74A9578763]) [    ] o.a.s.c.c.ZkStateReader Updating cluster state from ZooKeeper... 
   [junit4]   2> 1388097 INFO  (TEST-ZkStateReaderTest.testStateFormatUpdateWithTimeDelay-seed#[42D22A74A9578763]) [    ] o.a.s.c.c.ZkStateReader Loaded empty cluster properties
   [junit4]   2> 1388098 INFO  (TEST-ZkStateReaderTest.testStateFormatUpdateWithTimeDelay-seed#[42D22A74A9578763]) [    ] o.a.s.c.c.ZkStateReader Updated live nodes from ZooKeeper... (0) -> (0)
   [junit4]   2> 1388102 INFO  (TEST-ZkStateReaderTest.testStateFormatUpdateWithTimeDelay-seed#[42D22A74A9578763]) [    ] o.a.s.c.c.ZkStateReader Deleting data for [c1]
   [junit4]   2> 1388103 INFO  (TEST-ZkStateReaderTest.testStateFormatUpdateWithTimeDelay-seed#[42D22A74A9578763]) [    ] o.a.s.c.c.SolrZkClient makePath: /collections/c1
   [junit4]   2> 1388106 INFO  (zkCallback-1552-thread-1) [    ] o.a.s.c.c.ZkStateReader A collections change: [WatchedEvent state:SyncConnected type:NodeChildrenChanged path:/collections], has occurred - updating...
   [junit4]   2> 1388108 INFO  (zkCallback-1552-thread-1) [    ] o.a.s.c.c.ZkStateReader A cluster state change: [WatchedEvent state:SyncConnected type:NodeDataChanged path:/clusterstate.json], has occurred - updating... (live nodes size: [0])
   [junit4]   2> 1388110 INFO  (TEST-ZkStateReaderTest.testStateFormatUpdateWithTimeDelay-seed#[42D22A74A9578763]) [    ] o.a.s.c.o.ZkStateWriter going to create_collection /collections/c1/state.json
   [junit4]   2> 1388111 INFO  (zkCallback-1552-thread-1) [    ] o.a.s.c.c.ZkStateReader A cluster state change: [WatchedEvent state:SyncConnected type:NodeCreated path:/collections/c1/state.json] for collection [c1] has occurred - updating... (live nodes size: [0])
   [junit4]   2> 1388112 INFO  (zkCallback-1552-thread-1) [    ] o.a.s.c.c.ZkStateReader Add data for [c1] ver [0]
   [junit4]   2> 1388112 INFO  (zkCallback-1552-thread-2) [    ] o.a.s.c.c.ZkStateReader A cluster state change: [WatchedEvent state:SyncConnected type:NodeDataChanged path:/clusterstate.json], has occurred - updating... (live nodes size: [0])
   [junit4]   2> 1443622 INFO  (TEST-ZkStateReaderTest.testStateFormatUpdateWithTimeDelay-seed#[42D22A74A9578763]) [    ] o.a.s.c.ZkTestServer connecting to 127.0.0.1:56749 56749
   [junit4]   2> 1447817 INFO  (Thread-2683) [    ] o.a.s.c.ZkTestServer connecting to 127.0.0.1:56749 56749
   [junit4]   2> 1449453 INFO  (TEST-ZkStateReaderTest.testStateFormatUpdateWithTimeDelay-seed#[42D22A74A9578763]) [    ] o.a.s.SolrTestCaseJ4 ###Ending testStateFormatUpdateWithTimeDelay
   [junit4]   2> NOTE: reproduce with: ant test  -Dtestcase=ZkStateReaderTest -Dtests.method=testStateFormatUpdateWithTimeDelay -Dtests.seed=42D22A74A9578763 -Dtests.slow=true -Dtests.locale=de -Dtests.timezone=America/Argentina/San_Juan -Dtests.asserts=true -Dtests.file.encoding=UTF-8
   [junit4] FAILURE 61.6s J0 | ZkStateReaderTest.testStateFormatUpdateWithTimeDelay <<<
   [junit4]    > Throwable #1: java.lang.AssertionError: expected:<2> but was:<1>
   [junit4]    > 	at __randomizedtesting.SeedInfo.seed([42D22A74A9578763:3D4C9DF1C035AAE9]:0)
   [junit4]    > 	at org.apache.solr.cloud.overseer.ZkStateReaderTest.testStateFormatUpdate(ZkStateReaderTest.java:138)
   [junit4]    > 	at org.apache.solr.cloud.overseer.ZkStateReaderTest.testStateFormatUpdateWithTimeDelay(ZkStateReaderTest.java:52)
   [junit4]    > 	at java.lang.Thread.run(Thread.java:745)
   [junit4]   2> 1449455 INFO  (SUITE-ZkStateReaderTest-seed#[42D22A74A9578763]-worker) [    ] o.a.s.SolrTestCaseJ4 ###deleteCore
   [junit4]   2> NOTE: leaving temporary files on disk at: /Users/jenkins/workspace/Lucene-Solr-6.x-MacOSX/solr/build/solr-core/test/J0/temp/solr.cloud.overseer.ZkStateReaderTest_42D22A74A9578763-001
   [junit4]   2> NOTE: test params are: codec=Asserting(Lucene60), sim=ClassicSimilarity, locale=de, timezone=America/Argentina/San_Juan
   [junit4]   2> NOTE: Mac OS X 10.11.4 x86_64/Oracle Corporation 1.8.0_72 (64-bit)/cpus=3,threads=1,free=85603888,total=518979584
   [junit4]   2> NOTE: All tests run in this JVM: [TestDocSet, QueryEqualityTest, VersionInfoTest, TestLFUCache, TestUpdate, TestDocumentBuilder, TestMergePolicyConfig, RulesTest, DocumentBuilderTest, TestSchemaVersionResource, PingRequestHandlerTest, HdfsChaosMonkeyNothingIsSafeTest, CdcrReplicationDistributedZkTest, TestSubQueryTransformerCrossCore, DistributedExpandComponentTest, TestRTimerTree, PreAnalyzedFieldTest, TestInfoStreamLogging, HttpPartitionTest, TestCSVLoader, TestPKIAuthenticationPlugin, ActionThrottleTest, TestSQLHandler, HdfsBasicDistributedZk2Test, BlockJoinFacetRandomTest, RequiredFieldsTest, DistributedSuggestComponentTest, DistribJoinFromCollectionTest, TestExpandComponent, TestReqParamsAPI, TestMacros, HLLSerializationTest, TestSolrQueryResponse, XsltUpdateRequestHandlerTest, CollectionStateFormat2Test, TestFastLRUCache, RollingRestartTest, DirectoryFactoryTest, CustomCollectionTest, CursorPagingTest, BasicDistributedZkTest, RequestLoggingTest, TestGeoJSONResponseWriter, DataDrivenBlockJoinTest, BJQParserTest, TestXIncludeConfig, SuggestComponentTest, TestShardHandlerFactory, PreAnalyzedUpdateProcessorTest, BadComponentTest, TestFunctionQuery, TestRebalanceLeaders, TestConfigReload, TestConfigSetsAPIExclusivity, HighlighterTest, TestTrieFacet, DOMUtilTest, DistributedFacetPivotLongTailTest, TestClassicSimilarityFactory, SchemaVersionSpecificBehaviorTest, IndexSchemaTest, TestLeaderElectionZkExpiry, MigrateRouteKeyTest, IndexBasedSpellCheckerTest, DistribCursorPagingTest, TestRandomCollapseQParserPlugin, BigEndianAscendingWordSerializerTest, RecoveryZkTest, HardAutoCommitTest, JSONWriterTest, TestGraphTermsQParserPlugin, TestStandardQParsers, SpatialRPTFieldTypeTest, TestConfig, TolerantUpdateProcessorTest, TestCloudManagedSchema, DeleteShardTest, TestDownShardTolerantSearch, CloneFieldUpdateProcessorFactoryTest, CoreAdminRequestStatusTest, PeerSyncTest, TestArbitraryIndexDir, TestSolr4Spatial2, TestCryptoKeys, TestCloudInspectUtil, ZkStateReaderTest]
   [junit4] Completed [159/598 (1!)] on J0 in 75.67s, 6 tests, 1 failure, 1 error <<< FAILURES!

[...truncated 270 lines...]
   [junit4] Suite: org.apache.solr.cloud.LeaderElectionTest
   [junit4]   2> Creating dataDir: /Users/jenkins/workspace/Lucene-Solr-6.x-MacOSX/solr/build/solr-core/test/J0/temp/solr.cloud.LeaderElectionTest_42D22A74A9578763-001/init-core-data-001
   [junit4]   2> 1906454 INFO  (SUITE-LeaderElectionTest-seed#[42D22A74A9578763]-worker) [    ] o.a.s.SolrTestCaseJ4 Randomized ssl (false) and clientAuth (false)
   [junit4]   2> 1906459 INFO  (TEST-LeaderElectionTest.testElection-seed#[42D22A74A9578763]) [    ] o.a.s.SolrTestCaseJ4 ###Starting testElection
   [junit4]   2> 1906459 INFO  (TEST-LeaderElectionTest.testElection-seed#[42D22A74A9578763]) [    ] o.a.s.c.ZkTestServer STARTING ZK TEST SERVER
   [junit4]   2> 1906460 INFO  (Thread-3683) [    ] o.a.s.c.ZkTestServer client port:0.0.0.0/0.0.0.0:0
   [junit4]   2> 1906460 INFO  (Thread-3683) [    ] o.a.s.c.ZkTestServer Starting server
   [junit4]   2> 1906563 INFO  (TEST-LeaderElectionTest.testElection-seed#[42D22A74A9578763]) [    ] o.a.s.c.ZkTestServer start zk server on port:57950
   [junit4]   2> 1906563 INFO  (TEST-LeaderElectionTest.testElection-seed#[42D22A74A9578763]) [    ] o.a.s.c.c.SolrZkClient Using default ZkCredentialsProvider
   [junit4]   2> 1906564 INFO  (TEST-LeaderElectionTest.testElection-seed#[42D22A74A9578763]) [    ] o.a.s.c.c.ConnectionManager Waiting for client to connect to ZooKeeper
   [junit4]   2> 1906574 INFO  (zkCallback-2260-thread-1) [    ] o.a.s.c.c.ConnectionManager Watcher org.apache.solr.common.cloud.ConnectionManager@238b3c02 name:ZooKeeperConnection Watcher:127.0.0.1:57950 got event WatchedEvent state:SyncConnected type:None path:null path:null type:None
   [junit4]   2> 1906575 INFO  (TEST-LeaderElectionTest.testElection-seed#[42D22A74A9578763]) [    ] o.a.s.c.c.ConnectionManager Client is connected to ZooKeeper
   [junit4]   2> 1906575 INFO  (TEST-LeaderElectionTest.testElection-seed#[42D22A74A9578763]) [    ] o.a.s.c.c.SolrZkClient Using default ZkACLProvider
   [junit4]   2> 1906577 INFO  (TEST-LeaderElectionTest.testElection-seed#[42D22A74A9578763]) [    ] o.a.s.c.c.SolrZkClient Using default ZkCredentialsProvider
   [junit4]   2> 1906577 INFO  (TEST-LeaderElectionTest.testElection-seed#[42D22A74A9578763]) [    ] o.a.s.c.c.ConnectionManager Waiting for client to connect to ZooKeeper
   [junit4]   2> 1906582 INFO  (zkCallback-2261-thread-1) [    ] o.a.s.c.c.ConnectionManager Watcher org.apache.solr.common.cloud.ConnectionManager@288ea585 name:ZooKeeperConnection Watcher:127.0.0.1:57950 got event WatchedEvent state:SyncConnected type:None path:null path:null type:None
   [junit4]   2> 1906583 INFO  (TEST-LeaderElectionTest.testElection-seed#[42D22A74A9578763]) [    ] o.a.s.c.c.ConnectionManager Client is connected to ZooKeeper
   [junit4]   2> 1906583 INFO  (TEST-LeaderElectionTest.testElection-seed#[42D22A74A9578763]) [    ] o.a.s.c.c.SolrZkClient Using default ZkACLProvider
   [junit4]   2> 1906583 INFO  (TEST-LeaderElectionTest.testElection-seed#[42D22A74A9578763]) [    ] o.a.s.c.c.SolrZkClient makePath: /solr
   [junit4]   2> 1906586 INFO  (TEST-LeaderElectionTest.testElection-seed#[42D22A74A9578763]) [    ] o.a.s.c.c.SolrZkClient Using default ZkCredentialsProvider
   [junit4]   2> 1906588 INFO  (TEST-LeaderElectionTest.testElection-seed#[42D22A74A9578763]) [    ] o.a.s.c.c.ConnectionManager Waiting for client to connect to ZooKeeper
   [junit4]   2> 1906589 INFO  (zkCallback-2262-thread-1) [    ] o.a.s.c.c.ConnectionManager Watcher org.apache.solr.common.cloud.ConnectionManager@85bfe49 name:ZooKeeperConnection Watcher:127.0.0.1:57950/solr got event WatchedEvent state:SyncConnected type:None path:null path:null type:None
   [junit4]   2> 1906589 INFO  (TEST-LeaderElectionTest.testElection-seed#[42D22A74A9578763]) [    ] o.a.s.c.c.ConnectionManager Client is connected to ZooKeeper
   [junit4]   2> 1906589 INFO  (TEST-LeaderElectionTest.testElection-seed#[42D22A74A9578763]) [    ] o.a.s.c.c.SolrZkClient Using default ZkACLProvider
   [junit4]   2> 1906594 INFO  (TEST-LeaderElectionTest.testElection-seed#[42D22A74A9578763]) [    ] o.a.s.c.c.SolrZkClient Using default ZkCredentialsProvider
   [junit4]   2> 1906600 INFO  (TEST-LeaderElectionTest.testElection-seed#[42D22A74A9578763]) [    ] o.a.s.c.c.ConnectionManager Waiting for client to connect to ZooKeeper
   [junit4]   2> 1906602 INFO  (zkCallback-2264-thread-1) [    ] o.a.s.c.c.ConnectionManager Watcher org.apache.solr.common.cloud.ConnectionManager@3add22 name:ZooKeeperConnection Watcher:127.0.0.1:57950/solr got event WatchedEvent state:SyncConnected type:None path:null path:null type:None
   [junit4]   2> 1906602 INFO  (TEST-LeaderElectionTest.testElection-seed#[42D22A74A9578763]) [    ] o.a.s.c.c.ConnectionManager Client is connected to ZooKeeper
   [junit4]   2> 1906602 INFO  (TEST-LeaderElectionTest.testElection-seed#[42D22A74A9578763]) [    ] o.a.s.c.c.SolrZkClient Using default ZkACLProvider
   [junit4]   2> 1906602 INFO  (TEST-LeaderElectionTest.testElection-seed#[42D22A74A9578763]) [    ] o.a.s.c.c.SolrZkClient Using default ZkCredentialsProvider
   [junit4]   2> 1906603 INFO  (TEST-LeaderElectionTest.testElection-seed#[42D22A74A9578763]) [    ] o.a.s.c.c.ConnectionManager Waiting for client to connect to ZooKeeper
   [junit4]   2> 1906604 INFO  (zkCallback-2266-thread-1) [    ] o.a.s.c.c.ConnectionManager Watcher org.apache.solr.common.cloud.ConnectionManager@3f265cad name:ZooKeeperConnection Watcher:127.0.0.1:57950/solr got event WatchedEvent state:SyncConnected type:None path:null path:null type:None
   [junit4]   2> 1906604 INFO  (TEST-LeaderElectionTest.testElection-seed#[42D22A74A9578763]) [    ] o.a.s.c.c.ConnectionManager Client is connected to ZooKeeper
   [junit4]   2> 1906605 INFO  (TEST-LeaderElectionTest.testElection-seed#[42D22A74A9578763]) [    ] o.a.s.c.c.SolrZkClient Using default ZkACLProvider
   [junit4]   2> 1906605 INFO  (TEST-LeaderElectionTest.testElection-seed#[42D22A74A9578763]) [    ] o.a.s.c.c.SolrZkClient Using default ZkCredentialsProvider
   [junit4]   2> 1906606 INFO  (TEST-LeaderElectionTest.testElection-seed#[42D22A74A9578763]) [    ] o.a.s.c.c.ConnectionManager Waiting for client to connect to ZooKeeper
   [junit4]   2> 1906607 INFO  (zkCallback-2268-thread-1) [    ] o.a.s.c.c.ConnectionManager Watcher org.apache.solr.common.cloud.ConnectionManager@6c58ceb name:ZooKeeperConnection Watcher:127.0.0.1:57950/solr got event WatchedEvent state:SyncConnected type:None path:null path:null type:None
   [junit4]   2> 1906607 INFO  (TEST-LeaderElectionTest.testElection-seed#[42D22A74A9578763]) [    ] o.a.s.c.c.ConnectionManager Client is connected to ZooKeeper
   [junit4]   2> 1906607 INFO  (TEST-LeaderElectionTest.testElection-seed#[42D22A74A9578763]) [    ] o.a.s.c.c.SolrZkClient Using default ZkACLProvider
   [junit4]   2> 1906607 INFO  (TEST-LeaderElectionTest.testElection-seed#[42D22A74A9578763]) [    ] o.a.s.c.c.SolrZkClient Using default ZkCredentialsProvider
   [junit4]   2> 1906608 INFO  (TEST-LeaderElectionTest.testElection-seed#[42D22A74A9578763]) [    ] o.a.s.c.c.ConnectionManager Waiting for client to connect to ZooKeeper
   [junit4]   2> 1906609 INFO  (zkCallback-2270-thread-1) [    ] o.a.s.c.c.ConnectionManager Watcher org.apache.solr.common.cloud.ConnectionManager@5ad55f33 name:ZooKeeperConnection Watcher:127.0.0.1:57950/solr got event WatchedEvent state:SyncConnected type:None path:null path:null type:None
   [junit4]   2> 1906609 INFO  (TEST-LeaderElectionTest.testElection-seed#[42D22A74A9578763]) [    ] o.a.s.c.c.ConnectionManager Client is connected to ZooKeeper
   [junit4]   2> 1906609 INFO  (TEST-LeaderElectionTest.testElection-seed#[42D22A74A9578763]) [    ] o.a.s.c.c.SolrZkClient Using default ZkACLProvider
   [junit4]   2> 1906609 INFO  (TEST-LeaderElectionTest.testElection-seed#[42D22A74A9578763]) [    ] o.a.s.c.c.SolrZkClient Using default ZkCredentialsProvider
   [junit4]   2> 1906610 INFO  (TEST-LeaderElectionTest.testElection-seed#[42D22A74A9578763]) [    ] o.a.s.c.c.ConnectionManager Waiting for client to connect to ZooKeeper
   [junit4]   2> 1906612 INFO  (zkCallback-2272-thread-1) [    ] o.a.s.c.c.ConnectionManager Watcher org.apache.solr.common.cloud.ConnectionManager@44566571 name:ZooKeeperConnection Watcher:127.0.0.1:57950/solr got event WatchedEvent state:SyncConnected type:None path:null path:null type:None
   [junit4]   2> 1906612 INFO  (TEST-LeaderElectionTest.testElection-seed#[42D22A74A9578763]) [    ] o.a.s.c.c.ConnectionManager Client is connected to ZooKeeper
   [junit4]   2> 1906612 INFO  (TEST-LeaderElectionTest.testElection-seed#[42D22A74A9578763]) [    ] o.a.s.c.c.SolrZkClient Using default ZkACLProvider
   [junit4]   2> 1906612 INFO  (TEST-LeaderElectionTest.testElection-seed#[42D22A74A9578763]) [    ] o.a.s.c.c.SolrZkClient Using default ZkCredentialsProvider
   [junit4]   2> 1906612 INFO  (TEST-LeaderElectionTest.testElection-seed#[42D22A74A9578763]) [    ] o.a.s.c.c.ConnectionManager Waiting for client to connect to ZooKeeper
   [junit4]   2> 1906614 INFO  (zkCallback-2274-thread-1) [    ] o.a.s.c.c.ConnectionManager Watcher org.apache.solr.common.cloud.ConnectionManager@31b2866b name:ZooKeeperConnection Watcher:127.0.0.1:57950/solr got event WatchedEvent state:SyncConnected type:None path:null path:null type:None
   [junit4]   2> 1906615 INFO  (TEST-LeaderElectionTest.testElection-seed#[42D22A74A9578763]) [    ] o.a.s.c.c.ConnectionManager Client is connected to ZooKeeper
   [junit4]   2> 1906615 INFO  (TEST-LeaderElectionTest.testElection-seed#[42D22A74A9578763]) [    ] o.a.s.c.c.SolrZkClient Using default ZkACLProvider
   [junit4]   2> 1906615 INFO  (TEST-LeaderElectionTest.testElection-seed#[42D22A74A9578763]) [    ] o.a.s.c.c.SolrZkClient Using default ZkCredentialsProvider
   [junit4]   2> 1906617 INFO  (TEST-LeaderElectionTest.testElection-seed#[42D22A74A9578763]) [    ] o.a.s.c.c.ConnectionManager Waiting for client to connect to ZooKeeper
   [junit4]   2> 1906617 INFO  (zkCallback-2276-thread-1) [    ] o.a.s.c.c.ConnectionManager Watcher org.apache.solr.common.cloud.ConnectionManager@5e59153 name:ZooKeeperConnection Watcher:127.0.0.1:57950/solr got event WatchedEvent state:SyncConnected type:None path:null path:null type:None
   [junit4]   2> 1906618 INFO  (TEST-LeaderElectionTest.testElection-seed#[42D22A74A9578763]) [    ] o.a.s.c.c.ConnectionManager Client is connected to ZooKeeper
   [junit4]   2> 1906618 INFO  (TEST-LeaderElectionTest.testElection-seed#[42D22A74A9578763]) [    ] o.a.s.c.c.SolrZkClient Using default ZkACLProvider
   [junit4]   2> 1906618 INFO  (TEST-LeaderElectionTest.testElection-seed#[42D22A74A9578763]) [    ] o.a.s.c.c.SolrZkClient Using default ZkCredentialsProvider
   [junit4]   2> 1906629 INFO  (TEST-LeaderElectionTest.testElection-seed#[42D22A74A9578763]) [    ] o.a.s.c.c.ConnectionManager Waiting for client to connect to ZooKeeper
   [junit4]   2> 1906630 INFO  (zkCallback-2278-thread-1) [    ] o.a.s.c.c.ConnectionManager Watcher org.apache.solr.common.cloud.ConnectionManager@1c108e95 name:ZooKeeperConnection Watcher:127.0.0.1:57950/solr got event WatchedEvent state:SyncConnected type:None path:null path:null type:None
   [junit4]   2> 1906630 INFO  (TEST-LeaderElectionTest.testElection-seed#[42D22A74A9578763]) [    ] o.a.s.c.c.ConnectionManager Client is connected to ZooKeeper
   [junit4]   2> 1906630 INFO  (TEST-LeaderElectionTest.testElection-seed#[42D22A74A9578763]) [    ] o.a.s.c.c.SolrZkClient Using default ZkACLProvider
   [junit4]   2> 1906630 INFO  (TEST-LeaderElectionTest.testElection-seed#[42D22A74A9578763]) [    ] o.a.s.c.c.SolrZkClient Using default ZkCredentialsProvider
   [junit4]   2> 1906631 INFO  (TEST-LeaderElectionTest.testElection-seed#[42D22A74A9578763]) [    ] o.a.s.c.c.ConnectionManager Waiting for client to connect to ZooKeeper
   [junit4]   2> 1906633 INFO  (zkCallback-2280-thread-1) [    ] o.a.s.c.c.ConnectionManager Watcher org.apache.solr.common.cloud.ConnectionManager@206efbb1 name:ZooKeeperConnection Watcher:127.0.0.1:57950/solr got event WatchedEvent state:SyncConnected type:None path:null path:null type:None
   [junit4]   2> 1906633 INFO  (TEST-LeaderElectionTest.testElection-seed#[42D22A74A9578763]) [    ] o.a.s.c.c.ConnectionManager Client is connected to ZooKeeper
   [junit4]   2> 1906633 INFO  (TEST-LeaderElectionTest.testElection-seed#[42D22A74A9578763]) [    ] o.a.s.c.c.SolrZkClient Using default ZkACLProvider
   [junit4]   2> 1906633 INFO  (TEST-LeaderElectionTest.testElection-seed#[42D22A74A9578763]) [    ] o.a.s.c.c.SolrZkClient Using default ZkCredentialsProvider
   [junit4]   2> 1906633 INFO  (TEST-LeaderElectionTest.testElection-seed#[42D22A74A9578763]) [    ] o.a.s.c.c.ConnectionManager Waiting for client to connect to ZooKeeper
   [junit4]   2> 1906635 INFO  (zkCallback-2282-thread-1) [    ] o.a.s.c.c.ConnectionManager Watcher org.apache.solr.common.cloud.ConnectionManager@b9b5727 name:ZooKeeperConnection Watcher:127.0.0.1:57950/solr got event WatchedEvent state:SyncConnected type:None path:null path:null type:None
   [junit4]   2> 1906635 INFO  (TEST-LeaderElectionTest.testElection-seed#[42D22A74A9578763]) [    ] o.a.s.c.c.ConnectionManager Client is connected to ZooKeeper
   [junit4]   2> 1906635 INFO  (TEST-LeaderElectionTest.testElection-seed#[42D22A74A9578763]) [    ] o.a.s.c.c.SolrZkClient Using default ZkACLProvider
   [junit4]   2> 1906635 INFO  (TEST-LeaderElectionTest.testElection-seed#[42D22A74A9578763]) [    ] o.a.s.c.c.SolrZkClient Using default ZkCredentialsProvider
   [junit4]   2> 1906636 INFO  (TEST-LeaderElectionTest.testElection-seed#[42D22A74A9578763]) [    ] o.a.s.c.c.ConnectionManager Waiting for client to connect to ZooKeeper
   [junit4]   2> 1906637 INFO  (zkCallback-2284-thread-1) [    ] o.a.s.c.c.ConnectionManager Watcher org.apache.solr.common.cloud.ConnectionManager@98622a2 name:ZooKeeperConnection Watcher:127.0.0.1:57950/solr got event WatchedEvent state:SyncConnected type:None path:null path:null type:None
   [junit4]   2> 1906637 INFO  (TEST-LeaderElectionTest.testElection-seed#[42D22A74A9578763]) [    ] o.a.s.c.c.ConnectionManager Client is connected to ZooKeeper
   [junit4]   2> 1906637 INFO  (TEST-LeaderElectionTest.testElection-seed#[42D22A74A9578763]) [    ] o.a.s.c.c.SolrZkClient Using default ZkACLProvider
   [junit4]   2> 1906637 INFO  (TEST-LeaderElectionTest.testElection-seed#[42D22A74A9578763]) [    ] o.a.s.c.c.SolrZkClient Using default ZkCredentialsProvider
   [junit4]   2> 1906638 INFO  (TEST-LeaderElectionTest.testElection-seed#[42D22A74A9578763]) [    ] o.a.s.c.c.ConnectionManager Waiting for client to connect to ZooKeeper
   [junit4]   2> 1906639 INFO  (zkCallback-2286-thread-1) [    ] o.a.s.c.c.ConnectionManager Watcher org.apache.solr.common.cloud.ConnectionManager@1d44d5c5 name:ZooKeeperConnection Watcher:127.0.0.1:57950/solr got event WatchedEvent state:SyncConnected type:None path:null path:null type:None
   [junit4]   2> 1906639 INFO  (TEST-LeaderElectionTest.testElection-seed#[42D22A74A9578763]) [    ] o.a.s.c.c.ConnectionManager Client is connected to ZooKeeper
   [junit4]   2> 1906639 INFO  (TEST-LeaderElectionTest.testElection-seed#[42D22A74A9578763]) [    ] o.a.s.c.c.SolrZkClient Using default ZkACLProvider
   [junit4]   2> 1906640 INFO  (TEST-LeaderElectionTest.testElection-seed#[42D22A74A9578763]) [    ] o.a.s.c.c.SolrZkClient Using default ZkCredentialsProvider
   [junit4]   2> 1906641 INFO  (TEST-LeaderElectionTest.testElection-seed#[42D22A74A9578763]) [    ] o.a.s.c.c.ConnectionManager Waiting for client to connect to ZooKeeper
   [junit4]   2> 1906641 INFO  (zkCallback-2288-thread-1) [    ] o.a.s.c.c.ConnectionManager Watcher org.apache.solr.common.cloud.ConnectionManager@4f33ab60 name:ZooKeeperConnection Watcher:127.0.0.1:57950/solr got event WatchedEvent state:SyncConnected type:None path:null path:null type:None
   [junit4]   2> 1906642 INFO  (TEST-LeaderElectionTest.testElection-seed#[42D22A74A9578763]) [    ] o.a.s.c.c.ConnectionManager Client is connected to ZooKeeper
   [junit4]   2> 1906642 INFO  (TEST-LeaderElectionTest.testElection-seed#[42D22A74A9578763]) [    ] o.a.s.c.c.SolrZkClient Using default ZkACLProvider
   [junit4]   2> 1906642 INFO  (TEST-LeaderElectionTest.testElection-seed#[42D22A74A9578763]) [    ] o.a.s.c.c.SolrZkClient Using default ZkCredentialsProvider
   [junit4]   2> 1906644 INFO  (TEST-LeaderElectionTest.testElection-seed#[42D22A74A9578763]) [    ] o.a.s.c.c.ConnectionManager Waiting for client to connect to ZooKeeper
   [junit4]   2> 1906644 INFO  (zkCallback-2290-thread-1) [    ] o.a.s.c.c.ConnectionManager Watcher org.apache.solr.common.cloud.ConnectionManager@3e15ab10 name:ZooKeeperConnection Watcher:127.0.0.1:57950/solr got event WatchedEvent state:SyncConnected type:None path:null path:null type:None
   [junit4]   2> 1906645 INFO  (TEST-LeaderElectionTest.testElection-seed#[42D22A74A9578763]) [    ] o.a.s.c.c.ConnectionManager Client is connected to ZooKeeper
   [junit4]   2> 1906645 INFO  (TEST-LeaderElectionTest.testElection-seed#[42D22A74A9578763]) [    ] o.a.s.c.c.SolrZkClient Using default ZkACLProvider
   [junit4]   2> 1906645 INFO  (TEST-LeaderElectionTest.testElection-seed#[42D22A74A9578763]) [    ] o.a.s.c.c.SolrZkClient Using default ZkCredentialsProvider
   [junit4]   2> 1906645 INFO  (TEST-LeaderElectionTest.testElection-seed#[42D22A74A9578763]) [    ] o.a.s.c.c.ConnectionManager Waiting for client to connect to ZooKeeper
   [junit4]   2> 1906647 INFO  (zkCallback-2292-thread-1) [    ] o.a.s.c.c.ConnectionManager Watcher org.apache.solr.common.cloud.ConnectionManager@7a1d4cf7 name:ZooKeeperConnection Watcher:127.0.0.1:57950/solr got event WatchedEvent state:SyncConnected type:None path:null path:null type:None
   [junit4]   2> 1906647 INFO  (TEST-LeaderElectionTest.testElection-seed#[42D22A74A9578763]) [    ] o.a.s.c.c.ConnectionManager Client is connected to ZooKeeper
   [junit4]   2> 1906647 INFO  (TEST-LeaderElectionTest.testElection-seed#[42D22A74A9578763]) [    ] o.a.s.c.c.SolrZkClient Using default ZkACLProvider
   [junit4]   2> 1906648 INFO  (Thread-shard11) [    ] o.a.s.c.c.SolrZkClient makePath: /collections/collection1
   [junit4]   2> 1906649 INFO  (Thread-shard10) [    ] o.a.s.c.c.SolrZkClient makePath: /collections/collection1
   [junit4]   2> 1906649 INFO  (Thread-shard12) [    ] o.a.s.c.c.SolrZkClient makePath: /collections/collection1
   [junit4]   2> 1906651 INFO  (Thread-shard13) [    ] o.a.s.c.c.SolrZkClient makePath: /collections/collection1
   [junit4]   2> 1906651 INFO  (Thread-shard14) [    ] o.a.s.c.c.SolrZkClient makePath: /collections/collection1
   [junit4]   2> 1906651 INFO  (Thread-shard15) [    ] o.a.s.c.c.SolrZkClient makePath: /collections/collection1
   [junit4]   2> 1906652 INFO  (Thread-shard18) [    ] o.a.s.c.c.SolrZkClient makePath: /collections/collection1
   [junit4]   2> 1906652 INFO  (Thread-shard16) [    ] o.a.s.c.c.SolrZkClient makePath: /collections/collection1
   [junit4]   2> 1906653 INFO  (Thread-shard17) [    ] o.a.s.c.c.SolrZkClient makePath: /collections/collection1
   [junit4]   2> 1906653 INFO  (Thread-shard19) [    ] o.a.s.c.c.SolrZkClient makePath: /collections/collection1
   [junit4]   2> 1906655 INFO  (Thread-shard110) [    ] o.a.s.c.c.SolrZkClient makePath: /collections/collection1
   [junit4]   2> 1906655 INFO  (Thread-shard111) [    ] o.a.s.c.c.SolrZkClient makePath: /collections/collection1
   [junit4]   2> 1906656 INFO  (Thread-shard112) [    ] o.a.s.c.c.SolrZkClient makePath: /collections/collection1
   [junit4]   2> 1906656 INFO  (Thread-shard113) [    ] o.a.s.c.c.SolrZkClient makePath: /collections/collection1
   [junit4]   2> 1906656 INFO  (Thread-shard114) [    ] o.a.s.c.c.SolrZkClient makePath: /collections/collection1
   [junit4]   2> 1906662 INFO  (Thread-shard10) [    ] o.a.s.c.c.SolrZkClient makePath: /collections/collection1/leader_elect/shard1/election
   [junit4]   2> 1906662 INFO  (Thread-shard12) [    ] o.a.s.c.c.SolrZkClient makePath: /collections/collection1/leader_elect/shard1/election
   [junit4]   2> 1906662 INFO  (Thread-shard11) [    ] o.a.s.c.c.SolrZkClient makePath: /collections/collection1/leader_elect/shard1/election
   [junit4]   2> 1906662 INFO  (Thread-shard15) [    ] o.a.s.c.c.SolrZkClient makePath: /collections/collection1/leader_elect/shard1/election
   [junit4]   2> 1906662 INFO  (Thread-shard13) [    ] o.a.s.c.c.SolrZkClient makePath: /collections/collection1/leader_elect/shard1/election
   [junit4]   2> 1906663 INFO  (Thread-shard14) [    ] o.a.s.c.c.SolrZkClient makePath: /collections/collection1/leader_elect/shard1/election
   [junit4]   2> 1906663 INFO  (Thread-shard16) [    ] o.a.s.c.c.SolrZkClient makePath: /collections/collection1/leader_elect/shard1/election
   [junit4]   2> 1906663 INFO  (Thread-shard19) [    ] o.a.s.c.c.SolrZkClient makePath: /collections/collection1/leader_elect/shard1/election
   [junit4]   2> 1906663 INFO  (Thread-shard18) [    ] o.a.s.c.c.SolrZkClient makePath: /collections/collection1/leader_elect/shard1/election
   [junit4]   2> 1906665 INFO  (Thread-shard17) [    ] o.a.s.c.c.SolrZkClient makePath: /collections/collection1/leader_elect/shard1/election
   [junit4]   2> 1906666 INFO  (Thread-shard111) [    ] o.a.s.c.c.SolrZkClient makePath: /collections/collection1/leader_elect/shard1/election
   [junit4]   2> 1906666 INFO  (Thread-shard114) [    ] o.a.s.c.c.SolrZkClient makePath: /collections/collection1/leader_elect/shard1/election
   [junit4]   2> 1906666 INFO  (Thread-shard110) [    ] o.a.s.c.c.SolrZkClient makePath: /collections/collection1/leader_elect/shard1/election
   [junit4]   2> 1906667 INFO  (Thread-shard113) [    ] o.a.s.c.c.SolrZkClient makePath: /collections/collection1/leader_elect/shard1/election
   [junit4]   2> 1906668 INFO  (Thread-shard112) [    ] o.a.s.c.c.SolrZkClient makePath: /collections/collection1/leader_elect/shard1/election
   [junit4]   2> 1906686 INFO  (Thread-shard110) [    ] o.a.s.c.LeaderElector Joined leadership election with path: /collections/collection1/leader_elect/shard1/election/95894984998256653-shard110-n_0000000000
   [junit4]   2> 1906686 INFO  (Thread-shard13) [    ] o.a.s.c.LeaderElector Joined leadership election with path: /collections/collection1/leader_elect/shard1/election/95894984998256646-shard13-n_0000000001
   [junit4]   2> 1906687 INFO  (Thread-shard16) [    ] o.a.s.c.LeaderElector Joined leadership election with path: /collections/collection1/leader_elect/shard1/election/95894984998256649-shard16-n_0000000002
   [junit4]   2> 1906687 INFO  (Thread-shard113) [    ] o.a.s.c.LeaderElector Joined leadership election with path: /collections/collection1/leader_elect/shard1/election/95894984998256656-shard113-n_0000000003
   [junit4]   2> 1906687 INFO  (Thread-shard17) [    ] o.a.s.c.LeaderElector Joined leadership election with path: /collections/collection1/leader_elect/shard1/election/95894984998256650-shard17-n_0000000004
   [junit4]   2> 1906687 INFO  (Thread-shard19) [    ] o.a.s.c.LeaderElector Joined leadership election with path: /collections/collection1/leader_elect/shard1/election/95894984998256652-shard19-n_0000000005
   [junit4]   2> 1906687 INFO  (Thread-shard12) [    ] o.a.s.c.LeaderElector Joined leadership election with path: /collections/collection1/leader_elect/shard1/election/95894984998256645-shard12-n_0000000006
   [junit4]   2> 1906687 INFO  (Thread-shard11) [    ] o.a.s.c.LeaderElector Joined leadership election with path: /collections/collection1/leader_elect/shard1/election/95894984998256644-shard11-n_0000000008
   [junit4]   2> 1906687 INFO  (Thread-shard10) [    ] o.a.s.c.LeaderElector Joined leadership election with path: /collections/collection1/leader_elect/shard1/election/95894984998256643-shard10-n_0000000007
   [junit4]   2> 1906688 INFO  (Thread-shard111) [    ] o.a.s.c.LeaderElector Joined leadership election with path: /collections/collection1/leader_elect/shard1/election/95894984998256654-shard111-n_0000000009
   [junit4]   2> 1906688 INFO  (Thread-shard18) [    ] o.a.s.c.LeaderElector Joined leadership election with path: /collections/collection1/leader_elect/shard1/election/95894984998256651-shard18-n_0000000010
   [junit4]   2> 1906689 INFO  (Thread-shard114) [    ] o.a.s.c.LeaderElector Joined leadership election with path: /collections/collection1/leader_elect/shard1/election/95894984998256657-shard114-n_0000000011
   [junit4]   2> 1906689 INFO  (Thread-shard15) [    ] o.a.s.c.LeaderElector Joined leadership election with path: /collections/collection1/leader_elect/shard1/election/95894984998256648-shard15-n_0000000012
   [junit4]   2> 1906689 INFO  (Thread-shard14) [    ] o.a.s.c.LeaderElector Joined leadership election with path: /collections/collection1/leader_elect/shard1/election/95894984998256647-shard14-n_0000000013
   [junit4]   2> 1906693 INFO  (Thread-shard112) [    ] o.a.s.c.LeaderElector Joined leadership election with path: /collections/collection1/leader_elect/shard1/election/95894984998256655-shard112-n_0000000014
   [junit4]   2> 1906695 INFO  (Thread-shard110) [    ] o.a.s.c.c.SolrZkClient makePath: /collections/collection1/leaders/shard1
   [junit4]   2> 1906695 INFO  (Thread-shard13) [    ] o.a.s.c.LeaderElector Watching path /collections/collection1/leader_elect/shard1/election/95894984998256653-shard110-n_0000000000 to know if I could be the leader
   [junit4]   2> 1906695 INFO  (Thread-shard19) [    ] o.a.s.c.LeaderElector Watching path /collections/collection1/leader_elect/shard1/election/95894984998256650-shard17-n_0000000004 to know if I could be the leader
   [junit4]   2> 1906695 INFO  (Thread-shard12) [    ] o.a.s.c.LeaderElector Watching path /collections/collection1/leader_elect/shard1/election/95894984998256652-shard19-n_0000000005 to know if I could be the leader
   [junit4]   2> 1906696 INFO  (Thread-shard113) [    ] o.a.s.c.LeaderElector Watching path /collections/collection1/leader_elect/shard1/election/95894984998256649-shard16-n_0000000002 to know if I could be the leader
   [junit4]   2> 1906696 INFO  (Thread-shard16) [    ] o.a.s.c.LeaderElector Watching path /collections/collection1/leader_elect/shard1/election/95894984998256646-shard13-n_0000000001 to know if I could be the leader
   [junit4]   2> 1906697 INFO  (Thread-shard17) [    ] o.a.s.c.LeaderElector Watching path /collections/collection1/leader_elect/shard1/election/95894984998256656-shard113-n_0000000003 to know if I could be the leader
   [junit4]   2> 1906697 INFO  (Thread-shard11) [    ] o.a.s.c.LeaderElector Watching path /collections/collection1/leader_elect/shard1/election/95894984998256643-shard10-n_0000000007 to know if I could be the leader
   [junit4]   2> 1906697 INFO  (Thread-shard10) [    ] o.a.s.c.LeaderElector Watching path /collections/collection1/leader_elect/shard1/election/95894984998256645-shard12-n_0000000006 to know if I could be the leader
   [junit4]   2> 1906697 INFO  (Thread-shard111) [    ] o.a.s.c.LeaderElector Watching path /collections/collection1/leader_elect/shard1/election/95894984998256644-shard11-n_0000000008 to know if I could be the leader
   [junit4]   2> 1906698 INFO  (Thread-shard114) [    ] o.a.s.c.LeaderElector Watching path /collections/collection1/leader_elect/shard1/election/95894984998256651-shard18-n_0000000010 to know if I could be the leader
   [junit4]   2> 1906698 INFO  (Thread-shard18) [    ] o.a.s.c.LeaderElector Watching path /collections/collection1/leader_elect/shard1/election/95894984998256654-shard111-n_00

[...truncated too long message...]

llback-2326-thread-5) [    ] o.a.s.c.ShardLeaderElectionContextBase Creating leader registration node /collections/collection1/leaders/parshard10/leader after winning as /collections/collection1/leader_elect/parshard10/election/95894990301626372-parshard102-n_0000000001
   [junit4]   2> 1987743 INFO  (zkCallback-2326-thread-4) [    ] o.a.s.c.ShardLeaderElectionContextBase Creating leader registration node /collections/collection1/leaders/parshard9/leader after winning as /collections/collection1/leader_elect/parshard9/election/95894990301626372-parshard92-n_0000000001
   [junit4]   2> 1987744 INFO  (zkCallback-2326-thread-6) [    ] o.a.s.c.ShardLeaderElectionContextBase Creating leader registration node /collections/collection1/leaders/parshard1/leader after winning as /collections/collection1/leader_elect/parshard1/election/95894990301626372-parshard12-n_0000000001
   [junit4]   2> 1987744 INFO  (zkCallback-2326-thread-7) [    ] o.a.s.c.ShardLeaderElectionContextBase Creating leader registration node /collections/collection1/leaders/parshard6/leader after winning as /collections/collection1/leader_elect/parshard6/election/95894990301626372-parshard62-n_0000000001
   [junit4]   2> 1987747 INFO  (zkCallback-2326-thread-8) [    ] o.a.s.c.ShardLeaderElectionContextBase Creating leader registration node /collections/collection1/leaders/parshard7/leader after winning as /collections/collection1/leader_elect/parshard7/election/95894990301626372-parshard72-n_0000000001
   [junit4]   2> 1987748 INFO  (zkCallback-2326-thread-10) [    ] o.a.s.c.ShardLeaderElectionContextBase Creating leader registration node /collections/collection1/leaders/parshard4/leader after winning as /collections/collection1/leader_elect/parshard4/election/95894990301626372-parshard42-n_0000000001
   [junit4]   2> 1987748 INFO  (zkCallback-2326-thread-9) [    ] o.a.s.c.ShardLeaderElectionContextBase Creating leader registration node /collections/collection1/leaders/parshard11/leader after winning as /collections/collection1/leader_elect/parshard11/election/95894990301626372-parshard112-n_0000000001
   [junit4]   2> 1987749 INFO  (zkCallback-2326-thread-11) [    ] o.a.s.c.ShardLeaderElectionContextBase Creating leader registration node /collections/collection1/leaders/parshard5/leader after winning as /collections/collection1/leader_elect/parshard5/election/95894990301626372-parshard52-n_0000000001
   [junit4]   2> 1987750 INFO  (zkCallback-2326-thread-12) [    ] o.a.s.c.ShardLeaderElectionContextBase Creating leader registration node /collections/collection1/leaders/parshard2/leader after winning as /collections/collection1/leader_elect/parshard2/election/95894990301626372-parshard22-n_0000000001
   [junit4]   2> 1987752 INFO  (zkCallback-2326-thread-2) [    ] o.a.s.c.LeaderElectionTest Sleeping for 3636ms to simulate leadership takeover delay
   [junit4]   2> 1987752 INFO  (zkCallback-2326-thread-1) [    ] o.a.s.c.LeaderElectionTest Sleeping for 3636ms to simulate leadership takeover delay
   [junit4]   2> 1987753 INFO  (zkCallback-2326-thread-5) [    ] o.a.s.c.LeaderElectionTest Sleeping for 3636ms to simulate leadership takeover delay
   [junit4]   2> 1987753 INFO  (zkCallback-2326-thread-4) [    ] o.a.s.c.LeaderElectionTest Sleeping for 3636ms to simulate leadership takeover delay
   [junit4]   2> 1987753 INFO  (zkCallback-2326-thread-3) [    ] o.a.s.c.LeaderElectionTest Sleeping for 3636ms to simulate leadership takeover delay
   [junit4]   2> 1987753 INFO  (zkCallback-2326-thread-6) [    ] o.a.s.c.LeaderElectionTest Sleeping for 3636ms to simulate leadership takeover delay
   [junit4]   2> 1987753 INFO  (zkCallback-2326-thread-7) [    ] o.a.s.c.LeaderElectionTest Sleeping for 3636ms to simulate leadership takeover delay
   [junit4]   2> 1987754 INFO  (zkCallback-2326-thread-8) [    ] o.a.s.c.LeaderElectionTest Sleeping for 3636ms to simulate leadership takeover delay
   [junit4]   2> 1987755 INFO  (zkCallback-2326-thread-10) [    ] o.a.s.c.LeaderElectionTest Sleeping for 3636ms to simulate leadership takeover delay
   [junit4]   2> 1987755 INFO  (zkCallback-2326-thread-9) [    ] o.a.s.c.LeaderElectionTest Sleeping for 3636ms to simulate leadership takeover delay
   [junit4]   2> 1987755 INFO  (zkCallback-2326-thread-11) [    ] o.a.s.c.LeaderElectionTest Sleeping for 3636ms to simulate leadership takeover delay
   [junit4]   2> 1987755 INFO  (zkCallback-2326-thread-12) [    ] o.a.s.c.LeaderElectionTest Sleeping for 3636ms to simulate leadership takeover delay
   [junit4]   2> 1991404 INFO  (TEST-LeaderElectionTest.testParallelElection-seed#[42D22A74A9578763]) [    ] o.a.s.c.ZkTestServer connecting to 127.0.0.1:58065 58065
   [junit4]   2> 1992451 INFO  (Thread-3698) [    ] o.a.s.c.ZkTestServer connecting to 127.0.0.1:58065 58065
   [junit4]   2> 1993688 INFO  (TEST-LeaderElectionTest.testParallelElection-seed#[42D22A74A9578763]) [    ] o.a.s.SolrTestCaseJ4 ###Ending testParallelElection
   [junit4]   2> 1993690 INFO  (SUITE-LeaderElectionTest-seed#[42D22A74A9578763]-worker) [    ] o.a.s.SolrTestCaseJ4 ###deleteCore
   [junit4]   2> NOTE: leaving temporary files on disk at: /Users/jenkins/workspace/Lucene-Solr-6.x-MacOSX/solr/build/solr-core/test/J0/temp/solr.cloud.LeaderElectionTest_42D22A74A9578763-001
   [junit4]   2> NOTE: test params are: codec=Asserting(Lucene60): {}, docValues:{}, maxPointsInLeafNode=643, maxMBSortInHeap=7.849185801627954, sim=ClassicSimilarity, locale=el-CY, timezone=Arctic/Longyearbyen
   [junit4]   2> NOTE: Mac OS X 10.11.4 x86_64/Oracle Corporation 1.8.0_72 (64-bit)/cpus=3,threads=1,free=116515488,total=518979584
   [junit4]   2> NOTE: All tests run in this JVM: [TestDocSet, QueryEqualityTest, VersionInfoTest, TestLFUCache, TestUpdate, TestDocumentBuilder, TestMergePolicyConfig, RulesTest, DocumentBuilderTest, TestSchemaVersionResource, PingRequestHandlerTest, HdfsChaosMonkeyNothingIsSafeTest, CdcrReplicationDistributedZkTest, TestSubQueryTransformerCrossCore, DistributedExpandComponentTest, TestRTimerTree, PreAnalyzedFieldTest, TestInfoStreamLogging, HttpPartitionTest, TestCSVLoader, TestPKIAuthenticationPlugin, ActionThrottleTest, TestSQLHandler, HdfsBasicDistributedZk2Test, BlockJoinFacetRandomTest, RequiredFieldsTest, DistributedSuggestComponentTest, DistribJoinFromCollectionTest, TestExpandComponent, TestReqParamsAPI, TestMacros, HLLSerializationTest, TestSolrQueryResponse, XsltUpdateRequestHandlerTest, CollectionStateFormat2Test, TestFastLRUCache, RollingRestartTest, DirectoryFactoryTest, CustomCollectionTest, CursorPagingTest, BasicDistributedZkTest, RequestLoggingTest, TestGeoJSONResponseWriter, DataDrivenBlockJoinTest, BJQParserTest, TestXIncludeConfig, SuggestComponentTest, TestShardHandlerFactory, PreAnalyzedUpdateProcessorTest, BadComponentTest, TestFunctionQuery, TestRebalanceLeaders, TestConfigReload, TestConfigSetsAPIExclusivity, HighlighterTest, TestTrieFacet, DOMUtilTest, DistributedFacetPivotLongTailTest, TestClassicSimilarityFactory, SchemaVersionSpecificBehaviorTest, IndexSchemaTest, TestLeaderElectionZkExpiry, MigrateRouteKeyTest, IndexBasedSpellCheckerTest, DistribCursorPagingTest, TestRandomCollapseQParserPlugin, BigEndianAscendingWordSerializerTest, RecoveryZkTest, HardAutoCommitTest, JSONWriterTest, TestGraphTermsQParserPlugin, TestStandardQParsers, SpatialRPTFieldTypeTest, TestConfig, TolerantUpdateProcessorTest, TestCloudManagedSchema, DeleteShardTest, TestDownShardTolerantSearch, CloneFieldUpdateProcessorFactoryTest, CoreAdminRequestStatusTest, PeerSyncTest, TestArbitraryIndexDir, TestSolr4Spatial2, TestCryptoKeys, TestCloudInspectUtil, ZkStateReaderTest, ClusterStateUpdateTest, TestPseudoReturnFields, HdfsRecoverLeaseTest, TestQuerySenderNoQuery, DistributedSpellCheckComponentTest, JsonLoaderTest, TestStressVersions, TestBlendedInfixSuggestions, CloudExitableDirectoryReaderTest, PolyFieldTest, SpatialFilterTest, OverseerTest, CircularListTest, ScriptEngineTest, ConjunctionSolrSpellCheckerTest, TestOnReconnectListenerSupport, OutOfBoxZkACLAndCredentialsProvidersTest, HdfsRestartWhileUpdatingTest, TestUniqueKeyFieldResource, StatelessScriptUpdateProcessorFactoryTest, ConcurrentDeleteAndCreateCollectionTest, TestFieldSortValues, TestScoreJoinQPScore, TestMiniSolrCloudCluster, AsyncMigrateRouteKeyTest, SolrXmlInZkTest, TestCodecSupport, TestSchemaResource, SampleTest, TestDefaultStatsCache, TestManagedSynonymFilterFactory, AtomicUpdatesTest, TestLMDirichletSimilarityFactory, DocValuesTest, PathHierarchyTokenizerFactoryTest, HdfsThreadLeakTest, SolrCoreTest, ReplicationFactorTest, ClusterStateTest, TestPerFieldSimilarityWithDefaultOverride, LeaderElectionTest]
   [junit4] Completed [244/598 (2!)] on J0 in 87.25s, 5 tests, 1 error <<< FAILURES!

[...truncated 1142 lines...]
BUILD FAILED
/Users/jenkins/workspace/Lucene-Solr-6.x-MacOSX/build.xml:740: The following error occurred while executing this line:
/Users/jenkins/workspace/Lucene-Solr-6.x-MacOSX/build.xml:684: The following error occurred while executing this line:
/Users/jenkins/workspace/Lucene-Solr-6.x-MacOSX/build.xml:59: The following error occurred while executing this line:
/Users/jenkins/workspace/Lucene-Solr-6.x-MacOSX/solr/build.xml:233: The following error occurred while executing this line:
/Users/jenkins/workspace/Lucene-Solr-6.x-MacOSX/solr/common-build.xml:529: The following error occurred while executing this line:
/Users/jenkins/workspace/Lucene-Solr-6.x-MacOSX/lucene/common-build.xml:1457: The following error occurred while executing this line:
/Users/jenkins/workspace/Lucene-Solr-6.x-MacOSX/lucene/common-build.xml:1014: There were test failures: 598 suites (10 ignored), 2420 tests, 2 errors, 1 failure, 121 ignored (71 assumptions) [seed: 42D22A74A9578763]

Total time: 89 minutes 42 seconds
Build step 'Invoke Ant' marked build as failure
Archiving artifacts
[WARNINGS] Skipping publisher since build result is FAILURE
Recording test results
Email was triggered for: Failure - Any
Sending email for trigger: Failure - Any



Mime
View raw message