lucene-dev mailing list archives

Site index · List index
Message view « Date » · « Thread »
Top « Date » · « Thread »
From Policeman Jenkins Server <jenk...@thetaphi.de>
Subject [JENKINS] Lucene-Solr-master-Linux (32bit/jdk1.8.0_92) - Build # 16743 - Still Failing!
Date Sat, 14 May 2016 18:36:48 GMT
Build: http://jenkins.thetaphi.de/job/Lucene-Solr-master-Linux/16743/
Java: 32bit/jdk1.8.0_92 -server -XX:+UseConcMarkSweepGC

3 tests failed.
FAILED:  org.apache.solr.cloud.TestCollectionAPI.test

Error Message:
No live SolrServers available to handle this request:[https://127.0.0.1:45392, https://127.0.0.1:45408, https://127.0.0.1:43908]

Stack Trace:
org.apache.solr.client.solrj.SolrServerException: No live SolrServers available to handle this request:[https://127.0.0.1:45392, https://127.0.0.1:45408, https://127.0.0.1:43908]
	at __randomizedtesting.SeedInfo.seed([854D01BFC6242740:D193E6568D84AB8]:0)
	at org.apache.solr.client.solrj.impl.LBHttpSolrClient.request(LBHttpSolrClient.java:393)
	at org.apache.solr.client.solrj.impl.CloudSolrClient.sendRequest(CloudSolrClient.java:1228)
	at org.apache.solr.client.solrj.impl.CloudSolrClient.requestWithRetryOnStaleState(CloudSolrClient.java:998)
	at org.apache.solr.client.solrj.impl.CloudSolrClient.request(CloudSolrClient.java:934)
	at org.apache.solr.client.solrj.SolrRequest.process(SolrRequest.java:149)
	at org.apache.solr.client.solrj.SolrRequest.process(SolrRequest.java:166)
	at org.apache.solr.cloud.TestCollectionAPI.testClusterStateMigration(TestCollectionAPI.java:645)
	at org.apache.solr.cloud.TestCollectionAPI.test(TestCollectionAPI.java:83)
	at sun.reflect.NativeMethodAccessorImpl.invoke0(Native Method)
	at sun.reflect.NativeMethodAccessorImpl.invoke(NativeMethodAccessorImpl.java:62)
	at sun.reflect.DelegatingMethodAccessorImpl.invoke(DelegatingMethodAccessorImpl.java:43)
	at java.lang.reflect.Method.invoke(Method.java:498)
	at com.carrotsearch.randomizedtesting.RandomizedRunner.invoke(RandomizedRunner.java:1764)
	at com.carrotsearch.randomizedtesting.RandomizedRunner$8.evaluate(RandomizedRunner.java:871)
	at com.carrotsearch.randomizedtesting.RandomizedRunner$9.evaluate(RandomizedRunner.java:907)
	at com.carrotsearch.randomizedtesting.RandomizedRunner$10.evaluate(RandomizedRunner.java:921)
	at org.apache.solr.BaseDistributedSearchTestCase$ShardsRepeatRule$ShardsFixedStatement.callStatement(BaseDistributedSearchTestCase.java:985)
	at org.apache.solr.BaseDistributedSearchTestCase$ShardsRepeatRule$ShardsStatement.evaluate(BaseDistributedSearchTestCase.java:960)
	at com.carrotsearch.randomizedtesting.rules.SystemPropertiesRestoreRule$1.evaluate(SystemPropertiesRestoreRule.java:57)
	at org.apache.lucene.util.TestRuleSetupTeardownChained$1.evaluate(TestRuleSetupTeardownChained.java:49)
	at org.apache.lucene.util.AbstractBeforeAfterRule$1.evaluate(AbstractBeforeAfterRule.java:45)
	at org.apache.lucene.util.TestRuleThreadAndTestName$1.evaluate(TestRuleThreadAndTestName.java:48)
	at org.apache.lucene.util.TestRuleIgnoreAfterMaxFailures$1.evaluate(TestRuleIgnoreAfterMaxFailures.java:64)
	at org.apache.lucene.util.TestRuleMarkFailure$1.evaluate(TestRuleMarkFailure.java:47)
	at com.carrotsearch.randomizedtesting.rules.StatementAdapter.evaluate(StatementAdapter.java:36)
	at com.carrotsearch.randomizedtesting.ThreadLeakControl$StatementRunner.run(ThreadLeakControl.java:367)
	at com.carrotsearch.randomizedtesting.ThreadLeakControl.forkTimeoutingTask(ThreadLeakControl.java:809)
	at com.carrotsearch.randomizedtesting.ThreadLeakControl$3.evaluate(ThreadLeakControl.java:460)
	at com.carrotsearch.randomizedtesting.RandomizedRunner.runSingleTest(RandomizedRunner.java:880)
	at com.carrotsearch.randomizedtesting.RandomizedRunner$5.evaluate(RandomizedRunner.java:781)
	at com.carrotsearch.randomizedtesting.RandomizedRunner$6.evaluate(RandomizedRunner.java:816)
	at com.carrotsearch.randomizedtesting.RandomizedRunner$7.evaluate(RandomizedRunner.java:827)
	at com.carrotsearch.randomizedtesting.rules.StatementAdapter.evaluate(StatementAdapter.java:36)
	at com.carrotsearch.randomizedtesting.rules.SystemPropertiesRestoreRule$1.evaluate(SystemPropertiesRestoreRule.java:57)
	at org.apache.lucene.util.AbstractBeforeAfterRule$1.evaluate(AbstractBeforeAfterRule.java:45)
	at com.carrotsearch.randomizedtesting.rules.StatementAdapter.evaluate(StatementAdapter.java:36)
	at org.apache.lucene.util.TestRuleStoreClassName$1.evaluate(TestRuleStoreClassName.java:41)
	at com.carrotsearch.randomizedtesting.rules.NoShadowingOrOverridesOnMethodsRule$1.evaluate(NoShadowingOrOverridesOnMethodsRule.java:40)
	at com.carrotsearch.randomizedtesting.rules.NoShadowingOrOverridesOnMethodsRule$1.evaluate(NoShadowingOrOverridesOnMethodsRule.java:40)
	at com.carrotsearch.randomizedtesting.rules.StatementAdapter.evaluate(StatementAdapter.java:36)
	at com.carrotsearch.randomizedtesting.rules.StatementAdapter.evaluate(StatementAdapter.java:36)
	at com.carrotsearch.randomizedtesting.rules.StatementAdapter.evaluate(StatementAdapter.java:36)
	at org.apache.lucene.util.TestRuleAssertionsRequired$1.evaluate(TestRuleAssertionsRequired.java:53)
	at org.apache.lucene.util.TestRuleMarkFailure$1.evaluate(TestRuleMarkFailure.java:47)
	at org.apache.lucene.util.TestRuleIgnoreAfterMaxFailures$1.evaluate(TestRuleIgnoreAfterMaxFailures.java:64)
	at org.apache.lucene.util.TestRuleIgnoreTestSuites$1.evaluate(TestRuleIgnoreTestSuites.java:54)
	at com.carrotsearch.randomizedtesting.rules.StatementAdapter.evaluate(StatementAdapter.java:36)
	at com.carrotsearch.randomizedtesting.ThreadLeakControl$StatementRunner.run(ThreadLeakControl.java:367)
	at java.lang.Thread.run(Thread.java:745)
Caused by: org.apache.solr.client.solrj.impl.HttpSolrClient$RemoteSolrException: Error from server at https://127.0.0.1:45408: Could not migrate state format for collection: testClusterStateMigration
	at org.apache.solr.client.solrj.impl.HttpSolrClient.executeMethod(HttpSolrClient.java:606)
	at org.apache.solr.client.solrj.impl.HttpSolrClient.request(HttpSolrClient.java:259)
	at org.apache.solr.client.solrj.impl.HttpSolrClient.request(HttpSolrClient.java:248)
	at org.apache.solr.client.solrj.impl.LBHttpSolrClient.doRequest(LBHttpSolrClient.java:413)
	at org.apache.solr.client.solrj.impl.LBHttpSolrClient.request(LBHttpSolrClient.java:366)
	... 48 more


FAILED:  org.apache.solr.cloud.overseer.ZkStateReaderTest.testStateFormatUpdateWithExplicitRefresh

Error Message:


Stack Trace:
java.lang.NullPointerException
	at __randomizedtesting.SeedInfo.seed([854D01BFC6242740:9AF770481644E185]:0)
	at org.apache.solr.common.cloud.ZkStateReader.refreshLegacyClusterState(ZkStateReader.java:522)
	at org.apache.solr.common.cloud.ZkStateReader.forceUpdateCollection(ZkStateReader.java:296)
	at org.apache.solr.cloud.overseer.ZkStateReaderTest.testStateFormatUpdate(ZkStateReaderTest.java:126)
	at org.apache.solr.cloud.overseer.ZkStateReaderTest.testStateFormatUpdateWithExplicitRefresh(ZkStateReaderTest.java:41)
	at sun.reflect.NativeMethodAccessorImpl.invoke0(Native Method)
	at sun.reflect.NativeMethodAccessorImpl.invoke(NativeMethodAccessorImpl.java:62)
	at sun.reflect.DelegatingMethodAccessorImpl.invoke(DelegatingMethodAccessorImpl.java:43)
	at java.lang.reflect.Method.invoke(Method.java:498)
	at com.carrotsearch.randomizedtesting.RandomizedRunner.invoke(RandomizedRunner.java:1764)
	at com.carrotsearch.randomizedtesting.RandomizedRunner$8.evaluate(RandomizedRunner.java:871)
	at com.carrotsearch.randomizedtesting.RandomizedRunner$9.evaluate(RandomizedRunner.java:907)
	at com.carrotsearch.randomizedtesting.RandomizedRunner$10.evaluate(RandomizedRunner.java:921)
	at com.carrotsearch.randomizedtesting.rules.SystemPropertiesRestoreRule$1.evaluate(SystemPropertiesRestoreRule.java:57)
	at org.apache.lucene.util.TestRuleSetupTeardownChained$1.evaluate(TestRuleSetupTeardownChained.java:49)
	at org.apache.lucene.util.AbstractBeforeAfterRule$1.evaluate(AbstractBeforeAfterRule.java:45)
	at org.apache.lucene.util.TestRuleThreadAndTestName$1.evaluate(TestRuleThreadAndTestName.java:48)
	at org.apache.lucene.util.TestRuleIgnoreAfterMaxFailures$1.evaluate(TestRuleIgnoreAfterMaxFailures.java:64)
	at org.apache.lucene.util.TestRuleMarkFailure$1.evaluate(TestRuleMarkFailure.java:47)
	at com.carrotsearch.randomizedtesting.rules.StatementAdapter.evaluate(StatementAdapter.java:36)
	at com.carrotsearch.randomizedtesting.ThreadLeakControl$StatementRunner.run(ThreadLeakControl.java:367)
	at com.carrotsearch.randomizedtesting.ThreadLeakControl.forkTimeoutingTask(ThreadLeakControl.java:809)
	at com.carrotsearch.randomizedtesting.ThreadLeakControl$3.evaluate(ThreadLeakControl.java:460)
	at com.carrotsearch.randomizedtesting.RandomizedRunner.runSingleTest(RandomizedRunner.java:880)
	at com.carrotsearch.randomizedtesting.RandomizedRunner$5.evaluate(RandomizedRunner.java:781)
	at com.carrotsearch.randomizedtesting.RandomizedRunner$6.evaluate(RandomizedRunner.java:816)
	at com.carrotsearch.randomizedtesting.RandomizedRunner$7.evaluate(RandomizedRunner.java:827)
	at com.carrotsearch.randomizedtesting.rules.StatementAdapter.evaluate(StatementAdapter.java:36)
	at com.carrotsearch.randomizedtesting.rules.SystemPropertiesRestoreRule$1.evaluate(SystemPropertiesRestoreRule.java:57)
	at org.apache.lucene.util.AbstractBeforeAfterRule$1.evaluate(AbstractBeforeAfterRule.java:45)
	at com.carrotsearch.randomizedtesting.rules.StatementAdapter.evaluate(StatementAdapter.java:36)
	at org.apache.lucene.util.TestRuleStoreClassName$1.evaluate(TestRuleStoreClassName.java:41)
	at com.carrotsearch.randomizedtesting.rules.NoShadowingOrOverridesOnMethodsRule$1.evaluate(NoShadowingOrOverridesOnMethodsRule.java:40)
	at com.carrotsearch.randomizedtesting.rules.NoShadowingOrOverridesOnMethodsRule$1.evaluate(NoShadowingOrOverridesOnMethodsRule.java:40)
	at com.carrotsearch.randomizedtesting.rules.StatementAdapter.evaluate(StatementAdapter.java:36)
	at com.carrotsearch.randomizedtesting.rules.StatementAdapter.evaluate(StatementAdapter.java:36)
	at com.carrotsearch.randomizedtesting.rules.StatementAdapter.evaluate(StatementAdapter.java:36)
	at org.apache.lucene.util.TestRuleAssertionsRequired$1.evaluate(TestRuleAssertionsRequired.java:53)
	at org.apache.lucene.util.TestRuleMarkFailure$1.evaluate(TestRuleMarkFailure.java:47)
	at org.apache.lucene.util.TestRuleIgnoreAfterMaxFailures$1.evaluate(TestRuleIgnoreAfterMaxFailures.java:64)
	at org.apache.lucene.util.TestRuleIgnoreTestSuites$1.evaluate(TestRuleIgnoreTestSuites.java:54)
	at com.carrotsearch.randomizedtesting.rules.StatementAdapter.evaluate(StatementAdapter.java:36)
	at com.carrotsearch.randomizedtesting.ThreadLeakControl$StatementRunner.run(ThreadLeakControl.java:367)
	at java.lang.Thread.run(Thread.java:745)


FAILED:  org.apache.solr.cloud.overseer.ZkStateReaderTest.testStateFormatUpdateWithTimeDelay

Error Message:
expected:<2> but was:<1>

Stack Trace:
java.lang.AssertionError: expected:<2> but was:<1>
	at __randomizedtesting.SeedInfo.seed([854D01BFC6242740:FAD3B63AAF460ACA]:0)
	at org.junit.Assert.fail(Assert.java:93)
	at org.junit.Assert.failNotEquals(Assert.java:647)
	at org.junit.Assert.assertEquals(Assert.java:128)
	at org.junit.Assert.assertEquals(Assert.java:472)
	at org.junit.Assert.assertEquals(Assert.java:456)
	at org.apache.solr.cloud.overseer.ZkStateReaderTest.testStateFormatUpdate(ZkStateReaderTest.java:137)
	at org.apache.solr.cloud.overseer.ZkStateReaderTest.testStateFormatUpdateWithTimeDelay(ZkStateReaderTest.java:51)
	at sun.reflect.NativeMethodAccessorImpl.invoke0(Native Method)
	at sun.reflect.NativeMethodAccessorImpl.invoke(NativeMethodAccessorImpl.java:62)
	at sun.reflect.DelegatingMethodAccessorImpl.invoke(DelegatingMethodAccessorImpl.java:43)
	at java.lang.reflect.Method.invoke(Method.java:498)
	at com.carrotsearch.randomizedtesting.RandomizedRunner.invoke(RandomizedRunner.java:1764)
	at com.carrotsearch.randomizedtesting.RandomizedRunner$8.evaluate(RandomizedRunner.java:871)
	at com.carrotsearch.randomizedtesting.RandomizedRunner$9.evaluate(RandomizedRunner.java:907)
	at com.carrotsearch.randomizedtesting.RandomizedRunner$10.evaluate(RandomizedRunner.java:921)
	at com.carrotsearch.randomizedtesting.rules.SystemPropertiesRestoreRule$1.evaluate(SystemPropertiesRestoreRule.java:57)
	at org.apache.lucene.util.TestRuleSetupTeardownChained$1.evaluate(TestRuleSetupTeardownChained.java:49)
	at org.apache.lucene.util.AbstractBeforeAfterRule$1.evaluate(AbstractBeforeAfterRule.java:45)
	at org.apache.lucene.util.TestRuleThreadAndTestName$1.evaluate(TestRuleThreadAndTestName.java:48)
	at org.apache.lucene.util.TestRuleIgnoreAfterMaxFailures$1.evaluate(TestRuleIgnoreAfterMaxFailures.java:64)
	at org.apache.lucene.util.TestRuleMarkFailure$1.evaluate(TestRuleMarkFailure.java:47)
	at com.carrotsearch.randomizedtesting.rules.StatementAdapter.evaluate(StatementAdapter.java:36)
	at com.carrotsearch.randomizedtesting.ThreadLeakControl$StatementRunner.run(ThreadLeakControl.java:367)
	at com.carrotsearch.randomizedtesting.ThreadLeakControl.forkTimeoutingTask(ThreadLeakControl.java:809)
	at com.carrotsearch.randomizedtesting.ThreadLeakControl$3.evaluate(ThreadLeakControl.java:460)
	at com.carrotsearch.randomizedtesting.RandomizedRunner.runSingleTest(RandomizedRunner.java:880)
	at com.carrotsearch.randomizedtesting.RandomizedRunner$5.evaluate(RandomizedRunner.java:781)
	at com.carrotsearch.randomizedtesting.RandomizedRunner$6.evaluate(RandomizedRunner.java:816)
	at com.carrotsearch.randomizedtesting.RandomizedRunner$7.evaluate(RandomizedRunner.java:827)
	at com.carrotsearch.randomizedtesting.rules.StatementAdapter.evaluate(StatementAdapter.java:36)
	at com.carrotsearch.randomizedtesting.rules.SystemPropertiesRestoreRule$1.evaluate(SystemPropertiesRestoreRule.java:57)
	at org.apache.lucene.util.AbstractBeforeAfterRule$1.evaluate(AbstractBeforeAfterRule.java:45)
	at com.carrotsearch.randomizedtesting.rules.StatementAdapter.evaluate(StatementAdapter.java:36)
	at org.apache.lucene.util.TestRuleStoreClassName$1.evaluate(TestRuleStoreClassName.java:41)
	at com.carrotsearch.randomizedtesting.rules.NoShadowingOrOverridesOnMethodsRule$1.evaluate(NoShadowingOrOverridesOnMethodsRule.java:40)
	at com.carrotsearch.randomizedtesting.rules.NoShadowingOrOverridesOnMethodsRule$1.evaluate(NoShadowingOrOverridesOnMethodsRule.java:40)
	at com.carrotsearch.randomizedtesting.rules.StatementAdapter.evaluate(StatementAdapter.java:36)
	at com.carrotsearch.randomizedtesting.rules.StatementAdapter.evaluate(StatementAdapter.java:36)
	at com.carrotsearch.randomizedtesting.rules.StatementAdapter.evaluate(StatementAdapter.java:36)
	at org.apache.lucene.util.TestRuleAssertionsRequired$1.evaluate(TestRuleAssertionsRequired.java:53)
	at org.apache.lucene.util.TestRuleMarkFailure$1.evaluate(TestRuleMarkFailure.java:47)
	at org.apache.lucene.util.TestRuleIgnoreAfterMaxFailures$1.evaluate(TestRuleIgnoreAfterMaxFailures.java:64)
	at org.apache.lucene.util.TestRuleIgnoreTestSuites$1.evaluate(TestRuleIgnoreTestSuites.java:54)
	at com.carrotsearch.randomizedtesting.rules.StatementAdapter.evaluate(StatementAdapter.java:36)
	at com.carrotsearch.randomizedtesting.ThreadLeakControl$StatementRunner.run(ThreadLeakControl.java:367)
	at java.lang.Thread.run(Thread.java:745)




Build Log:
[...truncated 10937 lines...]
   [junit4] Suite: org.apache.solr.cloud.TestCollectionAPI
   [junit4]   2> Creating dataDir: /home/jenkins/workspace/Lucene-Solr-master-Linux/solr/build/solr-core/test/J1/temp/solr.cloud.TestCollectionAPI_854D01BFC6242740-001/init-core-data-001
   [junit4]   2> 396191 INFO  (SUITE-TestCollectionAPI-seed#[854D01BFC6242740]-worker) [    ] o.a.s.SolrTestCaseJ4 Randomized ssl (true) and clientAuth (false)
   [junit4]   2> 396192 INFO  (SUITE-TestCollectionAPI-seed#[854D01BFC6242740]-worker) [    ] o.a.s.BaseDistributedSearchTestCase Setting hostContext system property: /
   [junit4]   2> 396195 INFO  (TEST-TestCollectionAPI.test-seed#[854D01BFC6242740]) [    ] o.a.s.c.ZkTestServer STARTING ZK TEST SERVER
   [junit4]   2> 396195 INFO  (Thread-798) [    ] o.a.s.c.ZkTestServer client port:0.0.0.0/0.0.0.0:0
   [junit4]   2> 396195 INFO  (Thread-798) [    ] o.a.s.c.ZkTestServer Starting server
   [junit4]   2> 396295 INFO  (TEST-TestCollectionAPI.test-seed#[854D01BFC6242740]) [    ] o.a.s.c.ZkTestServer start zk server on port:35376
   [junit4]   2> 396295 INFO  (TEST-TestCollectionAPI.test-seed#[854D01BFC6242740]) [    ] o.a.s.c.c.SolrZkClient Using default ZkCredentialsProvider
   [junit4]   2> 396296 INFO  (TEST-TestCollectionAPI.test-seed#[854D01BFC6242740]) [    ] o.a.s.c.c.ConnectionManager Waiting for client to connect to ZooKeeper
   [junit4]   2> 396300 INFO  (zkCallback-317-thread-1) [    ] o.a.s.c.c.ConnectionManager Watcher org.apache.solr.common.cloud.ConnectionManager@1bd68f0 name:ZooKeeperConnection Watcher:127.0.0.1:35376 got event WatchedEvent state:SyncConnected type:None path:null path:null type:None
   [junit4]   2> 396300 INFO  (TEST-TestCollectionAPI.test-seed#[854D01BFC6242740]) [    ] o.a.s.c.c.ConnectionManager Client is connected to ZooKeeper
   [junit4]   2> 396301 INFO  (TEST-TestCollectionAPI.test-seed#[854D01BFC6242740]) [    ] o.a.s.c.c.SolrZkClient Using default ZkACLProvider
   [junit4]   2> 396301 INFO  (TEST-TestCollectionAPI.test-seed#[854D01BFC6242740]) [    ] o.a.s.c.c.SolrZkClient makePath: /solr
   [junit4]   2> 396303 INFO  (TEST-TestCollectionAPI.test-seed#[854D01BFC6242740]) [    ] o.a.s.c.c.SolrZkClient Using default ZkCredentialsProvider
   [junit4]   2> 396303 INFO  (TEST-TestCollectionAPI.test-seed#[854D01BFC6242740]) [    ] o.a.s.c.c.ConnectionManager Waiting for client to connect to ZooKeeper
   [junit4]   2> 396304 INFO  (zkCallback-318-thread-1) [    ] o.a.s.c.c.ConnectionManager Watcher org.apache.solr.common.cloud.ConnectionManager@149ba3a name:ZooKeeperConnection Watcher:127.0.0.1:35376/solr got event WatchedEvent state:SyncConnected type:None path:null path:null type:None
   [junit4]   2> 396304 INFO  (TEST-TestCollectionAPI.test-seed#[854D01BFC6242740]) [    ] o.a.s.c.c.ConnectionManager Client is connected to ZooKeeper
   [junit4]   2> 396305 INFO  (TEST-TestCollectionAPI.test-seed#[854D01BFC6242740]) [    ] o.a.s.c.c.SolrZkClient Using default ZkACLProvider
   [junit4]   2> 396305 INFO  (TEST-TestCollectionAPI.test-seed#[854D01BFC6242740]) [    ] o.a.s.c.c.SolrZkClient makePath: /collections/collection1
   [junit4]   2> 396306 INFO  (TEST-TestCollectionAPI.test-seed#[854D01BFC6242740]) [    ] o.a.s.c.c.SolrZkClient makePath: /collections/collection1/shards
   [junit4]   2> 396307 INFO  (TEST-TestCollectionAPI.test-seed#[854D01BFC6242740]) [    ] o.a.s.c.c.SolrZkClient makePath: /collections/control_collection
   [junit4]   2> 396308 INFO  (TEST-TestCollectionAPI.test-seed#[854D01BFC6242740]) [    ] o.a.s.c.c.SolrZkClient makePath: /collections/control_collection/shards
   [junit4]   2> 396309 INFO  (TEST-TestCollectionAPI.test-seed#[854D01BFC6242740]) [    ] o.a.s.c.AbstractZkTestCase put /home/jenkins/workspace/Lucene-Solr-master-Linux/solr/core/src/test-files/solr/collection1/conf/solrconfig-tlog.xml to /configs/conf1/solrconfig.xml
   [junit4]   2> 396309 INFO  (TEST-TestCollectionAPI.test-seed#[854D01BFC6242740]) [    ] o.a.s.c.c.SolrZkClient makePath: /configs/conf1/solrconfig.xml
   [junit4]   2> 396310 INFO  (TEST-TestCollectionAPI.test-seed#[854D01BFC6242740]) [    ] o.a.s.c.AbstractZkTestCase put /home/jenkins/workspace/Lucene-Solr-master-Linux/solr/core/src/test-files/solr/collection1/conf/schema15.xml to /configs/conf1/schema.xml
   [junit4]   2> 396310 INFO  (TEST-TestCollectionAPI.test-seed#[854D01BFC6242740]) [    ] o.a.s.c.c.SolrZkClient makePath: /configs/conf1/schema.xml
   [junit4]   2> 396311 INFO  (TEST-TestCollectionAPI.test-seed#[854D01BFC6242740]) [    ] o.a.s.c.AbstractZkTestCase put /home/jenkins/workspace/Lucene-Solr-master-Linux/solr/core/src/test-files/solr/collection1/conf/solrconfig.snippet.randomindexconfig.xml to /configs/conf1/solrconfig.snippet.randomindexconfig.xml
   [junit4]   2> 396311 INFO  (TEST-TestCollectionAPI.test-seed#[854D01BFC6242740]) [    ] o.a.s.c.c.SolrZkClient makePath: /configs/conf1/solrconfig.snippet.randomindexconfig.xml
   [junit4]   2> 396312 INFO  (TEST-TestCollectionAPI.test-seed#[854D01BFC6242740]) [    ] o.a.s.c.AbstractZkTestCase put /home/jenkins/workspace/Lucene-Solr-master-Linux/solr/core/src/test-files/solr/collection1/conf/stopwords.txt to /configs/conf1/stopwords.txt
   [junit4]   2> 396312 INFO  (TEST-TestCollectionAPI.test-seed#[854D01BFC6242740]) [    ] o.a.s.c.c.SolrZkClient makePath: /configs/conf1/stopwords.txt
   [junit4]   2> 396313 INFO  (TEST-TestCollectionAPI.test-seed#[854D01BFC6242740]) [    ] o.a.s.c.AbstractZkTestCase put /home/jenkins/workspace/Lucene-Solr-master-Linux/solr/core/src/test-files/solr/collection1/conf/protwords.txt to /configs/conf1/protwords.txt
   [junit4]   2> 396313 INFO  (TEST-TestCollectionAPI.test-seed#[854D01BFC6242740]) [    ] o.a.s.c.c.SolrZkClient makePath: /configs/conf1/protwords.txt
   [junit4]   2> 396313 INFO  (TEST-TestCollectionAPI.test-seed#[854D01BFC6242740]) [    ] o.a.s.c.AbstractZkTestCase put /home/jenkins/workspace/Lucene-Solr-master-Linux/solr/core/src/test-files/solr/collection1/conf/currency.xml to /configs/conf1/currency.xml
   [junit4]   2> 396313 INFO  (TEST-TestCollectionAPI.test-seed#[854D01BFC6242740]) [    ] o.a.s.c.c.SolrZkClient makePath: /configs/conf1/currency.xml
   [junit4]   2> 396314 INFO  (TEST-TestCollectionAPI.test-seed#[854D01BFC6242740]) [    ] o.a.s.c.AbstractZkTestCase put /home/jenkins/workspace/Lucene-Solr-master-Linux/solr/core/src/test-files/solr/collection1/conf/enumsConfig.xml to /configs/conf1/enumsConfig.xml
   [junit4]   2> 396314 INFO  (TEST-TestCollectionAPI.test-seed#[854D01BFC6242740]) [    ] o.a.s.c.c.SolrZkClient makePath: /configs/conf1/enumsConfig.xml
   [junit4]   2> 396315 INFO  (TEST-TestCollectionAPI.test-seed#[854D01BFC6242740]) [    ] o.a.s.c.AbstractZkTestCase put /home/jenkins/workspace/Lucene-Solr-master-Linux/solr/core/src/test-files/solr/collection1/conf/open-exchange-rates.json to /configs/conf1/open-exchange-rates.json
   [junit4]   2> 396315 INFO  (TEST-TestCollectionAPI.test-seed#[854D01BFC6242740]) [    ] o.a.s.c.c.SolrZkClient makePath: /configs/conf1/open-exchange-rates.json
   [junit4]   2> 396315 INFO  (TEST-TestCollectionAPI.test-seed#[854D01BFC6242740]) [    ] o.a.s.c.AbstractZkTestCase put /home/jenkins/workspace/Lucene-Solr-master-Linux/solr/core/src/test-files/solr/collection1/conf/mapping-ISOLatin1Accent.txt to /configs/conf1/mapping-ISOLatin1Accent.txt
   [junit4]   2> 396316 INFO  (TEST-TestCollectionAPI.test-seed#[854D01BFC6242740]) [    ] o.a.s.c.c.SolrZkClient makePath: /configs/conf1/mapping-ISOLatin1Accent.txt
   [junit4]   2> 396316 INFO  (TEST-TestCollectionAPI.test-seed#[854D01BFC6242740]) [    ] o.a.s.c.AbstractZkTestCase put /home/jenkins/workspace/Lucene-Solr-master-Linux/solr/core/src/test-files/solr/collection1/conf/old_synonyms.txt to /configs/conf1/old_synonyms.txt
   [junit4]   2> 396316 INFO  (TEST-TestCollectionAPI.test-seed#[854D01BFC6242740]) [    ] o.a.s.c.c.SolrZkClient makePath: /configs/conf1/old_synonyms.txt
   [junit4]   2> 396317 INFO  (TEST-TestCollectionAPI.test-seed#[854D01BFC6242740]) [    ] o.a.s.c.AbstractZkTestCase put /home/jenkins/workspace/Lucene-Solr-master-Linux/solr/core/src/test-files/solr/collection1/conf/synonyms.txt to /configs/conf1/synonyms.txt
   [junit4]   2> 396317 INFO  (TEST-TestCollectionAPI.test-seed#[854D01BFC6242740]) [    ] o.a.s.c.c.SolrZkClient makePath: /configs/conf1/synonyms.txt
   [junit4]   2> 396319 INFO  (TEST-TestCollectionAPI.test-seed#[854D01BFC6242740]) [    ] o.a.s.c.c.SolrZkClient Using default ZkCredentialsProvider
   [junit4]   2> 396319 INFO  (TEST-TestCollectionAPI.test-seed#[854D01BFC6242740]) [    ] o.a.s.c.c.ConnectionManager Waiting for client to connect to ZooKeeper
   [junit4]   2> 396321 INFO  (zkCallback-320-thread-1) [    ] o.a.s.c.c.ConnectionManager Watcher org.apache.solr.common.cloud.ConnectionManager@d9f46d name:ZooKeeperConnection Watcher:127.0.0.1:35376/solr got event WatchedEvent state:SyncConnected type:None path:null path:null type:None
   [junit4]   2> 396321 INFO  (TEST-TestCollectionAPI.test-seed#[854D01BFC6242740]) [    ] o.a.s.c.c.ConnectionManager Client is connected to ZooKeeper
   [junit4]   2> 396321 INFO  (TEST-TestCollectionAPI.test-seed#[854D01BFC6242740]) [    ] o.a.s.c.c.SolrZkClient Using default ZkACLProvider
   [junit4]   2> 396397 INFO  (TEST-TestCollectionAPI.test-seed#[854D01BFC6242740]) [    ] o.a.s.SolrTestCaseJ4 Writing core.properties file to /home/jenkins/workspace/Lucene-Solr-master-Linux/solr/build/solr-core/test/J1/temp/solr.cloud.TestCollectionAPI_854D01BFC6242740-001/control-001/cores/collection1
   [junit4]   2> 396436 INFO  (TEST-TestCollectionAPI.test-seed#[854D01BFC6242740]) [    ] o.e.j.s.Server jetty-9.3.8.v20160314
   [junit4]   2> 396436 INFO  (TEST-TestCollectionAPI.test-seed#[854D01BFC6242740]) [    ] o.e.j.s.h.ContextHandler Started o.e.j.s.ServletContextHandler@6ec793{/,null,AVAILABLE}
   [junit4]   2> 396440 INFO  (TEST-TestCollectionAPI.test-seed#[854D01BFC6242740]) [    ] o.e.j.s.ServerConnector Started ServerConnector@1e608f8{SSL,[ssl, http/1.1]}{127.0.0.1:45408}
   [junit4]   2> 396440 INFO  (TEST-TestCollectionAPI.test-seed#[854D01BFC6242740]) [    ] o.e.j.s.Server Started @398320ms
   [junit4]   2> 396440 INFO  (TEST-TestCollectionAPI.test-seed#[854D01BFC6242740]) [    ] o.a.s.c.s.e.JettySolrRunner Jetty properties: {solr.data.dir=/home/jenkins/workspace/Lucene-Solr-master-Linux/solr/build/solr-core/test/J1/temp/solr.cloud.TestCollectionAPI_854D01BFC6242740-001/tempDir-001/control/data, hostContext=/, hostPort=45408, coreRootDirectory=/home/jenkins/workspace/Lucene-Solr-master-Linux/solr/build/solr-core/test/J1/temp/solr.cloud.TestCollectionAPI_854D01BFC6242740-001/control-001/cores}
   [junit4]   2> 396440 INFO  (TEST-TestCollectionAPI.test-seed#[854D01BFC6242740]) [    ] o.a.s.s.SolrDispatchFilter SolrDispatchFilter.init(): sun.misc.Launcher$AppClassLoader@1d16e93
   [junit4]   2> 396440 INFO  (TEST-TestCollectionAPI.test-seed#[854D01BFC6242740]) [    ] o.a.s.c.SolrResourceLoader new SolrResourceLoader for directory: '/home/jenkins/workspace/Lucene-Solr-master-Linux/solr/build/solr-core/test/J1/temp/solr.cloud.TestCollectionAPI_854D01BFC6242740-001/control-001'
   [junit4]   2> 396440 INFO  (TEST-TestCollectionAPI.test-seed#[854D01BFC6242740]) [    ] o.a.s.c.SolrResourceLoader JNDI not configured for solr (NoInitialContextEx)
   [junit4]   2> 396441 INFO  (TEST-TestCollectionAPI.test-seed#[854D01BFC6242740]) [    ] o.a.s.c.SolrResourceLoader solr home defaulted to 'solr/' (could not find system property or JNDI)
   [junit4]   2> 396441 INFO  (TEST-TestCollectionAPI.test-seed#[854D01BFC6242740]) [    ] o.a.s.c.c.SolrZkClient Using default ZkCredentialsProvider
   [junit4]   2> 396441 INFO  (TEST-TestCollectionAPI.test-seed#[854D01BFC6242740]) [    ] o.a.s.c.c.ConnectionManager Waiting for client to connect to ZooKeeper
   [junit4]   2> 396442 INFO  (zkCallback-321-thread-1) [    ] o.a.s.c.c.ConnectionManager Watcher org.apache.solr.common.cloud.ConnectionManager@18261e4 name:ZooKeeperConnection Watcher:127.0.0.1:35376/solr got event WatchedEvent state:SyncConnected type:None path:null path:null type:None
   [junit4]   2> 396442 INFO  (TEST-TestCollectionAPI.test-seed#[854D01BFC6242740]) [    ] o.a.s.c.c.ConnectionManager Client is connected to ZooKeeper
   [junit4]   2> 396443 INFO  (TEST-TestCollectionAPI.test-seed#[854D01BFC6242740]) [    ] o.a.s.c.c.SolrZkClient Using default ZkACLProvider
   [junit4]   2> 396446 INFO  (TEST-TestCollectionAPI.test-seed#[854D01BFC6242740]) [    ] o.a.s.s.SolrDispatchFilter Loading solr.xml from SolrHome (not found in ZooKeeper)
   [junit4]   2> 396446 INFO  (TEST-TestCollectionAPI.test-seed#[854D01BFC6242740]) [    ] o.a.s.c.SolrXmlConfig Loading container configuration from /home/jenkins/workspace/Lucene-Solr-master-Linux/solr/build/solr-core/test/J1/temp/solr.cloud.TestCollectionAPI_854D01BFC6242740-001/control-001/solr.xml
   [junit4]   2> 396452 INFO  (TEST-TestCollectionAPI.test-seed#[854D01BFC6242740]) [    ] o.a.s.c.CorePropertiesLocator Config-defined core root directory: /home/jenkins/workspace/Lucene-Solr-master-Linux/solr/build/solr-core/test/J1/temp/solr.cloud.TestCollectionAPI_854D01BFC6242740-001/control-001/cores
   [junit4]   2> 396452 INFO  (TEST-TestCollectionAPI.test-seed#[854D01BFC6242740]) [    ] o.a.s.c.CoreContainer New CoreContainer 18630852
   [junit4]   2> 396452 INFO  (TEST-TestCollectionAPI.test-seed#[854D01BFC6242740]) [    ] o.a.s.c.CoreContainer Loading cores into CoreContainer [instanceDir=/home/jenkins/workspace/Lucene-Solr-master-Linux/solr/build/solr-core/test/J1/temp/solr.cloud.TestCollectionAPI_854D01BFC6242740-001/control-001]
   [junit4]   2> 396452 WARN  (TEST-TestCollectionAPI.test-seed#[854D01BFC6242740]) [    ] o.a.s.c.CoreContainer Couldn't add files from /home/jenkins/workspace/Lucene-Solr-master-Linux/solr/build/solr-core/test/J1/temp/solr.cloud.TestCollectionAPI_854D01BFC6242740-001/control-001/lib to classpath: /home/jenkins/workspace/Lucene-Solr-master-Linux/solr/build/solr-core/test/J1/temp/solr.cloud.TestCollectionAPI_854D01BFC6242740-001/control-001/lib
   [junit4]   2> 396453 INFO  (TEST-TestCollectionAPI.test-seed#[854D01BFC6242740]) [    ] o.a.s.h.c.HttpShardHandlerFactory created with socketTimeout : 90000,urlScheme : ,connTimeout : 15000,maxConnectionsPerHost : 20,maxConnections : 10000,corePoolSize : 0,maximumPoolSize : 2147483647,maxThreadIdleTime : 5,sizeOfQueue : -1,fairnessPolicy : false,
   [junit4]   2> 396454 INFO  (TEST-TestCollectionAPI.test-seed#[854D01BFC6242740]) [    ] o.a.s.u.UpdateShardHandler Creating UpdateShardHandler HTTP client with params: 
   [junit4]   2> 396455 INFO  (TEST-TestCollectionAPI.test-seed#[854D01BFC6242740]) [    ] o.a.s.l.LogWatcher SLF4J impl is org.slf4j.impl.Log4jLoggerFactory
   [junit4]   2> 396455 INFO  (TEST-TestCollectionAPI.test-seed#[854D01BFC6242740]) [    ] o.a.s.l.LogWatcher Registering Log Listener [Log4j (org.slf4j.impl.Log4jLoggerFactory)]
   [junit4]   2> 396455 INFO  (TEST-TestCollectionAPI.test-seed#[854D01BFC6242740]) [    ] o.a.s.c.ZkContainer Zookeeper client=127.0.0.1:35376/solr
   [junit4]   2> 396455 INFO  (TEST-TestCollectionAPI.test-seed#[854D01BFC6242740]) [    ] o.a.s.c.ZkController zkHost includes chroot
   [junit4]   2> 396455 INFO  (TEST-TestCollectionAPI.test-seed#[854D01BFC6242740]) [    ] o.a.s.c.c.SolrZkClient Using default ZkCredentialsProvider
   [junit4]   2> 396456 INFO  (TEST-TestCollectionAPI.test-seed#[854D01BFC6242740]) [    ] o.a.s.c.c.ConnectionManager Waiting for client to connect to ZooKeeper
   [junit4]   2> 396457 INFO  (zkCallback-324-thread-1) [    ] o.a.s.c.c.ConnectionManager Watcher org.apache.solr.common.cloud.ConnectionManager@68e745 name:ZooKeeperConnection Watcher:127.0.0.1:35376 got event WatchedEvent state:SyncConnected type:None path:null path:null type:None
   [junit4]   2> 396457 INFO  (TEST-TestCollectionAPI.test-seed#[854D01BFC6242740]) [    ] o.a.s.c.c.ConnectionManager Client is connected to ZooKeeper
   [junit4]   2> 396457 INFO  (TEST-TestCollectionAPI.test-seed#[854D01BFC6242740]) [    ] o.a.s.c.c.SolrZkClient Using default ZkACLProvider
   [junit4]   2> 396460 INFO  (TEST-TestCollectionAPI.test-seed#[854D01BFC6242740]) [n:127.0.0.1:45408_    ] o.a.s.c.ZkController Added new OnReconnect listener org.apache.solr.cloud.ZkController$$Lambda$52/26262809@ed67d5
   [junit4]   2> 396461 INFO  (TEST-TestCollectionAPI.test-seed#[854D01BFC6242740]) [n:127.0.0.1:45408_    ] o.a.s.c.c.ConnectionManager Waiting for client to connect to ZooKeeper
   [junit4]   2> 396466 INFO  (zkCallback-325-thread-1-processing-n:127.0.0.1:45408_) [n:127.0.0.1:45408_    ] o.a.s.c.c.ConnectionManager Watcher org.apache.solr.common.cloud.ConnectionManager@14f2188 name:ZooKeeperConnection Watcher:127.0.0.1:35376/solr got event WatchedEvent state:SyncConnected type:None path:null path:null type:None
   [junit4]   2> 396466 INFO  (TEST-TestCollectionAPI.test-seed#[854D01BFC6242740]) [n:127.0.0.1:45408_    ] o.a.s.c.c.ConnectionManager Client is connected to ZooKeeper
   [junit4]   2> 396467 INFO  (TEST-TestCollectionAPI.test-seed#[854D01BFC6242740]) [n:127.0.0.1:45408_    ] o.a.s.c.c.SolrZkClient makePath: /overseer/queue
   [junit4]   2> 396468 INFO  (TEST-TestCollectionAPI.test-seed#[854D01BFC6242740]) [n:127.0.0.1:45408_    ] o.a.s.c.c.SolrZkClient makePath: /overseer/collection-queue-work
   [junit4]   2> 396469 INFO  (TEST-TestCollectionAPI.test-seed#[854D01BFC6242740]) [n:127.0.0.1:45408_    ] o.a.s.c.c.SolrZkClient makePath: /overseer/collection-map-running
   [junit4]   2> 396470 INFO  (TEST-TestCollectionAPI.test-seed#[854D01BFC6242740]) [n:127.0.0.1:45408_    ] o.a.s.c.c.SolrZkClient makePath: /overseer/collection-map-completed
   [junit4]   2> 396471 INFO  (TEST-TestCollectionAPI.test-seed#[854D01BFC6242740]) [n:127.0.0.1:45408_    ] o.a.s.c.c.SolrZkClient makePath: /overseer/collection-map-failure
   [junit4]   2> 396472 INFO  (TEST-TestCollectionAPI.test-seed#[854D01BFC6242740]) [n:127.0.0.1:45408_    ] o.a.s.c.c.SolrZkClient makePath: /live_nodes
   [junit4]   2> 396473 INFO  (TEST-TestCollectionAPI.test-seed#[854D01BFC6242740]) [n:127.0.0.1:45408_    ] o.a.s.c.c.SolrZkClient makePath: /aliases.json
   [junit4]   2> 396473 INFO  (TEST-TestCollectionAPI.test-seed#[854D01BFC6242740]) [n:127.0.0.1:45408_    ] o.a.s.c.c.SolrZkClient makePath: /clusterstate.json
   [junit4]   2> 396474 INFO  (TEST-TestCollectionAPI.test-seed#[854D01BFC6242740]) [n:127.0.0.1:45408_    ] o.a.s.c.c.SolrZkClient makePath: /security.json
   [junit4]   2> 396476 INFO  (TEST-TestCollectionAPI.test-seed#[854D01BFC6242740]) [n:127.0.0.1:45408_    ] o.a.s.c.c.ZkStateReader Updating cluster state from ZooKeeper... 
   [junit4]   2> 396477 INFO  (TEST-TestCollectionAPI.test-seed#[854D01BFC6242740]) [n:127.0.0.1:45408_    ] o.a.s.c.c.ZkStateReader Loaded cluster properties: {urlScheme=https}
   [junit4]   2> 396477 INFO  (TEST-TestCollectionAPI.test-seed#[854D01BFC6242740]) [n:127.0.0.1:45408_    ] o.a.s.c.c.ZkStateReader Updated live nodes from ZooKeeper... (0) -> (0)
   [junit4]   2> 396478 INFO  (TEST-TestCollectionAPI.test-seed#[854D01BFC6242740]) [n:127.0.0.1:45408_    ] o.a.s.c.c.SolrZkClient makePath: /overseer_elect
   [junit4]   2> 396478 INFO  (TEST-TestCollectionAPI.test-seed#[854D01BFC6242740]) [n:127.0.0.1:45408_    ] o.a.s.c.c.SolrZkClient makePath: /overseer_elect/election
   [junit4]   2> 396479 INFO  (TEST-TestCollectionAPI.test-seed#[854D01BFC6242740]) [n:127.0.0.1:45408_    ] o.a.s.c.Overseer Overseer (id=null) closing
   [junit4]   2> 396479 INFO  (TEST-TestCollectionAPI.test-seed#[854D01BFC6242740]) [n:127.0.0.1:45408_    ] o.a.s.c.LeaderElector Joined leadership election with path: /overseer_elect/election/95895483760050181-127.0.0.1:45408_-n_0000000000
   [junit4]   2> 396479 INFO  (TEST-TestCollectionAPI.test-seed#[854D01BFC6242740]) [n:127.0.0.1:45408_    ] o.a.s.c.OverseerElectionContext I am going to be the leader 127.0.0.1:45408_
   [junit4]   2> 396480 INFO  (TEST-TestCollectionAPI.test-seed#[854D01BFC6242740]) [n:127.0.0.1:45408_    ] o.a.s.c.c.SolrZkClient makePath: /overseer_elect/leader
   [junit4]   2> 396480 INFO  (TEST-TestCollectionAPI.test-seed#[854D01BFC6242740]) [n:127.0.0.1:45408_    ] o.a.s.c.Overseer Overseer (id=95895483760050181-127.0.0.1:45408_-n_0000000000) starting
   [junit4]   2> 396481 INFO  (TEST-TestCollectionAPI.test-seed#[854D01BFC6242740]) [n:127.0.0.1:45408_    ] o.a.s.c.c.SolrZkClient makePath: /overseer/queue-work
   [junit4]   2> 396485 INFO  (TEST-TestCollectionAPI.test-seed#[854D01BFC6242740]) [n:127.0.0.1:45408_    ] o.a.s.c.OverseerAutoReplicaFailoverThread Starting OverseerAutoReplicaFailoverThread autoReplicaFailoverWorkLoopDelay=10000 autoReplicaFailoverWaitAfterExpiration=30000 autoReplicaFailoverBadNodeExpiration=60000
   [junit4]   2> 396486 INFO  (OverseerStateUpdate-95895483760050181-127.0.0.1:45408_-n_0000000000) [n:127.0.0.1:45408_    ] o.a.s.c.Overseer Starting to work on the main queue
   [junit4]   2> 396487 INFO  (OverseerCollectionConfigSetProcessor-95895483760050181-127.0.0.1:45408_-n_0000000000) [n:127.0.0.1:45408_    ] o.a.s.c.OverseerTaskProcessor Process current queue of overseer operations
   [junit4]   2> 396487 INFO  (TEST-TestCollectionAPI.test-seed#[854D01BFC6242740]) [n:127.0.0.1:45408_    ] o.a.s.c.ZkController Register node as live in ZooKeeper:/live_nodes/127.0.0.1:45408_
   [junit4]   2> 396488 INFO  (TEST-TestCollectionAPI.test-seed#[854D01BFC6242740]) [n:127.0.0.1:45408_    ] o.a.s.c.c.SolrZkClient makePath: /live_nodes/127.0.0.1:45408_
   [junit4]   2> 396489 INFO  (OverseerStateUpdate-95895483760050181-127.0.0.1:45408_-n_0000000000) [n:127.0.0.1:45408_    ] o.a.s.c.c.ZkStateReader Updated live nodes from ZooKeeper... (0) -> (0)
   [junit4]   2> 396489 INFO  (zkCallback-325-thread-1-processing-n:127.0.0.1:45408_) [n:127.0.0.1:45408_    ] o.a.s.c.c.ZkStateReader A live node change: [WatchedEvent state:SyncConnected type:NodeChildrenChanged path:/live_nodes], has occurred - updating... (live nodes size: [0])
   [junit4]   2> 396490 INFO  (zkCallback-325-thread-1-processing-n:127.0.0.1:45408_) [n:127.0.0.1:45408_    ] o.a.s.c.c.ZkStateReader Updated live nodes from ZooKeeper... (0) -> (1)
   [junit4]   2> 396553 INFO  (TEST-TestCollectionAPI.test-seed#[854D01BFC6242740]) [n:127.0.0.1:45408_    ] o.a.s.c.CoreContainer Security conf doesn't exist. Skipping setup for authorization module.
   [junit4]   2> 396553 INFO  (TEST-TestCollectionAPI.test-seed#[854D01BFC6242740]) [n:127.0.0.1:45408_    ] o.a.s.c.CoreContainer No authentication plugin used.
   [junit4]   2> 396554 INFO  (TEST-TestCollectionAPI.test-seed#[854D01BFC6242740]) [n:127.0.0.1:45408_    ] o.a.s.c.CorePropertiesLocator Looking for core definitions underneath /home/jenkins/workspace/Lucene-Solr-master-Linux/solr/build/solr-core/test/J1/temp/solr.cloud.TestCollectionAPI_854D01BFC6242740-001/control-001/cores
   [junit4]   2> 396555 INFO  (TEST-TestCollectionAPI.test-seed#[854D01BFC6242740]) [n:127.0.0.1:45408_    ] o.a.s.c.CoreDescriptor Created CoreDescriptor: {name=collection1, config=solrconfig.xml, transient=false, schema=schema.xml, loadOnStartup=true, configSetProperties=configsetprops.json, collection=control_collection, coreNodeName=, dataDir=data/, shard=}
   [junit4]   2> 396555 INFO  (TEST-TestCollectionAPI.test-seed#[854D01BFC6242740]) [n:127.0.0.1:45408_    ] o.a.s.c.CorePropertiesLocator Found core collection1 in /home/jenkins/workspace/Lucene-Solr-master-Linux/solr/build/solr-core/test/J1/temp/solr.cloud.TestCollectionAPI_854D01BFC6242740-001/control-001/cores/collection1
   [junit4]   2> 396555 INFO  (TEST-TestCollectionAPI.test-seed#[854D01BFC6242740]) [n:127.0.0.1:45408_    ] o.a.s.c.CorePropertiesLocator Found 1 core definitions
   [junit4]   2> 396565 INFO  (coreLoadExecutor-959-thread-1-processing-n:127.0.0.1:45408_) [n:127.0.0.1:45408_ c:control_collection   x:collection1] o.a.s.c.ZkController publishing state=down
   [junit4]   2> 396565 INFO  (TEST-TestCollectionAPI.test-seed#[854D01BFC6242740]) [n:127.0.0.1:45408_    ] o.a.s.s.SolrDispatchFilter user.dir=/home/jenkins/workspace/Lucene-Solr-master-Linux/solr/build/solr-core/test/J1
   [junit4]   2> 396565 INFO  (TEST-TestCollectionAPI.test-seed#[854D01BFC6242740]) [n:127.0.0.1:45408_    ] o.a.s.s.SolrDispatchFilter SolrDispatchFilter.init() done
   [junit4]   2> 396565 INFO  (coreLoadExecutor-959-thread-1-processing-n:127.0.0.1:45408_) [n:127.0.0.1:45408_ c:control_collection   x:collection1] o.a.s.c.ZkController numShards not found on descriptor - reading it from system property
   [junit4]   2> 396565 INFO  (coreLoadExecutor-959-thread-1-processing-n:127.0.0.1:45408_) [n:127.0.0.1:45408_ c:control_collection   x:collection1] o.a.s.c.ZkController Collection control_collection not visible yet, but flagging it so a watch is registered when it becomes visible
   [junit4]   2> 396566 INFO  (OverseerStateUpdate-95895483760050181-127.0.0.1:45408_-n_0000000000) [n:127.0.0.1:45408_    ] o.a.s.c.Overseer processMessage: queueSize: 1, message = {
   [junit4]   2>   "core":"collection1",
   [junit4]   2>   "roles":null,
   [junit4]   2>   "base_url":"https://127.0.0.1:45408",
   [junit4]   2>   "node_name":"127.0.0.1:45408_",
   [junit4]   2>   "numShards":"1",
   [junit4]   2>   "state":"down",
   [junit4]   2>   "shard":null,
   [junit4]   2>   "collection":"control_collection",
   [junit4]   2>   "operation":"state"} current state version: 0
   [junit4]   2> 396566 INFO  (OverseerStateUpdate-95895483760050181-127.0.0.1:45408_-n_0000000000) [n:127.0.0.1:45408_    ] o.a.s.c.o.ReplicaMutator Update state numShards=1 message={
   [junit4]   2>   "core":"collection1",
   [junit4]   2>   "roles":null,
   [junit4]   2>   "base_url":"https://127.0.0.1:45408",
   [junit4]   2>   "node_name":"127.0.0.1:45408_",
   [junit4]   2>   "numShards":"1",
   [junit4]   2>   "state":"down",
   [junit4]   2>   "shard":null,
   [junit4]   2>   "collection":"control_collection",
   [junit4]   2>   "operation":"state"}
   [junit4]   2> 396566 INFO  (coreLoadExecutor-959-thread-1-processing-n:127.0.0.1:45408_) [n:127.0.0.1:45408_ c:control_collection   x:collection1] o.a.s.c.c.ZkStateReader Deleting data for [control_collection]
   [junit4]   2> 396566 INFO  (OverseerStateUpdate-95895483760050181-127.0.0.1:45408_-n_0000000000) [n:127.0.0.1:45408_    ] o.a.s.c.o.ClusterStateMutator building a new cName: control_collection
   [junit4]   2> 396566 INFO  (OverseerStateUpdate-95895483760050181-127.0.0.1:45408_-n_0000000000) [n:127.0.0.1:45408_    ] o.a.s.c.o.ReplicaMutator Assigning new node to shard shard=shard1
   [junit4]   2> 396567 INFO  (coreLoadExecutor-959-thread-1-processing-n:127.0.0.1:45408_) [n:127.0.0.1:45408_ c:control_collection   x:collection1] o.a.s.c.ZkController look for our core node name
   [junit4]   2> 396567 INFO  (zkCallback-325-thread-1-processing-n:127.0.0.1:45408_) [n:127.0.0.1:45408_    ] o.a.s.c.c.ZkStateReader A cluster state change: [WatchedEvent state:SyncConnected type:NodeDataChanged path:/clusterstate.json], has occurred - updating... (live nodes size: [1])
   [junit4]   2> 397567 INFO  (coreLoadExecutor-959-thread-1-processing-n:127.0.0.1:45408_) [n:127.0.0.1:45408_ c:control_collection   x:collection1] o.a.s.c.ZkController waiting to find shard id in clusterstate for collection1
   [junit4]   2> 397567 INFO  (coreLoadExecutor-959-thread-1-processing-n:127.0.0.1:45408_) [n:127.0.0.1:45408_ c:control_collection   x:collection1] o.a.s.c.ZkController Check for collection zkNode:control_collection
   [junit4]   2> 397568 INFO  (coreLoadExecutor-959-thread-1-processing-n:127.0.0.1:45408_) [n:127.0.0.1:45408_ c:control_collection   x:collection1] o.a.s.c.ZkController Collection zkNode exists
   [junit4]   2> 397568 INFO  (coreLoadExecutor-959-thread-1-processing-n:127.0.0.1:45408_) [n:127.0.0.1:45408_ c:control_collection   x:collection1] o.a.s.c.c.ZkStateReader Load collection config from: [/collections/control_collection]
   [junit4]   2> 397568 INFO  (coreLoadExecutor-959-thread-1-processing-n:127.0.0.1:45408_) [n:127.0.0.1:45408_ c:control_collection   x:collection1] o.a.s.c.c.ZkStateReader path=[/collections/control_collection] [configName]=[conf1] specified config exists in ZooKeeper
   [junit4]   2> 397568 INFO  (coreLoadExecutor-959-thread-1-processing-n:127.0.0.1:45408_) [n:127.0.0.1:45408_ c:control_collection   x:collection1] o.a.s.c.SolrResourceLoader new SolrResourceLoader for directory: '/home/jenkins/workspace/Lucene-Solr-master-Linux/solr/build/solr-core/test/J1/temp/solr.cloud.TestCollectionAPI_854D01BFC6242740-001/control-001/cores/collection1'
   [junit4]   2> 397568 INFO  (coreLoadExecutor-959-thread-1-processing-n:127.0.0.1:45408_) [n:127.0.0.1:45408_ c:control_collection   x:collection1] o.a.s.c.SolrResourceLoader JNDI not configured for solr (NoInitialContextEx)
   [junit4]   2> 397568 INFO  (coreLoadExecutor-959-thread-1-processing-n:127.0.0.1:45408_) [n:127.0.0.1:45408_ c:control_collection   x:collection1] o.a.s.c.SolrResourceLoader solr home defaulted to 'solr/' (could not find system property or JNDI)
   [junit4]   2> 397569 INFO  (coreLoadExecutor-959-thread-1-processing-n:127.0.0.1:45408_) [n:127.0.0.1:45408_ c:control_collection   x:collection1] o.a.s.c.Config loaded config solrconfig.xml with version 0 
   [junit4]   2> 397573 INFO  (coreLoadExecutor-959-thread-1-processing-n:127.0.0.1:45408_) [n:127.0.0.1:45408_ c:control_collection   x:collection1] o.a.s.c.SolrConfig current version of requestparams : -1
   [junit4]   2> 397575 WARN  (coreLoadExecutor-959-thread-1-processing-n:127.0.0.1:45408_) [n:127.0.0.1:45408_ c:control_collection   x:collection1] o.a.s.c.Config Beginning with Solr 5.5, <mergePolicy> is deprecated, use <mergePolicyFactory> instead.
   [junit4]   2> 397576 INFO  (coreLoadExecutor-959-thread-1-processing-n:127.0.0.1:45408_) [n:127.0.0.1:45408_ c:control_collection   x:collection1] o.a.s.c.SolrConfig Using Lucene MatchVersion: 7.0.0
   [junit4]   2> 397583 INFO  (coreLoadExecutor-959-thread-1-processing-n:127.0.0.1:45408_) [n:127.0.0.1:45408_ c:control_collection   x:collection1] o.a.s.c.SolrConfig Loaded SolrConfig: solrconfig.xml
   [junit4]   2> 397588 INFO  (coreLoadExecutor-959-thread-1-processing-n:127.0.0.1:45408_) [n:127.0.0.1:45408_ c:control_collection   x:collection1] o.a.s.s.IndexSchema [collection1] Schema name=test
   [junit4]   2> 397673 INFO  (coreLoadExecutor-959-thread-1-processing-n:127.0.0.1:45408_) [n:127.0.0.1:45408_ c:control_collection   x:collection1] o.a.s.s.IndexSchema default search field in schema is text
   [junit4]   2> 397674 INFO  (coreLoadExecutor-959-thread-1-processing-n:127.0.0.1:45408_) [n:127.0.0.1:45408_ c:control_collection   x:collection1] o.a.s.s.IndexSchema unique key field: id
   [junit4]   2> 397675 INFO  (coreLoadExecutor-959-thread-1-processing-n:127.0.0.1:45408_) [n:127.0.0.1:45408_ c:control_collection   x:collection1] o.a.s.s.FileExchangeRateProvider Reloading exchange rates from file currency.xml
   [junit4]   2> 397677 INFO  (coreLoadExecutor-959-thread-1-processing-n:127.0.0.1:45408_) [n:127.0.0.1:45408_ c:control_collection   x:collection1] o.a.s.s.FileExchangeRateProvider Reloading exchange rates from file currency.xml
   [junit4]   2> 397692 INFO  (coreLoadExecutor-959-thread-1-processing-n:127.0.0.1:45408_) [n:127.0.0.1:45408_ c:control_collection   x:collection1] o.a.s.c.ConfigSetProperties Did not find ConfigSet properties, assuming default properties: Can't find resource 'configsetprops.json' in classpath or '/configs/conf1', cwd=/home/jenkins/workspace/Lucene-Solr-master-Linux/solr/build/solr-core/test/J1
   [junit4]   2> 397692 INFO  (coreLoadExecutor-959-thread-1-processing-n:127.0.0.1:45408_) [n:127.0.0.1:45408_ c:control_collection   x:collection1] o.a.s.c.CoreContainer Creating SolrCore 'collection1' using configuration from collection control_collection
   [junit4]   2> 397692 INFO  (coreLoadExecutor-959-thread-1-processing-n:127.0.0.1:45408_) [n:127.0.0.1:45408_ c:control_collection s:shard1 r:core_node1 x:collection1] o.a.s.c.SolrCore org.apache.solr.core.MockDirectoryFactory
   [junit4]   2> 397692 INFO  (coreLoadExecutor-959-thread-1-processing-n:127.0.0.1:45408_) [n:127.0.0.1:45408_ c:control_collection s:shard1 r:core_node1 x:collection1] o.a.s.c.SolrCore [[collection1] ] Opening new SolrCore at [/home/jenkins/workspace/Lucene-Solr-master-Linux/solr/build/solr-core/test/J1/temp/solr.cloud.TestCollectionAPI_854D01BFC6242740-001/control-001/cores/collection1], dataDir=[/home/jenkins/workspace/Lucene-Solr-master-Linux/solr/build/solr-core/test/J1/temp/solr.cloud.TestCollectionAPI_854D01BFC6242740-001/control-001/cores/collection1/data/]
   [junit4]   2> 397692 INFO  (coreLoadExecutor-959-thread-1-processing-n:127.0.0.1:45408_) [n:127.0.0.1:45408_ c:control_collection s:shard1 r:core_node1 x:collection1] o.a.s.c.JmxMonitoredMap JMX monitoring is enabled. Adding Solr mbeans to JMX Server: com.sun.jmx.mbeanserver.JmxMBeanServer@1f66b29
   [junit4]   2> 397693 INFO  (coreLoadExecutor-959-thread-1-processing-n:127.0.0.1:45408_) [n:127.0.0.1:45408_ c:control_collection s:shard1 r:core_node1 x:collection1] o.a.s.c.CachingDirectoryFactory return new directory for /home/jenkins/workspace/Lucene-Solr-master-Linux/solr/build/solr-core/test/J1/temp/solr.cloud.TestCollectionAPI_854D01BFC6242740-001/control-001/cores/collection1/data
   [junit4]   2> 397693 INFO  (coreLoadExecutor-959-thread-1-processing-n:127.0.0.1:45408_) [n:127.0.0.1:45408_ c:control_collection s:shard1 r:core_node1 x:collection1] o.a.s.c.SolrCore New index directory detected: old=null new=/home/jenkins/workspace/Lucene-Solr-master-Linux/solr/build/solr-core/test/J1/temp/solr.cloud.TestCollectionAPI_854D01BFC6242740-001/control-001/cores/collection1/data/index/
   [junit4]   2> 397693 WARN  (coreLoadExecutor-959-thread-1-processing-n:127.0.0.1:45408_) [n:127.0.0.1:45408_ c:control_collection s:shard1 r:core_node1 x:collection1] o.a.s.c.SolrCore [collection1] Solr index directory '/home/jenkins/workspace/Lucene-Solr-master-Linux/solr/build/solr-core/test/J1/temp/solr.cloud.TestCollectionAPI_854D01BFC6242740-001/control-001/cores/collection1/data/index' doesn't exist. Creating new index...
   [junit4]   2> 397693 INFO  (coreLoadExecutor-959-thread-1-processing-n:127.0.0.1:45408_) [n:127.0.0.1:45408_ c:control_collection s:shard1 r:core_node1 x:collection1] o.a.s.c.CachingDirectoryFactory return new directory for /home/jenkins/workspace/Lucene-Solr-master-Linux/solr/build/solr-core/test/J1/temp/solr.cloud.TestCollectionAPI_854D01BFC6242740-001/control-001/cores/collection1/data/index
   [junit4]   2> 397694 INFO  (coreLoadExecutor-959-thread-1-processing-n:127.0.0.1:45408_) [n:127.0.0.1:45408_ c:control_collection s:shard1 r:core_node1 x:collection1] o.a.s.u.RandomMergePolicy RandomMergePolicy wrapping class org.apache.lucene.index.LogByteSizeMergePolicy: [LogByteSizeMergePolicy: minMergeSize=1677721, mergeFactor=33, maxMergeSize=2147483648, maxMergeSizeForForcedMerge=9223372036854775807, calibrateSizeByDeletes=true, maxMergeDocs=2147483647, maxCFSSegmentSizeMB=8.796093022207999E12, noCFSRatio=0.25538696914635817]
   [junit4]   2> 397694 INFO  (coreLoadExecutor-959-thread-1-processing-n:127.0.0.1:45408_) [n:127.0.0.1:45408_ c:control_collection s:shard1 r:core_node1 x:collection1] o.a.s.c.SolrDeletionPolicy SolrDeletionPolicy.onCommit: commits: num=1
   [junit4]   2> 	commit{dir=MockDirectoryWrapper(RAMDirectory@dbb55b lockFactory=org.apache.lucene.store.SingleInstanceLockFactory@146d3d),segFN=segments_1,generation=1}
   [junit4]   2> 397694 INFO  (coreLoadExecutor-959-thread-1-processing-n:127.0.0.1:45408_) [n:127.0.0.1:45408_ c:control_collection s:shard1 r:core_node1 x:collection1] o.a.s.c.SolrDeletionPolicy newest commit generation = 1
   [junit4]   2> 397694 INFO  (OldIndexDirectoryCleanupThreadForCore-collection1) [n:127.0.0.1:45408_ c:control_collection s:shard1 r:core_node1 x:collection1] o.a.s.c.SolrCore Looking for old index directories to cleanup for core collection1 in /home/jenkins/workspace/Lucene-Solr-master-Linux/solr/build/solr-core/test/J1/temp/solr.cloud.TestCollectionAPI_854D01BFC6242740-001/control-001/cores/collection1/data/
   [junit4]   2> 397694 WARN  (OldIndexDirectoryCleanupThreadForCore-collection1) [n:127.0.0.1:45408_ c:control_collection s:shard1 r:core_node1 x:collection1] o.a.s.c.DirectoryFactory /home/jenkins/workspace/Lucene-Solr-master-Linux/solr/build/solr-core/test/J1/temp/solr.cloud.TestCollectionAPI_854D01BFC6242740-001/control-001/cores/collection1/data/ does not point to a valid data directory; skipping clean-up of old index directories.
   [junit4]   2> 397705 INFO  (coreLoadExecutor-959-thread-1-processing-n:127.0.0.1:45408_) [n:127.0.0.1:45408_ c:control_collection s:shard1 r:core_node1 x:collection1] o.a.s.u.p.UpdateRequestProcessorChain creating updateRequestProcessorChain "nodistrib"
   [junit4]   2> 397705 INFO  (coreLoadExecutor-959-thread-1-processing-n:127.0.0.1:45408_) [n:127.0.0.1:45408_ c:control_collection s:shard1 r:core_node1 x:collection1] o.a.s.u.p.UpdateRequestProcessorChain creating updateRequestProcessorChain "dedupe"
   [junit4]   2> 397705 INFO  (coreLoadExecutor-959-thread-1-processing-n:127.0.0.1:45408_) [n:127.0.0.1:45408_ c:control_collection s:shard1 r:core_node1 x:collection1] o.a.s.u.p.UpdateRequestProcessorChain inserting DistributedUpdateProcessorFactory into updateRequestProcessorChain "dedupe"
   [junit4]   2> 397705 INFO  (coreLoadExecutor-959-thread-1-processing-n:127.0.0.1:45408_) [n:127.0.0.1:45408_ c:control_collection s:shard1 r:core_node1 x:collection1] o.a.s.u.p.UpdateRequestProcessorChain creating updateRequestProcessorChain "stored_sig"
   [junit4]   2> 397705 INFO  (coreLoadExecutor-959-thread-1-processing-n:127.0.0.1:45408_) [n:127.0.0.1:45408_ c:control_collection s:shard1 r:core_node1 x:collection1] o.a.s.u.p.UpdateRequestProcessorChain inserting DistributedUpdateProcessorFactory into updateRequestProcessorChain "stored_sig"
   [junit4]   2> 397705 INFO  (coreLoadExecutor-959-thread-1-processing-n:127.0.0.1:45408_) [n:127.0.0.1:45408_ c:control_collection s:shard1 r:core_node1 x:collection1] o.a.s.u.p.UpdateRequestProcessorChain creating updateRequestProcessorChain "distrib-dup-test-chain-explicit"
   [junit4]   2> 397705 INFO  (coreLoadExecutor-959-thread-1-processing-n:127.0.0.1:45408_) [n:127.0.0.1:45408_ c:control_collection s:shard1 r:core_node1 x:collection1] o.a.s.u.p.UpdateRequestProcessorChain creating updateRequestProcessorChain "distrib-dup-test-chain-implicit"
   [junit4]   2> 397705 INFO  (coreLoadExecutor-959-thread-1-processing-n:127.0.0.1:45408_) [n:127.0.0.1:45408_ c:control_collection s:shard1 r:core_node1 x:collection1] o.a.s.u.p.UpdateRequestProcessorChain inserting DistributedUpdateProcessorFactory into updateRequestProcessorChain "distrib-dup-test-chain-implicit"
   [junit4]   2> 397705 INFO  (coreLoadExecutor-959-thread-1-processing-n:127.0.0.1:45408_) [n:127.0.0.1:45408_ c:control_collection s:shard1 r:core_node1 x:collection1] o.a.s.c.SolrCore no updateRequestProcessorChain defined as default, creating implicit default
   [junit4]   2> 397705 WARN  (coreLoadExecutor-959-thread-1-processing-n:127.0.0.1:45408_) [n:127.0.0.1:45408_ c:control_collection s:shard1 r:core_node1 x:collection1] o.a.s.c.RequestHandlers INVALID paramSet a in requestHandler {type = requestHandler,name = /dump,class = DumpRequestHandler,args = {defaults={a=A,b=B}}}
   [junit4]   2> 397707 INFO  (coreLoadExecutor-959-thread-1-processing-n:127.0.0.1:45408_) [n:127.0.0.1:45408_ c:control_collection s:shard1 r:core_node1 x:collection1] o.a.s.h.l.XMLLoader xsltCacheLifetimeSeconds=60
   [junit4]   2> 397708 INFO  (coreLoadExecutor-959-thread-1-processing-n:127.0.0.1:45408_) [n:127.0.0.1:45408_ c:control_collection s:shard1 r:core_node1 x:collection1] o.a.s.h.l.XMLLoader xsltCacheLifetimeSeconds=60
   [junit4]   2> 397709 INFO  (coreLoadExecutor-959-thread-1-processing-n:127.0.0.1:45408_) [n:127.0.0.1:45408_ c:control_collection s:shard1 r:core_node1 x:collection1] o.a.s.h.l.XMLLoader xsltCacheLifetimeSeconds=60
   [junit4]   2> 397710 INFO  (coreLoadExecutor-959-thread-1-processing-n:127.0.0.1:45408_) [n:127.0.0.1:45408_ c:control_collection s:shard1 r:core_node1 x:collection1] o.a.s.h.l.XMLLoader xsltCacheLifetimeSeconds=60
   [junit4]   2> 397718 INFO  (coreLoadExecutor-959-thread-1-processing-n:127.0.0.1:45408_) [n:127.0.0.1:45408_ c:control_collection s:shard1 r:core_node1 x:collection1] o.a.s.c.RequestHandlers Registered paths: /admin/mbeans,standard,/update/json/docs,/admin/luke,/export,/get,/admin/properties,/update/json,/admin/threads,/dump,/update/csv,/sql,/graph,/admin/segments,/admin/system,/replication,/config,/stream,/schema,/admin/plugins,/admin/logging,/admin/ping,/update,/admin/file
   [junit4]   2> 397718 INFO  (coreLoadExecutor-959-thread-1-processing-n:127.0.0.1:45408_) [n:127.0.0.1:45408_ c:control_collection s:shard1 r:core_node1 x:collection1] o.a.s.c.SolrCore Using default statsCache cache: org.apache.solr.search.stats.LocalStatsCache
   [junit4]   2> 397719 INFO  (coreLoadExecutor-959-thread-1-processing-n:127.0.0.1:45408_) [n:127.0.0.1:45408_ c:control_collection s:shard1 r:core_node1 x:collection1] o.a.s.u.UpdateHandler Using UpdateLog implementation: org.apache.solr.update.UpdateLog
   [junit4]   2> 397719 INFO  (coreLoadExecutor-959-thread-1-processing-n:127.0.0.1:45408_) [n:127.0.0.1:45408_ c:control_collection s:shard1 r:core_node1 x:collection1] o.a.s.u.UpdateLog Initializing UpdateLog: dataDir= defaultSyncLevel=FLUSH numRecordsToKeep=100 maxNumLogsToKeep=10 numVersionBuckets=65536
   [junit4]   2> 397719 INFO  (coreLoadExecutor-959-thread-1-processing-n:127.0.0.1:45408_) [n:127.0.0.1:45408_ c:control_collection s:shard1 r:core_node1 x:collection1] o.a.s.u.CommitTracker Hard AutoCommit: disabled
   [junit4]   2> 397719 INFO  (coreLoadExecutor-959-thread-1-processing-n:127.0.0.1:45408_) [n:127.0.0.1:45408_ c:control_collection s:shard1 r:core_node1 x:collection1] o.a.s.u.CommitTracker Soft AutoCommit: disabled
   [junit4]   2> 397720 INFO  (coreLoadExecutor-959-thread-1-processing-n:127.0.0.1:45408_) [n:127.0.0.1:45408_ c:control_collection s:shard1 r:core_node1 x:collection1] o.a.s.u.RandomMergePolicy RandomMergePolicy wrapping class org.apache.lucene.index.LogByteSizeMergePolicy: [LogByteSizeMergePolicy: minMergeSize=1677721, mergeFactor=43, maxMergeSize=2147483648, maxMergeSizeForForcedMerge=9223372036854775807, calibrateSizeByDeletes=false, maxMergeDocs=2147483647, maxCFSSegmentSizeMB=8.796093022207999E12, noCFSRatio=0.7375579228579664]
   [junit4]   2> 397721 INFO  (coreLoadExecutor-959-thread-1-processing-n:127.0.0.1:45408_) [n:127.0.0.1:45408_ c:control_collection s:shard1 r:core_node1 x:collection1] o.a.s.c.SolrDeletionPolicy SolrDeletionPolicy.onInit: commits: num=1
   [junit4]   2> 	commit{dir=MockDirectoryWrapper(RAMDirectory@dbb55b lockFactory=org.apache.lucene.store.SingleInstanceLockFactory@146d3d),segFN=segments_1,generation=1}
   [junit4]   2> 397721 INFO  (coreLoadExecutor-959-thread-1-processing-n:127.0.0.1:45408_) [n:127.0.0.1:45408_ c:control_collection s:shard1 r:core_node1 x:collection1] o.a.s.c.SolrDeletionPolicy newest commit generation = 1
   [junit4]   2> 397721 INFO  (coreLoadExecutor-959-thread-1-processing-n:127.0.0.1:45408_) [n:127.0.0.1:45408_ c:control_collection s:shard1 r:core_node1 x:collection1] o.a.s.s.SolrIndexSearcher Opening [Searcher@149abdf[collection1] main]
   [junit4]   2> 397721 INFO  (coreLoadExecutor-959-thread-1-processing-n:127.0.0.1:45408_) [n:127.0.0.1:45408_ c:control_collection s:shard1 r:core_node1 x:collection1] o.a.s.c.c.ZkStateReader Load collection config from: [/collections/control_collection]
   [junit4]   2> 397721 INFO  (coreLoadExecutor-959-thread-1-processing-n:127.0.0.1:45408_) [n:127.0.0.1:45408_ c:control_collection s:shard1 r:core_node1 x:collection1] o.a.s.c.c.ZkStateReader path=[/collections/control_collection] [configName]=[conf1] specified config exists in ZooKeeper
   [junit4]   2> 397721 INFO  (coreLoadExecutor-959-thread-1-processing-n:127.0.0.1:45408_) [n:127.0.0.1:45408_ c:control_collection s:shard1 r:core_node1 x:collection1] o.a.s.r.ManagedResourceStorage Setting up ZooKeeper-based storage for the RestManager with znodeBase: /configs/conf1
   [junit4]   2> 397721 INFO  (coreLoadExecutor-959-thread-1-processing-n:127.0.0.1:45408_) [n:127.0.0.1:45408_ c:control_collection s:shard1 r:core_node1 x:collection1] o.a.s.r.ManagedResourceStorage Configured ZooKeeperStorageIO with znodeBase: /configs/conf1
   [junit4]   2> 397721 INFO  (coreLoadExecutor-959-thread-1-processing-n:127.0.0.1:45408_) [n:127.0.0.1:45408_ c:control_collection s:shard1 r:core_node1 x:collection1] o.a.s.r.RestManager Initializing RestManager with initArgs: {}
   [junit4]   2> 397722 INFO  (coreLoadExecutor-959-thread-1-processing-n:127.0.0.1:45408_) [n:127.0.0.1:45408_ c:control_collection s:shard1 r:core_node1 x:collection1] o.a.s.r.ManagedResourceStorage Reading _rest_managed.json using ZooKeeperStorageIO:path=/configs/conf1
   [junit4]   2> 397722 INFO  (coreLoadExecutor-959-thread-1-processing-n:127.0.0.1:45408_) [n:127.0.0.1:45408_ c:control_collection s:shard1 r:core_node1 x:collection1] o.a.s.r.ManagedResourceStorage No data found for znode /configs/conf1/_rest_managed.json
   [junit4]   2> 397722 INFO  (coreLoadExecutor-959-thread-1-processing-n:127.0.0.1:45408_) [n:127.0.0.1:45408_ c:control_collection s:shard1 r:core_node1 x:collection1] o.a.s.r.ManagedResourceStorage Loaded null at path _rest_managed.json using ZooKeeperStorageIO:path=/configs/conf1
   [junit4]   2> 397722 INFO  (coreLoadExecutor-959-thread-1-processing-n:127.0.0.1:45408_) [n:127.0.0.1:45408_ c:control_collection s:shard1 r:core_node1 x:collection1] o.a.s.r.RestManager Initializing 0 registered ManagedResources
   [junit4]   2> 397722 INFO  (coreLoadExecutor-959-thread-1-processing-n:127.0.0.1:45408_) [n:127.0.0.1:45408_ c:control_collection s:shard1 r:core_node1 x:collection1] o.a.s.h.ReplicationHandler Commits will be reserved for  10000
   [junit4]   2> 397723 INFO  (searcherExecutor-960-thread-1-processing-n:127.0.0.1:45408_ x:collection1 s:shard1 c:control_collection r:core_node1) [n:127.0.0.1:45408_ c:control_collection s:shard1 r:core_node1 x:collection1] o.a.s.c.SolrCore [collection1] Registered new searcher Searcher@149abdf[collection1] main{ExitableDirectoryReader(UninvertingDirectoryReader())}
   [junit4]   2> 397723 INFO  (coreLoadExecutor-959-thread-1-processing-n:127.0.0.1:45408_) [n:127.0.0.1:45408_ c:control_collection s:shard1 r:core_node1 x:collection1] o.a.s.u.UpdateLog Looking up max value of version field to seed version buckets
   [junit4]   2> 397723 INFO  (coreLoadExecutor-959-thread-1-processing-n:127.0.0.1:45408_) [n:127.0.0.1:45408_ c:control_collection s:shard1 r:core_node1 x:collection1] o.a.s.u.VersionInfo Refreshing highest value of _version_ for 65536 version buckets from index
   [junit4]   2> 397723 INFO  (coreLoadExecutor-959-thread-1-processing-n:127.0.0.1:45408_) [n:127.0.0.1:45408_ c:control_collection s:shard1 r:core_node1 x:collection1] o.a.s.u.VersionInfo No terms found for _version_, cannot seed version bucket highest value from index
   [junit4]   2> 397723 INFO  (coreLoadExecutor-959-thread-1-processing-n:127.0.0.1:45408_) [n:127.0.0.1:45408_ c:control_collection s:shard1 r:core_node1 x:collection1] o.a.s.u.UpdateLog Could not find max version in index or recent updates, using new clock 1534327741761978368
   [junit4]   2> 397725 INFO  (coreLoadExecutor-959-thread-1-processing-n:127.0.0.1:45408_) [n:127.0.0.1:45408_ c:control_collection s:shard1 r:core_node1 x:collection1] o.a.s.u.UpdateLog Took 1.0ms to seed version buckets with highest version 1534327741761978368
   [junit4]   2> 397725 INFO  (coreLoadExecutor-959-thread-1-processing-n:127.0.0.1:45408_) [n:127.0.0.1:45408_ c:control_collection s:shard1 r:core_node1 x:collection1] o.a.s.c.ZkController watch zkdir /configs/conf1
   [junit4]   2> 397726 INFO  (coreLoadExecutor-959-thread-1-processing-n:127.0.0.1:45408_) [n:127.0.0.1:45408_ c:control_collection s:shard1 r:core_node1 x:collection1] o.a.s.c.CoreContainer registering core: collection1
   [junit4]   2> 397726 INFO  (coreZkRegister-953-thread-1-processing-n:127.0.0.1:45408_ x:collection1 s:shard1 c:control_collection r:core_node1) [n:127.0.0.1:45408_ c:control_collection s:shard1 r:core_node1 x:collection1] o.a.s.c.ZkController Register replica - core:collection1 address:https://127.0.0.1:45408 collection:control_collection shard:shard1
   [junit4]   2> 397726 INFO  (coreZkRegister-953-thread-1-processing-n:127.0.0.1:45408_ x:collection1 s:shard1 c:control_collection r:core_node1) [n:127.0.0.1:45408_ c:control_collection s:shard1 r:core_node1 x:collection1] o.a.s.c.c.SolrZkClient makePath: /collections/control_collection/leader_elect/shard1/election
   [junit4]   2> 397728 INFO  (coreZkRegister-953-thread-1-processing-n:127.0.0.1:45408_ x:collection1 s:shard1 c:control_collection r:core_node1) [n:127.0.0.1:45408_ c:control_collection s:shard1 r:core_node1 x:collection1] o.a.s.c.LeaderElector Joined leadership election with path: /collections/control_collection/leader_elect/shard1/election/95895483760050181-core_node1-n_0000000000
   [junit4]   2> 397728 INFO  (coreZkRegister-953-thread-1-processing-n:127.0.0.1:45408_ x:collection1 s:shard1 c:control_collection r:core_node1) [n:127.0.0.1:45408_ c:control_collection s:shard1 r:core_node1 x:collection1] o.a.s.c.ShardLeaderElectionContext Running the leader process for shard=shard1 and weAreReplacement=false and leaderVoteWait=10000
   [junit4]   2> 397729 INFO  (coreZkRegister-953-thread-1-processing-n:127.0.0.1:45408_ x:collection1 s:shard1 c:control_collection r:core_node1) [n:127.0.0.1:45408_ c:control_collection s:shard1 r:core_node1 x:collection1] o.a.s.c.ShardLeaderElectionContext Enough replicas found to continue.
   [junit4]   2> 397729 INFO  (coreZkRegister-953-thread-1-processing-n:127.0.0.1:45408_ x:collection1 s:shard1 c:control_collection r:core_node1) [n:127.0.0.1:45408_ c:control_collection s:shard1 r:core_node1 x:collection1] o.a.s.c.ShardLeaderElectionContext I may be the new leader - try and sync
   [junit4]   2> 397729 INFO  (coreZkRegister-953-thread-1-processing-n:127.0.0.1:45408_ x:collection1 s:shard1 c:control_collection r:core_node1) [n:127.0.0.1:45408_ c:control_collection s:shard1 r:core_node1 x:collection1] o.a.s.c.SyncStrategy Sync replicas to https://127.0.0.1:45408/collection1/
   [junit4]   2> 397729 INFO  (coreZkRegister-953-thread-1-processing-n:127.0.0.1:45408_ x:collection1 s:shard1 c:control_collection r:core_node1) [n:127.0.0.1:45408_ c:control_collection s:shard1 r:core_node1 x:collection1] o.a.s.c.SyncStrategy Sync Success - now sync replicas to me
   [junit4]   2> 397729 INFO  (coreZkRegister-953-thread-1-processing-n:127.0.0.1:45408_ x:collection1 s:shard1 c:control_collection r:core_node1) [n:127.0.0.1:45408_ c:control_collection s:shard1 r:core_node1 x:collection1] o.a.s.c.SyncStrategy https://127.0.0.1:45408/collection1/ has no replicas
   [junit4]   2> 397729 INFO  (OverseerStateUpdate-95895483760050181-127.0.0.1:45408_-n_0000000000) [n:127.0.0.1:45408_    ] o.a.s.c.Overseer processMessage: queueSize: 1, message = {
   [junit4]   2>   "operation":"leader",
   [junit4]   2>   "shard":"shard1",
   [junit4]   2>   "collection":"control_collection"} current state version: 1
   [junit4]   2> 397730 INFO  (coreZkRegister-953-thread-1-processing-n:127.0.0.1:45408_ x:collection1 s:shard1 c:control_collection r:core_node1) [n:127.0.0.1:45408_ c:control_collection s:shard1 r:core_node1 x:collection1] o.a.s.c.c.SolrZkClient makePath: /collections/control_collection/leaders/shard1
   [junit4]   2> 397731 INFO  (coreZkRegister-953-thread-1-processing-n:127.0.0.1:45408_ x:collection1 s:shard1 c:control_collection r:core_node1) [n:127.0.0.1:45408_ c:control_collection s:shard1 r:core_node1 x:collection1] o.a.s.c.ShardLeaderElectionContextBase Creating leader registration node /collections/control_collection/leaders/shard1/leader after winning as /collections/control_collection/leader_elect/shard1/election/95895483760050181-core_node1-n_0000000000
   [junit4]   2> 397732 INFO  (coreZkRegister-953-thread-1-processing-n:127.0.0.1:45408_ x:collection1 s:shard1 c:control_collection r:core_node1) [n:127.0.0.1:45408_ c:control_collection s:shard1 r:core_node1 x:collection1] o.a.s.c.ShardLeaderElectionContext I am the new leader: https://127.0.0.1:45408/collection1/ shard1
   [junit4]   2> 397732 INFO  (OverseerStateUpdate-95895483760050181-127.0.0.1:45408_-n_0000000000) [n:127.0.0.1:45408_    ] o.a.s.c.Overseer processMessage: queueSize: 1, message = {
   [junit4]   2>   "operation":"leader",
   [junit4]   2>   "shard":"shard1",
   [junit4]   2>   "collection":"control_collection",
   [junit4]   2>   "base_url":"https://127.0.0.1:45408",
   [junit4]   2>   "core":"collection1",
   [junit4]   2>   "state":"active"} current state version: 1
   [junit4]   2> 397833 INFO  (zkCallback-325-thread-1-processing-n:127.0.0.1:45408_) [n:127.0.0.1:45408_    ] o.a.s.c.c.ZkStateReader A cluster state change: [WatchedEvent state:SyncConnected type:NodeDataChanged path:/clusterstate.json], has occurred - updating... (live nodes size: [1])
   [junit4]   2> 397882 INFO  (coreZkRegister-953-thread-1-processing-n:127.0.0.1:45408_ x:collection1 s:shard1 c:control_collection r:core_node1) [n:127.0.0.1:45408_ c:control_collection s:shard1 r:core_node1 x:collection1] o.a.s.c.ZkController We are https://127.0.0.1:45408/collection1/ and leader is https://127.0.0.1:45408/collection1/
   [junit4]   2> 397883 INFO  (coreZkRegister-953-thread-1-processing-n:127.0.0.1:45408_ x:collection1 s:shard1 c:control_collection r:core_node1) [n:127.0.0.1:45408_ c:control_collection s:shard1 r:core_node1 x:collection1] o.a.s.c.ZkController No LogReplay needed for core=collection1 baseURL=https://127.0.0.1:45408
   [junit4]   2> 397883 INFO  (coreZkRegister-953-thread-1-processing-n:127.0.0.1:45408_ x:collection1 s:shard1 c:control_collection r:core_node1) [n:127.0.0.1:45408_ c:control_collection s:shard1 r:core_node1 x:collection1] o.a.s.c.ZkController I am the leader, no recovery necessary
   [junit4]   2> 397883 INFO  (coreZkRegister-953-thread-1-processing-n:127.0.0.1:45408_ x:collection1 s:shard1 c:control_collection r:core_node1) [n:127.0.0.1:45408_ c:control_collection s:shard1 r:core_node1 x:collection1] o.a.s.c.ZkController publishing state=active
   [junit4]   2> 397883 INFO  (coreZkRegister-953-thread-1-processing-n:127.0.0.1:45408_ x:collection1 s:shard1 c:control_collection r:core_node1) [n:127.0.0.1:45408_ c:control_collection s:shard1 r:core_node1 x:collection1] o.a.s.c.ZkController numShards not found on descriptor - reading it from system property
   [junit4]   2> 397884 INFO  (OverseerStateUpdate-95895483760050181-127.0.0.1:45408_-n_0000000000) [n:127.0.0.1:45408_    ] o.a.s.c.Overseer processMessage: queueSize: 1, message = {
   [junit4]   2>   "core":"collection1",
   [junit4]   2>   "core_node_name":"core_node1",
   [junit4]   2>   "roles":null,
   [junit4]   2>   "base_url":"https://127.0.0.1:45408",
   [junit4]   2>   "node_name":"127.0.0.1:45408_",
   [junit4]   2>   "numShards":"1",
   [junit4]   2>   "state":"active",
   [junit4]   2>   "shard":"shard1",
   [junit4]   2>   "collection":"control_collection",
   [junit4]   2>   "operation":"state"} current state version: 2
   [junit4]   2> 397884 INFO  (OverseerStateUpdate-95895483760050181-127.0.0.1:45408_-n_0000000000) [n:127.0.0.1:45408_    ] o.a.s.c.o.ReplicaMutator Update state numShards=1 message={
   [junit4]   2>   "core":"collection1",
   [junit4]   2>   "core_node_name":"core_node1",
   [junit4]   2>   "roles":null,
   [junit4]   2>   "base_url":"https://127.0.0.1:45408",
   [junit4]   2>   "node_name":"127.0.0.1:45408_",
   [junit4]   2>   "numShards":"1",
   [junit4]   2>   "state":"active",
   [junit4]   2>   "shard":"shard1",
   [junit4]   2>   "collection":"control_collection",
   [junit4]   2>   "operation":"state"}
   [junit4]   2> 397985 INFO  (zkCallback-325-thread-1-processing-n:127.0.0.1:45408_) [n:127.0.0.1:45408_    ] o.a.s.c.c.ZkStateReader A cluster state change: [WatchedEvent state:SyncConnected type:NodeDataChanged path:/clusterstate.json], has occurred - updating... (live nodes size: [1])
   [junit4]   2> 398067 INFO  (TEST-TestCollectionAPI.test-seed#[854D01BFC6242740]) [    ] o.a.s.c.c.SolrZkClient Using default ZkCredentialsProvider
   [junit4]   2> 398067 INFO  (TEST-TestCollectionAPI.test-seed#[854D01BFC6242740]) [    ] o.a.s.c.c.ConnectionManager Waiting for client to connect to ZooKeeper
   [junit4]   2> 398068 INFO  (zkCallback-329-thread-1) [    ] o.a.s.c.c.ConnectionManager Watcher org.apache.solr.common.cloud.ConnectionManager@1e34674 name:ZooKeeperConnection Watcher:127.0.0.1:35376/solr got event WatchedEvent state:SyncConnected type:None path:null path:null type:None
   [junit4]   2> 398068 INFO  (TEST-TestCollectionAPI.test-seed#[854D01BFC6242740]) [    ] o.a.s.c.c.ConnectionManager Client is connected to ZooKeeper
   [junit4]   2> 398068 INFO  (TEST-TestCollectionAPI.test-seed#[854D01BFC6242740]) [    ] o.a.s.c.c.SolrZkClient Using default ZkACLProvider
   [junit4]   2> 398068 INFO  (TEST-TestCollectionAPI.test-seed#[854D01BFC6242740]) [    ] o.a.s.c.c.ZkStateReader Updating cluster state from ZooKeeper... 
   [junit4]   2> 398069 INFO  (TEST-TestCollectionAPI.test-seed#[854D01BFC6242740]) [    ] o.a.s.c.c.ZkStateReader Loaded cluster properties: {urlScheme=https}
   [junit4]   2> 398069 INFO  (TEST-TestCollectionAPI.test-seed#[854D01BFC6242740]) [    ] o.a.s.c.c.ZkStateReader Updated live nodes from ZooKeeper... (0) -> (1)
   [junit4]   2> 398069 INFO  (TEST-TestCollectionAPI.test-seed#[854D01BFC6242740]) [    ] o.a.s.c.ChaosMonkey monkey: init - expire sessions:false cause connection loss:false
   [junit4]   2> 398135 INFO  (TEST-TestCollectionAPI.test-seed#[854D01BFC6242740]) [    ] o.a.s.SolrTestCaseJ4 Writing core.properties file to /home/jenkins/workspace/Lucene-Solr-master-Linux/solr/build/solr-core/test/J1/temp/solr.cloud.TestCollectionAPI_854D01BFC6242740-001/shard-1-001/cores/collection1
   [junit4]   2> 398136 INFO  (TEST-TestCollectionAPI.test-seed#[854D01BFC6242740]) [    ] o.a.s.c.AbstractFullDistribZkTestBase create jetty 1 in directory /home/jenkins/workspace/Lucene-Solr-master-Linux/solr/build/solr-core/test/J1/temp/solr.cloud.TestCollectionAPI_854D01BFC6242740-001/shard-1-001
   [junit4]   2> 398139 INFO  (TEST-TestCollectionAPI.test-seed#[854D01BFC6242740]) [    ] o.e.j.s.Server jetty-9.3.8.v20160314
   [junit4]   2> 398149 INFO  (TEST-TestCollectionAPI.test-seed#[854D01BFC6242740]) [    ] o.e.j.s.h.ContextHandler Started o.e.j.s.ServletContextHandler@5fae13{/,null,AVAILABLE}
   [junit4]   2> 398151 INFO  (TEST-TestCollectionAPI.test-seed#[854D01BFC6242740]) [    ] o.e.j.s.ServerConnector Started ServerConnector@169cdf{SSL,[ssl, http/1.1]}{127.0.0.1:45392}
   [junit4]   2> 398151 INFO  (TEST-TestCollectionAPI.test-seed#[854D01BFC6242740]) [    ] o.e.j.s.Server Started @400032ms
   [junit4]   2> 398152 INFO  (TEST-TestCollectionAPI.test-seed#[854D01BFC6242740]) [    ] o.a.s.c.s.e.JettySolrRunner Jetty properties: {solr.data.dir=/home/jenkins/workspace/Lucene-Solr-master-Linux/solr/build/solr-core/test/J1/temp/solr.cloud.TestCollectionAPI_854D01BFC6242740-001/tempDir-001/jetty1, solrconfig=solrconfig.xml, hostContext=/, hostPort=45392, coreRootDirectory=/home/jenkins/workspace/Lucene-Solr-master-Linux/solr/build/solr-core/test/J1/../../../../../../../../../home/jenkins/workspace/Lucene-Solr-master-Linux/solr/build/solr-core/test/J1/temp/solr.cloud.TestCollectionAPI_854D01BFC6242740-001/shard-1-001/cores}
   [junit4]   2> 398152 INFO  (TEST-TestCollectionAPI.test-seed#[854D01BFC6242740]) [    ] o.a.s.s.SolrDispatchFilter SolrDispatchFilter.init(): sun.misc.Launcher$AppClassLoader@1d16e93
   [junit4]   2> 398152 INFO  (TEST-TestCollectionAPI.test-seed#[854D01BFC6242740]) [    ] o.a.s.c.SolrResourceLoader new SolrResourceLoader for directory: '/home/jenkins/workspace/Lucene-Solr-master-Linux/solr/build/solr-core/test/J1/temp/solr.cloud.TestCollectionAPI_854D01BFC6242740-001/shard-1-001'
   [junit4]   2> 398152 INFO  (TEST-TestCollectionAPI.test-seed#[854D01BFC6242740]) [    ] o.a.s.c.SolrResourceLoader JNDI not configured for solr (NoInitialContextEx)
   [junit4]   2> 398152 INFO  (TEST-TestCollectionAPI.test-seed#[854D01BFC6242740]) [    ] o.a.s.c.SolrResourceLoader solr home defaulted to 'solr/' (could not find system property or JNDI)
   [junit4]   2> 398152 INFO  (TEST-TestCollectionAPI.test-seed#[854D01BFC6242740]) [    ] o.a.s.c.c.SolrZkClient Using default ZkCredentialsProvider
   [junit4]   2> 398155 INFO  (TEST-TestCollectionAPI.test-seed#[854D01BFC6242740]) [    ] o.a.s.c.c.ConnectionManager Waiting for client to connect to ZooKeeper
   [junit4]   2> 398158 INFO  (zkCallback-330-thread-1) [    ] o.a.s.c.c.ConnectionManager Watcher org.apache.solr.common.cloud.ConnectionManager@fdb899 name:ZooKeeperConnection Watcher:127.0.0.1:35376/solr got event WatchedEvent state:SyncConnected type:None path:null path:null type:None
   [junit4]   2> 398159 INFO  (TEST-TestCollectionAPI.test-seed#[854D01BFC6242740]) [    ] o.a.s.c.c.ConnectionManager Client is connected to ZooKeeper
   [junit4]   2> 398159 INFO  (TEST-TestCollectionAPI.test-seed#[854D01BFC6242740]) [    ] o.a.s.c.c.SolrZkClient Using default ZkACLProvider
   [junit4]   2> 398160 INFO  (TEST-TestCollectionAPI.test-seed#[854D01BFC6242740]) [    ] o.a.s.s.SolrDispatchFilter Loading solr.xml from SolrHome (not found in ZooKeeper)
   [junit4]   2> 398160 INFO  (TEST-TestCollectionAPI.test-seed#[854D01BFC6242740]) [    ] o.a.s.c.SolrXmlConfig Loading container configuration from /home/jenkins/workspace/Lucene-Solr-master-Linux/solr/build/solr-core/test/J1/temp/solr.cloud.TestCollectionAPI_854D01BFC6242740-001/shard-1-001/solr.xml
   [junit4]   2> 398164 INFO  (TEST-TestCollectionAPI.test-seed#[854D01BFC6242740]) [    ] o.a.s.c.CorePropertiesLocator Config-defined core root directory: /home/jenkins/workspace/Lucene-Solr-master-Linux/solr/build/solr-core/test/J1/../../../../../../../../../home/jenkins/workspace/Lucene-Solr-master-Linux/solr/build/solr-core/test/J1/temp/solr.cloud.TestCollectionAPI_854D01BFC6242740-001/shard-1-001/cores
   [junit4]   2> 398164 INFO  (TEST-TestCollectionAPI.test-seed#[854D01BFC6242740]) [    ] o.a.s.c.CoreContainer New CoreContainer 19143161
   [junit4]   2> 398164 INFO  (TEST-TestCollectionAPI.test-seed#[854D01BFC6242740]) [    ] o.a.s.c.CoreContainer Loading cores into CoreContainer [instanceDir=/home/jenkins/workspace/Lucene-Solr-master-Linux/solr/build/solr-core/test/J1/temp/solr.cloud.TestCollectionAPI_854D01BFC6242740-001/shard-1-001]
   [junit4]   2> 398164 WARN  (TEST-TestCollectionAPI.test-seed#[854D01BFC6242740]) [    ] o.a.s.c.CoreContainer Couldn't add files from /home/jenkins/workspace/Lucene-Solr-master-Linux/solr/build/solr-core/test/J1/temp/solr.cloud.TestCollectionAPI_854D01BFC6242740-001/shard-1-001/lib to classpath: /home/jenkins/workspace/Lucene-Solr-master-Linux/solr/build/solr-core/test/J1/temp/solr.cloud.TestCollectionAPI_854D01BFC6242740-001/shard-1-001/lib
   [junit4]   2> 398164 INFO  (TEST-TestCollectionAPI.test-seed#[854D01BFC6242740]) [    ] o.a.s.h.c.HttpShardHandlerFactory created with socketTimeout : 90000,urlScheme : ,connTimeout : 15000,maxConnectionsPerHost : 20,maxConnections : 10000,corePoolSize : 0,maximumPoolSize : 2147483647,maxThreadIdleTime : 5,sizeOfQueue : -1,fairnessPolicy : false,
   [junit4]   2> 398166 INFO  (TEST-TestCollectionAPI.test-seed#[854D01BFC6242740]) [    ] o.a.s.u.UpdateShardHandler Creating UpdateShardHandler HTTP client with params: 
   [junit4]   2> 398167 INFO  (TEST-TestCollectionAPI.test-seed#[854D01BFC6242740]) [    ] o.a.s.l.LogWatcher SLF4J impl is org.slf4j.impl.Log4jLoggerFactory
   [junit4]   2> 398167 INFO  (TEST-TestCollectionAPI.test-seed#[854D01BFC6242740]) [    ] o.a.s.l.LogWatcher Registering Log Listener [Log4j (org.slf4j.impl.Log4jLoggerFactory)]
   [junit4]   2> 398167 INFO  (TEST-TestCollectionAPI.test-seed#[854D01BFC6242740]) [    ] o.a.s.c.ZkContainer Zookeeper client=127.0.0.1:35376/solr
   [junit4]   2> 398167 INFO  (TEST-TestCollectionAPI.test-seed#[854D01BFC6242740]) [    ] o.a.s.c.ZkController zkHost includes chroot
   [junit4]   2> 398167 INFO  (TEST-TestCollectionAPI.test-seed#[854D01BFC6242740]) [    ] o.a.s.c.c.SolrZkClient Using default ZkCredentialsProvider
   [junit4]   2> 398168 INFO  (TEST-TestCollectionAPI.test-seed#[854D01BFC6242740]) [    ] o.a.s.c.c.ConnectionManager Waiting for client to connect to ZooKeeper
   [junit4]   2> 398170 INFO  (zkCallback-333-thread-1) [    ] o.a.s.c.c.ConnectionManager Watcher org.apache.solr.common.cloud.ConnectionManager@304a5d name:ZooKeeperConnection Watcher:127.0.0.1:35376 got event WatchedEvent state:SyncConnected type:None path:null path:null type:None
   [junit4]   2> 398171 INFO  (TEST-TestCollectionAPI.test-seed#[854D01BFC6242740]) [    ] o.a.s.c.c.ConnectionManager Client is connected to ZooKeeper
   [junit4]   2> 398171 INFO  (TEST-TestCollectionAPI.test-seed#[854D01BFC6242740]) [    ] o.a.s.c.c.SolrZkClient Using default ZkACLProvider
   [junit4]   2> 398172 INFO  (TEST-TestCollectionAPI.test-seed#[854D01BFC6242740]) [n:127.0.0.1:45392_    ] o.a.s.c.ZkController Added new OnReconnect listener org.apache.solr.cloud.ZkController$$Lambda$52/26262809@1583b5b
   [junit4]   2> 398172 INFO  (TEST-TestCollectionAPI.test-seed#[854D01BFC6242740]) [n:127.0.0.1:45392_    ] o.a.s.c.c.ConnectionManager Waiting for client to connect to ZooKeeper
   [junit4]   2> 398177 INFO  (zkCallback-334-thread-1-processing-n:127.0.0.1:45392_) [n:127.0.0.1:45392_    ] o.a.s.c.c.ConnectionManager Watcher org.apache.solr.common.cloud.ConnectionManager@a665ca name:ZooKeeperConnection Watcher:127.0.0.1:35376/solr got event WatchedEvent state:SyncConnected type:None path:null path:null type:None
   [junit4]   2> 398178 INFO  (TEST-TestCollectionAPI.test-seed#[854D01BFC6242740]) [n:127.0.0.1:45392_    ] o.a.s.c.c.ConnectionManager Client is connected to ZooKeeper
   [junit4]   2> 398181 INFO  (TEST-TestCollectionAPI.test-seed#[854D01BFC6242740]) [n:127.0.0.1:45392_    ] o.a.s.c.c.ZkStateReader Updating cluster state from ZooKeeper... 
   [junit4]   2> 398182 INFO  (TEST-TestCollectionAPI.test-seed#[854D01BFC6242740]) [n:127.0.0.1:45392_    ] o.a.s.c.c.ZkStateReader Loaded cluster properties: {urlScheme=https}
   [junit4]   2> 398182 INFO  (TEST-TestCollectionAPI.test-seed#[854D01BFC6242740]) [n:127.0.0.1:45392_    ] o.a.s.c.c.ZkStateReader Updated live nodes from ZooKeeper... (0) -> (1)
   [junit4]   2> 398183 INFO  (TEST-TestCollectionAPI.test-seed#[854D01BFC6242740]) [n:127.0.0.1:45392_    ] o.a.s.c.Overseer Overseer (id=null) closing
   [junit4]   2> 398183 INFO  (TEST-TestCollectionAPI.test-seed#[854D01BFC6242740]) [n:127.0.0.1:45392_    ] o.a.s.c.LeaderElector Joined leadership election with path: /overseer_elect/election/95895483760050185-127.0.0.1:45392_-n_0000000001
   [junit4]   2> 398184 INFO  (TEST-TestCollectionAPI.test-seed#[854D01BFC6242740]) [n:127.0.0.1:45392_    ] o.a.s.c.LeaderElector Watching path /overseer_elect/election/95895483760050181-127.0.0.1:45408_-n_0000000000 to know if I could be the leader
   [junit4]   2> 398184 INFO  (TEST-TestCollectionAPI.test-seed#[854D01BFC6242740]) [n:127.0.0.1:45392_    ] o.a.s.c.ZkController Publish node=127.0.0.1:45392_ as DOWN
   [junit4]   2> 398186 INFO  (OverseerStateUpdate-95895483760050181-127.0.0.1:45408_-n_0000000000) [n:127.0.0.1:45408_    ] o.a.s.c.Overseer processMessage: queueSize: 1, message = {
   [junit4]   2>   "operation":"downnode",
   [junit4]   2>   "node_name":"127.0.0.1:45392_"} current state version: 3
   [junit4]   2> 398187 INFO  (OverseerStateUpdate-95895483760050181-127.0.0.1:45408_-n_0000000000) [n:127.0.0.1:45408_    ] o.a.s.c.o.NodeMutator DownNode state invoked for node: 127.0.0.1:45392_
   [junit4]   2> 398288 INFO  (zkCallback-334-thread-1-processing-n:127.0.0.1:45392_) [n:127.0.0.1:45392_    ] o.a.s.c.c.ZkStateReader A cluster state change: [WatchedEvent state:SyncConnected type:NodeDataChanged path:/clusterstate.json], has occurred - updating... (live nodes size: [1])
   [junit4]   2> 398288 INFO  (zkCallback-329-thread-1) [    ] o.a.s.c.c.ZkStateReader A cluster state change: [WatchedEvent state:SyncConnected type:NodeDataChanged path:/clusterstate.json], has occurred - updating... (live nodes size: [1])
   [junit4]   2> 398288 INFO  (zkCallback-325-thread-1-processing-n:127.0.0.1:45408_) [n:127.0.0.1:45408_    ] o.a.s.c.c.ZkStateReader A cluster state change: [WatchedEvent state:SyncConnected type:NodeDataChanged path:/clusterstate.json], has occurred - updating... (live nodes size: [1])
   [junit4]   2> 399186 INFO  (TEST-TestCollectionAPI.test-seed#[854D01BFC6242740]) [n:127.0.0.1:45392_    ] o.a.s.c.ZkController Register node as live in ZooKeeper:/live_nodes/127.0.0.1:45392_
   [junit4]   2> 399187 INFO  (TEST-TestCollectionAPI.test-seed#[854D01BFC6242740]) [n:127.0.0.1:45392_    ] o.a.s.c.c.SolrZkClient makePath: /live_nodes/127.0.0.1:45392_
   [junit4]   2> 399187 INFO  (zkCallback-329-thread-1) [    ] o.a.s.c.c.ZkStateReader A live node change: [WatchedEvent state:SyncConnected type:NodeChildrenChanged path:/live_nodes], has occurred - updating... (live nodes size: [1])
   [junit4]   2> 399187 INFO  (zkCallback-325-thread-1-processing-n:127.0.0.1:45408_) [n:127.0.0.1:45408_    ] o.a.s.c.c.ZkStateReader A live node change: [WatchedEvent state:SyncConnected type:NodeChildrenChanged path:/live_nodes], has occurred - updating... (live nodes size: [1])
   [junit4]   2> 399187 INFO  (zkCallback-334-thread-1-processing-n:127.0.0.1:45392_) [n:127.0.0.1:45392_    ] o.a.s.c.c.ZkStateReader A live node change: [WatchedEvent state:SyncConnected type:NodeChildrenChanged path:/live_nodes], has occurred - updating... (live nodes size: [1])
   [junit4]   2> 399188 INFO  (zkCallback-329-thread-1) [    ] o.a.s.c.c.ZkStateReader Updated live nodes from ZooKeeper... (1) -> (2)
   [junit4]   2> 399188 INFO  (zkCallback-325-thread-1-processing-n:127.0.0.1:45408_) [n:127.0.0.1:45408_    ] o.a.s.c.c.ZkStateReader Updated live nodes from ZooKeeper... (1) -> (2)
   [junit4]   2> 399188 INFO  (zkCallback-334-thread-1-processing-n:127.0.0.1:45392_) [n:127.0.0.1:45392_    ] o.a.s.c.c.ZkStateReader Updated live nodes from ZooKeeper... (1) -> (2)
   [junit4]   2> 399212 INFO  (TEST-TestCollectionAPI.test-seed#[854D01BFC6242740]) [n:127.0.0.1:45392_    ] o.a.s.c.CoreContainer Security conf doesn't exist. Skipping setup for authorization module.
   [junit4]   2> 399212 INFO  (TEST-TestCollectionAPI.test-seed#[854D01BFC6242740]) [n:127.0.0.1:45392_    ] o.a.s.c.CoreContainer No authentication plugin used.
   [junit4]   2> 399213 INFO  (TEST-TestCollectionAPI.test-seed#[854D01BFC6242740]) [n:127.0.0.1:45392_    ] o.a.s.c.CorePropertiesLocator Looking for core definitions underneath /home/jenkins/workspace/Lucene-Solr-master-Linux/solr/build/solr-core/test/J1/../../../../../../../../../home/jenkins/workspace/Lucene-Solr-master-Linux/solr/build/solr-core/test/J1/temp/solr.cloud.TestCollectionAPI_854D01BFC6242740-001/shard-1-001/cores
   [junit4]   2> 399213 INFO  (TEST-TestCollectionAPI.test-seed#[854D01BFC6242740]) [n:127.0.0.1:45392_    ] o.a.s.c.CoreDescriptor Created CoreDescriptor: {name=collection1, config=solrconfig.xml, transient=false, schema=schema.xml, loadOnStartup=true, configSetProperties=configsetprops.json, collection=collection1, coreNodeName=, dataDir=data/, shard=}
   [junit4]   2> 399213 INFO  (TEST-TestCollectionAPI.test-seed#[854D01BFC6242740]) [n:127.0.0.1:45392_    ] o.a.s.c.CorePropertiesLocator Found core collection1 in /home/jenkins/workspace/Lucene-Solr-master-Linux/solr/build/solr-core/test/J1/../../../../../../../../../home/jenkins/workspace/Lucene-Solr-master-Linux/solr/build/solr-core/test/J1/temp/solr.cloud.TestCollectionAPI_854D01BFC6242740-001/shard-1-001/cores/collection1
   [junit4]   2> 399213 INFO  (TEST-TestCollectionAPI.test-seed#[854D01BFC6242740]) [n:127.0.0.1:45392_    ] o.a.s.c.CorePropertiesLocator Found 1 core definitions
   [junit4]   2> 399214 INFO  (coreLoadExecutor-970-thread-1-processing-n:127.0.0.1:45392_) [n:127.0.0.1:45392_ c:collection1   x:collection1] o.a.s.c.ZkController publishing state=down
   [junit4]   2> 399214 INFO  (coreLoadExecutor-970-thread-1-processing-n:127.0.0.1:45392_) [n:127.0.0.1:45392_ c:collection1   x:collection1] o.a.s.c.ZkController numShards not found on descriptor - reading it from system property
   [junit4]   2> 399214 INFO  (TEST-TestCollectionAPI.test-seed#[854D01BFC6242740]) [n:127.0.0.1:45392_    ] o.a.s.s.SolrDispatchFilter user.dir=/home/jenkins/workspace/Lucene-Solr-master-Linux/solr/build/solr-core/test/J1
   [junit4]   2> 399214 INFO  (TEST-TestCollectionAPI.test-seed#[854D01BFC6242740]) [n:127.0.0.1:45392_    ] o.a.s.s.SolrDispatchFilter SolrDispatchFilter.init() done
   [junit4]   2> 399214 INFO  (coreLoadExecutor-970-thread-1-processing-n:127.0.0.1:45392_) [n:127.0.0.1:45392_ c:collection1   x:collection1] o.a.s.c.ZkController Collection collection1 not visible yet, but flagging it so a watch is registered when it becomes visible
   [junit4]   2> 399215 INFO  (OverseerStateUpdate-95895483760050181-127.0.0.1:45408_-n_0000000000) [n:127.0.0.1:45408_    ] o.a.s.c.Overseer processMessage: queueSize: 1, message = {
   [junit4]   2>   "core":"collection1",
   [junit4]   2>   "roles":null,
   [junit4]   2>   "base_url":"https://127.0.0.1:45392",
   [junit4]   2>   "node_name":"127.0.0.1:45392_",
   [junit4]   2>   "numShards":"2",
   [junit4]   2>   "state":"down",
   [junit4]   2>   "shard":null,
   [junit4]   2>   "collection":"collection1",
   [junit4]   2>   "operation":"state"} current state version: 4
   [junit4]   2> 399215 INFO  (coreLoadExecutor-970-thread-1-processing-n:127.0.0.1:45392_) [n:127.0.0.1:45392_ c:collection1   x:collection1] o.a.s.c.c.ZkStateReader Deleting data for [collection1]
   [junit4]   2> 399215 INFO  (OverseerStateUpdate-95895483760050181-127.0.0.1:45408_-n_0000000000) [n:127.0.0.1:45408_    ] o.a.s.c.o.ReplicaMutator Update state numShards=2 message={
   [junit4]   2>   "core":"collection1",
   [junit4]   2>   "roles":null,
   [junit4]   2>   "base_url":"https://127.0.0.1:45392",
   [junit4]   2>   "node_name":"127.0.0.1:45392_",
   [junit4]   2>   "numShards":"2",
   [junit4]   2>   "state":"down",
   [junit4]   2>   "shard":null,
   [junit4]   2>   "collection":"collection1",
   [junit4]   2>   "operation":"state"}
   [junit4]   2> 399215 INFO  (OverseerStateUpdate-95895483760050181-127.0.0.1:45408_-n_000000

[...truncated too long message...]

rmatUpdateWithTimeDelayLazy-seed#[854D01BFC6242740]) [    ] o.a.s.c.c.ConnectionManager Waiting for client to connect to ZooKeeper
   [junit4]   2> 950648 INFO  (zkCallback-1133-thread-1) [    ] o.a.s.c.c.ConnectionManager Watcher org.apache.solr.common.cloud.ConnectionManager@905073 name:ZooKeeperConnection Watcher:127.0.0.1:37142 got event WatchedEvent state:SyncConnected type:None path:null path:null type:None
   [junit4]   2> 950648 INFO  (TEST-ZkStateReaderTest.testStateFormatUpdateWithTimeDelayLazy-seed#[854D01BFC6242740]) [    ] o.a.s.c.c.ConnectionManager Client is connected to ZooKeeper
   [junit4]   2> 950648 INFO  (TEST-ZkStateReaderTest.testStateFormatUpdateWithTimeDelayLazy-seed#[854D01BFC6242740]) [    ] o.a.s.c.c.SolrZkClient Using default ZkACLProvider
   [junit4]   2> 950649 INFO  (TEST-ZkStateReaderTest.testStateFormatUpdateWithTimeDelayLazy-seed#[854D01BFC6242740]) [    ] o.a.s.c.c.SolrZkClient Using default ZkCredentialsProvider
   [junit4]   2> 950649 INFO  (TEST-ZkStateReaderTest.testStateFormatUpdateWithTimeDelayLazy-seed#[854D01BFC6242740]) [    ] o.a.s.c.c.ConnectionManager Waiting for client to connect to ZooKeeper
   [junit4]   2> 950649 INFO  (zkCallback-1134-thread-1) [    ] o.a.s.c.c.ConnectionManager Watcher org.apache.solr.common.cloud.ConnectionManager@1606c77 name:ZooKeeperConnection Watcher:127.0.0.1:37142 got event WatchedEvent state:SyncConnected type:None path:null path:null type:None
   [junit4]   2> 950649 INFO  (TEST-ZkStateReaderTest.testStateFormatUpdateWithTimeDelayLazy-seed#[854D01BFC6242740]) [    ] o.a.s.c.c.ConnectionManager Client is connected to ZooKeeper
   [junit4]   2> 950650 INFO  (TEST-ZkStateReaderTest.testStateFormatUpdateWithTimeDelayLazy-seed#[854D01BFC6242740]) [    ] o.a.s.c.c.SolrZkClient Using default ZkACLProvider
   [junit4]   2> 950650 INFO  (TEST-ZkStateReaderTest.testStateFormatUpdateWithTimeDelayLazy-seed#[854D01BFC6242740]) [    ] o.a.s.c.c.SolrZkClient makePath: /solr
   [junit4]   2> 950651 INFO  (TEST-ZkStateReaderTest.testStateFormatUpdateWithTimeDelayLazy-seed#[854D01BFC6242740]) [    ] o.a.s.c.c.SolrZkClient Using default ZkCredentialsProvider
   [junit4]   2> 950651 INFO  (TEST-ZkStateReaderTest.testStateFormatUpdateWithTimeDelayLazy-seed#[854D01BFC6242740]) [    ] o.a.s.c.c.ConnectionManager Waiting for client to connect to ZooKeeper
   [junit4]   2> 950652 INFO  (zkCallback-1135-thread-1) [    ] o.a.s.c.c.ConnectionManager Watcher org.apache.solr.common.cloud.ConnectionManager@1019291 name:ZooKeeperConnection Watcher:127.0.0.1:37142/solr got event WatchedEvent state:SyncConnected type:None path:null path:null type:None
   [junit4]   2> 950652 INFO  (TEST-ZkStateReaderTest.testStateFormatUpdateWithTimeDelayLazy-seed#[854D01BFC6242740]) [    ] o.a.s.c.c.ConnectionManager Client is connected to ZooKeeper
   [junit4]   2> 950652 INFO  (TEST-ZkStateReaderTest.testStateFormatUpdateWithTimeDelayLazy-seed#[854D01BFC6242740]) [    ] o.a.s.c.c.SolrZkClient Using default ZkACLProvider
   [junit4]   2> 950652 INFO  (TEST-ZkStateReaderTest.testStateFormatUpdateWithTimeDelayLazy-seed#[854D01BFC6242740]) [    ] o.a.s.c.c.SolrZkClient makePath: /live_nodes
   [junit4]   2> 950652 INFO  (TEST-ZkStateReaderTest.testStateFormatUpdateWithTimeDelayLazy-seed#[854D01BFC6242740]) [    ] o.a.s.c.c.SolrZkClient makePath: /collections
   [junit4]   2> 950653 INFO  (TEST-ZkStateReaderTest.testStateFormatUpdateWithTimeDelayLazy-seed#[854D01BFC6242740]) [    ] o.a.s.c.c.SolrZkClient makePath: /aliases.json
   [junit4]   2> 950653 INFO  (TEST-ZkStateReaderTest.testStateFormatUpdateWithTimeDelayLazy-seed#[854D01BFC6242740]) [    ] o.a.s.c.c.SolrZkClient makePath: /clusterstate.json
   [junit4]   2> 950653 INFO  (TEST-ZkStateReaderTest.testStateFormatUpdateWithTimeDelayLazy-seed#[854D01BFC6242740]) [    ] o.a.s.c.c.SolrZkClient makePath: /security.json
   [junit4]   2> 950654 INFO  (TEST-ZkStateReaderTest.testStateFormatUpdateWithTimeDelayLazy-seed#[854D01BFC6242740]) [    ] o.a.s.c.c.ZkStateReader Updating cluster state from ZooKeeper... 
   [junit4]   2> 950654 INFO  (TEST-ZkStateReaderTest.testStateFormatUpdateWithTimeDelayLazy-seed#[854D01BFC6242740]) [    ] o.a.s.c.c.ZkStateReader Loaded empty cluster properties
   [junit4]   2> 950654 INFO  (TEST-ZkStateReaderTest.testStateFormatUpdateWithTimeDelayLazy-seed#[854D01BFC6242740]) [    ] o.a.s.c.c.ZkStateReader Updated live nodes from ZooKeeper... (0) -> (0)
   [junit4]   2> 950654 INFO  (TEST-ZkStateReaderTest.testStateFormatUpdateWithTimeDelayLazy-seed#[854D01BFC6242740]) [    ] o.a.s.c.c.SolrZkClient makePath: /collections/c1
   [junit4]   2> 950655 INFO  (zkCallback-1135-thread-1) [    ] o.a.s.c.c.ZkStateReader A collections change: [WatchedEvent state:SyncConnected type:NodeChildrenChanged path:/collections], has occurred - updating...
   [junit4]   2> 950656 INFO  (zkCallback-1135-thread-1) [    ] o.a.s.c.c.ZkStateReader A cluster state change: [WatchedEvent state:SyncConnected type:NodeDataChanged path:/clusterstate.json], has occurred - updating... (live nodes size: [0])
   [junit4]   2> 950656 INFO  (TEST-ZkStateReaderTest.testStateFormatUpdateWithTimeDelayLazy-seed#[854D01BFC6242740]) [    ] o.a.s.c.o.ZkStateWriter going to create_collection /collections/c1/state.json
   [junit4]   2> 950656 INFO  (zkCallback-1135-thread-1) [    ] o.a.s.c.c.ZkStateReader A cluster state change: [WatchedEvent state:SyncConnected type:NodeDataChanged path:/clusterstate.json], has occurred - updating... (live nodes size: [0])
   [junit4]   2> 950657 INFO  (TEST-ZkStateReaderTest.testStateFormatUpdateWithTimeDelayLazy-seed#[854D01BFC6242740]) [    ] o.a.s.c.ZkTestServer connecting to 127.0.0.1:37142 37142
   [junit4]   2> 955679 INFO  (Thread-2146) [    ] o.a.s.c.ZkTestServer connecting to 127.0.0.1:37142 37142
   [junit4]   2> 955680 INFO  (TEST-ZkStateReaderTest.testStateFormatUpdateWithTimeDelayLazy-seed#[854D01BFC6242740]) [    ] o.a.s.SolrTestCaseJ4 ###Ending testStateFormatUpdateWithTimeDelayLazy
   [junit4]   2> 955681 INFO  (SUITE-ZkStateReaderTest-seed#[854D01BFC6242740]-worker) [    ] o.a.s.SolrTestCaseJ4 ###deleteCore
   [junit4]   2> NOTE: leaving temporary files on disk at: /home/jenkins/workspace/Lucene-Solr-master-Linux/solr/build/solr-core/test/J2/temp/solr.cloud.overseer.ZkStateReaderTest_854D01BFC6242740-001
   [junit4]   2> NOTE: test params are: codec=Lucene62, sim=ClassicSimilarity, locale=en-US, timezone=MET
   [junit4]   2> NOTE: Linux 4.4.0-21-generic i386/Oracle Corporation 1.8.0_92 (32-bit)/cpus=12,threads=1,free=58856568,total=166739968
   [junit4]   2> NOTE: All tests run in this JVM: [SolrTestCaseJ4Test, BadIndexSchemaTest, StatelessScriptUpdateProcessorFactoryTest, SecurityConfHandlerTest, TestTolerantUpdateProcessorCloud, TestSizeLimitedDistributedMap, RuleEngineTest, ConjunctionSolrSpellCheckerTest, TestCSVResponseWriter, DirectSolrConnectionTest, BlockJoinFacetSimpleTest, TestJmxMonitoredMap, TestComplexPhraseQParserPlugin, HardAutoCommitTest, TestFastWriter, TestFuzzyAnalyzedSuggestions, TestSchemaManager, ChangedSchemaMergeTest, LeaderFailoverAfterPartitionTest, RollingRestartTest, ScriptEngineTest, CleanupOldIndexTest, DistanceUnitsTest, TestFieldTypeResource, TestDefaultStatsCache, TestDistributedMissingSort, UnloadDistributedZkTest, DeleteInactiveReplicaTest, SliceStateTest, AnalysisErrorHandlingTest, TestInitQParser, CoreAdminHandlerTest, TestJmxIntegration, TestConfigOverlay, PrimitiveFieldTypeTest, ShowFileRequestHandlerTest, TestDefaultSearchFieldResource, TestSweetSpotSimilarityFactory, TermVectorComponentDistributedTest, TestMiniSolrCloudClusterSSL, TestMacros, TestSolrQueryParserDefaultOperatorResource, TestNonDefinedSimilarityFactory, DirectUpdateHandlerOptimizeTest, PluginInfoTest, TestPivotHelperCode, ClassificationUpdateProcessorFactoryTest, TestSubQueryTransformer, TestFileDictionaryLookup, DistribDocExpirationUpdateProcessorTest, TestDocBasedVersionConstraints, TestInfoStreamLogging, TestExactStatsCache, HdfsWriteToMultipleCollectionsTest, AutoCommitTest, SuggesterTSTTest, SuggesterTest, OverriddenZkACLAndCredentialsProvidersTest, TestRebalanceLeaders, BigEndianAscendingWordSerializerTest, SimpleCollectionCreateDeleteTest, DistributedFacetPivotSmallAdvancedTest, RegexBoostProcessorTest, TestRecovery, MigrateRouteKeyTest, TestCloudManagedSchema, CurrencyFieldXmlFileTest, FullHLLTest, TestCryptoKeys, TestTrieFacet, VersionInfoTest, TestSolrIndexConfig, TestIndexingPerformance, OverseerStatusTest, PKIAuthenticationIntegrationTest, TestSuggestSpellingConverter, CollectionsAPISolrJTest, TestReloadAndDeleteDocs, ZkStateReaderTest]
   [junit4] Completed [232/597 (2!)] on J2 in 66.15s, 6 tests, 1 failure, 1 error <<< FAILURES!

[...truncated 1189 lines...]
BUILD FAILED
/home/jenkins/workspace/Lucene-Solr-master-Linux/build.xml:740: The following error occurred while executing this line:
/home/jenkins/workspace/Lucene-Solr-master-Linux/build.xml:684: The following error occurred while executing this line:
/home/jenkins/workspace/Lucene-Solr-master-Linux/build.xml:59: The following error occurred while executing this line:
/home/jenkins/workspace/Lucene-Solr-master-Linux/solr/build.xml:233: The following error occurred while executing this line:
/home/jenkins/workspace/Lucene-Solr-master-Linux/solr/common-build.xml:529: The following error occurred while executing this line:
/home/jenkins/workspace/Lucene-Solr-master-Linux/lucene/common-build.xml:1457: The following error occurred while executing this line:
/home/jenkins/workspace/Lucene-Solr-master-Linux/lucene/common-build.xml:1014: There were test failures: 597 suites (10 ignored), 2413 tests, 2 errors, 1 failure, 115 ignored (71 assumptions) [seed: 854D01BFC6242740]

Total time: 65 minutes 38 seconds
Build step 'Invoke Ant' marked build as failure
Archiving artifacts
[WARNINGS] Skipping publisher since build result is FAILURE
Recording test results
Email was triggered for: Failure - Any
Sending email for trigger: Failure - Any



Mime
View raw message