lucene-dev mailing list archives

Site index · List index
Message view « Date » · « Thread »
Top « Date » · « Thread »
From Policeman Jenkins Server <jenk...@thetaphi.de>
Subject [JENKINS] Lucene-Solr-master-Windows (32bit/jdk1.8.0_92) - Build # 5841 - Failure!
Date Sat, 14 May 2016 11:38:07 GMT
Build: http://jenkins.thetaphi.de/job/Lucene-Solr-master-Windows/5841/
Java: 32bit/jdk1.8.0_92 -server -XX:+UseParallelGC

1 tests failed.
FAILED:  org.apache.lucene.index.TestIndexSorting.testConcurrentDVUpdates

Error Message:
expected:<9> but was:<14>

Stack Trace:
java.lang.AssertionError: expected:<9> but was:<14>
	at __randomizedtesting.SeedInfo.seed([12CF3B37A4EA55B:38B40D2AD62C9C32]:0)
	at org.junit.Assert.fail(Assert.java:93)
	at org.junit.Assert.failNotEquals(Assert.java:647)
	at org.junit.Assert.assertEquals(Assert.java:128)
	at org.junit.Assert.assertEquals(Assert.java:472)
	at org.junit.Assert.assertEquals(Assert.java:456)
	at org.apache.lucene.index.TestIndexSorting.testConcurrentDVUpdates(TestIndexSorting.java:872)
	at sun.reflect.NativeMethodAccessorImpl.invoke0(Native Method)
	at sun.reflect.NativeMethodAccessorImpl.invoke(NativeMethodAccessorImpl.java:62)
	at sun.reflect.DelegatingMethodAccessorImpl.invoke(DelegatingMethodAccessorImpl.java:43)
	at java.lang.reflect.Method.invoke(Method.java:498)
	at com.carrotsearch.randomizedtesting.RandomizedRunner.invoke(RandomizedRunner.java:1764)
	at com.carrotsearch.randomizedtesting.RandomizedRunner$8.evaluate(RandomizedRunner.java:871)
	at com.carrotsearch.randomizedtesting.RandomizedRunner$9.evaluate(RandomizedRunner.java:907)
	at com.carrotsearch.randomizedtesting.RandomizedRunner$10.evaluate(RandomizedRunner.java:921)
	at org.apache.lucene.util.TestRuleSetupTeardownChained$1.evaluate(TestRuleSetupTeardownChained.java:49)
	at org.apache.lucene.util.AbstractBeforeAfterRule$1.evaluate(AbstractBeforeAfterRule.java:45)
	at org.apache.lucene.util.TestRuleThreadAndTestName$1.evaluate(TestRuleThreadAndTestName.java:48)
	at org.apache.lucene.util.TestRuleIgnoreAfterMaxFailures$1.evaluate(TestRuleIgnoreAfterMaxFailures.java:64)
	at org.apache.lucene.util.TestRuleMarkFailure$1.evaluate(TestRuleMarkFailure.java:47)
	at com.carrotsearch.randomizedtesting.rules.StatementAdapter.evaluate(StatementAdapter.java:36)
	at com.carrotsearch.randomizedtesting.ThreadLeakControl$StatementRunner.run(ThreadLeakControl.java:367)
	at com.carrotsearch.randomizedtesting.ThreadLeakControl.forkTimeoutingTask(ThreadLeakControl.java:809)
	at com.carrotsearch.randomizedtesting.ThreadLeakControl$3.evaluate(ThreadLeakControl.java:460)
	at com.carrotsearch.randomizedtesting.RandomizedRunner.runSingleTest(RandomizedRunner.java:880)
	at com.carrotsearch.randomizedtesting.RandomizedRunner$5.evaluate(RandomizedRunner.java:781)
	at com.carrotsearch.randomizedtesting.RandomizedRunner$6.evaluate(RandomizedRunner.java:816)
	at com.carrotsearch.randomizedtesting.RandomizedRunner$7.evaluate(RandomizedRunner.java:827)
	at org.apache.lucene.util.AbstractBeforeAfterRule$1.evaluate(AbstractBeforeAfterRule.java:45)
	at com.carrotsearch.randomizedtesting.rules.StatementAdapter.evaluate(StatementAdapter.java:36)
	at org.apache.lucene.util.TestRuleStoreClassName$1.evaluate(TestRuleStoreClassName.java:41)
	at com.carrotsearch.randomizedtesting.rules.NoShadowingOrOverridesOnMethodsRule$1.evaluate(NoShadowingOrOverridesOnMethodsRule.java:40)
	at com.carrotsearch.randomizedtesting.rules.NoShadowingOrOverridesOnMethodsRule$1.evaluate(NoShadowingOrOverridesOnMethodsRule.java:40)
	at com.carrotsearch.randomizedtesting.rules.StatementAdapter.evaluate(StatementAdapter.java:36)
	at com.carrotsearch.randomizedtesting.rules.StatementAdapter.evaluate(StatementAdapter.java:36)
	at com.carrotsearch.randomizedtesting.rules.StatementAdapter.evaluate(StatementAdapter.java:36)
	at org.apache.lucene.util.TestRuleAssertionsRequired$1.evaluate(TestRuleAssertionsRequired.java:53)
	at org.apache.lucene.util.TestRuleMarkFailure$1.evaluate(TestRuleMarkFailure.java:47)
	at org.apache.lucene.util.TestRuleIgnoreAfterMaxFailures$1.evaluate(TestRuleIgnoreAfterMaxFailures.java:64)
	at org.apache.lucene.util.TestRuleIgnoreTestSuites$1.evaluate(TestRuleIgnoreTestSuites.java:54)
	at com.carrotsearch.randomizedtesting.rules.StatementAdapter.evaluate(StatementAdapter.java:36)
	at com.carrotsearch.randomizedtesting.ThreadLeakControl$StatementRunner.run(ThreadLeakControl.java:367)
	at java.lang.Thread.run(Thread.java:745)




Build Log:
[...truncated 861 lines...]
   [junit4] Suite: org.apache.lucene.index.TestIndexSorting
   [junit4]   2> NOTE: reproduce with: ant test  -Dtestcase=TestIndexSorting -Dtests.method=testConcurrentDVUpdates
-Dtests.seed=12CF3B37A4EA55B -Dtests.slow=true -Dtests.locale=ca-ES -Dtests.timezone=America/Anchorage
-Dtests.asserts=true -Dtests.file.encoding=US-ASCII
   [junit4] FAILURE 0.93s J1 | TestIndexSorting.testConcurrentDVUpdates <<<
   [junit4]    > Throwable #1: java.lang.AssertionError: expected:<9> but was:<14>
   [junit4]    > 	at __randomizedtesting.SeedInfo.seed([12CF3B37A4EA55B:38B40D2AD62C9C32]:0)
   [junit4]    > 	at org.apache.lucene.index.TestIndexSorting.testConcurrentDVUpdates(TestIndexSorting.java:872)
   [junit4]    > 	at java.lang.Thread.run(Thread.java:745)
   [junit4]   2> NOTE: leaving temporary files on disk at: C:\Users\jenkins\workspace\Lucene-Solr-master-Windows\lucene\build\core\test\J1\temp\lucene.index.TestIndexSorting_12CF3B37A4EA55B-001
   [junit4]   2> NOTE: test params are: codec=Asserting(Lucene62), sim=ClassicSimilarity,
locale=ca-ES, timezone=America/Anchorage
   [junit4]   2> NOTE: Windows 10 10.0 x86/Oracle Corporation 1.8.0_92 (32-bit)/cpus=3,threads=1,free=137771776,total=259522560
   [junit4]   2> NOTE: All tests run in this JVM: [TestRollingBuffer, TestFilterDirectoryReader,
TestDocumentsWriterDeleteQueue, TestSort, TestTermVectorsWriter, TestSearcherManager, TestFieldsReader,
TestIndexWriterReader, LimitedFiniteStringsIteratorTest, TestPersistentSnapshotDeletionPolicy,
TestOmitPositions, TestTermVectors, TestStressIndexing, TestSimilarity, TestBooleanScorer,
TestArrayUtil, TestPackedInts, TestBytesRefArray, TestNRTCachingDirectory, TestIndexWriterOnJRECrash,
TestBoostQuery, TestGeoEncodingUtils, Test2BBKDPoints, TestMultiTermConstantScore, TestVirtualMethod,
TestCharsRef, TestMinShouldMatch2, TestTieredMergePolicy, TestBooleanCoord, TestFastCompressionMode,
TestSpanOrQuery, TestSynonymQuery, TestDocInverterPerFieldErrorInfo, TestFixedLengthBytesRefArray,
TestMultiPhraseEnum, TestFieldCacheRewriteMethod, TestQueryRescorer, TestFilterSpans, TestSpansEnum,
TestSleepingLockWrapper, TestPositionIncrement, TestMixedDocValuesUpdates, TestSPIClassIterator,
TestThreadedForceMerge, TestInPlaceMergeSorter, TestForceMergeForever, TestNumericTokenStream,
TestNewestSegment, TestUniqueTermCount, TestDocValuesIndexing, TestMergedIterator, Test2BNumericDocValues,
TestSortRescorer, TestMergePolicyWrapper, TestMultiPhraseQuery, TestRateLimiter, TestNumericRangeQuery64,
TestTotalHitCountCollector, TestSpanFirstQuery, TestPolygon, TestTopFieldCollector, TestCompiledAutomaton,
TestStringHelper, TestSpanMultiTermQueryWrapper, TestDocumentWriter, TestReadOnlyIndex, TestLRUQueryCache,
TestIndexWriterOutOfFileDescriptors, TestOmitTf, TestFixedBitSet, TestPerSegmentDeletes, TestPrefixCodedTerms,
TestNRTReaderCleanup, TestIsCurrent, TestSimpleAttributeImpl, TestCustomNorms, TestToken,
TestUTF32ToUTF8, TestNumericRangeQuery32, TestScoreCachingWrappingScorer, TestDemo, TestDirectoryReader,
TestUpgradeIndexMergePolicy, TestDirectory, TestCachingCollector, TestTimeLimitingCollector,
TestElevationComparator, TestAutomatonQuery, TestSpans, TestIndexWriterMaxDocs, TestIndexSorting]
   [junit4] Completed [198/422 (1!)] on J1 in 59.27s, 27 tests, 1 failure <<< FAILURES!

[...truncated 750 lines...]
BUILD FAILED
C:\Users\jenkins\workspace\Lucene-Solr-master-Windows\build.xml:740: The following error occurred
while executing this line:
C:\Users\jenkins\workspace\Lucene-Solr-master-Windows\build.xml:684: The following error occurred
while executing this line:
C:\Users\jenkins\workspace\Lucene-Solr-master-Windows\build.xml:59: The following error occurred
while executing this line:
C:\Users\jenkins\workspace\Lucene-Solr-master-Windows\lucene\build.xml:50: The following error
occurred while executing this line:
C:\Users\jenkins\workspace\Lucene-Solr-master-Windows\lucene\common-build.xml:1457: The following
error occurred while executing this line:
C:\Users\jenkins\workspace\Lucene-Solr-master-Windows\lucene\common-build.xml:1014: There
were test failures: 422 suites (1 ignored), 3544 tests, 1 failure, 73 ignored (69 assumptions)
[seed: 12CF3B37A4EA55B]

Total time: 9 minutes 6 seconds
Build step 'Invoke Ant' marked build as failure
Archiving artifacts
[WARNINGS] Skipping publisher since build result is FAILURE
Recording test results
Email was triggered for: Failure - Any
Sending email for trigger: Failure - Any



Mime
View raw message