lucene-dev mailing list archives

Site index · List index
Message view « Date » · « Thread »
Top « Date » · « Thread »
From Policeman Jenkins Server <jenk...@thetaphi.de>
Subject [JENKINS] Lucene-Solr-6.0-Windows (32bit/jdk1.8.0_92) - Build # 46 - Failure!
Date Mon, 23 May 2016 11:59:55 GMT
Build: http://jenkins.thetaphi.de/job/Lucene-Solr-6.0-Windows/46/
Java: 32bit/jdk1.8.0_92 -client -XX:+UseConcMarkSweepGC

1 tests failed.
FAILED:  org.apache.lucene.replicator.IndexReplicationClientTest.testRestart

Error Message:
Could not remove the following files (in the order of attempts):    C:\Users\jenkins\workspace\Lucene-Solr-6.0-Windows\lucene\build\replicator\test\J0\temp\lucene.replicator.IndexReplicationClientTest_B75D1D40F4EA481B-001\replicationClientTest-004\2:
java.nio.file.DirectoryNotEmptyException: C:\Users\jenkins\workspace\Lucene-Solr-6.0-Windows\lucene\build\replicator\test\J0\temp\lucene.replicator.IndexReplicationClientTest_B75D1D40F4EA481B-001\replicationClientTest-004\2


Stack Trace:
java.io.IOException: Could not remove the following files (in the order of attempts):
   C:\Users\jenkins\workspace\Lucene-Solr-6.0-Windows\lucene\build\replicator\test\J0\temp\lucene.replicator.IndexReplicationClientTest_B75D1D40F4EA481B-001\replicationClientTest-004\2:
java.nio.file.DirectoryNotEmptyException: C:\Users\jenkins\workspace\Lucene-Solr-6.0-Windows\lucene\build\replicator\test\J0\temp\lucene.replicator.IndexReplicationClientTest_B75D1D40F4EA481B-001\replicationClientTest-004\2

	at __randomizedtesting.SeedInfo.seed([B75D1D40F4EA481B:22D0F1217102FC0E]:0)
	at org.apache.lucene.util.IOUtils.rm(IOUtils.java:323)
	at org.apache.lucene.replicator.PerSessionDirectoryFactory.cleanupSession(PerSessionDirectoryFactory.java:58)
	at org.apache.lucene.replicator.ReplicationClient.doUpdate(ReplicationClient.java:259)
	at org.apache.lucene.replicator.ReplicationClient.updateNow(ReplicationClient.java:401)
	at org.apache.lucene.replicator.IndexReplicationClientTest.testRestart(IndexReplicationClientTest.java:196)
	at sun.reflect.NativeMethodAccessorImpl.invoke0(Native Method)
	at sun.reflect.NativeMethodAccessorImpl.invoke(NativeMethodAccessorImpl.java:62)
	at sun.reflect.DelegatingMethodAccessorImpl.invoke(DelegatingMethodAccessorImpl.java:43)
	at java.lang.reflect.Method.invoke(Method.java:498)
	at com.carrotsearch.randomizedtesting.RandomizedRunner.invoke(RandomizedRunner.java:1764)
	at com.carrotsearch.randomizedtesting.RandomizedRunner$8.evaluate(RandomizedRunner.java:871)
	at com.carrotsearch.randomizedtesting.RandomizedRunner$9.evaluate(RandomizedRunner.java:907)
	at com.carrotsearch.randomizedtesting.RandomizedRunner$10.evaluate(RandomizedRunner.java:921)
	at org.apache.lucene.util.TestRuleSetupTeardownChained$1.evaluate(TestRuleSetupTeardownChained.java:49)
	at org.apache.lucene.util.AbstractBeforeAfterRule$1.evaluate(AbstractBeforeAfterRule.java:45)
	at org.apache.lucene.util.TestRuleThreadAndTestName$1.evaluate(TestRuleThreadAndTestName.java:48)
	at org.apache.lucene.util.TestRuleIgnoreAfterMaxFailures$1.evaluate(TestRuleIgnoreAfterMaxFailures.java:64)
	at org.apache.lucene.util.TestRuleMarkFailure$1.evaluate(TestRuleMarkFailure.java:47)
	at com.carrotsearch.randomizedtesting.rules.StatementAdapter.evaluate(StatementAdapter.java:36)
	at com.carrotsearch.randomizedtesting.ThreadLeakControl$StatementRunner.run(ThreadLeakControl.java:367)
	at com.carrotsearch.randomizedtesting.ThreadLeakControl.forkTimeoutingTask(ThreadLeakControl.java:809)
	at com.carrotsearch.randomizedtesting.ThreadLeakControl$3.evaluate(ThreadLeakControl.java:460)
	at com.carrotsearch.randomizedtesting.RandomizedRunner.runSingleTest(RandomizedRunner.java:880)
	at com.carrotsearch.randomizedtesting.RandomizedRunner$5.evaluate(RandomizedRunner.java:781)
	at com.carrotsearch.randomizedtesting.RandomizedRunner$6.evaluate(RandomizedRunner.java:816)
	at com.carrotsearch.randomizedtesting.RandomizedRunner$7.evaluate(RandomizedRunner.java:827)
	at org.apache.lucene.util.AbstractBeforeAfterRule$1.evaluate(AbstractBeforeAfterRule.java:45)
	at com.carrotsearch.randomizedtesting.rules.StatementAdapter.evaluate(StatementAdapter.java:36)
	at org.apache.lucene.util.TestRuleStoreClassName$1.evaluate(TestRuleStoreClassName.java:41)
	at com.carrotsearch.randomizedtesting.rules.NoShadowingOrOverridesOnMethodsRule$1.evaluate(NoShadowingOrOverridesOnMethodsRule.java:40)
	at com.carrotsearch.randomizedtesting.rules.NoShadowingOrOverridesOnMethodsRule$1.evaluate(NoShadowingOrOverridesOnMethodsRule.java:40)
	at com.carrotsearch.randomizedtesting.rules.StatementAdapter.evaluate(StatementAdapter.java:36)
	at com.carrotsearch.randomizedtesting.rules.StatementAdapter.evaluate(StatementAdapter.java:36)
	at com.carrotsearch.randomizedtesting.rules.StatementAdapter.evaluate(StatementAdapter.java:36)
	at org.apache.lucene.util.TestRuleAssertionsRequired$1.evaluate(TestRuleAssertionsRequired.java:53)
	at org.apache.lucene.util.TestRuleMarkFailure$1.evaluate(TestRuleMarkFailure.java:47)
	at org.apache.lucene.util.TestRuleIgnoreAfterMaxFailures$1.evaluate(TestRuleIgnoreAfterMaxFailures.java:64)
	at org.apache.lucene.util.TestRuleIgnoreTestSuites$1.evaluate(TestRuleIgnoreTestSuites.java:54)
	at com.carrotsearch.randomizedtesting.rules.StatementAdapter.evaluate(StatementAdapter.java:36)
	at com.carrotsearch.randomizedtesting.ThreadLeakControl$StatementRunner.run(ThreadLeakControl.java:367)
	at java.lang.Thread.run(Thread.java:745)




Build Log:
[...truncated 8141 lines...]
   [junit4] Suite: org.apache.lucene.replicator.IndexReplicationClientTest
   [junit4]   2> NOTE: reproduce with: ant test  -Dtestcase=IndexReplicationClientTest
-Dtests.method=testRestart -Dtests.seed=B75D1D40F4EA481B -Dtests.slow=true -Dtests.locale=be-BY
-Dtests.timezone=America/Recife -Dtests.asserts=true -Dtests.file.encoding=UTF-8
   [junit4] ERROR   0.06s J0 | IndexReplicationClientTest.testRestart <<<
   [junit4]    > Throwable #1: java.io.IOException: Could not remove the following files
(in the order of attempts):
   [junit4]    >    C:\Users\jenkins\workspace\Lucene-Solr-6.0-Windows\lucene\build\replicator\test\J0\temp\lucene.replicator.IndexReplicationClientTest_B75D1D40F4EA481B-001\replicationClientTest-004\2:
java.nio.file.DirectoryNotEmptyException: C:\Users\jenkins\workspace\Lucene-Solr-6.0-Windows\lucene\build\replicator\test\J0\temp\lucene.replicator.IndexReplicationClientTest_B75D1D40F4EA481B-001\replicationClientTest-004\2
   [junit4]    > 	at __randomizedtesting.SeedInfo.seed([B75D1D40F4EA481B:22D0F1217102FC0E]:0)
   [junit4]    > 	at org.apache.lucene.util.IOUtils.rm(IOUtils.java:323)
   [junit4]    > 	at org.apache.lucene.replicator.PerSessionDirectoryFactory.cleanupSession(PerSessionDirectoryFactory.java:58)
   [junit4]    > 	at org.apache.lucene.replicator.ReplicationClient.doUpdate(ReplicationClient.java:259)
   [junit4]    > 	at org.apache.lucene.replicator.ReplicationClient.updateNow(ReplicationClient.java:401)
   [junit4]    > 	at org.apache.lucene.replicator.IndexReplicationClientTest.testRestart(IndexReplicationClientTest.java:196)
   [junit4]    > 	at java.lang.Thread.run(Thread.java:745)
   [junit4]   2> NOTE: leaving temporary files on disk at: C:\Users\jenkins\workspace\Lucene-Solr-6.0-Windows\lucene\build\replicator\test\J0\temp\lucene.replicator.IndexReplicationClientTest_B75D1D40F4EA481B-001
   [junit4]   2> NOTE: test params are: codec=Asserting(Lucene60): {}, docValues:{}, maxPointsInLeafNode=1729,
maxMBSortInHeap=7.95262602578554, sim=ClassicSimilarity, locale=be-BY, timezone=America/Recife
   [junit4]   2> NOTE: Windows 10 10.0 x86/Oracle Corporation 1.8.0_92 (32-bit)/cpus=3,threads=1,free=4966352,total=16252928
   [junit4]   2> NOTE: All tests run in this JVM: [IndexReplicationClientTest]
   [junit4] Completed [2/9 (1!)] on J0 in 4.23s, 4 tests, 1 error <<< FAILURES!

[...truncated 53 lines...]
BUILD FAILED
C:\Users\jenkins\workspace\Lucene-Solr-6.0-Windows\build.xml:740: The following error occurred
while executing this line:
C:\Users\jenkins\workspace\Lucene-Solr-6.0-Windows\build.xml:684: The following error occurred
while executing this line:
C:\Users\jenkins\workspace\Lucene-Solr-6.0-Windows\build.xml:59: The following error occurred
while executing this line:
C:\Users\jenkins\workspace\Lucene-Solr-6.0-Windows\lucene\build.xml:476: The following error
occurred while executing this line:
C:\Users\jenkins\workspace\Lucene-Solr-6.0-Windows\lucene\common-build.xml:2187: The following
error occurred while executing this line:
C:\Users\jenkins\workspace\Lucene-Solr-6.0-Windows\lucene\module-build.xml:58: The following
error occurred while executing this line:
C:\Users\jenkins\workspace\Lucene-Solr-6.0-Windows\lucene\common-build.xml:1457: The following
error occurred while executing this line:
C:\Users\jenkins\workspace\Lucene-Solr-6.0-Windows\lucene\common-build.xml:1014: There were
test failures: 9 suites, 43 tests, 1 error, 11 ignored (11 assumptions) [seed: B75D1D40F4EA481B]

Total time: 17 minutes 19 seconds
Build step 'Invoke Ant' marked build as failure
Archiving artifacts
[WARNINGS] Skipping publisher since build result is FAILURE
Recording test results
Email was triggered for: Failure - Any
Sending email for trigger: Failure - Any



Mime
View raw message