lucene-dev mailing list archives

Site index · List index
Message view « Date » · « Thread »
Top « Date » · « Thread »
From Policeman Jenkins Server <jenk...@thetaphi.de>
Subject [JENKINS] Lucene-Solr-6.x-Windows (64bit/jdk1.8.0_92) - Build # 199 - Still Failing!
Date Mon, 23 May 2016 11:41:38 GMT
Build: http://jenkins.thetaphi.de/job/Lucene-Solr-6.x-Windows/199/
Java: 64bit/jdk1.8.0_92 -XX:+UseCompressedOops -XX:+UseG1GC

1 tests failed.
FAILED:  org.apache.solr.handler.TestReqParamsAPI.test

Error Message:
Could not get expected value  'CY val' for path 'params/c' full output: {   "responseHeader":{     "status":0,     "QTime":0},   "params":{     "a":"A val",     "b":"B val",     "wt":"json",     "useParams":""},   "context":{     "webapp":"",     "path":"/dump1",     "httpMethod":"GET"}},  from server:  http://127.0.0.1:63650/collection1

Stack Trace:
java.lang.AssertionError: Could not get expected value  'CY val' for path 'params/c' full output: {
  "responseHeader":{
    "status":0,
    "QTime":0},
  "params":{
    "a":"A val",
    "b":"B val",
    "wt":"json",
    "useParams":""},
  "context":{
    "webapp":"",
    "path":"/dump1",
    "httpMethod":"GET"}},  from server:  http://127.0.0.1:63650/collection1
	at __randomizedtesting.SeedInfo.seed([9497902C2497AF8F:1CC3AFF68A6BC277]:0)
	at org.junit.Assert.fail(Assert.java:93)
	at org.junit.Assert.assertTrue(Assert.java:43)
	at org.apache.solr.core.TestSolrConfigHandler.testForResponseElement(TestSolrConfigHandler.java:457)
	at org.apache.solr.handler.TestReqParamsAPI.testReqParams(TestReqParamsAPI.java:172)
	at org.apache.solr.handler.TestReqParamsAPI.test(TestReqParamsAPI.java:62)
	at sun.reflect.NativeMethodAccessorImpl.invoke0(Native Method)
	at sun.reflect.NativeMethodAccessorImpl.invoke(NativeMethodAccessorImpl.java:62)
	at sun.reflect.DelegatingMethodAccessorImpl.invoke(DelegatingMethodAccessorImpl.java:43)
	at java.lang.reflect.Method.invoke(Method.java:498)
	at com.carrotsearch.randomizedtesting.RandomizedRunner.invoke(RandomizedRunner.java:1764)
	at com.carrotsearch.randomizedtesting.RandomizedRunner$8.evaluate(RandomizedRunner.java:871)
	at com.carrotsearch.randomizedtesting.RandomizedRunner$9.evaluate(RandomizedRunner.java:907)
	at com.carrotsearch.randomizedtesting.RandomizedRunner$10.evaluate(RandomizedRunner.java:921)
	at org.apache.solr.BaseDistributedSearchTestCase$ShardsRepeatRule$ShardsFixedStatement.callStatement(BaseDistributedSearchTestCase.java:992)
	at org.apache.solr.BaseDistributedSearchTestCase$ShardsRepeatRule$ShardsStatement.evaluate(BaseDistributedSearchTestCase.java:967)
	at com.carrotsearch.randomizedtesting.rules.SystemPropertiesRestoreRule$1.evaluate(SystemPropertiesRestoreRule.java:57)
	at org.apache.lucene.util.TestRuleSetupTeardownChained$1.evaluate(TestRuleSetupTeardownChained.java:49)
	at org.apache.lucene.util.AbstractBeforeAfterRule$1.evaluate(AbstractBeforeAfterRule.java:45)
	at org.apache.lucene.util.TestRuleThreadAndTestName$1.evaluate(TestRuleThreadAndTestName.java:48)
	at org.apache.lucene.util.TestRuleIgnoreAfterMaxFailures$1.evaluate(TestRuleIgnoreAfterMaxFailures.java:64)
	at org.apache.lucene.util.TestRuleMarkFailure$1.evaluate(TestRuleMarkFailure.java:47)
	at com.carrotsearch.randomizedtesting.rules.StatementAdapter.evaluate(StatementAdapter.java:36)
	at com.carrotsearch.randomizedtesting.ThreadLeakControl$StatementRunner.run(ThreadLeakControl.java:367)
	at com.carrotsearch.randomizedtesting.ThreadLeakControl.forkTimeoutingTask(ThreadLeakControl.java:809)
	at com.carrotsearch.randomizedtesting.ThreadLeakControl$3.evaluate(ThreadLeakControl.java:460)
	at com.carrotsearch.randomizedtesting.RandomizedRunner.runSingleTest(RandomizedRunner.java:880)
	at com.carrotsearch.randomizedtesting.RandomizedRunner$5.evaluate(RandomizedRunner.java:781)
	at com.carrotsearch.randomizedtesting.RandomizedRunner$6.evaluate(RandomizedRunner.java:816)
	at com.carrotsearch.randomizedtesting.RandomizedRunner$7.evaluate(RandomizedRunner.java:827)
	at com.carrotsearch.randomizedtesting.rules.StatementAdapter.evaluate(StatementAdapter.java:36)
	at com.carrotsearch.randomizedtesting.rules.SystemPropertiesRestoreRule$1.evaluate(SystemPropertiesRestoreRule.java:57)
	at org.apache.lucene.util.AbstractBeforeAfterRule$1.evaluate(AbstractBeforeAfterRule.java:45)
	at com.carrotsearch.randomizedtesting.rules.StatementAdapter.evaluate(StatementAdapter.java:36)
	at org.apache.lucene.util.TestRuleStoreClassName$1.evaluate(TestRuleStoreClassName.java:41)
	at com.carrotsearch.randomizedtesting.rules.NoShadowingOrOverridesOnMethodsRule$1.evaluate(NoShadowingOrOverridesOnMethodsRule.java:40)
	at com.carrotsearch.randomizedtesting.rules.NoShadowingOrOverridesOnMethodsRule$1.evaluate(NoShadowingOrOverridesOnMethodsRule.java:40)
	at com.carrotsearch.randomizedtesting.rules.StatementAdapter.evaluate(StatementAdapter.java:36)
	at com.carrotsearch.randomizedtesting.rules.StatementAdapter.evaluate(StatementAdapter.java:36)
	at com.carrotsearch.randomizedtesting.rules.StatementAdapter.evaluate(StatementAdapter.java:36)
	at org.apache.lucene.util.TestRuleAssertionsRequired$1.evaluate(TestRuleAssertionsRequired.java:53)
	at org.apache.lucene.util.TestRuleMarkFailure$1.evaluate(TestRuleMarkFailure.java:47)
	at org.apache.lucene.util.TestRuleIgnoreAfterMaxFailures$1.evaluate(TestRuleIgnoreAfterMaxFailures.java:64)
	at org.apache.lucene.util.TestRuleIgnoreTestSuites$1.evaluate(TestRuleIgnoreTestSuites.java:54)
	at com.carrotsearch.randomizedtesting.rules.StatementAdapter.evaluate(StatementAdapter.java:36)
	at com.carrotsearch.randomizedtesting.ThreadLeakControl$StatementRunner.run(ThreadLeakControl.java:367)
	at java.lang.Thread.run(Thread.java:745)




Build Log:
[...truncated 12134 lines...]
   [junit4] Suite: org.apache.solr.handler.TestReqParamsAPI
   [junit4]   2> Creating dataDir: C:\Users\jenkins\workspace\Lucene-Solr-6.x-Windows\solr\build\solr-core\test\J1\temp\solr.handler.TestReqParamsAPI_9497902C2497AF8F-001\init-core-data-001
   [junit4]   2> 3018761 INFO  (SUITE-TestReqParamsAPI-seed#[9497902C2497AF8F]-worker) [    ] o.a.s.SolrTestCaseJ4 Randomized ssl (false) and clientAuth (false)
   [junit4]   2> 3018769 INFO  (SUITE-TestReqParamsAPI-seed#[9497902C2497AF8F]-worker) [    ] o.a.s.BaseDistributedSearchTestCase Setting hostContext system property: /
   [junit4]   2> 3018772 INFO  (TEST-TestReqParamsAPI.test-seed#[9497902C2497AF8F]) [    ] o.a.s.c.ZkTestServer STARTING ZK TEST SERVER
   [junit4]   2> 3018773 INFO  (Thread-7298) [    ] o.a.s.c.ZkTestServer client port:0.0.0.0/0.0.0.0:0
   [junit4]   2> 3018773 INFO  (Thread-7298) [    ] o.a.s.c.ZkTestServer Starting server
   [junit4]   2> 3018873 INFO  (TEST-TestReqParamsAPI.test-seed#[9497902C2497AF8F]) [    ] o.a.s.c.ZkTestServer start zk server on port:63584
   [junit4]   2> 3018873 INFO  (TEST-TestReqParamsAPI.test-seed#[9497902C2497AF8F]) [    ] o.a.s.c.c.SolrZkClient Using default ZkCredentialsProvider
   [junit4]   2> 3018874 INFO  (TEST-TestReqParamsAPI.test-seed#[9497902C2497AF8F]) [    ] o.a.s.c.c.ConnectionManager Waiting for client to connect to ZooKeeper
   [junit4]   2> 3018890 INFO  (zkCallback-3850-thread-1) [    ] o.a.s.c.c.ConnectionManager Watcher org.apache.solr.common.cloud.ConnectionManager@50fd304e name:ZooKeeperConnection Watcher:127.0.0.1:63584 got event WatchedEvent state:SyncConnected type:None path:null path:null type:None
   [junit4]   2> 3018890 INFO  (TEST-TestReqParamsAPI.test-seed#[9497902C2497AF8F]) [    ] o.a.s.c.c.ConnectionManager Client is connected to ZooKeeper
   [junit4]   2> 3018891 INFO  (TEST-TestReqParamsAPI.test-seed#[9497902C2497AF8F]) [    ] o.a.s.c.c.SolrZkClient Using default ZkACLProvider
   [junit4]   2> 3018891 INFO  (TEST-TestReqParamsAPI.test-seed#[9497902C2497AF8F]) [    ] o.a.s.c.c.SolrZkClient makePath: /solr
   [junit4]   2> 3018896 WARN  (NIOServerCxn.Factory:0.0.0.0/0.0.0.0:0) [    ] o.a.z.s.NIOServerCnxn caught end of stream exception
   [junit4]   2> EndOfStreamException: Unable to read additional data from client sessionid 0x154dd67d2ca0000, likely client has closed socket
   [junit4]   2> 	at org.apache.zookeeper.server.NIOServerCnxn.doIO(NIOServerCnxn.java:228)
   [junit4]   2> 	at org.apache.zookeeper.server.NIOServerCnxnFactory.run(NIOServerCnxnFactory.java:208)
   [junit4]   2> 	at java.lang.Thread.run(Thread.java:745)
   [junit4]   2> 3018896 INFO  (TEST-TestReqParamsAPI.test-seed#[9497902C2497AF8F]) [    ] o.a.s.c.c.SolrZkClient Using default ZkCredentialsProvider
   [junit4]   2> 3018901 INFO  (TEST-TestReqParamsAPI.test-seed#[9497902C2497AF8F]) [    ] o.a.s.c.c.ConnectionManager Waiting for client to connect to ZooKeeper
   [junit4]   2> 3018904 INFO  (zkCallback-3851-thread-1) [    ] o.a.s.c.c.ConnectionManager Watcher org.apache.solr.common.cloud.ConnectionManager@6366129a name:ZooKeeperConnection Watcher:127.0.0.1:63584/solr got event WatchedEvent state:SyncConnected type:None path:null path:null type:None
   [junit4]   2> 3018904 INFO  (TEST-TestReqParamsAPI.test-seed#[9497902C2497AF8F]) [    ] o.a.s.c.c.ConnectionManager Client is connected to ZooKeeper
   [junit4]   2> 3018905 INFO  (TEST-TestReqParamsAPI.test-seed#[9497902C2497AF8F]) [    ] o.a.s.c.c.SolrZkClient Using default ZkACLProvider
   [junit4]   2> 3018905 INFO  (TEST-TestReqParamsAPI.test-seed#[9497902C2497AF8F]) [    ] o.a.s.c.c.SolrZkClient makePath: /collections/collection1
   [junit4]   2> 3018908 INFO  (TEST-TestReqParamsAPI.test-seed#[9497902C2497AF8F]) [    ] o.a.s.c.c.SolrZkClient makePath: /collections/collection1/shards
   [junit4]   2> 3018911 INFO  (TEST-TestReqParamsAPI.test-seed#[9497902C2497AF8F]) [    ] o.a.s.c.c.SolrZkClient makePath: /collections/control_collection
   [junit4]   2> 3018914 INFO  (TEST-TestReqParamsAPI.test-seed#[9497902C2497AF8F]) [    ] o.a.s.c.c.SolrZkClient makePath: /collections/control_collection/shards
   [junit4]   2> 3018917 INFO  (TEST-TestReqParamsAPI.test-seed#[9497902C2497AF8F]) [    ] o.a.s.c.AbstractZkTestCase put C:\Users\jenkins\workspace\Lucene-Solr-6.x-Windows\solr\core\src\test-files\solr\collection1\conf\solrconfig-tlog.xml to /configs/conf1/solrconfig.xml
   [junit4]   2> 3018917 INFO  (TEST-TestReqParamsAPI.test-seed#[9497902C2497AF8F]) [    ] o.a.s.c.c.SolrZkClient makePath: /configs/conf1/solrconfig.xml
   [junit4]   2> 3018922 INFO  (TEST-TestReqParamsAPI.test-seed#[9497902C2497AF8F]) [    ] o.a.s.c.AbstractZkTestCase put C:\Users\jenkins\workspace\Lucene-Solr-6.x-Windows\solr\core\src\test-files\solr\collection1\conf\schema.xml to /configs/conf1/schema.xml
   [junit4]   2> 3018922 INFO  (TEST-TestReqParamsAPI.test-seed#[9497902C2497AF8F]) [    ] o.a.s.c.c.SolrZkClient makePath: /configs/conf1/schema.xml
   [junit4]   2> 3018926 INFO  (TEST-TestReqParamsAPI.test-seed#[9497902C2497AF8F]) [    ] o.a.s.c.AbstractZkTestCase put C:\Users\jenkins\workspace\Lucene-Solr-6.x-Windows\solr\core\src\test-files\solr\collection1\conf\solrconfig.snippet.randomindexconfig.xml to /configs/conf1/solrconfig.snippet.randomindexconfig.xml
   [junit4]   2> 3018926 INFO  (TEST-TestReqParamsAPI.test-seed#[9497902C2497AF8F]) [    ] o.a.s.c.c.SolrZkClient makePath: /configs/conf1/solrconfig.snippet.randomindexconfig.xml
   [junit4]   2> 3018929 INFO  (TEST-TestReqParamsAPI.test-seed#[9497902C2497AF8F]) [    ] o.a.s.c.AbstractZkTestCase put C:\Users\jenkins\workspace\Lucene-Solr-6.x-Windows\solr\core\src\test-files\solr\collection1\conf\stopwords.txt to /configs/conf1/stopwords.txt
   [junit4]   2> 3018930 INFO  (TEST-TestReqParamsAPI.test-seed#[9497902C2497AF8F]) [    ] o.a.s.c.c.SolrZkClient makePath: /configs/conf1/stopwords.txt
   [junit4]   2> 3018933 INFO  (TEST-TestReqParamsAPI.test-seed#[9497902C2497AF8F]) [    ] o.a.s.c.AbstractZkTestCase put C:\Users\jenkins\workspace\Lucene-Solr-6.x-Windows\solr\core\src\test-files\solr\collection1\conf\protwords.txt to /configs/conf1/protwords.txt
   [junit4]   2> 3018933 INFO  (TEST-TestReqParamsAPI.test-seed#[9497902C2497AF8F]) [    ] o.a.s.c.c.SolrZkClient makePath: /configs/conf1/protwords.txt
   [junit4]   2> 3018936 INFO  (TEST-TestReqParamsAPI.test-seed#[9497902C2497AF8F]) [    ] o.a.s.c.AbstractZkTestCase put C:\Users\jenkins\workspace\Lucene-Solr-6.x-Windows\solr\core\src\test-files\solr\collection1\conf\currency.xml to /configs/conf1/currency.xml
   [junit4]   2> 3018936 INFO  (TEST-TestReqParamsAPI.test-seed#[9497902C2497AF8F]) [    ] o.a.s.c.c.SolrZkClient makePath: /configs/conf1/currency.xml
   [junit4]   2> 3018939 INFO  (TEST-TestReqParamsAPI.test-seed#[9497902C2497AF8F]) [    ] o.a.s.c.AbstractZkTestCase put C:\Users\jenkins\workspace\Lucene-Solr-6.x-Windows\solr\core\src\test-files\solr\collection1\conf\enumsConfig.xml to /configs/conf1/enumsConfig.xml
   [junit4]   2> 3018940 INFO  (TEST-TestReqParamsAPI.test-seed#[9497902C2497AF8F]) [    ] o.a.s.c.c.SolrZkClient makePath: /configs/conf1/enumsConfig.xml
   [junit4]   2> 3018943 INFO  (TEST-TestReqParamsAPI.test-seed#[9497902C2497AF8F]) [    ] o.a.s.c.AbstractZkTestCase put C:\Users\jenkins\workspace\Lucene-Solr-6.x-Windows\solr\core\src\test-files\solr\collection1\conf\open-exchange-rates.json to /configs/conf1/open-exchange-rates.json
   [junit4]   2> 3018943 INFO  (TEST-TestReqParamsAPI.test-seed#[9497902C2497AF8F]) [    ] o.a.s.c.c.SolrZkClient makePath: /configs/conf1/open-exchange-rates.json
   [junit4]   2> 3018946 INFO  (TEST-TestReqParamsAPI.test-seed#[9497902C2497AF8F]) [    ] o.a.s.c.AbstractZkTestCase put C:\Users\jenkins\workspace\Lucene-Solr-6.x-Windows\solr\core\src\test-files\solr\collection1\conf\mapping-ISOLatin1Accent.txt to /configs/conf1/mapping-ISOLatin1Accent.txt
   [junit4]   2> 3018946 INFO  (TEST-TestReqParamsAPI.test-seed#[9497902C2497AF8F]) [    ] o.a.s.c.c.SolrZkClient makePath: /configs/conf1/mapping-ISOLatin1Accent.txt
   [junit4]   2> 3018949 INFO  (TEST-TestReqParamsAPI.test-seed#[9497902C2497AF8F]) [    ] o.a.s.c.AbstractZkTestCase put C:\Users\jenkins\workspace\Lucene-Solr-6.x-Windows\solr\core\src\test-files\solr\collection1\conf\old_synonyms.txt to /configs/conf1/old_synonyms.txt
   [junit4]   2> 3018949 INFO  (TEST-TestReqParamsAPI.test-seed#[9497902C2497AF8F]) [    ] o.a.s.c.c.SolrZkClient makePath: /configs/conf1/old_synonyms.txt
   [junit4]   2> 3018953 INFO  (TEST-TestReqParamsAPI.test-seed#[9497902C2497AF8F]) [    ] o.a.s.c.AbstractZkTestCase put C:\Users\jenkins\workspace\Lucene-Solr-6.x-Windows\solr\core\src\test-files\solr\collection1\conf\synonyms.txt to /configs/conf1/synonyms.txt
   [junit4]   2> 3018953 INFO  (TEST-TestReqParamsAPI.test-seed#[9497902C2497AF8F]) [    ] o.a.s.c.c.SolrZkClient makePath: /configs/conf1/synonyms.txt
   [junit4]   2> 3018956 WARN  (NIOServerCxn.Factory:0.0.0.0/0.0.0.0:0) [    ] o.a.z.s.NIOServerCnxn caught end of stream exception
   [junit4]   2> EndOfStreamException: Unable to read additional data from client sessionid 0x154dd67d2ca0001, likely client has closed socket
   [junit4]   2> 	at org.apache.zookeeper.server.NIOServerCnxn.doIO(NIOServerCnxn.java:228)
   [junit4]   2> 	at org.apache.zookeeper.server.NIOServerCnxnFactory.run(NIOServerCnxnFactory.java:208)
   [junit4]   2> 	at java.lang.Thread.run(Thread.java:745)
   [junit4]   2> 3019484 INFO  (TEST-TestReqParamsAPI.test-seed#[9497902C2497AF8F]) [    ] o.a.s.SolrTestCaseJ4 Writing core.properties file to C:\Users\jenkins\workspace\Lucene-Solr-6.x-Windows\solr\build\solr-core\test\J1\temp\solr.handler.TestReqParamsAPI_9497902C2497AF8F-001\control-001\cores\collection1
   [junit4]   2> 3019488 INFO  (TEST-TestReqParamsAPI.test-seed#[9497902C2497AF8F]) [    ] o.e.j.s.Server jetty-9.3.8.v20160314
   [junit4]   2> 3019489 INFO  (TEST-TestReqParamsAPI.test-seed#[9497902C2497AF8F]) [    ] o.e.j.s.h.ContextHandler Started o.e.j.s.ServletContextHandler@525ece61{/,null,AVAILABLE}
   [junit4]   2> 3019490 INFO  (TEST-TestReqParamsAPI.test-seed#[9497902C2497AF8F]) [    ] o.e.j.s.ServerConnector Started ServerConnector@485bfb64{HTTP/1.1,[http/1.1]}{127.0.0.1:63591}
   [junit4]   2> 3019490 INFO  (TEST-TestReqParamsAPI.test-seed#[9497902C2497AF8F]) [    ] o.e.j.s.Server Started @3026459ms
   [junit4]   2> 3019490 INFO  (TEST-TestReqParamsAPI.test-seed#[9497902C2497AF8F]) [    ] o.a.s.c.s.e.JettySolrRunner Jetty properties: {solr.data.dir=C:\Users\jenkins\workspace\Lucene-Solr-6.x-Windows\solr\build\solr-core\test\J1\temp\solr.handler.TestReqParamsAPI_9497902C2497AF8F-001\tempDir-001/control/data, hostContext=/, hostPort=63591, coreRootDirectory=C:\Users\jenkins\workspace\Lucene-Solr-6.x-Windows\solr\build\solr-core\test\J1\..\..\..\..\..\..\..\..\..\Users\jenkins\workspace\Lucene-Solr-6.x-Windows\solr\build\solr-core\test\J1\temp\solr.handler.TestReqParamsAPI_9497902C2497AF8F-001\control-001\cores}
   [junit4]   2> 3019493 INFO  (TEST-TestReqParamsAPI.test-seed#[9497902C2497AF8F]) [    ] o.a.s.s.SolrDispatchFilter SolrDispatchFilter.init(): sun.misc.Launcher$AppClassLoader@73d16e93
   [junit4]   2> 3019493 INFO  (TEST-TestReqParamsAPI.test-seed#[9497902C2497AF8F]) [    ] o.a.s.c.SolrResourceLoader new SolrResourceLoader for directory: 'C:\Users\jenkins\workspace\Lucene-Solr-6.x-Windows\solr\build\solr-core\test\J1\temp\solr.handler.TestReqParamsAPI_9497902C2497AF8F-001\control-001'
   [junit4]   2> 3019493 INFO  (TEST-TestReqParamsAPI.test-seed#[9497902C2497AF8F]) [    ] o.a.s.c.SolrResourceLoader JNDI not configured for solr (NoInitialContextEx)
   [junit4]   2> 3019493 INFO  (TEST-TestReqParamsAPI.test-seed#[9497902C2497AF8F]) [    ] o.a.s.c.SolrResourceLoader solr home defaulted to 'solr/' (could not find system property or JNDI)
   [junit4]   2> 3019495 INFO  (TEST-TestReqParamsAPI.test-seed#[9497902C2497AF8F]) [    ] o.a.s.c.c.SolrZkClient Using default ZkCredentialsProvider
   [junit4]   2> 3019496 INFO  (TEST-TestReqParamsAPI.test-seed#[9497902C2497AF8F]) [    ] o.a.s.c.c.ConnectionManager Waiting for client to connect to ZooKeeper
   [junit4]   2> 3019498 INFO  (zkCallback-3852-thread-1) [    ] o.a.s.c.c.ConnectionManager Watcher org.apache.solr.common.cloud.ConnectionManager@426da23b name:ZooKeeperConnection Watcher:127.0.0.1:63584/solr got event WatchedEvent state:SyncConnected type:None path:null path:null type:None
   [junit4]   2> 3019498 INFO  (TEST-TestReqParamsAPI.test-seed#[9497902C2497AF8F]) [    ] o.a.s.c.c.ConnectionManager Client is connected to ZooKeeper
   [junit4]   2> 3019498 INFO  (TEST-TestReqParamsAPI.test-seed#[9497902C2497AF8F]) [    ] o.a.s.c.c.SolrZkClient Using default ZkACLProvider
   [junit4]   2> 3019500 INFO  (TEST-TestReqParamsAPI.test-seed#[9497902C2497AF8F]) [    ] o.a.s.s.SolrDispatchFilter Loading solr.xml from SolrHome (not found in ZooKeeper)
   [junit4]   2> 3019500 INFO  (TEST-TestReqParamsAPI.test-seed#[9497902C2497AF8F]) [    ] o.a.s.c.SolrXmlConfig Loading container configuration from C:\Users\jenkins\workspace\Lucene-Solr-6.x-Windows\solr\build\solr-core\test\J1\temp\solr.handler.TestReqParamsAPI_9497902C2497AF8F-001\control-001\solr.xml
   [junit4]   2> 3019515 INFO  (TEST-TestReqParamsAPI.test-seed#[9497902C2497AF8F]) [    ] o.a.s.c.CorePropertiesLocator Config-defined core root directory: C:\Users\jenkins\workspace\Lucene-Solr-6.x-Windows\solr\build\solr-core\test\J1\..\..\..\..\..\..\..\..\..\Users\jenkins\workspace\Lucene-Solr-6.x-Windows\solr\build\solr-core\test\J1\temp\solr.handler.TestReqParamsAPI_9497902C2497AF8F-001\control-001\cores
   [junit4]   2> 3019515 INFO  (TEST-TestReqParamsAPI.test-seed#[9497902C2497AF8F]) [    ] o.a.s.c.CoreContainer New CoreContainer 1441299554
   [junit4]   2> 3019515 INFO  (TEST-TestReqParamsAPI.test-seed#[9497902C2497AF8F]) [    ] o.a.s.c.CoreContainer Loading cores into CoreContainer [instanceDir=C:\Users\jenkins\workspace\Lucene-Solr-6.x-Windows\solr\build\solr-core\test\J1\temp\solr.handler.TestReqParamsAPI_9497902C2497AF8F-001\control-001]
   [junit4]   2> 3019515 WARN  (TEST-TestReqParamsAPI.test-seed#[9497902C2497AF8F]) [    ] o.a.s.c.CoreContainer Couldn't add files from C:\Users\jenkins\workspace\Lucene-Solr-6.x-Windows\solr\build\solr-core\test\J1\temp\solr.handler.TestReqParamsAPI_9497902C2497AF8F-001\control-001\lib to classpath: C:\Users\jenkins\workspace\Lucene-Solr-6.x-Windows\solr\build\solr-core\test\J1\temp\solr.handler.TestReqParamsAPI_9497902C2497AF8F-001\control-001\lib
   [junit4]   2> 3019516 INFO  (TEST-TestReqParamsAPI.test-seed#[9497902C2497AF8F]) [    ] o.a.s.h.c.HttpShardHandlerFactory created with socketTimeout : 90000,urlScheme : ,connTimeout : 15000,maxConnectionsPerHost : 20,maxConnections : 10000,corePoolSize : 0,maximumPoolSize : 2147483647,maxThreadIdleTime : 5,sizeOfQueue : -1,fairnessPolicy : false,useRetries : false,
   [junit4]   2> 3019519 INFO  (TEST-TestReqParamsAPI.test-seed#[9497902C2497AF8F]) [    ] o.a.s.u.UpdateShardHandler Creating UpdateShardHandler HTTP client with params: socketTimeout=340000&connTimeout=45000&retry=true
   [junit4]   2> 3019520 INFO  (TEST-TestReqParamsAPI.test-seed#[9497902C2497AF8F]) [    ] o.a.s.l.LogWatcher SLF4J impl is org.slf4j.impl.Log4jLoggerFactory
   [junit4]   2> 3019520 INFO  (TEST-TestReqParamsAPI.test-seed#[9497902C2497AF8F]) [    ] o.a.s.l.LogWatcher Registering Log Listener [Log4j (org.slf4j.impl.Log4jLoggerFactory)]
   [junit4]   2> 3019520 INFO  (TEST-TestReqParamsAPI.test-seed#[9497902C2497AF8F]) [    ] o.a.s.c.ZkContainer Zookeeper client=127.0.0.1:63584/solr
   [junit4]   2> 3019520 INFO  (TEST-TestReqParamsAPI.test-seed#[9497902C2497AF8F]) [    ] o.a.s.c.ZkController zkHost includes chroot
   [junit4]   2> 3019520 INFO  (TEST-TestReqParamsAPI.test-seed#[9497902C2497AF8F]) [    ] o.a.s.c.c.SolrZkClient Using default ZkCredentialsProvider
   [junit4]   2> 3019521 INFO  (TEST-TestReqParamsAPI.test-seed#[9497902C2497AF8F]) [    ] o.a.s.c.c.ConnectionManager Waiting for client to connect to ZooKeeper
   [junit4]   2> 3019523 INFO  (zkCallback-3855-thread-1) [    ] o.a.s.c.c.ConnectionManager Watcher org.apache.solr.common.cloud.ConnectionManager@3c3e4ac5 name:ZooKeeperConnection Watcher:127.0.0.1:63584 got event WatchedEvent state:SyncConnected type:None path:null path:null type:None
   [junit4]   2> 3019523 INFO  (TEST-TestReqParamsAPI.test-seed#[9497902C2497AF8F]) [    ] o.a.s.c.c.ConnectionManager Client is connected to ZooKeeper
   [junit4]   2> 3019523 INFO  (TEST-TestReqParamsAPI.test-seed#[9497902C2497AF8F]) [    ] o.a.s.c.c.SolrZkClient Using default ZkACLProvider
   [junit4]   2> 3019525 WARN  (NIOServerCxn.Factory:0.0.0.0/0.0.0.0:0) [    ] o.a.z.s.NIOServerCnxn caught end of stream exception
   [junit4]   2> EndOfStreamException: Unable to read additional data from client sessionid 0x154dd67d2ca0003, likely client has closed socket
   [junit4]   2> 	at org.apache.zookeeper.server.NIOServerCnxn.doIO(NIOServerCnxn.java:228)
   [junit4]   2> 	at org.apache.zookeeper.server.NIOServerCnxnFactory.run(NIOServerCnxnFactory.java:208)
   [junit4]   2> 	at java.lang.Thread.run(Thread.java:745)
   [junit4]   2> 3019525 INFO  (TEST-TestReqParamsAPI.test-seed#[9497902C2497AF8F]) [n:127.0.0.1:63591_    ] o.a.s.c.ZkController Added new OnReconnect listener org.apache.solr.cloud.ZkController$$Lambda$10/1022744557@149e88b4
   [junit4]   2> 3019527 INFO  (TEST-TestReqParamsAPI.test-seed#[9497902C2497AF8F]) [n:127.0.0.1:63591_    ] o.a.s.c.c.ConnectionManager Waiting for client to connect to ZooKeeper
   [junit4]   2> 3019529 INFO  (zkCallback-3856-thread-1-processing-n:127.0.0.1:63591_) [n:127.0.0.1:63591_    ] o.a.s.c.c.ConnectionManager Watcher org.apache.solr.common.cloud.ConnectionManager@53a8a1e9 name:ZooKeeperConnection Watcher:127.0.0.1:63584/solr got event WatchedEvent state:SyncConnected type:None path:null path:null type:None
   [junit4]   2> 3019529 INFO  (TEST-TestReqParamsAPI.test-seed#[9497902C2497AF8F]) [n:127.0.0.1:63591_    ] o.a.s.c.c.ConnectionManager Client is connected to ZooKeeper
   [junit4]   2> 3019530 INFO  (TEST-TestReqParamsAPI.test-seed#[9497902C2497AF8F]) [n:127.0.0.1:63591_    ] o.a.s.c.c.SolrZkClient makePath: /overseer/queue
   [junit4]   2> 3019533 INFO  (TEST-TestReqParamsAPI.test-seed#[9497902C2497AF8F]) [n:127.0.0.1:63591_    ] o.a.s.c.c.SolrZkClient makePath: /overseer/collection-queue-work
   [junit4]   2> 3019538 INFO  (TEST-TestReqParamsAPI.test-seed#[9497902C2497AF8F]) [n:127.0.0.1:63591_    ] o.a.s.c.c.SolrZkClient makePath: /overseer/collection-map-running
   [junit4]   2> 3019540 INFO  (TEST-TestReqParamsAPI.test-seed#[9497902C2497AF8F]) [n:127.0.0.1:63591_    ] o.a.s.c.c.SolrZkClient makePath: /overseer/collection-map-completed
   [junit4]   2> 3019544 INFO  (TEST-TestReqParamsAPI.test-seed#[9497902C2497AF8F]) [n:127.0.0.1:63591_    ] o.a.s.c.c.SolrZkClient makePath: /overseer/collection-map-failure
   [junit4]   2> 3019546 INFO  (TEST-TestReqParamsAPI.test-seed#[9497902C2497AF8F]) [n:127.0.0.1:63591_    ] o.a.s.c.c.SolrZkClient makePath: /live_nodes
   [junit4]   2> 3019549 INFO  (TEST-TestReqParamsAPI.test-seed#[9497902C2497AF8F]) [n:127.0.0.1:63591_    ] o.a.s.c.c.SolrZkClient makePath: /aliases.json
   [junit4]   2> 3019551 INFO  (TEST-TestReqParamsAPI.test-seed#[9497902C2497AF8F]) [n:127.0.0.1:63591_    ] o.a.s.c.c.SolrZkClient makePath: /clusterstate.json
   [junit4]   2> 3019553 INFO  (TEST-TestReqParamsAPI.test-seed#[9497902C2497AF8F]) [n:127.0.0.1:63591_    ] o.a.s.c.c.SolrZkClient makePath: /security.json
   [junit4]   2> 3019554 INFO  (TEST-TestReqParamsAPI.test-seed#[9497902C2497AF8F]) [n:127.0.0.1:63591_    ] o.a.s.c.c.ZkStateReader Updating cluster state from ZooKeeper... 
   [junit4]   2> 3019555 INFO  (TEST-TestReqParamsAPI.test-seed#[9497902C2497AF8F]) [n:127.0.0.1:63591_    ] o.a.s.c.c.ZkStateReader Loaded empty cluster properties
   [junit4]   2> 3019556 INFO  (TEST-TestReqParamsAPI.test-seed#[9497902C2497AF8F]) [n:127.0.0.1:63591_    ] o.a.s.c.c.ZkStateReader Updated live nodes from ZooKeeper... (0) -> (0)
   [junit4]   2> 3019559 INFO  (TEST-TestReqParamsAPI.test-seed#[9497902C2497AF8F]) [n:127.0.0.1:63591_    ] o.a.s.c.c.SolrZkClient makePath: /overseer_elect
   [junit4]   2> 3019561 INFO  (TEST-TestReqParamsAPI.test-seed#[9497902C2497AF8F]) [n:127.0.0.1:63591_    ] o.a.s.c.c.SolrZkClient makePath: /overseer_elect/election
   [junit4]   2> 3019564 INFO  (TEST-TestReqParamsAPI.test-seed#[9497902C2497AF8F]) [n:127.0.0.1:63591_    ] o.a.s.c.Overseer Overseer (id=null) closing
   [junit4]   2> 3019565 INFO  (TEST-TestReqParamsAPI.test-seed#[9497902C2497AF8F]) [n:127.0.0.1:63591_    ] o.a.s.c.LeaderElector Joined leadership election with path: /overseer_elect/election/95944930069446660-127.0.0.1:63591_-n_0000000000
   [junit4]   2> 3019565 INFO  (TEST-TestReqParamsAPI.test-seed#[9497902C2497AF8F]) [n:127.0.0.1:63591_    ] o.a.s.c.OverseerElectionContext I am going to be the leader 127.0.0.1:63591_
   [junit4]   2> 3019565 INFO  (TEST-TestReqParamsAPI.test-seed#[9497902C2497AF8F]) [n:127.0.0.1:63591_    ] o.a.s.c.c.SolrZkClient makePath: /overseer_elect/leader
   [junit4]   2> 3019566 INFO  (TEST-TestReqParamsAPI.test-seed#[9497902C2497AF8F]) [n:127.0.0.1:63591_    ] o.a.s.c.Overseer Overseer (id=95944930069446660-127.0.0.1:63591_-n_0000000000) starting
   [junit4]   2> 3019569 INFO  (TEST-TestReqParamsAPI.test-seed#[9497902C2497AF8F]) [n:127.0.0.1:63591_    ] o.a.s.c.c.SolrZkClient makePath: /overseer/queue-work
   [junit4]   2> 3019579 INFO  (TEST-TestReqParamsAPI.test-seed#[9497902C2497AF8F]) [n:127.0.0.1:63591_    ] o.a.s.c.OverseerAutoReplicaFailoverThread Starting OverseerAutoReplicaFailoverThread autoReplicaFailoverWorkLoopDelay=10000 autoReplicaFailoverWaitAfterExpiration=30000 autoReplicaFailoverBadNodeExpiration=60000
   [junit4]   2> 3019580 INFO  (TEST-TestReqParamsAPI.test-seed#[9497902C2497AF8F]) [n:127.0.0.1:63591_    ] o.a.s.c.ZkController Register node as live in ZooKeeper:/live_nodes/127.0.0.1:63591_
   [junit4]   2> 3019580 INFO  (OverseerCollectionConfigSetProcessor-95944930069446660-127.0.0.1:63591_-n_0000000000) [n:127.0.0.1:63591_    ] o.a.s.c.OverseerTaskProcessor Process current queue of overseer operations
   [junit4]   2> 3019580 INFO  (OverseerStateUpdate-95944930069446660-127.0.0.1:63591_-n_0000000000) [n:127.0.0.1:63591_    ] o.a.s.c.Overseer Starting to work on the main queue
   [junit4]   2> 3019581 INFO  (TEST-TestReqParamsAPI.test-seed#[9497902C2497AF8F]) [n:127.0.0.1:63591_    ] o.a.s.c.c.SolrZkClient makePath: /live_nodes/127.0.0.1:63591_
   [junit4]   2> 3019583 INFO  (zkCallback-3856-thread-1-processing-n:127.0.0.1:63591_) [n:127.0.0.1:63591_    ] o.a.s.c.c.ZkStateReader A live node change: [WatchedEvent state:SyncConnected type:NodeChildrenChanged path:/live_nodes], has occurred - updating... (live nodes size: [0])
   [junit4]   2> 3019583 INFO  (OverseerStateUpdate-95944930069446660-127.0.0.1:63591_-n_0000000000) [n:127.0.0.1:63591_    ] o.a.s.c.c.ZkStateReader Updated live nodes from ZooKeeper... (0) -> (1)
   [junit4]   2> 3019584 INFO  (zkCallback-3856-thread-1-processing-n:127.0.0.1:63591_) [n:127.0.0.1:63591_    ] o.a.s.c.c.ZkStateReader Updated live nodes from ZooKeeper... (1) -> (1)
   [junit4]   2> 3019596 INFO  (TEST-TestReqParamsAPI.test-seed#[9497902C2497AF8F]) [n:127.0.0.1:63591_    ] o.a.s.c.CoreContainer Security conf doesn't exist. Skipping setup for authorization module.
   [junit4]   2> 3019596 INFO  (TEST-TestReqParamsAPI.test-seed#[9497902C2497AF8F]) [n:127.0.0.1:63591_    ] o.a.s.c.CoreContainer No authentication plugin used.
   [junit4]   2> 3019598 INFO  (TEST-TestReqParamsAPI.test-seed#[9497902C2497AF8F]) [n:127.0.0.1:63591_    ] o.a.s.c.CorePropertiesLocator Looking for core definitions underneath C:\Users\jenkins\workspace\Lucene-Solr-6.x-Windows\solr\build\solr-core\test\J1\..\..\..\..\..\..\..\..\..\Users\jenkins\workspace\Lucene-Solr-6.x-Windows\solr\build\solr-core\test\J1\temp\solr.handler.TestReqParamsAPI_9497902C2497AF8F-001\control-001\cores
   [junit4]   2> 3019603 INFO  (TEST-TestReqParamsAPI.test-seed#[9497902C2497AF8F]) [n:127.0.0.1:63591_    ] o.a.s.c.CoreDescriptor Created CoreDescriptor: {name=collection1, config=solrconfig.xml, transient=false, schema=schema.xml, loadOnStartup=true, configSetProperties=configsetprops.json, collection=control_collection, coreNodeName=, dataDir=data\, shard=}
   [junit4]   2> 3019603 INFO  (TEST-TestReqParamsAPI.test-seed#[9497902C2497AF8F]) [n:127.0.0.1:63591_    ] o.a.s.c.CorePropertiesLocator Found core collection1 in C:\Users\jenkins\workspace\Lucene-Solr-6.x-Windows\solr\build\solr-core\test\J1\..\..\..\..\..\..\..\..\..\Users\jenkins\workspace\Lucene-Solr-6.x-Windows\solr\build\solr-core\test\J1\temp\solr.handler.TestReqParamsAPI_9497902C2497AF8F-001\control-001\cores\collection1
   [junit4]   2> 3019603 INFO  (TEST-TestReqParamsAPI.test-seed#[9497902C2497AF8F]) [n:127.0.0.1:63591_    ] o.a.s.c.CorePropertiesLocator Found 1 core definitions
   [junit4]   2> 3019604 INFO  (TEST-TestReqParamsAPI.test-seed#[9497902C2497AF8F]) [n:127.0.0.1:63591_    ] o.a.s.s.SolrDispatchFilter user.dir=C:\Users\jenkins\workspace\Lucene-Solr-6.x-Windows\solr\build\solr-core\test\J1
   [junit4]   2> 3019604 INFO  (TEST-TestReqParamsAPI.test-seed#[9497902C2497AF8F]) [n:127.0.0.1:63591_    ] o.a.s.s.SolrDispatchFilter SolrDispatchFilter.init() done
   [junit4]   2> 3019605 INFO  (coreLoadExecutor-9693-thread-1-processing-n:127.0.0.1:63591_) [n:127.0.0.1:63591_ c:control_collection   x:collection1] o.a.s.c.ZkController publishing state=down
   [junit4]   2> 3019605 INFO  (coreLoadExecutor-9693-thread-1-processing-n:127.0.0.1:63591_) [n:127.0.0.1:63591_ c:control_collection   x:collection1] o.a.s.c.ZkController numShards not found on descriptor - reading it from system property
   [junit4]   2> 3019606 INFO  (coreLoadExecutor-9693-thread-1-processing-n:127.0.0.1:63591_) [n:127.0.0.1:63591_ c:control_collection   x:collection1] o.a.s.c.ZkController Collection control_collection not visible yet, but flagging it so a watch is registered when it becomes visible
   [junit4]   2> 3019607 INFO  (OverseerStateUpdate-95944930069446660-127.0.0.1:63591_-n_0000000000) [n:127.0.0.1:63591_    ] o.a.s.c.Overseer processMessage: queueSize: 1, message = {
   [junit4]   2>   "core":"collection1",
   [junit4]   2>   "roles":null,
   [junit4]   2>   "base_url":"http://127.0.0.1:63591",
   [junit4]   2>   "node_name":"127.0.0.1:63591_",
   [junit4]   2>   "numShards":"1",
   [junit4]   2>   "state":"down",
   [junit4]   2>   "shard":null,
   [junit4]   2>   "collection":"control_collection",
   [junit4]   2>   "operation":"state"} current state version: 0
   [junit4]   2> 3019607 INFO  (coreLoadExecutor-9693-thread-1-processing-n:127.0.0.1:63591_) [n:127.0.0.1:63591_ c:control_collection   x:collection1] o.a.s.c.c.ZkStateReader Deleting data for [control_collection]
   [junit4]   2> 3019607 INFO  (OverseerStateUpdate-95944930069446660-127.0.0.1:63591_-n_0000000000) [n:127.0.0.1:63591_    ] o.a.s.c.o.ReplicaMutator Update state numShards=1 message={
   [junit4]   2>   "core":"collection1",
   [junit4]   2>   "roles":null,
   [junit4]   2>   "base_url":"http://127.0.0.1:63591",
   [junit4]   2>   "node_name":"127.0.0.1:63591_",
   [junit4]   2>   "numShards":"1",
   [junit4]   2>   "state":"down",
   [junit4]   2>   "shard":null,
   [junit4]   2>   "collection":"control_collection",
   [junit4]   2>   "operation":"state"}
   [junit4]   2> 3019608 INFO  (OverseerStateUpdate-95944930069446660-127.0.0.1:63591_-n_0000000000) [n:127.0.0.1:63591_    ] o.a.s.c.o.ClusterStateMutator building a new cName: control_collection
   [junit4]   2> 3019608 INFO  (OverseerStateUpdate-95944930069446660-127.0.0.1:63591_-n_0000000000) [n:127.0.0.1:63591_    ] o.a.s.c.o.ReplicaMutator Assigning new node to shard shard=shard1
   [junit4]   2> 3019608 INFO  (coreLoadExecutor-9693-thread-1-processing-n:127.0.0.1:63591_) [n:127.0.0.1:63591_ c:control_collection   x:collection1] o.a.s.c.ZkController look for our core node name
   [junit4]   2> 3019610 INFO  (zkCallback-3856-thread-1-processing-n:127.0.0.1:63591_) [n:127.0.0.1:63591_    ] o.a.s.c.c.ZkStateReader A cluster state change: [WatchedEvent state:SyncConnected type:NodeDataChanged path:/clusterstate.json], has occurred - updating... (live nodes size: [1])
   [junit4]   2> 3020612 INFO  (coreLoadExecutor-9693-thread-1-processing-n:127.0.0.1:63591_) [n:127.0.0.1:63591_ c:control_collection   x:collection1] o.a.s.c.ZkController waiting to find shard id in clusterstate for collection1
   [junit4]   2> 3020612 INFO  (coreLoadExecutor-9693-thread-1-processing-n:127.0.0.1:63591_) [n:127.0.0.1:63591_ c:control_collection   x:collection1] o.a.s.c.ZkController Check for collection zkNode:control_collection
   [junit4]   2> 3020613 INFO  (coreLoadExecutor-9693-thread-1-processing-n:127.0.0.1:63591_) [n:127.0.0.1:63591_ c:control_collection   x:collection1] o.a.s.c.ZkController Collection zkNode exists
   [junit4]   2> 3020613 INFO  (coreLoadExecutor-9693-thread-1-processing-n:127.0.0.1:63591_) [n:127.0.0.1:63591_ c:control_collection   x:collection1] o.a.s.c.c.ZkStateReader Load collection config from: [/collections/control_collection]
   [junit4]   2> 3020613 INFO  (coreLoadExecutor-9693-thread-1-processing-n:127.0.0.1:63591_) [n:127.0.0.1:63591_ c:control_collection   x:collection1] o.a.s.c.c.ZkStateReader path=[/collections/control_collection] [configName]=[conf1] specified config exists in ZooKeeper
   [junit4]   2> 3020614 INFO  (coreLoadExecutor-9693-thread-1-processing-n:127.0.0.1:63591_) [n:127.0.0.1:63591_ c:control_collection   x:collection1] o.a.s.c.SolrResourceLoader new SolrResourceLoader for directory: 'C:\Users\jenkins\workspace\Lucene-Solr-6.x-Windows\solr\build\solr-core\test\J1\temp\solr.handler.TestReqParamsAPI_9497902C2497AF8F-001\control-001\cores\collection1'
   [junit4]   2> 3020614 INFO  (coreLoadExecutor-9693-thread-1-processing-n:127.0.0.1:63591_) [n:127.0.0.1:63591_ c:control_collection   x:collection1] o.a.s.c.SolrResourceLoader JNDI not configured for solr (NoInitialContextEx)
   [junit4]   2> 3020614 INFO  (coreLoadExecutor-9693-thread-1-processing-n:127.0.0.1:63591_) [n:127.0.0.1:63591_ c:control_collection   x:collection1] o.a.s.c.SolrResourceLoader solr home defaulted to 'solr/' (could not find system property or JNDI)
   [junit4]   2> 3020617 INFO  (coreLoadExecutor-9693-thread-1-processing-n:127.0.0.1:63591_) [n:127.0.0.1:63591_ c:control_collection   x:collection1] o.a.s.c.Config loaded config solrconfig.xml with version 0 
   [junit4]   2> 3020627 INFO  (coreLoadExecutor-9693-thread-1-processing-n:127.0.0.1:63591_) [n:127.0.0.1:63591_ c:control_collection   x:collection1] o.a.s.c.SolrConfig current version of requestparams : -1
   [junit4]   2> 3020631 INFO  (coreLoadExecutor-9693-thread-1-processing-n:127.0.0.1:63591_) [n:127.0.0.1:63591_ c:control_collection   x:collection1] o.a.s.c.SolrConfig Using Lucene MatchVersion: 6.1.0
   [junit4]   2> 3020640 INFO  (coreLoadExecutor-9693-thread-1-processing-n:127.0.0.1:63591_) [n:127.0.0.1:63591_ c:control_collection   x:collection1] o.a.s.c.SolrConfig Loaded SolrConfig: solrconfig.xml
   [junit4]   2> 3020648 INFO  (coreLoadExecutor-9693-thread-1-processing-n:127.0.0.1:63591_) [n:127.0.0.1:63591_ c:control_collection   x:collection1] o.a.s.s.IndexSchema [collection1] Schema name=test
   [junit4]   2> 3020806 INFO  (coreLoadExecutor-9693-thread-1-processing-n:127.0.0.1:63591_) [n:127.0.0.1:63591_ c:control_collection   x:collection1] o.a.s.s.OpenExchangeRatesOrgProvider Initialized with rates=open-exchange-rates.json, refreshInterval=1440.
   [junit4]   2> 3020816 INFO  (coreLoadExecutor-9693-thread-1-processing-n:127.0.0.1:63591_) [n:127.0.0.1:63591_ c:control_collection   x:collection1] o.a.s.s.IndexSchema default search field in schema is text
   [junit4]   2> 3020816 INFO  (coreLoadExecutor-9693-thread-1-processing-n:127.0.0.1:63591_) [n:127.0.0.1:63591_ c:control_collection   x:collection1] o.a.s.s.IndexSchema unique key field: id
   [junit4]   2> 3020831 INFO  (coreLoadExecutor-9693-thread-1-processing-n:127.0.0.1:63591_) [n:127.0.0.1:63591_ c:control_collection   x:collection1] o.a.s.s.FileExchangeRateProvider Reloading exchange rates from file currency.xml
   [junit4]   2> 3020835 INFO  (coreLoadExecutor-9693-thread-1-processing-n:127.0.0.1:63591_) [n:127.0.0.1:63591_ c:control_collection   x:collection1] o.a.s.s.FileExchangeRateProvider Reloading exchange rates from file currency.xml
   [junit4]   2> 3020838 INFO  (coreLoadExecutor-9693-thread-1-processing-n:127.0.0.1:63591_) [n:127.0.0.1:63591_ c:control_collection   x:collection1] o.a.s.s.OpenExchangeRatesOrgProvider Reloading exchange rates from open-exchange-rates.json
   [junit4]   2> 3020841 INFO  (coreLoadExecutor-9693-thread-1-processing-n:127.0.0.1:63591_) [n:127.0.0.1:63591_ c:control_collection   x:collection1] o.a.s.s.OpenExchangeRatesOrgProvider Reloading exchange rates from open-exchange-rates.json
   [junit4]   2> 3020846 INFO  (coreLoadExecutor-9693-thread-1-processing-n:127.0.0.1:63591_) [n:127.0.0.1:63591_ c:control_collection   x:collection1] o.a.s.c.ConfigSetProperties Did not find ConfigSet properties, assuming default properties: Can't find resource 'configsetprops.json' in classpath or '/configs/conf1', cwd=C:\Users\jenkins\workspace\Lucene-Solr-6.x-Windows\solr\build\solr-core\test\J1
   [junit4]   2> 3020846 INFO  (coreLoadExecutor-9693-thread-1-processing-n:127.0.0.1:63591_) [n:127.0.0.1:63591_ c:control_collection   x:collection1] o.a.s.c.CoreContainer Creating SolrCore 'collection1' using configuration from collection control_collection
   [junit4]   2> 3020846 INFO  (coreLoadExecutor-9693-thread-1-processing-n:127.0.0.1:63591_) [n:127.0.0.1:63591_ c:control_collection s:shard1 r:core_node1 x:collection1] o.a.s.c.SolrCore org.apache.solr.core.MockDirectoryFactory
   [junit4]   2> 3020847 INFO  (coreLoadExecutor-9693-thread-1-processing-n:127.0.0.1:63591_) [n:127.0.0.1:63591_ c:control_collection s:shard1 r:core_node1 x:collection1] o.a.s.c.SolrCore [[collection1] ] Opening new SolrCore at [C:\Users\jenkins\workspace\Lucene-Solr-6.x-Windows\solr\build\solr-core\test\J1\temp\solr.handler.TestReqParamsAPI_9497902C2497AF8F-001\control-001\cores\collection1], dataDir=[C:\Users\jenkins\workspace\Lucene-Solr-6.x-Windows\solr\build\solr-core\test\J1\..\..\..\..\..\..\..\..\..\Users\jenkins\workspace\Lucene-Solr-6.x-Windows\solr\build\solr-core\test\J1\temp\solr.handler.TestReqParamsAPI_9497902C2497AF8F-001\control-001\cores\collection1\data\]
   [junit4]   2> 3020847 INFO  (coreLoadExecutor-9693-thread-1-processing-n:127.0.0.1:63591_) [n:127.0.0.1:63591_ c:control_collection s:shard1 r:core_node1 x:collection1] o.a.s.c.JmxMonitoredMap JMX monitoring is enabled. Adding Solr mbeans to JMX Server: com.sun.jmx.mbeanserver.JmxMBeanServer@3bf33679
   [junit4]   2> 3020847 INFO  (coreLoadExecutor-9693-thread-1-processing-n:127.0.0.1:63591_) [n:127.0.0.1:63591_ c:control_collection s:shard1 r:core_node1 x:collection1] o.a.s.c.CachingDirectoryFactory return new directory for C:\Users\jenkins\workspace\Lucene-Solr-6.x-Windows\solr\build\solr-core\test\J1\..\..\..\..\..\..\..\..\..\Users\jenkins\workspace\Lucene-Solr-6.x-Windows\solr\build\solr-core\test\J1\temp\solr.handler.TestReqParamsAPI_9497902C2497AF8F-001\control-001\cores\collection1\data\
   [junit4]   2> 3020847 INFO  (coreLoadExecutor-9693-thread-1-processing-n:127.0.0.1:63591_) [n:127.0.0.1:63591_ c:control_collection s:shard1 r:core_node1 x:collection1] o.a.s.c.SolrCore New index directory detected: old=null new=C:\Users\jenkins\workspace\Lucene-Solr-6.x-Windows\solr\build\solr-core\test\J1\..\..\..\..\..\..\..\..\..\Users\jenkins\workspace\Lucene-Solr-6.x-Windows\solr\build\solr-core\test\J1\temp\solr.handler.TestReqParamsAPI_9497902C2497AF8F-001\control-001\cores\collection1\data\index/
   [junit4]   2> 3020848 WARN  (coreLoadExecutor-9693-thread-1-processing-n:127.0.0.1:63591_) [n:127.0.0.1:63591_ c:control_collection s:shard1 r:core_node1 x:collection1] o.a.s.c.SolrCore [collection1] Solr index directory 'C:\Users\jenkins\workspace\Lucene-Solr-6.x-Windows\solr\build\solr-core\test\J1\..\..\..\..\..\..\..\..\..\Users\jenkins\workspace\Lucene-Solr-6.x-Windows\solr\build\solr-core\test\J1\temp\solr.handler.TestReqParamsAPI_9497902C2497AF8F-001\control-001\cores\collection1\data\index' doesn't exist. Creating new index...
   [junit4]   2> 3020848 INFO  (coreLoadExecutor-9693-thread-1-processing-n:127.0.0.1:63591_) [n:127.0.0.1:63591_ c:control_collection s:shard1 r:core_node1 x:collection1] o.a.s.c.CachingDirectoryFactory return new directory for C:\Users\jenkins\workspace\Lucene-Solr-6.x-Windows\solr\build\solr-core\test\J1\..\..\..\..\..\..\..\..\..\Users\jenkins\workspace\Lucene-Solr-6.x-Windows\solr\build\solr-core\test\J1\temp\solr.handler.TestReqParamsAPI_9497902C2497AF8F-001\control-001\cores\collection1\data\index
   [junit4]   2> 3020848 INFO  (coreLoadExecutor-9693-thread-1-processing-n:127.0.0.1:63591_) [n:127.0.0.1:63591_ c:control_collection s:shard1 r:core_node1 x:collection1] o.a.s.u.RandomMergePolicy RandomMergePolicy wrapping class org.apache.lucene.index.MockRandomMergePolicy: org.apache.lucene.index.MockRandomMergePolicy@23f773ae
   [junit4]   2> 3020849 INFO  (coreLoadExecutor-9693-thread-1-processing-n:127.0.0.1:63591_) [n:127.0.0.1:63591_ c:control_collection s:shard1 r:core_node1 x:collection1] o.a.s.c.SolrDeletionPolicy SolrDeletionPolicy.onCommit: commits: num=1
   [junit4]   2> 	commit{dir=MockDirectoryWrapper(RAMDirectory@6430277a lockFactory=org.apache.lucene.store.SingleInstanceLockFactory@16094c27),segFN=segments_1,generation=1}
   [junit4]   2> 3020849 INFO  (coreLoadExecutor-9693-thread-1-processing-n:127.0.0.1:63591_) [n:127.0.0.1:63591_ c:control_collection s:shard1 r:core_node1 x:collection1] o.a.s.c.SolrDeletionPolicy newest commit generation = 1
   [junit4]   2> 3020850 INFO  (OldIndexDirectoryCleanupThreadForCore-collection1) [n:127.0.0.1:63591_ c:control_collection s:shard1 r:core_node1 x:collection1] o.a.s.c.SolrCore Looking for old index directories to cleanup for core collection1 in C:\Users\jenkins\workspace\Lucene-Solr-6.x-Windows\solr\build\solr-core\test\J1\..\..\..\..\..\..\..\..\..\Users\jenkins\workspace\Lucene-Solr-6.x-Windows\solr\build\solr-core\test\J1\temp\solr.handler.TestReqParamsAPI_9497902C2497AF8F-001\control-001\cores\collection1\data\
   [junit4]   2> 3020851 WARN  (OldIndexDirectoryCleanupThreadForCore-collection1) [n:127.0.0.1:63591_ c:control_collection s:shard1 r:core_node1 x:collection1] o.a.s.c.DirectoryFactory C:\Users\jenkins\workspace\Lucene-Solr-6.x-Windows\solr\build\solr-core\test\J1\..\..\..\..\..\..\..\..\..\Users\jenkins\workspace\Lucene-Solr-6.x-Windows\solr\build\solr-core\test\J1\temp\solr.handler.TestReqParamsAPI_9497902C2497AF8F-001\control-001\cores\collection1\data\ does not point to a valid data directory; skipping clean-up of old index directories.
   [junit4]   2> 3020852 INFO  (coreLoadExecutor-9693-thread-1-processing-n:127.0.0.1:63591_) [n:127.0.0.1:63591_ c:control_collection s:shard1 r:core_node1 x:collection1] o.a.s.u.p.UpdateRequestProcessorChain creating updateRequestProcessorChain "nodistrib"
   [junit4]   2> 3020852 INFO  (coreLoadExecutor-9693-thread-1-processing-n:127.0.0.1:63591_) [n:127.0.0.1:63591_ c:control_collection s:shard1 r:core_node1 x:collection1] o.a.s.u.p.UpdateRequestProcessorChain creating updateRequestProcessorChain "dedupe"
   [junit4]   2> 3020853 INFO  (coreLoadExecutor-9693-thread-1-processing-n:127.0.0.1:63591_) [n:127.0.0.1:63591_ c:control_collection s:shard1 r:core_node1 x:collection1] o.a.s.u.p.UpdateRequestProcessorChain inserting DistributedUpdateProcessorFactory into updateRequestProcessorChain "dedupe"
   [junit4]   2> 3020853 INFO  (coreLoadExecutor-9693-thread-1-processing-n:127.0.0.1:63591_) [n:127.0.0.1:63591_ c:control_collection s:shard1 r:core_node1 x:collection1] o.a.s.u.p.UpdateRequestProcessorChain creating updateRequestProcessorChain "stored_sig"
   [junit4]   2> 3020853 INFO  (coreLoadExecutor-9693-thread-1-processing-n:127.0.0.1:63591_) [n:127.0.0.1:63591_ c:control_collection s:shard1 r:core_node1 x:collection1] o.a.s.u.p.UpdateRequestProcessorChain inserting DistributedUpdateProcessorFactory into updateRequestProcessorChain "stored_sig"
   [junit4]   2> 3020853 INFO  (coreLoadExecutor-9693-thread-1-processing-n:127.0.0.1:63591_) [n:127.0.0.1:63591_ c:control_collection s:shard1 r:core_node1 x:collection1] o.a.s.u.p.UpdateRequestProcessorChain creating updateRequestProcessorChain "distrib-dup-test-chain-explicit"
   [junit4]   2> 3020853 INFO  (coreLoadExecutor-9693-thread-1-processing-n:127.0.0.1:63591_) [n:127.0.0.1:63591_ c:control_collection s:shard1 r:core_node1 x:collection1] o.a.s.u.p.UpdateRequestProcessorChain creating updateRequestProcessorChain "distrib-dup-test-chain-implicit"
   [junit4]   2> 3020853 INFO  (coreLoadExecutor-9693-thread-1-processing-n:127.0.0.1:63591_) [n:127.0.0.1:63591_ c:control_collection s:shard1 r:core_node1 x:collection1] o.a.s.u.p.UpdateRequestProcessorChain inserting DistributedUpdateProcessorFactory into updateRequestProcessorChain "distrib-dup-test-chain-implicit"
   [junit4]   2> 3020853 INFO  (coreLoadExecutor-9693-thread-1-processing-n:127.0.0.1:63591_) [n:127.0.0.1:63591_ c:control_collection s:shard1 r:core_node1 x:collection1] o.a.s.c.SolrCore no updateRequestProcessorChain defined as default, creating implicit default
   [junit4]   2> 3020853 WARN  (coreLoadExecutor-9693-thread-1-processing-n:127.0.0.1:63591_) [n:127.0.0.1:63591_ c:control_collection s:shard1 r:core_node1 x:collection1] o.a.s.c.RequestHandlers INVALID paramSet a in requestHandler {type = requestHandler,name = /dump,class = DumpRequestHandler,args = {defaults={a=A,b=B}}}
   [junit4]   2> 3020865 INFO  (coreLoadExecutor-9693-thread-1-processing-n:127.0.0.1:63591_) [n:127.0.0.1:63591_ c:control_collection s:shard1 r:core_node1 x:collection1] o.a.s.h.l.XMLLoader xsltCacheLifetimeSeconds=60
   [junit4]   2> 3020867 INFO  (coreLoadExecutor-9693-thread-1-processing-n:127.0.0.1:63591_) [n:127.0.0.1:63591_ c:control_collection s:shard1 r:core_node1 x:collection1] o.a.s.h.l.XMLLoader xsltCacheLifetimeSeconds=60
   [junit4]   2> 3020869 INFO  (coreLoadExecutor-9693-thread-1-processing-n:127.0.0.1:63591_) [n:127.0.0.1:63591_ c:control_collection s:shard1 r:core_node1 x:collection1] o.a.s.h.l.XMLLoader xsltCacheLifetimeSeconds=60
   [junit4]   2> 3020871 INFO  (coreLoadExecutor-9693-thread-1-processing-n:127.0.0.1:63591_) [n:127.0.0.1:63591_ c:control_collection s:shard1 r:core_node1 x:collection1] o.a.s.h.l.XMLLoader xsltCacheLifetimeSeconds=60
   [junit4]   2> 3020876 INFO  (coreLoadExecutor-9693-thread-1-processing-n:127.0.0.1:63591_) [n:127.0.0.1:63591_ c:control_collection s:shard1 r:core_node1 x:collection1] o.a.s.c.RequestHandlers Registered paths: /admin/mbeans,standard,/update/json/docs,/admin/luke,/export,/get,/admin/properties,/update/json,/admin/threads,/dump,/update/csv,/sql,/graph,/admin/segments,/admin/system,/replication,/config,/stream,/schema,/admin/plugins,/admin/logging,/admin/ping,/update,/admin/file
   [junit4]   2> 3020876 INFO  (coreLoadExecutor-9693-thread-1-processing-n:127.0.0.1:63591_) [n:127.0.0.1:63591_ c:control_collection s:shard1 r:core_node1 x:collection1] o.a.s.c.SolrCore Using default statsCache cache: org.apache.solr.search.stats.LocalStatsCache
   [junit4]   2> 3020878 INFO  (coreLoadExecutor-9693-thread-1-processing-n:127.0.0.1:63591_) [n:127.0.0.1:63591_ c:control_collection s:shard1 r:core_node1 x:collection1] o.a.s.u.UpdateHandler Using UpdateLog implementation: org.apache.solr.update.UpdateLog
   [junit4]   2> 3020878 INFO  (coreLoadExecutor-9693-thread-1-processing-n:127.0.0.1:63591_) [n:127.0.0.1:63591_ c:control_collection s:shard1 r:core_node1 x:collection1] o.a.s.u.UpdateLog Initializing UpdateLog: dataDir= defaultSyncLevel=FLUSH numRecordsToKeep=100 maxNumLogsToKeep=10 numVersionBuckets=65536
   [junit4]   2> 3020880 INFO  (coreLoadExecutor-9693-thread-1-processing-n:127.0.0.1:63591_) [n:127.0.0.1:63591_ c:control_collection s:shard1 r:core_node1 x:collection1] o.a.s.u.CommitTracker Hard AutoCommit: disabled
   [junit4]   2> 3020880 INFO  (coreLoadExecutor-9693-thread-1-processing-n:127.0.0.1:63591_) [n:127.0.0.1:63591_ c:control_collection s:shard1 r:core_node1 x:collection1] o.a.s.u.CommitTracker Soft AutoCommit: disabled
   [junit4]   2> 3020880 INFO  (coreLoadExecutor-9693-thread-1-processing-n:127.0.0.1:63591_) [n:127.0.0.1:63591_ c:control_collection s:shard1 r:core_node1 x:collection1] o.a.s.u.RandomMergePolicy RandomMergePolicy wrapping class org.apache.lucene.index.TieredMergePolicy: [TieredMergePolicy: maxMergeAtOnce=31, maxMergeAtOnceExplicit=44, maxMergedSegmentMB=70.3017578125, floorSegmentMB=0.8447265625, forceMergeDeletesPctAllowed=16.667525538383657, segmentsPerTier=11.0, maxCFSSegmentSizeMB=8.796093022207999E12, noCFSRatio=0.0
   [junit4]   2> 3020881 INFO  (coreLoadExecutor-9693-thread-1-processing-n:127.0.0.1:63591_) [n:127.0.0.1:63591_ c:control_collection s:shard1 r:core_node1 x:collection1] o.a.s.c.SolrDeletionPolicy SolrDeletionPolicy.onInit: commits: num=1
   [junit4]   2> 	commit{dir=MockDirectoryWrapper(RAMDirectory@6430277a lockFactory=org.apache.lucene.store.SingleInstanceLockFactory@16094c27),segFN=segments_1,generation=1}
   [junit4]   2> 3020881 INFO  (coreLoadExecutor-9693-thread-1-processing-n:127.0.0.1:63591_) [n:127.0.0.1:63591_ c:control_collection s:shard1 r:core_node1 x:collection1] o.a.s.c.SolrDeletionPolicy newest commit generation = 1
   [junit4]   2> 3020881 INFO  (coreLoadExecutor-9693-thread-1-processing-n:127.0.0.1:63591_) [n:127.0.0.1:63591_ c:control_collection s:shard1 r:core_node1 x:collection1] o.a.s.s.SolrIndexSearcher Opening [Searcher@3bce06a1[collection1] main]
   [junit4]   2> 3020881 INFO  (coreLoadExecutor-9693-thread-1-processing-n:127.0.0.1:63591_) [n:127.0.0.1:63591_ c:control_collection s:shard1 r:core_node1 x:collection1] o.a.s.c.c.ZkStateReader Load collection config from: [/collections/control_collection]
   [junit4]   2> 3020882 INFO  (coreLoadExecutor-9693-thread-1-processing-n:127.0.0.1:63591_) [n:127.0.0.1:63591_ c:control_collection s:shard1 r:core_node1 x:collection1] o.a.s.c.c.ZkStateReader path=[/collections/control_collection] [configName]=[conf1] specified config exists in ZooKeeper
   [junit4]   2> 3020882 INFO  (coreLoadExecutor-9693-thread-1-processing-n:127.0.0.1:63591_) [n:127.0.0.1:63591_ c:control_collection s:shard1 r:core_node1 x:collection1] o.a.s.r.ManagedResourceStorage Setting up ZooKeeper-based storage for the RestManager with znodeBase: /configs/conf1
   [junit4]   2> 3020883 INFO  (coreLoadExecutor-9693-thread-1-processing-n:127.0.0.1:63591_) [n:127.0.0.1:63591_ c:control_collection s:shard1 r:core_node1 x:collection1] o.a.s.r.ManagedResourceStorage Configured ZooKeeperStorageIO with znodeBase: /configs/conf1
   [junit4]   2> 3020883 INFO  (coreLoadExecutor-9693-thread-1-processing-n:127.0.0.1:63591_) [n:127.0.0.1:63591_ c:control_collection s:shard1 r:core_node1 x:collection1] o.a.s.r.RestManager Initializing RestManager with initArgs: {}
   [junit4]   2> 3020883 INFO  (coreLoadExecutor-9693-thread-1-processing-n:127.0.0.1:63591_) [n:127.0.0.1:63591_ c:control_collection s:shard1 r:core_node1 x:collection1] o.a.s.r.ManagedResourceStorage Reading _rest_managed.json using ZooKeeperStorageIO:path=/configs/conf1
   [junit4]   2> 3020884 INFO  (coreLoadExecutor-9693-thread-1-processing-n:127.0.0.1:63591_) [n:127.0.0.1:63591_ c:control_collection s:shard1 r:core_node1 x:collection1] o.a.s.r.ManagedResourceStorage No data found for znode /configs/conf1/_rest_managed.json
   [junit4]   2> 3020884 INFO  (coreLoadExecutor-9693-thread-1-processing-n:127.0.0.1:63591_) [n:127.0.0.1:63591_ c:control_collection s:shard1 r:core_node1 x:collection1] o.a.s.r.ManagedResourceStorage Loaded null at path _rest_managed.json using ZooKeeperStorageIO:path=/configs/conf1
   [junit4]   2> 3020884 INFO  (coreLoadExecutor-9693-thread-1-processing-n:127.0.0.1:63591_) [n:127.0.0.1:63591_ c:control_collection s:shard1 r:core_node1 x:collection1] o.a.s.r.RestManager Initializing 0 registered ManagedResources
   [junit4]   2> 3020884 INFO  (coreLoadExecutor-9693-thread-1-processing-n:127.0.0.1:63591_) [n:127.0.0.1:63591_ c:control_collection s:shard1 r:core_node1 x:collection1] o.a.s.h.ReplicationHandler Commits will be reserved for  10000
   [junit4]   2> 3020885 INFO  (searcherExecutor-9694-thread-1-processing-n:127.0.0.1:63591_ x:collection1 s:shard1 c:control_collection r:core_node1) [n:127.0.0.1:63591_ c:control_collection s:shard1 r:core_node1 x:collection1] o.a.s.c.SolrCore [collection1] Registered new searcher Searcher@3bce06a1[collection1] main{ExitableDirectoryReader(UninvertingDirectoryReader())}
   [junit4]   2> 3020885 INFO  (coreLoadExecutor-9693-thread-1-processing-n:127.0.0.1:63591_) [n:127.0.0.1:63591_ c:control_collection s:shard1 r:core_node1 x:collection1] o.a.s.u.UpdateLog Looking up max value of version field to seed version buckets
   [junit4]   2> 3020886 INFO  (coreLoadExecutor-9693-thread-1-processing-n:127.0.0.1:63591_) [n:127.0.0.1:63591_ c:control_collection s:shard1 r:core_node1 x:collection1] o.a.s.u.VersionInfo Refreshing highest value of _version_ for 65536 version buckets from index
   [junit4]   2> 3020886 INFO  (coreLoadExecutor-9693-thread-1-processing-n:127.0.0.1:63591_) [n:127.0.0.1:63591_ c:control_collection s:shard1 r:core_node1 x:collection1] o.a.s.u.VersionInfo No terms found for _version_, cannot seed version bucket highest value from index
   [junit4]   2> 3020886 INFO  (coreLoadExecutor-9693-thread-1-processing-n:127.0.0.1:63591_) [n:127.0.0.1:63591_ c:control_collection s:shard1 r:core_node1 x:collection1] o.a.s.u.UpdateLog Could not find max version in index or recent updates, using new clock 1535118883319447552
   [junit4]   2> 3020888 INFO  (coreLoadExecutor-9693-thread-1-processing-n:127.0.0.1:63591_) [n:127.0.0.1:63591_ c:control_collection s:shard1 r:core_node1 x:collection1] o.a.s.u.UpdateLog Took 2.0ms to seed version buckets with highest version 1535118883319447552
   [junit4]   2> 3020888 INFO  (coreLoadExecutor-9693-thread-1-processing-n:127.0.0.1:63591_) [n:127.0.0.1:63591_ c:control_collection s:shard1 r:core_node1 x:collection1] o.a.s.c.ZkController watch zkdir /configs/conf1
   [junit4]   2> 3020889 INFO  (coreLoadExecutor-9693-thread-1-processing-n:127.0.0.1:63591_) [n:127.0.0.1:63591_ c:control_collection s:shard1 r:core_node1 x:collection1] o.a.s.c.CoreContainer registering core: collection1
   [junit4]   2> 3020890 INFO  (coreZkRegister-9687-thread-1-processing-n:127.0.0.1:63591_ x:collection1 s:shard1 c:control_collection r:core_node1) [n:127.0.0.1:63591_ c:control_collection s:shard1 r:core_node1 x:collection1] o.a.s.c.ZkController Register replica - core:collection1 address:http://127.0.0.1:63591 collection:control_collection shard:shard1
   [junit4]   2> 3020891 INFO  (coreZkRegister-9687-thread-1-processing-n:127.0.0.1:63591_ x:collection1 s:shard1 c:control_collection r:core_node1) [n:127.0.0.1:63591_ c:control_collection s:shard1 r:core_node1 x:collection1] o.a.s.c.c.SolrZkClient makePath: /collections/control_collection/leader_elect/shard1/election
   [junit4]   2> 3020897 INFO  (coreZkRegister-9687-thread-1-processing-n:127.0.0.1:63591_ x:collection1 s:shard1 c:control_collection r:core_node1) [n:127.0.0.1:63591_ c:control_collection s:shard1 r:core_node1 x:collection1] o.a.s.c.LeaderElector Joined leadership election with path: /collections/control_collection/leader_elect/shard1/election/95944930069446660-core_node1-n_0000000000
   [junit4]   2> 3020898 INFO  (coreZkRegister-9687-thread-1-processing-n:127.0.0.1:63591_ x:collection1 s:shard1 c:control_collection r:core_node1) [n:127.0.0.1:63591_ c:control_collection s:shard1 r:core_node1 x:collection1] o.a.s.c.ShardLeaderElectionContext Running the leader process for shard=shard1 and weAreReplacement=false and leaderVoteWait=10000
   [junit4]   2> 3020901 INFO  (coreZkRegister-9687-thread-1-processing-n:127.0.0.1:63591_ x:collection1 s:shard1 c:control_collection r:core_node1) [n:127.0.0.1:63591_ c:control_collection s:shard1 r:core_node1 x:collection1] o.a.s.c.ShardLeaderElectionContext Enough replicas found to continue.
   [junit4]   2> 3020901 INFO  (coreZkRegister-9687-thread-1-processing-n:127.0.0.1:63591_ x:collection1 s:shard1 c:control_collection r:core_node1) [n:127.0.0.1:63591_ c:control_collection s:shard1 r:core_node1 x:collection1] o.a.s.c.ShardLeaderElectionContext I may be the new leader - try and sync
   [junit4]   2> 3020901 INFO  (coreZkRegister-9687-thread-1-processing-n:127.0.0.1:63591_ x:collection1 s:shard1 c:control_collection r:core_node1) [n:127.0.0.1:63591_ c:control_collection s:shard1 r:core_node1 x:collection1] o.a.s.c.SyncStrategy Sync replicas to http://127.0.0.1:63591/collection1/
   [junit4]   2> 3020901 INFO  (coreZkRegister-9687-thread-1-processing-n:127.0.0.1:63591_ x:collection1 s:shard1 c:control_collection r:core_node1) [n:127.0.0.1:63591_ c:control_collection s:shard1 r:core_node1 x:collection1] o.a.s.c.SyncStrategy Sync Success - now sync replicas to me
   [junit4]   2> 3020901 INFO  (coreZkRegister-9687-thread-1-processing-n:127.0.0.1:63591_ x:collection1 s:shard1 c:control_collection r:core_node1) [n:127.0.0.1:63591_ c:control_collection s:shard1 r:core_node1 x:collection1] o.a.s.c.SyncStrategy http://127.0.0.1:63591/collection1/ has no replicas
   [junit4]   2> 3020902 INFO  (OverseerStateUpdate-95944930069446660-127.0.0.1:63591_-n_0000000000) [n:127.0.0.1:63591_    ] o.a.s.c.Overseer processMessage: queueSize: 1, message = {
   [junit4]   2>   "operation":"leader",
   [junit4]   2>   "shard":"shard1",
   [junit4]   2>   "collection":"control_collection"} current state version: 1
   [junit4]   2> 3020903 INFO  (coreZkRegister-9687-thread-1-processing-n:127.0.0.1:63591_ x:collection1 s:shard1 c:control_collection r:core_node1) [n:127.0.0.1:63591_ c:control_collection s:shard1 r:core_node1 x:collection1] o.a.s.c.c.SolrZkClient makePath: /collections/control_collection/leaders/shard1
   [junit4]   2> 3020909 INFO  (coreZkRegister-9687-thread-1-processing-n:127.0.0.1:63591_ x:collection1 s:shard1 c:control_collection r:core_node1) [n:127.0.0.1:63591_ c:control_collection s:shard1 r:core_node1 x:collection1] o.a.s.c.ShardLeaderElectionContextBase Creating leader registration node /collections/control_collection/leaders/shard1/leader after winning as /collections/control_collection/leader_elect/shard1/election/95944930069446660-core_node1-n_0000000000
   [junit4]   2> 3020912 INFO  (coreZkRegister-9687-thread-1-processing-n:127.0.0.1:63591_ x:collection1 s:shard1 c:control_collection r:core_node1) [n:127.0.0.1:63591_ c:control_collection s:shard1 r:core_node1 x:collection1] o.a.s.c.ShardLeaderElectionContext I am the new leader: http://127.0.0.1:63591/collection1/ shard1
   [junit4]   2> 3020913 INFO  (OverseerStateUpdate-95944930069446660-127.0.0.1:63591_-n_0000000000) [n:127.0.0.1:63591_    ] o.a.s.c.Overseer processMessage: queueSize: 1, message = {
   [junit4]   2>   "operation":"leader",
   [junit4]   2>   "shard":"shard1",
   [junit4]   2>   "collection":"control_collection",
   [junit4]   2>   "base_url":"http://127.0.0.1:63591",
   [junit4]   2>   "core":"collection1",
   [junit4]   2>   "state":"active"} current state version: 1
   [junit4]   2> 3021017 INFO  (zkCallback-3856-thread-1-processing-n:127.0.0.1:63591_) [n:127.0.0.1:63591_    ] o.a.s.c.c.ZkStateReader A cluster state change: [WatchedEvent state:SyncConnected type:NodeDataChanged path:/clusterstate.json], has occurred - updating... (live nodes size: [1])
   [junit4]   2> 3021065 INFO  (coreZkRegister-9687-thread-1-processing-n:127.0.0.1:63591_ x:collection1 s:shard1 c:control_collection r:core_node1) [n:127.0.0.1:63591_ c:control_collection s:shard1 r:core_node1 x:collection1] o.a.s.c.ZkController We are http://127.0.0.1:63591/collection1/ and leader is http://127.0.0.1:63591/collection1/
   [junit4]   2> 3021065 INFO  (coreZkRegister-9687-thread-1-processing-n:127.0.0.1:63591_ x:collection1 s:shard1 c:control_collection r:core_node1) [n:127.0.0.1:63591_ c:control_collection s:shard1 r:core_node1 x:collection1] o.a.s.c.ZkController No LogReplay needed for core=collection1 baseURL=http://127.0.0.1:63591
   [junit4]   2> 3021065 INFO  (coreZkRegister-9687-thread-1-processing-n:127.0.0.1:63591_ x:collection1 s:shard1 c:control_collection r:core_node1) [n:127.0.0.1:63591_ c:control_collection s:shard1 r:core_node1 x:collection1] o.a.s.c.ZkController I am the leader, no recovery necessary
   [junit4]   2> 3021065 INFO  (coreZkRegister-9687-thread-1-processing-n:127.0.0.1:63591_ x:collection1 s:shard1 c:control_collection r:core_node1) [n:127.0.0.1:63591_ c:control_collection s:shard1 r:core_node1 x:collection1] o.a.s.c.ZkController publishing state=active
   [junit4]   2> 3021065 INFO  (coreZkRegister-9687-thread-1-processing-n:127.0.0.1:63591_ x:collection1 s:shard1 c:control_collection r:core_node1) [n:127.0.0.1:63591_ c:control_collection s:shard1 r:core_node1 x:collection1] o.a.s.c.ZkController numShards not found on descriptor - reading it from system property
   [junit4]   2> 3021069 INFO  (OverseerStateUpdate-95944930069446660-127.0.0.1:63591_-n_0000000000) [n:127.0.0.1:63591_    ] o.a.s.c.Overseer processMessage: queueSize: 1, message = {
   [junit4]   2>   "core":"collection1",
   [junit4]   2>   "core_node_name":"core_node1",
   [junit4]   2>   "roles":null,
   [junit4]   2>   "base_url":"http://127.0.0.1:63591",
   [junit4]   2>   "node_name":"127.0.0.1:63591_",
   [junit4]   2>   "numShards":"1",
   [junit4]   2>   "state":"active",
   [junit4]   2>   "shard":"shard1",
   [junit4]   2>   "collection":"control_collection",
   [junit4]   2>   "operation":"state"} current state version: 2
   [junit4]   2> 3021069 INFO  (OverseerStateUpdate-95944930069446660-127.0.0.1:63591_-n_0000000000) [n:127.0.0.1:63591_    ] o.a.s.c.o.ReplicaMutator Update state numShards=1 message={
   [junit4]   2>   "core":"collection1",
   [junit4]   2>   "core_node_name":"core_node1",
   [junit4]   2>   "roles":null,
   [junit4]   2>   "base_url":"http://127.0.0.1:63591",
   [junit4]   2>   "node_name":"127.0.0.1:63591_",
   [junit4]   2>   "numShards":"1",
   [junit4]   2>   "state":"active",
   [junit4]   2>   "shard":"shard1",
   [junit4]   2>   "collection":"control_collection",
   [junit4]   2>   "operation":"state"}
   [junit4]   2> 3021106 INFO  (TEST-TestReqParamsAPI.test-seed#[9497902C2497AF8F]) [    ] o.a.s.c.s.i.CloudSolrClient Final constructed zkHost string: 127.0.0.1:63584/solr
   [junit4]   2> 3021107 INFO  (TEST-TestReqParamsAPI.test-seed#[9497902C2497AF8F]) [    ] o.a.s.c.c.SolrZkClient Using default ZkCredentialsProvider
   [junit4]   2> 3021107 INFO  (TEST-TestReqParamsAPI.test-seed#[9497902C2497AF8F]) [    ] o.a.s.c.c.ConnectionManager Waiting for client to connect to ZooKeeper
   [junit4]   2> 3021109 INFO  (zkCallback-3860-thread-1) [    ] o.a.s.c.c.ConnectionManager Watcher org.apache.solr.common.cloud.ConnectionManager@66d5ebed name:ZooKeeperConnection Watcher:127.0.0.1:63584/solr got event WatchedEvent state:SyncConnected type:None path:null path:null type:None
   [junit4]   2> 3021109 INFO  (TEST-TestReqParamsAPI.test-seed#[9497902C2497AF8F]) [    ] o.a.s.c.c.ConnectionManager Client is connected to ZooKeeper
   [junit4]   2> 3021109 INFO  (TEST-TestReqParamsAPI.test-seed#[9497902C2497AF8F]) [    ] o.a.s.c.c.SolrZkClient Using default ZkACLProvider
   [junit4]   2> 3021109 INFO  (TEST-TestReqParamsAPI.test-seed#[9497902C2497AF8F]) [    ] o.a.s.c.c.ZkStateReader Updating cluster state from ZooKeeper... 
   [junit4]   2> 3021111 INFO  (TEST-TestReqParamsAPI.test-seed#[9497902C2497AF8F]) [    ] o.a.s.c.c.ZkStateReader Loaded empty cluster properties
   [junit4]   2> 3021112 INFO  (TEST-TestReqParamsAPI.test-seed#[9497902C2497AF8F]) [    ] o.a.s.c.c.ZkStateReader Updated live nodes from ZooKeeper... (0) -> (1)
   [junit4]   2> 3021116 INFO  (TEST-TestReqParamsAPI.test-seed#[9497902C2497AF8F]) [    ] o.a.s.c.ChaosMonkey monkey: init - expire sessions:false cause connection loss:false
   [junit4]   2> 3021173 INFO  (zkCallback-3856-thread-1-processing-n:127.0.0.1:63591_) [n:127.0.0.1:63591_    ] o.a.s.c.c.ZkStateReader A cluster state change: [WatchedEvent state:SyncConnected type:NodeDataChanged path:/clusterstate.json], has occurred - updating... (live nodes size: [1])
   [junit4]   2> 3021173 INFO  (zkCallback-3860-thread-1) [    ] o.a.s.c.c.ZkStateReader A cluster state change: [WatchedEvent state:SyncConnected type:NodeDataChanged path:/clusterstate.json], has occurred - updating... (live nodes size: [1])
   [junit4]   2> 3021613 INFO  (TEST-TestReqParamsAPI.test-seed#[9497902C2497AF8F]) [    ] o.a.s.SolrTestCaseJ4 Writing core.properties file to C:\Users\jenkins\workspace\Lucene-Solr-6.x-Windows\solr\build\solr-core\test\J1\temp\solr.handler.TestReqParamsAPI_9497902C2497AF8F-001\shard-1-001\cores\collection1
   [junit4]   2> 3021616 INFO  (TEST-TestReqParamsAPI.test-seed#[9497902C2497AF8F]) [    ] o.a.s.c.AbstractFullDistribZkTestBase create jetty 1 in directory C:\Users\jenkins\workspace\Lucene-Solr-6.x-Windows\solr\build\solr-core\test\J1\temp\solr.handler.TestReqParamsAPI_9497902C2497AF8F-001\shard-1-001
   [junit4]   2> 3021616 INFO  (TEST-TestReqParamsAPI.test-seed#[9497902C2497AF8F]) [    ] o.e.j.s.Server jetty-9.3.8.v20160314
   [junit4]   2> 3021618 INFO  (TEST-TestReqParamsAPI.test-seed#[9497902C2497AF8F]) [    ] o.e.j.s.h.ContextHandler Started o.e.j.s.ServletContextHandler@4e9b6316{/,null,AVAILABLE}
   [junit4]   2> 3021618 INFO  (TEST-TestReqParamsAPI.test-seed#[9497902C2497AF8F]) [    ] o.e.j.s.ServerConnector Started ServerConnector@248262eb{HTTP/1.1,[http/1.1]}{127.0.0.1:63608}
   [junit4]   2> 3021620 INFO  (TEST-TestReqParamsAPI.test-seed#[9497902C2497AF8F]) [    ] o.e.j.s.Server Started @3028588ms
   [junit4]   2> 3021622 INFO  (TEST-TestReqParamsAPI.test-seed#[9497902C2497AF8F]) [    ] o.a.s.c.s.e.JettySolrRunner Jetty properties: {solr.data.dir=C:\Users\jenkins\workspace\Lucene-Solr-6.x-Windows\solr\build\solr-core\test\J1\temp\solr.handler.TestReqParamsAPI_9497902C2497AF8F-001\tempDir-001/jetty1, solrconfig=solrconfig.xml, hostContext=/, hostPort=63608, coreRootDirectory=C:\Users\jenkins\workspace\Lucene-Solr-6.x-Windows\solr\build\solr-core\test\J1\temp\solr.handler.TestReqParamsAPI_9497902C2497AF8F-001\shard-1-001\cores}
   [junit4]   2> 3021622 INFO  (TEST-TestReqParamsAPI.test-seed#[9497902C2497AF8F]) [    ] o.a.s.s.SolrDispatchFilter SolrDispatchFilter.init(): sun.misc.Launcher$AppClassLoader@73d16e93
   [junit4]   2> 3021622 INFO  (TEST-TestReqParamsAPI.test-seed#[9497902C2497AF8F]) [    ] o.a.s.c.SolrResourceLoader new SolrResourceLoader for directory: 'C:\Users\jenkins\workspace\Lucene-Solr-6.x-Windows\solr\build\solr-core\test\J1\temp\solr.handler.TestReqParamsAPI_9497902C2497AF8F-001\shard-1-001'
   [junit4]   2> 3021622 INFO  (TEST-TestReqParamsAPI.test-seed#[9497902C2497AF8F]) [    ] o.a.s.c.SolrResourceLoader JNDI not configured for solr (NoInitialContextEx)
   [junit4]   2> 3021622 INFO  (TEST-TestReqParamsAPI.test-seed#[9497902C2497AF8F]) [    ] o.a.s.c.SolrResourceLoader solr home defaulted to 'solr/' (could not find system property or JNDI)
   [junit4]   2> 3021623 INFO  (TEST-TestReqParamsAPI.test-seed#[9497902C2497AF8F]) [    ] o.a.s.c.c.SolrZkClient Using default ZkCredentialsProvider
   [junit4]   2> 3021624 INFO  (TEST-TestReqParamsAPI.test-seed#[9497902C2497AF8F]) [    ] o.a.s.c.c.ConnectionManager Waiting for client to connect to ZooKeeper
   [junit4]   2> 3021626 INFO  (zkCallback-3861-thread-1) [    ] o.a.s.c.c.ConnectionManager Watcher org.apache.solr.common.cloud.ConnectionManager@50f9e176 name:ZooKeeperConnection Watcher:127.0.0.1:63584/solr got event WatchedEvent state:SyncConnected type:None path:null path:null type:None
   [junit4]   2> 3021626 INFO  (TEST-TestReqParamsAPI.test-seed#[9497902C2497AF8F]) [    ] o.a.s.c.c.ConnectionManager Client is connected to ZooKeeper
   [junit4]   2> 3021626 INFO  (TEST-TestReqParamsAPI.test-seed#[9497902C2497AF8F]) [    ] o.a.s.c.c.SolrZkClient Using default ZkACLProvider
   [junit4]   2> 3021628 WARN  (NIOServerCxn.Factory:0.0.0.0/0.0.0.0:0) [    ] o.a.z.s.NIOServerCnxn caught end of stream exception
   [junit4]   2> EndOfStreamException: Unable to read additional data from client sessionid 0x154dd67d2ca0006, likely client has closed socket
   [junit4]   2> 	at org.apache.zookeeper.server.NIOServerCnxn.doIO(NIOServerCnxn.java:228)
   [junit4]   2> 	at org.apache.zookeeper.server.NIOServerCnxnFactory.run(NIOServerCnxnFactory.java:208)
   [junit4]   2> 	at java.lang.Thread.run(Thread.java:745)
   [junit4]   2> 3021628 INFO  (TEST-TestReqParamsAPI.test-seed#[9497902C2497AF8F]) [    ] o.a.s.s.SolrDispatchFilter Loading solr.xml from SolrHome (not found in ZooKeeper)
   [junit4]   2> 3021628 INFO  (TEST-TestReqParamsAPI.test-seed#[9497902C2497AF8F]) [    ] o.a.s.c.SolrXmlConfig Loading container configuration from C:\Users\jenkins\workspace\Lucene-Solr-6.x-Windows\solr\build\solr-core\test\J1\temp\solr.handler.TestReqParamsAPI_9497902C2497AF8F-001\shard-1-001\solr.xml
   [junit4]   2> 3021640 INFO  (TEST-TestReqParamsAPI.test-seed#[9497902C2497AF8F]) [    ] o.a.s.c.CorePropertiesLocator Config-defined core root directory: C:\Users\jenkins\workspace\Lucene-Solr-6.x-Windows\solr\build\solr-core\test\J1\temp\solr.handler.TestReqParamsAPI_9497902C2497AF8F-001\shard-1-001\cores
   [junit4]   2> 3021640 INFO  (TEST-TestReqParamsAPI.test-seed#[9497902C2497AF8F]) [    ] o.a.s.c.CoreContainer New CoreContainer 803392722
   [junit4]   2> 3021640 INFO  (TEST-TestReqParamsAPI.test-seed#[9497902C2497AF8F]) [    ] o.a.s.c.CoreContainer Loading cores into CoreContainer [instanceDir=C:\Users\jenkins\workspace\Lucene-Solr-6.x-Windows\solr\build\solr-core\test\J1\temp\solr.handler.TestReqParamsAPI_9497902C2497AF8F-001\shard-1-001]
   [junit4]   2> 3021640 WARN  (TEST-TestReqParamsAPI.test-seed#[9497902C2497AF8F]) [    ] o.a.s.c.CoreContainer Couldn't add files from C:\Users\jenkins\workspace\Lucene-Solr-6.x-Windows\solr\build\solr-core\test\J1\temp\solr.handler.TestReqParamsAPI_9497902C2497AF8F-001\shard-1-001\lib to classpath: C:\Users\jenkins\workspace\Lucene-Solr-6.x-Windows\solr\build\solr-core\test\J1\temp\solr.handler.TestReqParamsAPI_9497902C2497AF8F-001\shard-1-001\lib
   [junit4]   2> 3021641 INFO  (TEST-TestReqParamsAPI.test-seed#[9497902C2497AF8F]) [    ] o.a.s.h.c.HttpShardHandlerFactory created with socketTimeout : 90000,urlScheme : ,connTimeout : 15000,maxConnectionsPerHost : 20,maxConnections : 10000,corePoolSize : 0,maximumPoolSize : 2147483647,maxThreadIdleTime : 5,sizeOfQueue : -1,fairnessPolicy : false,useRetries : false,
   [junit4]   2> 3021644 INFO  (TEST-TestReqParamsAPI.test-seed#[9497902C2497AF8F]) [    ] o.a.s.u.UpdateShardHandler Creating UpdateShardHandler HTTP client with params: socketTimeout=340000&connTimeout=45000&retry=true
   [junit4]   2> 3021645 INFO  (TEST-TestReqParamsAPI.test-seed#[9497902C2497AF8F]) [    ] o.a.s.l.LogWatcher SLF4J impl is org.slf4j.impl.Log4jLoggerFactory
   [junit4]   2> 3021645 INFO  (TEST-TestReqParamsAPI.test-seed#[9497902C2497AF8F]) [    ] o.a.s.l.LogWatcher Registering Log Listener [Log4j (org.slf4j.impl.Log4jLoggerFactory)]
   [junit4]   2> 3021645 INFO  (TEST-TestReqParamsAPI.test-seed#[9497902C2497AF8F]) [    ] o.a.s.c.ZkContainer Zookeeper client=127.0.0.1:63584/solr
   [junit4]   2> 3021645 INFO  (TEST-TestReqParamsAPI.test-seed#[9497902C2497AF8F]) [    ] o.a.s.c.ZkController zkHost includes chroot
   [junit4]   2> 3021645 INFO  (TEST-TestReqParamsAPI.test-seed#[9497902C2497AF8F]) [    ] o.a.s.c.c.SolrZkClient Using default ZkCredentialsProvider
   [junit4]   2> 3021646 INFO  (TEST-TestReqParamsAPI.test-seed#[9497902C2497AF8F]) [    ] o.a.s.c.c.ConnectionManager Waiting for client to connect to ZooKeeper
   [junit4]   2> 3021648 INFO  (zkCallback-3864-thread-1) [    ] o.a.s.c.c.ConnectionManager Watcher org.apache.solr.common.cloud.ConnectionManager@7c0e8e1b name:ZooKeeperConnection Watcher:127.0.0.1:63584 got event WatchedEvent state:SyncConnected type:None path:null path:null type:None
   [junit4]   2> 3021648 INFO  (TEST-TestReqParamsAPI.test-seed#[9497902C2497AF8F]) [    ] o.a.s.c.c.ConnectionManager Client is connected to ZooKeeper
   [junit4]   2> 3021648 INFO  (TEST-TestReqParamsAPI.test-seed#[9497902C2497AF8F]) [    ] o.a.s.c.c.SolrZkClient Using default ZkACLProvider
   [junit4]   2> 3021649 INFO  (TEST-TestReqParamsAPI.test-seed#[9497902C2497AF8F]) [n:127.0.0.1:63608_    ] o.a.s.c.ZkController Added new OnReconnect listener org.apache.solr.cloud.ZkController$$Lambda$10/1022744557@5e0df704
   [junit4]   2> 3021652 INFO  (TEST-TestReqParamsAPI.test-seed#[9497902C2497AF8F]) [n:127.0.0.1:63608_    ] o.a.s.c.c.ConnectionManager Waiting for client to connect to ZooKeeper
   [junit4]   2> 3021652 INFO  (zkCallback-3865-thread-1-processing-n:127.0.0.1:63608_) [n:127.0.0.1:63608_    ] o.a.s.c.c.ConnectionManager Watcher org.apache.solr.common.cloud.ConnectionManager@3ee1ce6e name:ZooKeeperConnection Watcher:127.0.0.1:63584/solr got event WatchedEvent state:SyncConnected type:None path:null path:null type:None
   [junit4]   2> 3021653 INFO  (TEST-TestReqParamsAPI.test-seed#[9497902C2497AF8F]) [n:127.0.0.1:63608_    ] o.a.s.c.c.ConnectionManager Client is connected to ZooKeeper
   [junit4]   2> 3021661 INFO  (TEST-TestReqParamsAPI.test-seed#[9497902C2497AF8F]) [n:127.0.0.1:63608_    ] o.a.s.c.c.ZkStateReader Updating cluster state from ZooKeeper... 
   [junit4]   2> 3021661 INFO  (TEST-TestReqParamsAPI.test-seed#[9497902C2497AF8F]) [n:127.0.0.1:63608_    ] o.a.s.c.c.ZkStateReader Loaded empty cluster properties
   [junit4]   2> 3021662 INFO  (TEST-TestReqParamsAPI.test-seed#[9497902C2497AF8F]) [n:127.0.0.1:63608_    ] o.a.s.c.c.ZkStateReader Updated live nodes from ZooKeeper... (0) -> (1)
   [junit4]   2> 3021666 INFO  (TEST-TestReqParamsAPI.test-seed#[9497902C2497AF8F]) [n:127.0.0.1:63608_    ] o.a.s.c.Overseer Overseer (id=null) closing
   [junit4]   2> 3021666 INFO  (TEST-TestReqParamsAPI.test-seed#[9497902C2497AF8F]) [n:127.0.0.1:63608_    ] o.a.s.c.LeaderElector Joined leadership election with path: /overseer_elect/election/95944930069446664-127.0.0.1:63608_-n_0000000001
   [junit4]   2> 3021667 INFO  (TEST-TestReqParamsAPI.test-seed#[9497902C2497AF8F]) [n:127.0.0.1:63608_    ] o.a.s.c.LeaderElector Watching path /overseer_elect/election/95944930069446660-127.0.0.1:63591_-n_0000000000 to know if I could be the leader
   [junit4]   2> 3021668 INFO  (TEST-TestReqParamsAPI.test-seed#[9497902C2497AF8F]) [n:127.0.0.1:63608_    ] o.a.s.c.ZkController Publish node=127.0.0.1:63608_ as DOWN
   [junit4]   2> 3021670 INFO  (OverseerStateUpdate-95944930069446660-127.0.0.1:63591_-n_0000000000) [n:127.0.0.1:63591_    ] o.a.s.c.Overseer processMessage: queueSize: 1, message = {
   [junit4]   2>   "operation":"downnode",
   [junit4]   2>   "node_name":"127.0.0.1:63608_"} current state version: 3
   [junit4]   2> 3021670 INFO  (OverseerStateUpdate-95944930069446660-127.0.0.1:63591_-n_0000000000) [n:127.0.0.1:63591_    ] o.a.s.c.o.NodeMutator DownNode state invoked for node: 127.0.0.1:63608_
   [junit4]   2> 3021773 INFO  (zkCallback-3856-thread-1-processing-n:127.0.0.1:63591_) [n:127.0.0.1:63591_    ] o.a.s.c.c.ZkStateReader A cluster state change: [WatchedEvent state:SyncConnected type:NodeDataChanged path:/clusterstate.json], has occurred - updating... (live nodes size: [1])
   [junit4]   2> 3021773 INFO  (zkCallback-3860-thread-1) [    ] o.a.s.c.c.ZkStateReader A cluster state change: [WatchedEvent state:SyncConnected type:NodeDataChanged path:/clusterstate.json], has occurred - updating... (live nodes size: [1])
   [junit4]   2> 3021773 INFO  (zkCallback-3865-thread-1-processing-n:127.0.0.1:63608_) [n:127.0.0.1:63608_    ] o.a.s.c.c.ZkStateReader A cluster state change: [WatchedEvent state:SyncConnected type:NodeDataChanged path:/clusterstate.json], has occurred - updating... (live nodes size: [1])
   [junit4]   2> 3022670 INFO  (TEST-TestReqParamsAPI.test-seed#[9497902C2497AF8F]) [n:127.0.0.1:63608_    ] o.a.s.c.ZkController Register node as live in ZooKeeper:/live_nodes/127.0.0.1:63608_
   [junit4]   2> 3022670 INFO  (TEST-TestReqParamsAPI.test-seed#[9497902C2497AF8F]) [n:127.0.0.1:63608_    ] o.a.s.c.c.SolrZkClient makePath: /live_nodes/127.0.0.1:63608_
   [junit4]   2> 3022672 INFO  (zkCallback-3865-thread-1-processing-n:127.0.0.1:63608_) [n:127.0.0.1:63608_    ] o.a.s.c.c.ZkStateReader A live node change: [WatchedEvent state:SyncConnected type:NodeChildrenChanged path:/live_nodes], has occurred - updating... (live nodes size: [1])
   [junit4]   2> 3022672 INFO  (zkCallback-3860-thread-1) [    ] o.a.s.c.c.ZkStateReader A live node change: [WatchedEvent state:SyncConnected type:NodeChildrenChanged path:/live_nodes], has occurred - updating... (live nodes size: [1])
   [junit4]   2> 3022672 INFO  (zkCallback-3856-thread-1-processing-n:127.0.0.1:63591_) [n:127.0.0.1:63591_    ] o.a.s.c.c.ZkStateReader A live node change: [WatchedEvent state:SyncConnected type:NodeChildrenChanged path:/live_nodes], has occurred - updating... (live nodes size: [1])
   [junit4]   2> 3022673 INFO  (zkCallback-3865-thread-1-processing-n:127.0.0.1:63608_) [n:127.0.0.1:63608_    ] o.a.s.c.c.ZkStateReader Updated live nodes from ZooKeeper... (1) -> (2)
   [junit4]   2> 3022673 INFO  (zkCallback-3860-thread-1) [    ] o.a.s.c.c.ZkStateReader Updated live nodes from ZooKeeper... (1) -> (2)
   [junit4]   2> 3022673 INFO  (zkCallback-3856-thread-1-processing-n:127.0.0.1:63591_) [n:127.0.0.1:63591_    ] o.a.s.c.c.ZkStateReader Updated live nodes from ZooKeeper... (1) -> (2)
   [junit4]   2> 3022678 INFO  (TEST-TestReqParamsAPI.test-seed#[9497902C2497AF8F]) [n:127.0.0.1:63608_    ] o.a.s.c.CoreContainer Security conf doesn't exist. Skipping setup for authorization module.
   [junit4]   2> 3022678 INFO  (TEST-TestReqParamsAPI.test-seed#[9497902C2497AF8F]) [n:127.0.0.1:63608_    ] o.a.s.c.CoreContainer No authentication plugin used.
   [junit4]   2> 3022679 INFO  (TEST-TestReqParamsAPI.test-seed#[9497902C2497AF8F]) [n:127.0.0.1:63608_    ] o.a.s.c.CorePropertiesLocator Looking for core definitions underneath C:\Users\jenkins\workspace\Lucene-Solr-6.x-Windows\solr\build\solr-core\test\J1\temp\solr.handler.TestReqParamsAPI_9497902C2497AF8F-001\shard-1-001\cores
   [junit4]   2> 3022681 INFO  (TEST-TestReqParamsAPI.test-seed#[9497902C2497AF8F]) [n:127.0.0.1:63608_    ] o.a.s.c.CoreDescriptor Created CoreDescriptor: {name=collection1, config=solrconfig.xml, transient=false, schema=schema.xml, loadOnStartup=true, configSetProperties=configsetprops.json, collection=collection1, coreNodeName=, dataDir=data\, shard=}
   [junit4]   2> 3022681 INFO  (TEST-TestReqParamsAPI.test-seed#[9497902C2497AF8F]) [n:127.0.0.1:63608_    ] o.a.s.c.CorePropertiesLocator Found core collection1 in C:\Users\jenkins\workspace\Lucene-Solr-6.x-Windows\solr\build\solr-core\test\J1\temp\solr.handler.TestReqParamsAPI_9497902C2497AF8F-001\shard-1-001\cores\collection1
   [junit4]   2> 3022681 INFO  (TEST-TestReqParamsAPI.test-seed#[9497902C2497AF8F]) [n:127.0.0.1:63608_    ] o.a.s.c.CorePropertiesLocator Found 1 core definitions
   [junit4]   2> 3022681 INFO  (TEST-TestReqParamsAPI.test-seed#[9497902C2497AF8F]) [n:127.0.0.1:63608_    ] o.a.s.s.SolrDispatchFilter user.dir=C:\Users\jenkins\workspace\Lucene-Solr-6.x-Windows\solr\build\solr-core\test\J1
   [junit4]   2> 3022682 INFO  (TEST-TestReqParamsAPI.test-seed#[9497902C2497AF8F]) [n:127.0.0.1:63608_    ] o.a.s.s.SolrDispatchFilter SolrDispatchFilter.init() done
   [junit4]   2> 3022682 INFO  (coreLoadExecutor-9704-thread-1-processing-n:127.0.0.1:63608_) [n:127.0.0.1:63608_ c:collection1   x:collection1] o.a.s.c.ZkController publishing state=down
   [junit4]   2> 3022682 INFO  (coreLoadExecutor-9704-thread-1-processing-n:127.0.0.1:63608_) [n:127.0.0.1:63608_ c:collection1   x:collection1] o.a.s.c.ZkController numShards not found on descriptor - reading it from system property
   [junit4]   2> 3022683 INFO  (coreLoadExecutor-9704-thread-1-processing-n:127.0.0.1:63608_) [n:127.0.0.1:63608_ c:collection1   x:collection1] o.a.s.c.ZkController Collection collection1 not visible yet, but flagging it so a watch is registered when it becomes visible
   [junit4]   2> 3022684 INFO  (OverseerStateUpdate-95944930069446660-127.0.0.1:63591_-n_0000000000) [n:127.0.0.1:63591_    ] o.a.s.c.Overseer processMessage: queueSize: 1, message = {
   [junit4]   2>   "core":"collection1",
   [junit4]   2>   "roles":null,
   [junit4]   2>   "base_url":"http://127.0.0.1:63608",
   [junit4]   2>   "node_name":"127.0.0.1:63608_",
   [junit4]   2>   "numShards":"2",
   [junit4]   2>   "state":"down",
   [junit4]   2>   "shard":null,
   [junit4]   2>   "collection":"collection1",
   [junit4]   2>   "operation":"state"} current state version: 4
   [junit4]   2> 3022684 INFO  (OverseerStateUpdate-95944930069446660-127.0.0.1:63591_-n_0000000000) [n:127.0.0.1:63591_    ] o.a.s.c.o.ReplicaMutator Update state numShards=2 message={
   [junit4]   2>   "core":"collection1",
   [junit4]   2>   "roles":null,
   [junit4]   2>   "base_url":"http://127.0.0.1:63608",
   [junit4]   2>   "node_name":"127.0.0.1:63608_",
   [junit4]   2>   "numShards":"2",
   [junit4]   2>   "state":"down",
   [junit4]   2>   "shard":null,
   [junit4]   2>   "collection":"collection1",
   [junit4]   2>   "operation":"state"}
   [junit4]   2> 3022684 INFO  (OverseerStateUpdate-95944930069446660-127.0.0.1:63591_-n_0000000000) [n:127.0.0.1:63591_    ] o.a.s.c.o.ClusterStateMutator building a new cName: collection1
   [junit4]   2> 3022684 INFO  (OverseerStateUpdate-95944930069446660-127.0.0.1:63591_-n_0000000000) [n:127.0.0.1:63591_    ] o.a.s.c.o.ReplicaMutator Assigning new node to shard shard=shard2
   [junit4]   2> 3022684 INFO  (coreLoadExecutor-9704-thread-1-processing-n:127.0.0.1:63608_) [n:127.0.0.1:63608_ c:collection1   x:collection1] o.a.s.c.c.ZkStateReader Deleting data for [collection1]
   [junit4]   2> 3022685 INFO  (coreLoadExecutor-9704-thread-1-processing-n:127.0.0.1:63608_) [n:127.0.0.1:63608_ c:collection1   x:collection1] o.a.s.c.ZkController look for our core node name
   [junit4]   2> 3022786 INFO  (zkCallback-3865-thread-1-processing-n:127.0.0.1:63608_) [n:127.0.0.1:63608_    ] o.a.s.c.c.ZkStateReader A cluster state change: [WatchedEvent state:SyncConnected type:NodeDataChanged path:/clusterstate.json], has occurred - updating... (live nodes size: [2])
   [junit4]   2> 3022787 INFO  (zkCallback-3856-thread-1-processing-n:127.0.0.1:63591_) [n:127.0.0.1:63591_    ] o.a.s.c.c.ZkStateReader A cluster state change: [WatchedEvent state:SyncConnected type:NodeDataChanged path:/clusterstate.json], has occurred - updating... (live nodes size: [2])
   [junit4]   2> 3022787 INFO  (zkCallback-3860-thread-1) [    ] o.a.s.c.c.ZkStateReader A cluster state change: [WatchedEvent state:SyncConnected type:NodeDataChanged path:/clusterstate.json], has occurred - updating... (live nodes size: [2])
   [junit4]   2> 3023686 INFO  (coreLoadExecutor-9704-thread-1-processing-n:127.0.0.1:63608_) [n:127.0.0.1:63608_ c:collection1   x:collection1] o.a.s.c.ZkController waiting to find shard id in clusterstate for collection1
   [junit4]   2> 3023686 INFO  (coreLoadExecutor-9704-thread-1-processing-n:127.0.0.1:63608_) [n:127.0.0.1:63608_ c:collection1   x:collection1] o.a.s.c.ZkController Check for collection zkNode:collection1
   [junit4]   2> 3023686 INFO  (coreLoadExecutor-9704-thread-1-processing-n:127.0.0.1:63608_) [n:127.0.0.1:63608_ c:collection1   x:collection1] o.a.s.c.ZkController Collection zkNode exists
   [junit4]   2> 3023686 INFO  (coreLoadExecutor-9704-thread-1-processing-n:127.0.0.1:63608_) [n:127.0.0.1:63608_ c:collection1   x:collection1] o.a.s.c.c.ZkStateReader Load collection config from: [/collections/collection1]
   [junit4]   2> 3023688 INFO  (coreLoadExecutor-9704-thread-1-processing-n:127.0.0.1:63608_) [n:127.0.0.1:63608_ c:collection1   x:collection1] o.a.s.c.c.ZkStateReader path=[/collections/collection1] [configName]=[conf1] specified config exists in ZooKeeper
   [junit4]   2> 3023688 INFO  (coreLoadExecutor-9704-thread-1-processing-n:127.0.0.1:63608_) [n:127.0.0.1:63608_ c:collection1   x:collection1] o.a.s.c.SolrResourceLoader new SolrResourceLoader for directory: 'C:\Users\jenkins\workspace\Lucene-Solr-6.x-Windows\solr\build\solr-core\test\J1\temp\solr.handler.TestReqParamsAPI_9497902C2497AF8F-001\shard-1-001\cores\collection1'
   [junit4]   2> 3023688 INFO  (coreLoadExecutor-9704-thread-1-processing-n:127.0.0.1:63608_) [n:127.0.0.1:63608_ c:collection1   x:collection1] o.a.s.c.SolrResourceLoader JNDI not configured for solr (NoInitialContextEx)
   [junit4]   2> 3023688 INFO  (coreLoadExecutor-9704-thread-1-processing-n:127.0.0.1:63608_) [n:127.0.0.1:63608_ c:collection1   x:collection1] o.a.s.c.SolrResourceLoader solr home defaulted to 'solr/' (could not find system property or JNDI)
   [junit4]   2> 3023690 INFO  (coreLoadExecutor-9704-thread-1-processing-n:127.0.0.1:63608_) [n:127.0.0.1:63608_ c:collection1   x:collection1] o.a.s.c.Config loaded config solrconfig.xml with version 0 
   [junit4]   2> 3023699 INFO  (coreLoadExecutor-9704-thread-1-processing-n:127.0.0.1:63608_) [n:127.0.0.1:63608_ c:collection1   x:collection1] o.a.s.c.SolrConfig current version of requestparams : -1
   [junit4]   2> 3023702 INFO  (coreLoadExecutor-9704-thread-1-processing-n:127.0.0.1:63608_) [n:127.0.0.1:63608_ c:collection1   x:collection1] o.a.s.c.SolrConfig Using Lucene MatchVersion: 6.1.0
   [junit4]   2> 3023710 INFO  (coreLoadExecutor-9704-thread-1-processing-n:127.0.0.1:63608_) [n:127.0.0.1:63608_ c:collection1   x:collection1] o.a.s.c.SolrConfig Loaded SolrConfig: solrconfig.xml
   [junit4]   2> 3023716 INFO  (coreLoadExecutor-9704-thread-1-processing-n:127.0.0.1:63608_) [n:127.0.0.1:63608_ c:collection1   x:collection1] o.a.s.s.IndexSchema [collection1] Schema name=test
   [junit4]   2> 3023819 INFO  (coreLoadExecutor-9704-thread-1-processing-n:127.0.0.1:63608_) [n:127.0.0.1:63608_ c:collection1   x:collection1] o.a.s.s.OpenExchangeRatesOrgProvider Initialized with rates=open-exchange-rates.json, refreshInterval=1440.
   [junit4]   2> 3023829 INFO  (coreLoadExecutor-9704-thread-1-processing-n:127.0.0.1:63608_) [n:127.0.0.1:63608_ c:collection1   x:collection1] o.a.s.s.IndexSchema default search field in schema is text
   [junit4]   2> 3023830 INFO  (coreLoadExecutor-9704-thread-1-processing-n:127.0.0.1:63608_) [n:127.0.0.1:63608_ c:collection1   x:collection1] o.a.s.s.IndexSchema unique key field: id
   [junit4]   2> 3023841 INFO  (coreLoadExecutor-9704-thread-1-processing-n:127.0.0.1:63608_) [n:127.0.0.1:63608_ c:collection1   x:collection1] o.a.s.s.FileExchangeRateProvider Reloading exchange rates from file currency.xml
   [junit4]   2> 3023844 INFO  (coreLoadExecutor-9704-thread-1-processing-n:127.0.0.1:63608_) [n:127.0.0.1:63608_ c:collection1   x:collection1] o.a.s.s.FileExchangeRateProvider Reloading exchange rates from file currency.xml
   [junit4]   2> 3023848 INFO  (coreLoadExecutor-9704-thread-1-processing-n:127.0.0.1:63608_) [n:127.0.0.1:63608_ c:collection1   x:collection1] o.a.s.s.OpenExchangeRatesOrgProvider Reloading exchange rates from open-exchange-rates.json
   [junit4]   2> 3023849 INFO  (coreLoadExecutor-9704-thread-1-processing-n:127.0.0.1:63608_) [n:127.0.0.1:63608_ c:collection1   x:collection1] o.a.s.s.OpenExchangeRatesOrgProvider Reloading exchange rates from open-exchange-rates.json
   [junit4]   2> 3023853 INFO  (coreLoadExecutor-9704-thread-1-processing-n:127.0.0.1:63608_) [n:127.0.0.1:63608_ c:collection1

[...truncated too long message...]

t4]   2> 	3	/solr/overseer/queue
   [junit4]   2> 	3	/solr/overseer/collection-queue-work
   [junit4]   2> 
   [junit4]   2> NOTE: reproduce with: ant test  -Dtestcase=TestReqParamsAPI -Dtests.method=test -Dtests.seed=9497902C2497AF8F -Dtests.slow=true -Dtests.locale=hu-HU -Dtests.timezone=Etc/GMT-14 -Dtests.asserts=true -Dtests.file.encoding=US-ASCII
   [junit4] FAILURE 28.0s J1 | TestReqParamsAPI.test <<<
   [junit4]    > Throwable #1: java.lang.AssertionError: Could not get expected value  'CY val' for path 'params/c' full output: {
   [junit4]    >   "responseHeader":{
   [junit4]    >     "status":0,
   [junit4]    >     "QTime":0},
   [junit4]    >   "params":{
   [junit4]    >     "a":"A val",
   [junit4]    >     "b":"B val",
   [junit4]    >     "wt":"json",
   [junit4]    >     "useParams":""},
   [junit4]    >   "context":{
   [junit4]    >     "webapp":"",
   [junit4]    >     "path":"/dump1",
   [junit4]    >     "httpMethod":"GET"}},  from server:  http://127.0.0.1:63650/collection1
   [junit4]    > 	at __randomizedtesting.SeedInfo.seed([9497902C2497AF8F:1CC3AFF68A6BC277]:0)
   [junit4]    > 	at org.apache.solr.core.TestSolrConfigHandler.testForResponseElement(TestSolrConfigHandler.java:457)
   [junit4]    > 	at org.apache.solr.handler.TestReqParamsAPI.testReqParams(TestReqParamsAPI.java:172)
   [junit4]    > 	at org.apache.solr.handler.TestReqParamsAPI.test(TestReqParamsAPI.java:62)
   [junit4]    > 	at org.apache.solr.BaseDistributedSearchTestCase$ShardsRepeatRule$ShardsFixedStatement.callStatement(BaseDistributedSearchTestCase.java:992)
   [junit4]    > 	at org.apache.solr.BaseDistributedSearchTestCase$ShardsRepeatRule$ShardsStatement.evaluate(BaseDistributedSearchTestCase.java:967)
   [junit4]    > 	at java.lang.Thread.run(Thread.java:745)
   [junit4]   2> 3046753 INFO  (SUITE-TestReqParamsAPI-seed#[9497902C2497AF8F]-worker) [    ] o.a.s.SolrTestCaseJ4 ###deleteCore
   [junit4]   2> NOTE: leaving temporary files on disk at: C:\Users\jenkins\workspace\Lucene-Solr-6.x-Windows\solr\build\solr-core\test\J1\temp\solr.handler.TestReqParamsAPI_9497902C2497AF8F-001
   [junit4]   2> May 23, 2016 11:37:57 AM com.carrotsearch.randomizedtesting.ThreadLeakControl checkThreadLeaks
   [junit4]   2> WARNING: Will linger awaiting termination of 1 leaked thread(s).
   [junit4]   2> NOTE: test params are: codec=Lucene60, sim=ClassicSimilarity, locale=hu-HU, timezone=Etc/GMT-14
   [junit4]   2> NOTE: Windows 10 10.0 amd64/Oracle Corporation 1.8.0_92 (64-bit)/cpus=3,threads=1,free=142895136,total=536870912
   [junit4]   2> NOTE: All tests run in this JVM: [CollectionTooManyReplicasTest, AddSchemaFieldsUpdateProcessorFactoryTest, SolrCmdDistributorTest, LeaderFailoverAfterPartitionTest, ZkNodePropsTest, CleanupOldIndexTest, NumericFieldsTest, TestSolrCloudWithKerberosAlt, TestRestoreCore, FileBasedSpellCheckerTest, HdfsDirectoryTest, OutputWriterTest, SpellCheckComponentTest, ResponseLogComponentTest, JavabinLoaderTest, TestDistribIDF, SolrCloudExampleTest, TestBinaryField, SolrInfoMBeanTest, TestIndexingPerformance, TestFieldTypeCollectionResource, LeaderElectionIntegrationTest, TestRealTimeGet, HLLUtilTest, TestHdfsUpdateLog, IndexSchemaRuntimeFieldTest, TestCollationField, TestZkChroot, OpenExchangeRatesOrgProviderTest, CdcrReplicationHandlerTest, TestSystemIdResolver, TestAddFieldRealTimeGet, TestSolrXml, OverseerRolesTest, SuggesterTSTTest, TestClusterStateMutator, TestAuthorizationFramework, TestReloadAndDeleteDocs, TestRandomRequestDistribution, TestFilteredDocIdSet, WrapperMergePolicyFactoryTest, TestCloudPivotFacet, FullSolrCloudDistribCmdsTest, DistributedTermsComponentTest, TestIntervalFaceting, TestRequestStatusCollectionAPI, CursorMarkTest, TermVectorComponentTest, TestSortByMinMaxFunction, QueryParsingTest, HdfsNNFailoverTest, DistributedQueryComponentOptimizationTest, TestDistributedGrouping, TestUseDocValuesAsStored, TestAtomicUpdateErrorCases, ChaosMonkeySafeLeaderTest, DefaultValueUpdateProcessorTest, TestSubQueryTransformer, TestQueryTypes, TestBinaryResponseWriter, TestDocBasedVersionConstraints, FieldMutatingUpdateProcessorTest, UUIDUpdateProcessorFallbackTest, CreateCollectionCleanupTest, EchoParamsTest, HdfsWriteToMultipleCollectionsTest, TestMaxScoreQueryParser, TestShortCircuitedRequests, MinimalSchemaTest, HdfsChaosMonkeySafeLeaderTest, CoreMergeIndexesAdminHandlerTest, TestSolr4Spatial, TlogReplayBufferedWhileIndexingTest, TestDistributedStatsComponentCardinality, TestScoreJoinQPNoScore, LukeRequestHandlerTest, SuggesterWFSTTest, TestSearcherReuse, AsyncCallRequestStatusResponseTest, ParsingFieldUpdateProcessorsTest, TestConfigSetsAPIZkFailure, TestAuthenticationFramework, TestNoOpRegenerator, TestFuzzyAnalyzedSuggestions, CdcrVersionReplicationTest, TestFileDictionaryLookup, TestBadConfig, TestRawTransformer, AutoCommitTest, TestReplicaProperties, TestSimpleTrackingShardHandler, DateFieldTest, VMParamsZkACLAndCredentialsProvidersTest, BasicAuthIntegrationTest, SynonymTokenizerTest, LoggingHandlerTest, TestBulkSchemaConcurrent, BigEndianAscendingWordDeserializerTest, SolrPluginUtilsTest, TestDistribDocBasedVersion, TestReload, TestMiniSolrCloudClusterSSL, ShardRoutingCustomTest, TestRecoveryHdfs, TestReversedWildcardFilterFactory, NoCacheHeaderTest, SolrCoreCheckLockOnStartupTest, ExitableDirectoryReaderTest, ZkStateWriterTest, TestRandomFaceting, SearchHandlerTest, DirectUpdateHandlerOptimizeTest, BaseCdcrDistributedZkTest, UniqFieldsUpdateProcessorFactoryTest, BlockJoinFacetSimpleTest, SimpleMLTQParserTest, TestJsonRequest, TestUtils, TestDynamicFieldCollectionResource, TestReplicationHandlerBackup, SecurityConfHandlerTest, DateMathParserTest, TestSolrQueryParserResource, TestCloudDeleteByQuery, HdfsTlogReplayBufferedWhileIndexingTest, QueryResultKeyTest, ConnectionReuseTest, ClassificationUpdateProcessorFactoryTest, TestManagedSchemaAPI, TestSubQueryTransformerDistrib, TestDFISimilarityFactory, ResourceLoaderTest, DistributedFacetPivotLargeTest, TestFoldingMultitermQuery, DistributedIntervalFacetingTest, ConfigSetsAPITest, ShardSplitTest, DateRangeFieldTest, NotRequiredUniqueKeyTest, RestartWhileUpdatingTest, CoreAdminCreateDiscoverTest, TestSchemaSimilarityResource, TestCustomSort, TestXmlQParser, AnalyticsMergeStrategyTest, OpenCloseCoreStressTest, OverseerTest, ShardRoutingTest, BasicZkTest, LeaderElectionTest, ZkSolrClientTest, TestRandomDVFaceting, ZkCLITest, TestRecovery, TestHashPartitioner, TermVectorComponentDistributedTest, ZkControllerTest, TestJoin, TestStressVersions, TestRangeQuery, TestCoreContainer, SolrCoreTest, QueryElevationComponentTest, PeerSyncTest, ConvertedLegacyTest, TestFiltering, DirectUpdateHandlerTest, TestIndexSearcher, CurrencyFieldOpenExchangeTest, SolrIndexSplitterTest, SimplePostToolTest, TestCoreDiscovery, AnalysisAfterCoreReloadTest, SignatureUpdateProcessorFactoryTest, SpellCheckCollatorTest, CoreAdminHandlerTest, TestTrie, PolyFieldTest, SchemaVersionSpecificBehaviorTest, QueryEqualityTest, TestSolrDeletionPolicy1, DebugComponentTest, TestSurroundQueryParser, TestQueryUtils, DirectSolrSpellCheckerTest, PrimitiveFieldTypeTest, RequestHandlersTest, MoreLikeThisHandlerTest, TestSolrQueryParser, RegexBoostProcessorTest, UpdateRequestProcessorFactoryTest, JSONWriterTest, BinaryUpdateRequestHandlerTest, CSVRequestHandlerTest, SOLR749Test, TestSolrIndexConfig, TestStressRecovery, TestSolrDeletionPolicy2, MultiTermTest, TestElisionMultitermQuery, DirectSolrConnectionTest, TestLuceneMatchVersion, TestXIncludeConfig, TestPerFieldSimilarity, TestBM25SimilarityFactory, TestFastOutputStream, PluginInfoTest, ChaosMonkeyNothingIsSafeTest, AsyncMigrateRouteKeyTest, CollectionsAPIAsyncDistributedZkTest, ConnectionManagerTest, CustomCollectionTest, DeleteStatusTest, DistribCursorPagingTest, DistribJoinFromCollectionTest, ForceLeaderTest, LeaderInitiatedRecoveryOnCommitTest, OverriddenZkACLAndCredentialsProvidersTest, OverseerStatusTest, OverseerTaskQueueTest, RecoveryAfterSoftCommitTest, ReplicationFactorTest, RollingRestartTest, TestConfigSetsAPI, TestDownShardTolerantSearch, TestExclusionRuleCollectionAccess, TestMiniSolrCloudClusterBase, TestSizeLimitedDistributedMap, TestTolerantUpdateProcessorCloud, BlobRepositoryCloudTest, CachingDirectoryFactoryTest, DirectoryFactoryTest, TestConfigOverlay, TestConfigSetImmutable, TestConfigSetProperties, TestConfigSets, TestDynamicLoading, TestImplicitCoreProperties, TestInfoStreamLogging, TestInitParams, TestNRTOpen, TestShardHandlerFactory, TestSolrConfigHandler, TestSolrDynamicMBean, RequestLoggingTest, TestBlobHandler, TestReqParamsAPI]
   [junit4] Completed [499/598 (1!)] on J1 in 28.54s, 1 test, 1 failure <<< FAILURES!

[...truncated 344 lines...]
BUILD FAILED
C:\Users\jenkins\workspace\Lucene-Solr-6.x-Windows\build.xml:740: The following error occurred while executing this line:
C:\Users\jenkins\workspace\Lucene-Solr-6.x-Windows\build.xml:684: The following error occurred while executing this line:
C:\Users\jenkins\workspace\Lucene-Solr-6.x-Windows\build.xml:59: The following error occurred while executing this line:
C:\Users\jenkins\workspace\Lucene-Solr-6.x-Windows\solr\build.xml:233: The following error occurred while executing this line:
C:\Users\jenkins\workspace\Lucene-Solr-6.x-Windows\solr\common-build.xml:531: The following error occurred while executing this line:
C:\Users\jenkins\workspace\Lucene-Solr-6.x-Windows\lucene\common-build.xml:1427: The following error occurred while executing this line:
C:\Users\jenkins\workspace\Lucene-Solr-6.x-Windows\lucene\common-build.xml:984: There were test failures: 598 suites (10 ignored), 2435 tests, 1 failure, 125 ignored (81 assumptions) [seed: 9497902C2497AF8F]

Total time: 76 minutes 17 seconds
Build step 'Invoke Ant' marked build as failure
Archiving artifacts
[WARNINGS] Skipping publisher since build result is FAILURE
Recording test results
Email was triggered for: Failure - Any
Sending email for trigger: Failure - Any



Mime
View raw message