lucene-dev mailing list archives

Site index · List index
Message view « Date » · « Thread »
Top « Date » · « Thread »
From Policeman Jenkins Server <jenk...@thetaphi.de>
Subject [JENKINS] Lucene-Solr-master-Windows (32bit/jdk1.8.0_92) - Build # 5845 - Failure!
Date Mon, 16 May 2016 02:29:01 GMT
Build: http://jenkins.thetaphi.de/job/Lucene-Solr-master-Windows/5845/
Java: 32bit/jdk1.8.0_92 -client -XX:+UseSerialGC

1 tests failed.
FAILED:  org.apache.solr.common.cloud.TestCollectionStateWatchers.testSimpleCollectionWatch

Error Message:
 Expected: is <3>      got: <4> 

Stack Trace:
java.lang.AssertionError: 
Expected: is <3>
     got: <4>

	at __randomizedtesting.SeedInfo.seed([D6D18F617A1C57F6:8BEA40113D11C8C8]:0)
	at org.junit.Assert.assertThat(Assert.java:780)
	at org.junit.Assert.assertThat(Assert.java:738)
	at org.apache.solr.common.cloud.TestCollectionStateWatchers.testSimpleCollectionWatch(TestCollectionStateWatchers.java:118)
	at sun.reflect.NativeMethodAccessorImpl.invoke0(Native Method)
	at sun.reflect.NativeMethodAccessorImpl.invoke(NativeMethodAccessorImpl.java:62)
	at sun.reflect.DelegatingMethodAccessorImpl.invoke(DelegatingMethodAccessorImpl.java:43)
	at java.lang.reflect.Method.invoke(Method.java:498)
	at com.carrotsearch.randomizedtesting.RandomizedRunner.invoke(RandomizedRunner.java:1764)
	at com.carrotsearch.randomizedtesting.RandomizedRunner$8.evaluate(RandomizedRunner.java:871)
	at com.carrotsearch.randomizedtesting.RandomizedRunner$9.evaluate(RandomizedRunner.java:907)
	at com.carrotsearch.randomizedtesting.RandomizedRunner$10.evaluate(RandomizedRunner.java:921)
	at com.carrotsearch.randomizedtesting.rules.SystemPropertiesRestoreRule$1.evaluate(SystemPropertiesRestoreRule.java:57)
	at org.apache.lucene.util.TestRuleSetupTeardownChained$1.evaluate(TestRuleSetupTeardownChained.java:49)
	at org.apache.lucene.util.AbstractBeforeAfterRule$1.evaluate(AbstractBeforeAfterRule.java:45)
	at org.apache.lucene.util.TestRuleThreadAndTestName$1.evaluate(TestRuleThreadAndTestName.java:48)
	at org.apache.lucene.util.TestRuleIgnoreAfterMaxFailures$1.evaluate(TestRuleIgnoreAfterMaxFailures.java:64)
	at org.apache.lucene.util.TestRuleMarkFailure$1.evaluate(TestRuleMarkFailure.java:47)
	at com.carrotsearch.randomizedtesting.rules.StatementAdapter.evaluate(StatementAdapter.java:36)
	at com.carrotsearch.randomizedtesting.ThreadLeakControl$StatementRunner.run(ThreadLeakControl.java:367)
	at com.carrotsearch.randomizedtesting.ThreadLeakControl.forkTimeoutingTask(ThreadLeakControl.java:809)
	at com.carrotsearch.randomizedtesting.ThreadLeakControl$3.evaluate(ThreadLeakControl.java:460)
	at com.carrotsearch.randomizedtesting.RandomizedRunner.runSingleTest(RandomizedRunner.java:880)
	at com.carrotsearch.randomizedtesting.RandomizedRunner$5.evaluate(RandomizedRunner.java:781)
	at com.carrotsearch.randomizedtesting.RandomizedRunner$6.evaluate(RandomizedRunner.java:816)
	at com.carrotsearch.randomizedtesting.RandomizedRunner$7.evaluate(RandomizedRunner.java:827)
	at com.carrotsearch.randomizedtesting.rules.StatementAdapter.evaluate(StatementAdapter.java:36)
	at com.carrotsearch.randomizedtesting.rules.SystemPropertiesRestoreRule$1.evaluate(SystemPropertiesRestoreRule.java:57)
	at org.apache.lucene.util.AbstractBeforeAfterRule$1.evaluate(AbstractBeforeAfterRule.java:45)
	at com.carrotsearch.randomizedtesting.rules.StatementAdapter.evaluate(StatementAdapter.java:36)
	at org.apache.lucene.util.TestRuleStoreClassName$1.evaluate(TestRuleStoreClassName.java:41)
	at com.carrotsearch.randomizedtesting.rules.NoShadowingOrOverridesOnMethodsRule$1.evaluate(NoShadowingOrOverridesOnMethodsRule.java:40)
	at com.carrotsearch.randomizedtesting.rules.NoShadowingOrOverridesOnMethodsRule$1.evaluate(NoShadowingOrOverridesOnMethodsRule.java:40)
	at com.carrotsearch.randomizedtesting.rules.StatementAdapter.evaluate(StatementAdapter.java:36)
	at com.carrotsearch.randomizedtesting.rules.StatementAdapter.evaluate(StatementAdapter.java:36)
	at com.carrotsearch.randomizedtesting.rules.StatementAdapter.evaluate(StatementAdapter.java:36)
	at org.apache.lucene.util.TestRuleAssertionsRequired$1.evaluate(TestRuleAssertionsRequired.java:53)
	at org.apache.lucene.util.TestRuleMarkFailure$1.evaluate(TestRuleMarkFailure.java:47)
	at org.apache.lucene.util.TestRuleIgnoreAfterMaxFailures$1.evaluate(TestRuleIgnoreAfterMaxFailures.java:64)
	at org.apache.lucene.util.TestRuleIgnoreTestSuites$1.evaluate(TestRuleIgnoreTestSuites.java:54)
	at com.carrotsearch.randomizedtesting.rules.StatementAdapter.evaluate(StatementAdapter.java:36)
	at com.carrotsearch.randomizedtesting.ThreadLeakControl$StatementRunner.run(ThreadLeakControl.java:367)
	at java.lang.Thread.run(Thread.java:745)




Build Log:
[...truncated 12918 lines...]
   [junit4] Suite: org.apache.solr.common.cloud.TestCollectionStateWatchers
   [junit4]   2> Creating dataDir: C:\Users\jenkins\workspace\Lucene-Solr-master-Windows\solr\build\solr-solrj\test\J0\temp\solr.common.cloud.TestCollectionStateWatchers_D6D18F617A1C57F6-001\init-core-data-001
   [junit4]   2> 32896 INFO  (SUITE-TestCollectionStateWatchers-seed#[D6D18F617A1C57F6]-worker) [    ] o.a.s.SolrTestCaseJ4 Randomized ssl (false) and clientAuth (false)
   [junit4]   2> 32920 INFO  (SUITE-TestCollectionStateWatchers-seed#[D6D18F617A1C57F6]-worker) [    ] o.a.s.c.ZkTestServer STARTING ZK TEST SERVER
   [junit4]   2> 32924 INFO  (Thread-60) [    ] o.a.s.c.ZkTestServer client port:0.0.0.0/0.0.0.0:0
   [junit4]   2> 32925 INFO  (Thread-60) [    ] o.a.s.c.ZkTestServer Starting server
   [junit4]   2> 33124 INFO  (SUITE-TestCollectionStateWatchers-seed#[D6D18F617A1C57F6]-worker) [    ] o.a.s.c.ZkTestServer start zk server on port:53284
   [junit4]   2> 33173 INFO  (SUITE-TestCollectionStateWatchers-seed#[D6D18F617A1C57F6]-worker) [    ] o.a.s.c.c.SolrZkClient Using default ZkCredentialsProvider
   [junit4]   2> 33267 INFO  (SUITE-TestCollectionStateWatchers-seed#[D6D18F617A1C57F6]-worker) [    ] o.a.s.c.c.ConnectionManager Waiting for client to connect to ZooKeeper
   [junit4]   2> 33343 INFO  (zkCallback-19-thread-1) [    ] o.a.s.c.c.ConnectionManager Watcher org.apache.solr.common.cloud.ConnectionManager@187f02b name:ZooKeeperConnection Watcher:127.0.0.1:53284 got event WatchedEvent state:SyncConnected type:None path:null path:null type:None
   [junit4]   2> 33343 INFO  (SUITE-TestCollectionStateWatchers-seed#[D6D18F617A1C57F6]-worker) [    ] o.a.s.c.c.ConnectionManager Client is connected to ZooKeeper
   [junit4]   2> 33344 INFO  (SUITE-TestCollectionStateWatchers-seed#[D6D18F617A1C57F6]-worker) [    ] o.a.s.c.c.SolrZkClient Using default ZkACLProvider
   [junit4]   2> 33348 INFO  (SUITE-TestCollectionStateWatchers-seed#[D6D18F617A1C57F6]-worker) [    ] o.a.s.c.c.SolrZkClient makePath: /solr/solr.xml
   [junit4]   2> 33409 INFO  (jetty-launcher-18-thread-2) [    ] o.e.j.s.Server jetty-9.3.8.v20160314
   [junit4]   2> 33411 INFO  (jetty-launcher-18-thread-1) [    ] o.e.j.s.Server jetty-9.3.8.v20160314
   [junit4]   2> 33411 INFO  (jetty-launcher-18-thread-2) [    ] o.e.j.s.h.ContextHandler Started o.e.j.s.ServletContextHandler@b9d4f7{/solr,null,AVAILABLE}
   [junit4]   2> 33411 INFO  (jetty-launcher-18-thread-4) [    ] o.e.j.s.Server jetty-9.3.8.v20160314
   [junit4]   2> 33409 INFO  (jetty-launcher-18-thread-3) [    ] o.e.j.s.Server jetty-9.3.8.v20160314
   [junit4]   2> 33412 INFO  (jetty-launcher-18-thread-1) [    ] o.e.j.s.h.ContextHandler Started o.e.j.s.ServletContextHandler@19adc6b{/solr,null,AVAILABLE}
   [junit4]   2> 33419 INFO  (jetty-launcher-18-thread-3) [    ] o.e.j.s.h.ContextHandler Started o.e.j.s.ServletContextHandler@1b88ef8{/solr,null,AVAILABLE}
   [junit4]   2> 33422 INFO  (jetty-launcher-18-thread-4) [    ] o.e.j.s.h.ContextHandler Started o.e.j.s.ServletContextHandler@5e7bd6{/solr,null,AVAILABLE}
   [junit4]   2> 33427 INFO  (jetty-launcher-18-thread-1) [    ] o.e.j.s.ServerConnector Started ServerConnector@1a63700{HTTP/1.1,[http/1.1]}{127.0.0.1:53290}
   [junit4]   2> 33427 INFO  (jetty-launcher-18-thread-1) [    ] o.e.j.s.Server Started @38967ms
   [junit4]   2> 33427 INFO  (jetty-launcher-18-thread-1) [    ] o.a.s.c.s.e.JettySolrRunner Jetty properties: {hostContext=/solr, hostPort=53290}
   [junit4]   2> 33427 INFO  (jetty-launcher-18-thread-1) [    ] o.a.s.s.SolrDispatchFilter SolrDispatchFilter.init(): sun.misc.Launcher$AppClassLoader@1d16e93
   [junit4]   2> 33427 INFO  (jetty-launcher-18-thread-1) [    ] o.a.s.c.SolrResourceLoader new SolrResourceLoader for directory: 'C:\Users\jenkins\workspace\Lucene-Solr-master-Windows\solr\build\solr-solrj\test\J0\temp\solr.common.cloud.TestCollectionStateWatchers_D6D18F617A1C57F6-001\tempDir-001\node1'
   [junit4]   2> 33427 INFO  (jetty-launcher-18-thread-1) [    ] o.a.s.c.SolrResourceLoader JNDI not configured for solr (NoInitialContextEx)
   [junit4]   2> 33428 INFO  (jetty-launcher-18-thread-1) [    ] o.a.s.c.SolrResourceLoader solr home defaulted to 'solr/' (could not find system property or JNDI)
   [junit4]   2> 33427 INFO  (jetty-launcher-18-thread-4) [    ] o.e.j.s.ServerConnector Started ServerConnector@15b4d92{HTTP/1.1,[http/1.1]}{127.0.0.1:53297}
   [junit4]   2> 33427 INFO  (jetty-launcher-18-thread-2) [    ] o.e.j.s.ServerConnector Started ServerConnector@129d693{HTTP/1.1,[http/1.1]}{127.0.0.1:53288}
   [junit4]   2> 33427 INFO  (jetty-launcher-18-thread-3) [    ] o.e.j.s.ServerConnector Started ServerConnector@1f8b236{HTTP/1.1,[http/1.1]}{127.0.0.1:53294}
   [junit4]   2> 33429 INFO  (jetty-launcher-18-thread-4) [    ] o.e.j.s.Server Started @38970ms
   [junit4]   2> 33429 INFO  (jetty-launcher-18-thread-2) [    ] o.e.j.s.Server Started @38970ms
   [junit4]   2> 33430 INFO  (jetty-launcher-18-thread-4) [    ] o.a.s.c.s.e.JettySolrRunner Jetty properties: {hostContext=/solr, hostPort=53297}
   [junit4]   2> 33430 INFO  (jetty-launcher-18-thread-2) [    ] o.a.s.c.s.e.JettySolrRunner Jetty properties: {hostContext=/solr, hostPort=53288}
   [junit4]   2> 33430 INFO  (jetty-launcher-18-thread-4) [    ] o.a.s.s.SolrDispatchFilter SolrDispatchFilter.init(): sun.misc.Launcher$AppClassLoader@1d16e93
   [junit4]   2> 33430 INFO  (jetty-launcher-18-thread-2) [    ] o.a.s.s.SolrDispatchFilter SolrDispatchFilter.init(): sun.misc.Launcher$AppClassLoader@1d16e93
   [junit4]   2> 33430 INFO  (jetty-launcher-18-thread-3) [    ] o.e.j.s.Server Started @38970ms
   [junit4]   2> 33431 INFO  (jetty-launcher-18-thread-1) [    ] o.a.s.c.c.SolrZkClient Using default ZkCredentialsProvider
   [junit4]   2> 33431 INFO  (jetty-launcher-18-thread-2) [    ] o.a.s.c.SolrResourceLoader new SolrResourceLoader for directory: 'C:\Users\jenkins\workspace\Lucene-Solr-master-Windows\solr\build\solr-solrj\test\J0\temp\solr.common.cloud.TestCollectionStateWatchers_D6D18F617A1C57F6-001\tempDir-001\node2'
   [junit4]   2> 33431 INFO  (jetty-launcher-18-thread-2) [    ] o.a.s.c.SolrResourceLoader JNDI not configured for solr (NoInitialContextEx)
   [junit4]   2> 33432 INFO  (jetty-launcher-18-thread-2) [    ] o.a.s.c.SolrResourceLoader solr home defaulted to 'solr/' (could not find system property or JNDI)
   [junit4]   2> 33432 INFO  (jetty-launcher-18-thread-1) [    ] o.a.s.c.c.ConnectionManager Waiting for client to connect to ZooKeeper
   [junit4]   2> 33431 INFO  (jetty-launcher-18-thread-4) [    ] o.a.s.c.SolrResourceLoader new SolrResourceLoader for directory: 'C:\Users\jenkins\workspace\Lucene-Solr-master-Windows\solr\build\solr-solrj\test\J0\temp\solr.common.cloud.TestCollectionStateWatchers_D6D18F617A1C57F6-001\tempDir-001\node4'
   [junit4]   2> 33432 INFO  (jetty-launcher-18-thread-2) [    ] o.a.s.c.c.SolrZkClient Using default ZkCredentialsProvider
   [junit4]   2> 33431 INFO  (jetty-launcher-18-thread-3) [    ] o.a.s.c.s.e.JettySolrRunner Jetty properties: {hostContext=/solr, hostPort=53294}
   [junit4]   2> 33432 INFO  (jetty-launcher-18-thread-3) [    ] o.a.s.s.SolrDispatchFilter SolrDispatchFilter.init(): sun.misc.Launcher$AppClassLoader@1d16e93
   [junit4]   2> 33432 INFO  (jetty-launcher-18-thread-3) [    ] o.a.s.c.SolrResourceLoader new SolrResourceLoader for directory: 'C:\Users\jenkins\workspace\Lucene-Solr-master-Windows\solr\build\solr-solrj\test\J0\temp\solr.common.cloud.TestCollectionStateWatchers_D6D18F617A1C57F6-001\tempDir-001\node3'
   [junit4]   2> 33433 INFO  (jetty-launcher-18-thread-3) [    ] o.a.s.c.SolrResourceLoader JNDI not configured for solr (NoInitialContextEx)
   [junit4]   2> 33433 INFO  (jetty-launcher-18-thread-3) [    ] o.a.s.c.SolrResourceLoader solr home defaulted to 'solr/' (could not find system property or JNDI)
   [junit4]   2> 33433 INFO  (jetty-launcher-18-thread-2) [    ] o.a.s.c.c.ConnectionManager Waiting for client to connect to ZooKeeper
   [junit4]   2> 33432 INFO  (jetty-launcher-18-thread-4) [    ] o.a.s.c.SolrResourceLoader JNDI not configured for solr (NoInitialContextEx)
   [junit4]   2> 33433 INFO  (jetty-launcher-18-thread-4) [    ] o.a.s.c.SolrResourceLoader solr home defaulted to 'solr/' (could not find system property or JNDI)
   [junit4]   2> 33433 INFO  (jetty-launcher-18-thread-3) [    ] o.a.s.c.c.SolrZkClient Using default ZkCredentialsProvider
   [junit4]   2> 33436 INFO  (jetty-launcher-18-thread-4) [    ] o.a.s.c.c.SolrZkClient Using default ZkCredentialsProvider
   [junit4]   2> 33436 INFO  (jetty-launcher-18-thread-3) [    ] o.a.s.c.c.ConnectionManager Waiting for client to connect to ZooKeeper
   [junit4]   2> 33438 INFO  (jetty-launcher-18-thread-4) [    ] o.a.s.c.c.ConnectionManager Waiting for client to connect to ZooKeeper
   [junit4]   2> 33443 INFO  (zkCallback-21-thread-1) [    ] o.a.s.c.c.ConnectionManager Watcher org.apache.solr.common.cloud.ConnectionManager@a6fc19 name:ZooKeeperConnection Watcher:127.0.0.1:53284/solr got event WatchedEvent state:SyncConnected type:None path:null path:null type:None
   [junit4]   2> 33443 INFO  (jetty-launcher-18-thread-2) [    ] o.a.s.c.c.ConnectionManager Client is connected to ZooKeeper
   [junit4]   2> 33443 INFO  (jetty-launcher-18-thread-2) [    ] o.a.s.c.c.SolrZkClient Using default ZkACLProvider
   [junit4]   2> 33444 INFO  (zkCallback-23-thread-1) [    ] o.a.s.c.c.ConnectionManager Watcher org.apache.solr.common.cloud.ConnectionManager@8b3b6e name:ZooKeeperConnection Watcher:127.0.0.1:53284/solr got event WatchedEvent state:SyncConnected type:None path:null path:null type:None
   [junit4]   2> 33444 INFO  (zkCallback-22-thread-1) [    ] o.a.s.c.c.ConnectionManager Watcher org.apache.solr.common.cloud.ConnectionManager@6258d8 name:ZooKeeperConnection Watcher:127.0.0.1:53284/solr got event WatchedEvent state:SyncConnected type:None path:null path:null type:None
   [junit4]   2> 33444 INFO  (jetty-launcher-18-thread-4) [    ] o.a.s.c.c.ConnectionManager Client is connected to ZooKeeper
   [junit4]   2> 33444 INFO  (jetty-launcher-18-thread-3) [    ] o.a.s.c.c.ConnectionManager Client is connected to ZooKeeper
   [junit4]   2> 33444 INFO  (zkCallback-20-thread-1) [    ] o.a.s.c.c.ConnectionManager Watcher org.apache.solr.common.cloud.ConnectionManager@e04db1 name:ZooKeeperConnection Watcher:127.0.0.1:53284/solr got event WatchedEvent state:SyncConnected type:None path:null path:null type:None
   [junit4]   2> 33444 INFO  (jetty-launcher-18-thread-4) [    ] o.a.s.c.c.SolrZkClient Using default ZkACLProvider
   [junit4]   2> 33444 INFO  (jetty-launcher-18-thread-1) [    ] o.a.s.c.c.ConnectionManager Client is connected to ZooKeeper
   [junit4]   2> 33445 INFO  (jetty-launcher-18-thread-3) [    ] o.a.s.c.c.SolrZkClient Using default ZkACLProvider
   [junit4]   2> 33445 INFO  (jetty-launcher-18-thread-1) [    ] o.a.s.c.c.SolrZkClient Using default ZkACLProvider
   [junit4]   2> 33447 INFO  (jetty-launcher-18-thread-2) [    ] o.a.s.s.SolrDispatchFilter solr.xml found in ZooKeeper. Loading...
   [junit4]   2> 33448 INFO  (jetty-launcher-18-thread-3) [    ] o.a.s.s.SolrDispatchFilter solr.xml found in ZooKeeper. Loading...
   [junit4]   2> 33448 INFO  (jetty-launcher-18-thread-4) [    ] o.a.s.s.SolrDispatchFilter solr.xml found in ZooKeeper. Loading...
   [junit4]   2> 33448 INFO  (jetty-launcher-18-thread-1) [    ] o.a.s.s.SolrDispatchFilter solr.xml found in ZooKeeper. Loading...
   [junit4]   2> 33483 INFO  (jetty-launcher-18-thread-2) [    ] o.a.s.c.CorePropertiesLocator Config-defined core root directory: C:\Users\jenkins\workspace\Lucene-Solr-master-Windows\solr\build\solr-solrj\test\J0\temp\solr.common.cloud.TestCollectionStateWatchers_D6D18F617A1C57F6-001\tempDir-001\node2\.
   [junit4]   2> 33483 INFO  (jetty-launcher-18-thread-2) [    ] o.a.s.c.CoreContainer New CoreContainer 17313998
   [junit4]   2> 33483 INFO  (jetty-launcher-18-thread-2) [    ] o.a.s.c.CoreContainer Loading cores into CoreContainer [instanceDir=C:\Users\jenkins\workspace\Lucene-Solr-master-Windows\solr\build\solr-solrj\test\J0\temp\solr.common.cloud.TestCollectionStateWatchers_D6D18F617A1C57F6-001\tempDir-001\node2]
   [junit4]   2> 33484 WARN  (jetty-launcher-18-thread-2) [    ] o.a.s.c.CoreContainer Couldn't add files from C:\Users\jenkins\workspace\Lucene-Solr-master-Windows\solr\build\solr-solrj\test\J0\temp\solr.common.cloud.TestCollectionStateWatchers_D6D18F617A1C57F6-001\tempDir-001\node2\lib to classpath: C:\Users\jenkins\workspace\Lucene-Solr-master-Windows\solr\build\solr-solrj\test\J0\temp\solr.common.cloud.TestCollectionStateWatchers_D6D18F617A1C57F6-001\tempDir-001\node2\lib
   [junit4]   2> 33490 INFO  (jetty-launcher-18-thread-2) [    ] o.a.s.h.c.HttpShardHandlerFactory created with socketTimeout : 90000,urlScheme : ,connTimeout : 15000,maxConnectionsPerHost : 20,maxConnections : 10000,corePoolSize : 0,maximumPoolSize : 2147483647,maxThreadIdleTime : 5,sizeOfQueue : -1,fairnessPolicy : false,
   [junit4]   2> 33491 WARN  (NIOServerCxn.Factory:0.0.0.0/0.0.0.0:0) [    ] o.a.z.s.NIOServerCnxn caught end of stream exception
   [junit4]   2> EndOfStreamException: Unable to read additional data from client sessionid 0x154b76284260001, likely client has closed socket
   [junit4]   2> 	at org.apache.zookeeper.server.NIOServerCnxn.doIO(NIOServerCnxn.java:228)
   [junit4]   2> 	at org.apache.zookeeper.server.NIOServerCnxnFactory.run(NIOServerCnxnFactory.java:208)
   [junit4]   2> 	at java.lang.Thread.run(Thread.java:745)
   [junit4]   2> 33497 INFO  (jetty-launcher-18-thread-1) [    ] o.a.s.c.CorePropertiesLocator Config-defined core root directory: C:\Users\jenkins\workspace\Lucene-Solr-master-Windows\solr\build\solr-solrj\test\J0\temp\solr.common.cloud.TestCollectionStateWatchers_D6D18F617A1C57F6-001\tempDir-001\node1\.
   [junit4]   2> 33495 INFO  (jetty-launcher-18-thread-2) [    ] o.a.s.u.UpdateShardHandler Creating UpdateShardHandler HTTP client with params: 
   [junit4]   2> 33502 INFO  (jetty-launcher-18-thread-1) [    ] o.a.s.c.CoreContainer New CoreContainer 20978547
   [junit4]   2> 33502 INFO  (jetty-launcher-18-thread-1) [    ] o.a.s.c.CoreContainer Loading cores into CoreContainer [instanceDir=C:\Users\jenkins\workspace\Lucene-Solr-master-Windows\solr\build\solr-solrj\test\J0\temp\solr.common.cloud.TestCollectionStateWatchers_D6D18F617A1C57F6-001\tempDir-001\node1]
   [junit4]   2> 33502 WARN  (NIOServerCxn.Factory:0.0.0.0/0.0.0.0:0) [    ] o.a.z.s.NIOServerCnxn caught end of stream exception
   [junit4]   2> EndOfStreamException: Unable to read additional data from client sessionid 0x154b76284260002, likely client has closed socket
   [junit4]   2> 	at org.apache.zookeeper.server.NIOServerCnxn.doIO(NIOServerCnxn.java:228)
   [junit4]   2> 	at org.apache.zookeeper.server.NIOServerCnxnFactory.run(NIOServerCnxnFactory.java:208)
   [junit4]   2> 	at java.lang.Thread.run(Thread.java:745)
   [junit4]   2> 33502 WARN  (jetty-launcher-18-thread-1) [    ] o.a.s.c.CoreContainer Couldn't add files from C:\Users\jenkins\workspace\Lucene-Solr-master-Windows\solr\build\solr-solrj\test\J0\temp\solr.common.cloud.TestCollectionStateWatchers_D6D18F617A1C57F6-001\tempDir-001\node1\lib to classpath: C:\Users\jenkins\workspace\Lucene-Solr-master-Windows\solr\build\solr-solrj\test\J0\temp\solr.common.cloud.TestCollectionStateWatchers_D6D18F617A1C57F6-001\tempDir-001\node1\lib
   [junit4]   2> 33502 INFO  (jetty-launcher-18-thread-1) [    ] o.a.s.h.c.HttpShardHandlerFactory created with socketTimeout : 90000,urlScheme : ,connTimeout : 15000,maxConnectionsPerHost : 20,maxConnections : 10000,corePoolSize : 0,maximumPoolSize : 2147483647,maxThreadIdleTime : 5,sizeOfQueue : -1,fairnessPolicy : false,
   [junit4]   2> 33503 INFO  (jetty-launcher-18-thread-2) [    ] o.a.s.l.LogWatcher SLF4J impl is org.slf4j.impl.Log4jLoggerFactory
   [junit4]   2> 33503 INFO  (jetty-launcher-18-thread-2) [    ] o.a.s.l.LogWatcher Registering Log Listener [Log4j (org.slf4j.impl.Log4jLoggerFactory)]
   [junit4]   2> 33503 INFO  (jetty-launcher-18-thread-2) [    ] o.a.s.c.ZkContainer Zookeeper client=127.0.0.1:53284/solr
   [junit4]   2> 33505 INFO  (jetty-launcher-18-thread-1) [    ] o.a.s.u.UpdateShardHandler Creating UpdateShardHandler HTTP client with params: 
   [junit4]   2> 33505 INFO  (jetty-launcher-18-thread-4) [    ] o.a.s.c.CorePropertiesLocator Config-defined core root directory: C:\Users\jenkins\workspace\Lucene-Solr-master-Windows\solr\build\solr-solrj\test\J0\temp\solr.common.cloud.TestCollectionStateWatchers_D6D18F617A1C57F6-001\tempDir-001\node4\.
   [junit4]   2> 33512 INFO  (jetty-launcher-18-thread-4) [    ] o.a.s.c.CoreContainer New CoreContainer 12493078
   [junit4]   2> 33512 INFO  (jetty-launcher-18-thread-4) [    ] o.a.s.c.CoreContainer Loading cores into CoreContainer [instanceDir=C:\Users\jenkins\workspace\Lucene-Solr-master-Windows\solr\build\solr-solrj\test\J0\temp\solr.common.cloud.TestCollectionStateWatchers_D6D18F617A1C57F6-001\tempDir-001\node4]
   [junit4]   2> 33512 WARN  (jetty-launcher-18-thread-4) [    ] o.a.s.c.CoreContainer Couldn't add files from C:\Users\jenkins\workspace\Lucene-Solr-master-Windows\solr\build\solr-solrj\test\J0\temp\solr.common.cloud.TestCollectionStateWatchers_D6D18F617A1C57F6-001\tempDir-001\node4\lib to classpath: C:\Users\jenkins\workspace\Lucene-Solr-master-Windows\solr\build\solr-solrj\test\J0\temp\solr.common.cloud.TestCollectionStateWatchers_D6D18F617A1C57F6-001\tempDir-001\node4\lib
   [junit4]   2> 33512 INFO  (jetty-launcher-18-thread-4) [    ] o.a.s.h.c.HttpShardHandlerFactory created with socketTimeout : 90000,urlScheme : ,connTimeout : 15000,maxConnectionsPerHost : 20,maxConnections : 10000,corePoolSize : 0,maximumPoolSize : 2147483647,maxThreadIdleTime : 5,sizeOfQueue : -1,fairnessPolicy : false,
   [junit4]   2> 33514 INFO  (jetty-launcher-18-thread-4) [    ] o.a.s.u.UpdateShardHandler Creating UpdateShardHandler HTTP client with params: 
   [junit4]   2> 33514 INFO  (jetty-launcher-18-thread-1) [    ] o.a.s.l.LogWatcher SLF4J impl is org.slf4j.impl.Log4jLoggerFactory
   [junit4]   2> 33514 INFO  (jetty-launcher-18-thread-1) [    ] o.a.s.l.LogWatcher Registering Log Listener [Log4j (org.slf4j.impl.Log4jLoggerFactory)]
   [junit4]   2> 33514 INFO  (jetty-launcher-18-thread-1) [    ] o.a.s.c.ZkContainer Zookeeper client=127.0.0.1:53284/solr
   [junit4]   2> 33515 INFO  (jetty-launcher-18-thread-3) [    ] o.a.s.c.CorePropertiesLocator Config-defined core root directory: C:\Users\jenkins\workspace\Lucene-Solr-master-Windows\solr\build\solr-solrj\test\J0\temp\solr.common.cloud.TestCollectionStateWatchers_D6D18F617A1C57F6-001\tempDir-001\node3\.
   [junit4]   2> 33517 INFO  (jetty-launcher-18-thread-4) [    ] o.a.s.l.LogWatcher SLF4J impl is org.slf4j.impl.Log4jLoggerFactory
   [junit4]   2> 33517 INFO  (jetty-launcher-18-thread-4) [    ] o.a.s.l.LogWatcher Registering Log Listener [Log4j (org.slf4j.impl.Log4jLoggerFactory)]
   [junit4]   2> 33517 INFO  (jetty-launcher-18-thread-4) [    ] o.a.s.c.ZkContainer Zookeeper client=127.0.0.1:53284/solr
   [junit4]   2> 33517 INFO  (jetty-launcher-18-thread-3) [    ] o.a.s.c.CoreContainer New CoreContainer 2669370
   [junit4]   2> 33518 INFO  (jetty-launcher-18-thread-3) [    ] o.a.s.c.CoreContainer Loading cores into CoreContainer [instanceDir=C:\Users\jenkins\workspace\Lucene-Solr-master-Windows\solr\build\solr-solrj\test\J0\temp\solr.common.cloud.TestCollectionStateWatchers_D6D18F617A1C57F6-001\tempDir-001\node3]
   [junit4]   2> 33518 WARN  (jetty-launcher-18-thread-3) [    ] o.a.s.c.CoreContainer Couldn't add files from C:\Users\jenkins\workspace\Lucene-Solr-master-Windows\solr\build\solr-solrj\test\J0\temp\solr.common.cloud.TestCollectionStateWatchers_D6D18F617A1C57F6-001\tempDir-001\node3\lib to classpath: C:\Users\jenkins\workspace\Lucene-Solr-master-Windows\solr\build\solr-solrj\test\J0\temp\solr.common.cloud.TestCollectionStateWatchers_D6D18F617A1C57F6-001\tempDir-001\node3\lib
   [junit4]   2> 33518 INFO  (jetty-launcher-18-thread-3) [    ] o.a.s.h.c.HttpShardHandlerFactory created with socketTimeout : 90000,urlScheme : ,connTimeout : 15000,maxConnectionsPerHost : 20,maxConnections : 10000,corePoolSize : 0,maximumPoolSize : 2147483647,maxThreadIdleTime : 5,sizeOfQueue : -1,fairnessPolicy : false,
   [junit4]   2> 33519 INFO  (jetty-launcher-18-thread-3) [    ] o.a.s.u.UpdateShardHandler Creating UpdateShardHandler HTTP client with params: 
   [junit4]   2> 33521 INFO  (jetty-launcher-18-thread-3) [    ] o.a.s.l.LogWatcher SLF4J impl is org.slf4j.impl.Log4jLoggerFactory
   [junit4]   2> 33521 INFO  (jetty-launcher-18-thread-3) [    ] o.a.s.l.LogWatcher Registering Log Listener [Log4j (org.slf4j.impl.Log4jLoggerFactory)]
   [junit4]   2> 33521 INFO  (jetty-launcher-18-thread-3) [    ] o.a.s.c.ZkContainer Zookeeper client=127.0.0.1:53284/solr
   [junit4]   2> 33540 INFO  (jetty-launcher-18-thread-2) [    ] o.a.s.c.ZkController zkHost includes chroot
   [junit4]   2> 33541 INFO  (jetty-launcher-18-thread-3) [    ] o.a.s.c.ZkController zkHost includes chroot
   [junit4]   2> 33541 INFO  (jetty-launcher-18-thread-2) [    ] o.a.s.c.c.SolrZkClient Using default ZkCredentialsProvider
   [junit4]   2> 33541 INFO  (jetty-launcher-18-thread-3) [    ] o.a.s.c.c.SolrZkClient Using default ZkCredentialsProvider
   [junit4]   2> 33541 INFO  (jetty-launcher-18-thread-1) [    ] o.a.s.c.ZkController zkHost includes chroot
   [junit4]   2> 33543 INFO  (jetty-launcher-18-thread-1) [    ] o.a.s.c.c.SolrZkClient Using default ZkCredentialsProvider
   [junit4]   2> 33543 INFO  (jetty-launcher-18-thread-2) [    ] o.a.s.c.c.ConnectionManager Waiting for client to connect to ZooKeeper
   [junit4]   2> 33541 INFO  (jetty-launcher-18-thread-4) [    ] o.a.s.c.ZkController zkHost includes chroot
   [junit4]   2> 33544 INFO  (jetty-launcher-18-thread-3) [    ] o.a.s.c.c.ConnectionManager Waiting for client to connect to ZooKeeper
   [junit4]   2> 33544 INFO  (jetty-launcher-18-thread-4) [    ] o.a.s.c.c.SolrZkClient Using default ZkCredentialsProvider
   [junit4]   2> 33544 INFO  (jetty-launcher-18-thread-1) [    ] o.a.s.c.c.ConnectionManager Waiting for client to connect to ZooKeeper
   [junit4]   2> 33547 INFO  (jetty-launcher-18-thread-4) [    ] o.a.s.c.c.ConnectionManager Waiting for client to connect to ZooKeeper
   [junit4]   2> 33549 INFO  (zkCallback-32-thread-1) [    ] o.a.s.c.c.ConnectionManager Watcher org.apache.solr.common.cloud.ConnectionManager@14069 name:ZooKeeperConnection Watcher:127.0.0.1:53284 got event WatchedEvent state:SyncConnected type:None path:null path:null type:None
   [junit4]   2> 33550 INFO  (jetty-launcher-18-thread-2) [    ] o.a.s.c.c.ConnectionManager Client is connected to ZooKeeper
   [junit4]   2> 33550 INFO  (jetty-launcher-18-thread-2) [    ] o.a.s.c.c.SolrZkClient Using default ZkACLProvider
   [junit4]   2> 33551 INFO  (zkCallback-33-thread-1) [    ] o.a.s.c.c.ConnectionManager Watcher org.apache.solr.common.cloud.ConnectionManager@16e3a24 name:ZooKeeperConnection Watcher:127.0.0.1:53284 got event WatchedEvent state:SyncConnected type:None path:null path:null type:None
   [junit4]   2> 33551 INFO  (jetty-launcher-18-thread-3) [    ] o.a.s.c.c.ConnectionManager Client is connected to ZooKeeper
   [junit4]   2> 33551 INFO  (jetty-launcher-18-thread-3) [    ] o.a.s.c.c.SolrZkClient Using default ZkACLProvider
   [junit4]   2> 33552 INFO  (zkCallback-34-thread-1) [    ] o.a.s.c.c.ConnectionManager Watcher org.apache.solr.common.cloud.ConnectionManager@1c8647f name:ZooKeeperConnection Watcher:127.0.0.1:53284 got event WatchedEvent state:SyncConnected type:None path:null path:null type:None
   [junit4]   2> 33554 INFO  (jetty-launcher-18-thread-1) [    ] o.a.s.c.c.ConnectionManager Client is connected to ZooKeeper
   [junit4]   2> 33554 INFO  (jetty-launcher-18-thread-1) [    ] o.a.s.c.c.SolrZkClient Using default ZkACLProvider
   [junit4]   2> 33555 INFO  (zkCallback-35-thread-1) [    ] o.a.s.c.c.ConnectionManager Watcher org.apache.solr.common.cloud.ConnectionManager@a20e84 name:ZooKeeperConnection Watcher:127.0.0.1:53284 got event WatchedEvent state:SyncConnected type:None path:null path:null type:None
   [junit4]   2> 33556 WARN  (NIOServerCxn.Factory:0.0.0.0/0.0.0.0:0) [    ] o.a.z.s.NIOServerCnxn caught end of stream exception
   [junit4]   2> EndOfStreamException: Unable to read additional data from client sessionid 0x154b76284260005, likely client has closed socket
   [junit4]   2> 	at org.apache.zookeeper.server.NIOServerCnxn.doIO(NIOServerCnxn.java:228)
   [junit4]   2> 	at org.apache.zookeeper.server.NIOServerCnxnFactory.run(NIOServerCnxnFactory.java:208)
   [junit4]   2> 	at java.lang.Thread.run(Thread.java:745)
   [junit4]   2> 33560 INFO  (jetty-launcher-18-thread-4) [    ] o.a.s.c.c.ConnectionManager Client is connected to ZooKeeper
   [junit4]   2> 33560 INFO  (jetty-launcher-18-thread-4) [    ] o.a.s.c.c.SolrZkClient Using default ZkACLProvider
   [junit4]   2> 33563 INFO  (jetty-launcher-18-thread-2) [n:127.0.0.1:53288_solr    ] o.a.s.c.ZkController Added new OnReconnect listener org.apache.solr.cloud.ZkController$$Lambda$76/6788031@145c497
   [junit4]   2> 33570 INFO  (jetty-launcher-18-thread-3) [n:127.0.0.1:53294_solr    ] o.a.s.c.ZkController Added new OnReconnect listener org.apache.solr.cloud.ZkController$$Lambda$76/6788031@32f218
   [junit4]   2> 33571 INFO  (jetty-launcher-18-thread-1) [n:127.0.0.1:53290_solr    ] o.a.s.c.ZkController Added new OnReconnect listener org.apache.solr.cloud.ZkController$$Lambda$76/6788031@161a86a
   [junit4]   2> 33574 INFO  (jetty-launcher-18-thread-4) [n:127.0.0.1:53297_solr    ] o.a.s.c.ZkController Added new OnReconnect listener org.apache.solr.cloud.ZkController$$Lambda$76/6788031@7696ea
   [junit4]   2> 33576 INFO  (jetty-launcher-18-thread-2) [n:127.0.0.1:53288_solr    ] o.a.s.c.c.ConnectionManager Waiting for client to connect to ZooKeeper
   [junit4]   2> 33576 INFO  (jetty-launcher-18-thread-3) [n:127.0.0.1:53294_solr    ] o.a.s.c.c.ConnectionManager Waiting for client to connect to ZooKeeper
   [junit4]   2> 33576 INFO  (jetty-launcher-18-thread-1) [n:127.0.0.1:53290_solr    ] o.a.s.c.c.ConnectionManager Waiting for client to connect to ZooKeeper
   [junit4]   2> 33576 INFO  (jetty-launcher-18-thread-4) [n:127.0.0.1:53297_solr    ] o.a.s.c.c.ConnectionManager Waiting for client to connect to ZooKeeper
   [junit4]   2> 33582 INFO  (zkCallback-37-thread-1-processing-n:127.0.0.1:53288_solr) [n:127.0.0.1:53288_solr    ] o.a.s.c.c.ConnectionManager Watcher org.apache.solr.common.cloud.ConnectionManager@544667 name:ZooKeeperConnection Watcher:127.0.0.1:53284/solr got event WatchedEvent state:SyncConnected type:None path:null path:null type:None
   [junit4]   2> 33582 INFO  (jetty-launcher-18-thread-2) [n:127.0.0.1:53288_solr    ] o.a.s.c.c.ConnectionManager Client is connected to ZooKeeper
   [junit4]   2> 33583 INFO  (zkCallback-38-thread-1-processing-n:127.0.0.1:53290_solr) [n:127.0.0.1:53290_solr    ] o.a.s.c.c.ConnectionManager Watcher org.apache.solr.common.cloud.ConnectionManager@124fbd7 name:ZooKeeperConnection Watcher:127.0.0.1:53284/solr got event WatchedEvent state:SyncConnected type:None path:null path:null type:None
   [junit4]   2> 33583 INFO  (zkCallback-39-thread-1-processing-n:127.0.0.1:53297_solr) [n:127.0.0.1:53297_solr    ] o.a.s.c.c.ConnectionManager Watcher org.apache.solr.common.cloud.ConnectionManager@10130cb name:ZooKeeperConnection Watcher:127.0.0.1:53284/solr got event WatchedEvent state:SyncConnected type:None path:null path:null type:None
   [junit4]   2> 33583 INFO  (jetty-launcher-18-thread-1) [n:127.0.0.1:53290_solr    ] o.a.s.c.c.ConnectionManager Client is connected to ZooKeeper
   [junit4]   2> 33583 INFO  (jetty-launcher-18-thread-4) [n:127.0.0.1:53297_solr    ] o.a.s.c.c.ConnectionManager Client is connected to ZooKeeper
   [junit4]   2> 33583 INFO  (zkCallback-36-thread-1-processing-n:127.0.0.1:53294_solr) [n:127.0.0.1:53294_solr    ] o.a.s.c.c.ConnectionManager Watcher org.apache.solr.common.cloud.ConnectionManager@10de3a6 name:ZooKeeperConnection Watcher:127.0.0.1:53284/solr got event WatchedEvent state:SyncConnected type:None path:null path:null type:None
   [junit4]   2> 33584 INFO  (jetty-launcher-18-thread-3) [n:127.0.0.1:53294_solr    ] o.a.s.c.c.ConnectionManager Client is connected to ZooKeeper
   [junit4]   2> 33601 INFO  (jetty-launcher-18-thread-3) [n:127.0.0.1:53294_solr    ] o.a.s.c.c.SolrZkClient makePath: /overseer/queue
   [junit4]   2> 33601 INFO  (jetty-launcher-18-thread-2) [n:127.0.0.1:53288_solr    ] o.a.s.c.c.SolrZkClient makePath: /overseer/queue
   [junit4]   2> 33602 INFO  (jetty-launcher-18-thread-1) [n:127.0.0.1:53290_solr    ] o.a.s.c.c.SolrZkClient makePath: /overseer/queue
   [junit4]   2> 33603 INFO  (jetty-launcher-18-thread-4) [n:127.0.0.1:53297_solr    ] o.a.s.c.c.SolrZkClient makePath: /overseer/queue
   [junit4]   2> 33614 INFO  (jetty-launcher-18-thread-4) [n:127.0.0.1:53297_solr    ] o.a.s.c.c.SolrZkClient makePath: /overseer/collection-queue-work
   [junit4]   2> 33614 INFO  (jetty-launcher-18-thread-2) [n:127.0.0.1:53288_solr    ] o.a.s.c.c.SolrZkClient makePath: /overseer/collection-queue-work
   [junit4]   2> 33615 INFO  (jetty-launcher-18-thread-1) [n:127.0.0.1:53290_solr    ] o.a.s.c.c.SolrZkClient makePath: /overseer/collection-queue-work
   [junit4]   2> 33615 INFO  (jetty-launcher-18-thread-3) [n:127.0.0.1:53294_solr    ] o.a.s.c.c.SolrZkClient makePath: /overseer/collection-queue-work
   [junit4]   2> 33626 INFO  (jetty-launcher-18-thread-2) [n:127.0.0.1:53288_solr    ] o.a.s.c.c.SolrZkClient makePath: /overseer/collection-map-running
   [junit4]   2> 33627 INFO  (jetty-launcher-18-thread-1) [n:127.0.0.1:53290_solr    ] o.a.s.c.c.SolrZkClient makePath: /overseer/collection-map-running
   [junit4]   2> 33627 INFO  (jetty-launcher-18-thread-4) [n:127.0.0.1:53297_solr    ] o.a.s.c.c.SolrZkClient makePath: /overseer/collection-map-running
   [junit4]   2> 33628 INFO  (jetty-launcher-18-thread-3) [n:127.0.0.1:53294_solr    ] o.a.s.c.c.SolrZkClient makePath: /overseer/collection-map-running
   [junit4]   2> 33635 INFO  (jetty-launcher-18-thread-2) [n:127.0.0.1:53288_solr    ] o.a.s.c.c.SolrZkClient makePath: /overseer/collection-map-completed
   [junit4]   2> 33635 INFO  (jetty-launcher-18-thread-4) [n:127.0.0.1:53297_solr    ] o.a.s.c.c.SolrZkClient makePath: /overseer/collection-map-completed
   [junit4]   2> 33635 INFO  (jetty-launcher-18-thread-1) [n:127.0.0.1:53290_solr    ] o.a.s.c.c.SolrZkClient makePath: /overseer/collection-map-completed
   [junit4]   2> 33636 INFO  (jetty-launcher-18-thread-3) [n:127.0.0.1:53294_solr    ] o.a.s.c.c.SolrZkClient makePath: /overseer/collection-map-completed
   [junit4]   2> 33643 INFO  (jetty-launcher-18-thread-2) [n:127.0.0.1:53288_solr    ] o.a.s.c.c.SolrZkClient makePath: /overseer/collection-map-failure
   [junit4]   2> 33643 INFO  (jetty-launcher-18-thread-4) [n:127.0.0.1:53297_solr    ] o.a.s.c.c.SolrZkClient makePath: /overseer/collection-map-failure
   [junit4]   2> 33644 INFO  (jetty-launcher-18-thread-1) [n:127.0.0.1:53290_solr    ] o.a.s.c.c.SolrZkClient makePath: /overseer/collection-map-failure
   [junit4]   2> 33644 INFO  (jetty-launcher-18-thread-3) [n:127.0.0.1:53294_solr    ] o.a.s.c.c.SolrZkClient makePath: /overseer/collection-map-failure
   [junit4]   2> 33661 INFO  (jetty-launcher-18-thread-2) [n:127.0.0.1:53288_solr    ] o.a.s.c.c.SolrZkClient makePath: /live_nodes
   [junit4]   2> 33661 INFO  (jetty-launcher-18-thread-4) [n:127.0.0.1:53297_solr    ] o.a.s.c.c.SolrZkClient makePath: /live_nodes
   [junit4]   2> 33662 INFO  (jetty-launcher-18-thread-1) [n:127.0.0.1:53290_solr    ] o.a.s.c.c.SolrZkClient makePath: /live_nodes
   [junit4]   2> 33662 INFO  (jetty-launcher-18-thread-3) [n:127.0.0.1:53294_solr    ] o.a.s.c.c.SolrZkClient makePath: /live_nodes
   [junit4]   2> 33667 INFO  (jetty-launcher-18-thread-4) [n:127.0.0.1:53297_solr    ] o.a.s.c.c.SolrZkClient makePath: /collections
   [junit4]   2> 33667 INFO  (jetty-launcher-18-thread-2) [n:127.0.0.1:53288_solr    ] o.a.s.c.c.SolrZkClient makePath: /collections
   [junit4]   2> 33668 INFO  (jetty-launcher-18-thread-1) [n:127.0.0.1:53290_solr    ] o.a.s.c.c.SolrZkClient makePath: /collections
   [junit4]   2> 33668 INFO  (jetty-launcher-18-thread-3) [n:127.0.0.1:53294_solr    ] o.a.s.c.c.SolrZkClient makePath: /collections
   [junit4]   2> 33671 INFO  (jetty-launcher-18-thread-4) [n:127.0.0.1:53297_solr    ] o.a.s.c.c.SolrZkClient makePath: /aliases.json
   [junit4]   2> 33671 INFO  (jetty-launcher-18-thread-1) [n:127.0.0.1:53290_solr    ] o.a.s.c.c.SolrZkClient makePath: /aliases.json
   [junit4]   2> 33671 INFO  (jetty-launcher-18-thread-3) [n:127.0.0.1:53294_solr    ] o.a.s.c.c.SolrZkClient makePath: /aliases.json
   [junit4]   2> 33672 INFO  (jetty-launcher-18-thread-2) [n:127.0.0.1:53288_solr    ] o.a.s.c.c.SolrZkClient makePath: /aliases.json
   [junit4]   2> 33675 INFO  (jetty-launcher-18-thread-2) [n:127.0.0.1:53288_solr    ] o.a.s.c.c.SolrZkClient makePath: /clusterstate.json
   [junit4]   2> 33676 INFO  (jetty-launcher-18-thread-1) [n:127.0.0.1:53290_solr    ] o.a.s.c.c.SolrZkClient makePath: /clusterstate.json
   [junit4]   2> 33677 INFO  (jetty-launcher-18-thread-3) [n:127.0.0.1:53294_solr    ] o.a.s.c.c.SolrZkClient makePath: /clusterstate.json
   [junit4]   2> 33678 INFO  (jetty-launcher-18-thread-4) [n:127.0.0.1:53297_solr    ] o.a.s.c.c.SolrZkClient makePath: /clusterstate.json
   [junit4]   2> 33680 INFO  (jetty-launcher-18-thread-1) [n:127.0.0.1:53290_solr    ] o.a.s.c.c.SolrZkClient makePath: /security.json
   [junit4]   2> 33681 INFO  (jetty-launcher-18-thread-2) [n:127.0.0.1:53288_solr    ] o.a.s.c.c.SolrZkClient makePath: /security.json
   [junit4]   2> 33682 INFO  (jetty-launcher-18-thread-3) [n:127.0.0.1:53294_solr    ] o.a.s.c.c.SolrZkClient makePath: /security.json
   [junit4]   2> 33683 INFO  (jetty-launcher-18-thread-4) [n:127.0.0.1:53297_solr    ] o.a.s.c.c.SolrZkClient makePath: /security.json
   [junit4]   2> 33684 INFO  (jetty-launcher-18-thread-1) [n:127.0.0.1:53290_solr    ] o.a.s.c.c.ZkStateReader Updating cluster state from ZooKeeper... 
   [junit4]   2> 33685 INFO  (jetty-launcher-18-thread-2) [n:127.0.0.1:53288_solr    ] o.a.s.c.c.ZkStateReader Updating cluster state from ZooKeeper... 
   [junit4]   2> 33685 INFO  (jetty-launcher-18-thread-3) [n:127.0.0.1:53294_solr    ] o.a.s.c.c.ZkStateReader Updating cluster state from ZooKeeper... 
   [junit4]   2> 33686 INFO  (jetty-launcher-18-thread-4) [n:127.0.0.1:53297_solr    ] o.a.s.c.c.ZkStateReader Updating cluster state from ZooKeeper... 
   [junit4]   2> 33686 INFO  (jetty-launcher-18-thread-1) [n:127.0.0.1:53290_solr    ] o.a.s.c.c.ZkStateReader Loaded empty cluster properties
   [junit4]   2> 33687 INFO  (jetty-launcher-18-thread-2) [n:127.0.0.1:53288_solr    ] o.a.s.c.c.ZkStateReader Loaded empty cluster properties
   [junit4]   2> 33687 INFO  (jetty-launcher-18-thread-3) [n:127.0.0.1:53294_solr    ] o.a.s.c.c.ZkStateReader Loaded empty cluster properties
   [junit4]   2> 33688 INFO  (jetty-launcher-18-thread-4) [n:127.0.0.1:53297_solr    ] o.a.s.c.c.ZkStateReader Loaded empty cluster properties
   [junit4]   2> 33696 INFO  (jetty-launcher-18-thread-2) [n:127.0.0.1:53288_solr    ] o.a.s.c.c.ZkStateReader Updated live nodes from ZooKeeper... (0) -> (0)
   [junit4]   2> 33698 INFO  (jetty-launcher-18-thread-1) [n:127.0.0.1:53290_solr    ] o.a.s.c.c.ZkStateReader Updated live nodes from ZooKeeper... (0) -> (0)
   [junit4]   2> 33698 INFO  (jetty-launcher-18-thread-4) [n:127.0.0.1:53297_solr    ] o.a.s.c.c.ZkStateReader Updated live nodes from ZooKeeper... (0) -> (0)
   [junit4]   2> 33698 INFO  (jetty-launcher-18-thread-3) [n:127.0.0.1:53294_solr    ] o.a.s.c.c.ZkStateReader Updated live nodes from ZooKeeper... (0) -> (0)
   [junit4]   2> 33730 INFO  (jetty-launcher-18-thread-1) [n:127.0.0.1:53290_solr    ] o.a.s.c.c.SolrZkClient makePath: /overseer_elect
   [junit4]   2> 33730 INFO  (jetty-launcher-18-thread-2) [n:127.0.0.1:53288_solr    ] o.a.s.c.c.SolrZkClient makePath: /overseer_elect
   [junit4]   2> 33730 INFO  (jetty-launcher-18-thread-4) [n:127.0.0.1:53297_solr    ] o.a.s.c.c.SolrZkClient makePath: /overseer_elect
   [junit4]   2> 33730 INFO  (jetty-launcher-18-thread-3) [n:127.0.0.1:53294_solr    ] o.a.s.c.c.SolrZkClient makePath: /overseer_elect
   [junit4]   2> 33733 INFO  (jetty-launcher-18-thread-1) [n:127.0.0.1:53290_solr    ] o.a.s.c.c.SolrZkClient makePath: /overseer_elect/election
   [junit4]   2> 33734 INFO  (jetty-launcher-18-thread-4) [n:127.0.0.1:53297_solr    ] o.a.s.c.c.SolrZkClient makePath: /overseer_elect/election
   [junit4]   2> 33734 INFO  (jetty-launcher-18-thread-2) [n:127.0.0.1:53288_solr    ] o.a.s.c.c.SolrZkClient makePath: /overseer_elect/election
   [junit4]   2> 33734 INFO  (jetty-launcher-18-thread-3) [n:127.0.0.1:53294_solr    ] o.a.s.c.c.SolrZkClient makePath: /overseer_elect/election
   [junit4]   2> 33738 INFO  (jetty-launcher-18-thread-1) [n:127.0.0.1:53290_solr    ] o.a.s.c.Overseer Overseer (id=null) closing
   [junit4]   2> 33739 INFO  (jetty-launcher-18-thread-2) [n:127.0.0.1:53288_solr    ] o.a.s.c.Overseer Overseer (id=null) closing
   [junit4]   2> 33739 INFO  (jetty-launcher-18-thread-3) [n:127.0.0.1:53294_solr    ] o.a.s.c.Overseer Overseer (id=null) closing
   [junit4]   2> 33739 INFO  (jetty-launcher-18-thread-4) [n:127.0.0.1:53297_solr    ] o.a.s.c.Overseer Overseer (id=null) closing
   [junit4]   2> 33740 INFO  (jetty-launcher-18-thread-1) [n:127.0.0.1:53290_solr    ] o.a.s.c.LeaderElector Joined leadership election with path: /overseer_elect/election/95903125833383947-127.0.0.1:53290_solr-n_0000000000
   [junit4]   2> 33741 INFO  (jetty-launcher-18-thread-2) [n:127.0.0.1:53288_solr    ] o.a.s.c.LeaderElector Joined leadership election with path: /overseer_elect/election/95903125833383945-127.0.0.1:53288_solr-n_0000000001
   [junit4]   2> 33741 INFO  (jetty-launcher-18-thread-3) [n:127.0.0.1:53294_solr    ] o.a.s.c.LeaderElector Joined leadership election with path: /overseer_elect/election/95903125833383948-127.0.0.1:53294_solr-n_0000000002
   [junit4]   2> 33741 INFO  (jetty-launcher-18-thread-4) [n:127.0.0.1:53297_solr    ] o.a.s.c.LeaderElector Joined leadership election with path: /overseer_elect/election/95903125833383946-127.0.0.1:53297_solr-n_0000000003
   [junit4]   2> 33744 INFO  (jetty-launcher-18-thread-1) [n:127.0.0.1:53290_solr    ] o.a.s.c.OverseerElectionContext I am going to be the leader 127.0.0.1:53290_solr
   [junit4]   2> 33749 INFO  (jetty-launcher-18-thread-2) [n:127.0.0.1:53288_solr    ] o.a.s.c.LeaderElector Watching path /overseer_elect/election/95903125833383947-127.0.0.1:53290_solr-n_0000000000 to know if I could be the leader
   [junit4]   2> 33750 INFO  (jetty-launcher-18-thread-3) [n:127.0.0.1:53294_solr    ] o.a.s.c.LeaderElector Watching path /overseer_elect/election/95903125833383945-127.0.0.1:53288_solr-n_0000000001 to know if I could be the leader
   [junit4]   2> 33750 INFO  (jetty-launcher-18-thread-1) [n:127.0.0.1:53290_solr    ] o.a.s.c.c.SolrZkClient makePath: /overseer_elect/leader
   [junit4]   2> 33750 INFO  (jetty-launcher-18-thread-2) [n:127.0.0.1:53288_solr    ] o.a.s.c.ZkController Register node as live in ZooKeeper:/live_nodes/127.0.0.1:53288_solr
   [junit4]   2> 33751 INFO  (jetty-launcher-18-thread-4) [n:127.0.0.1:53297_solr    ] o.a.s.c.LeaderElector Watching path /overseer_elect/election/95903125833383948-127.0.0.1:53294_solr-n_0000000002 to know if I could be the leader
   [junit4]   2> 33753 INFO  (jetty-launcher-18-thread-3) [n:127.0.0.1:53294_solr    ] o.a.s.c.ZkController Register node as live in ZooKeeper:/live_nodes/127.0.0.1:53294_solr
   [junit4]   2> 33754 INFO  (jetty-launcher-18-thread-4) [n:127.0.0.1:53297_solr    ] o.a.s.c.ZkController Register node as live in ZooKeeper:/live_nodes/127.0.0.1:53297_solr
   [junit4]   2> 33755 INFO  (jetty-launcher-18-thread-3) [n:127.0.0.1:53294_solr    ] o.a.s.c.c.SolrZkClient makePath: /live_nodes/127.0.0.1:53294_solr
   [junit4]   2> 33755 INFO  (jetty-launcher-18-thread-2) [n:127.0.0.1:53288_solr    ] o.a.s.c.c.SolrZkClient makePath: /live_nodes/127.0.0.1:53288_solr
   [junit4]   2> 33755 INFO  (jetty-launcher-18-thread-4) [n:127.0.0.1:53297_solr    ] o.a.s.c.c.SolrZkClient makePath: /live_nodes/127.0.0.1:53297_solr
   [junit4]   2> 33758 INFO  (jetty-launcher-18-thread-1) [n:127.0.0.1:53290_solr    ] o.a.s.c.Overseer Overseer (id=95903125833383947-127.0.0.1:53290_solr-n_0000000000) starting
   [junit4]   2> 33763 INFO  (zkCallback-37-thread-1-processing-n:127.0.0.1:53288_solr) [n:127.0.0.1:53288_solr    ] o.a.s.c.c.ZkStateReader A live node change: [WatchedEvent state:SyncConnected type:NodeChildrenChanged path:/live_nodes], has occurred - updating... (live nodes size: [0])
   [junit4]   2> 33763 INFO  (zkCallback-39-thread-1-processing-n:127.0.0.1:53297_solr) [n:127.0.0.1:53297_solr    ] o.a.s.c.c.ZkStateReader A live node change: [WatchedEvent state:SyncConnected type:NodeChildrenChanged path:/live_nodes], has occurred - updating... (live nodes size: [0])
   [junit4]   2> 33764 INFO  (zkCallback-38-thread-1-processing-n:127.0.0.1:53290_solr) [n:127.0.0.1:53290_solr    ] o.a.s.c.c.ZkStateReader A live node change: [WatchedEvent state:SyncConnected type:NodeChildrenChanged path:/live_nodes], has occurred - updating... (live nodes size: [0])
   [junit4]   2> 33764 INFO  (zkCallback-36-thread-1-processing-n:127.0.0.1:53294_solr) [n:127.0.0.1:53294_solr    ] o.a.s.c.c.ZkStateReader A live node change: [WatchedEvent state:SyncConnected type:NodeChildrenChanged path:/live_nodes], has occurred - updating... (live nodes size: [0])
   [junit4]   2> 33771 INFO  (zkCallback-37-thread-1-processing-n:127.0.0.1:53288_solr) [n:127.0.0.1:53288_solr    ] o.a.s.c.c.ZkStateReader Updated live nodes from ZooKeeper... (0) -> (3)
   [junit4]   2> 33771 INFO  (zkCallback-39-thread-1-processing-n:127.0.0.1:53297_solr) [n:127.0.0.1:53297_solr    ] o.a.s.c.c.ZkStateReader Updated live nodes from ZooKeeper... (0) -> (3)
   [junit4]   2> 33771 INFO  (zkCallback-38-thread-1-processing-n:127.0.0.1:53290_solr) [n:127.0.0.1:53290_solr    ] o.a.s.c.c.ZkStateReader Updated live nodes from ZooKeeper... (0) -> (3)
   [junit4]   2> 33771 INFO  (zkCallback-36-thread-1-processing-n:127.0.0.1:53294_solr) [n:127.0.0.1:53294_solr    ] o.a.s.c.c.ZkStateReader Updated live nodes from ZooKeeper... (0) -> (3)
   [junit4]   2> 33801 INFO  (jetty-launcher-18-thread-1) [n:127.0.0.1:53290_solr    ] o.a.s.c.c.SolrZkClient makePath: /overseer/queue-work
   [junit4]   2> 33835 INFO  (jetty-launcher-18-thread-3) [n:127.0.0.1:53294_solr    ] o.a.s.c.CoreContainer Security conf doesn't exist. Skipping setup for authorization module.
   [junit4]   2> 33835 INFO  (jetty-launcher-18-thread-3) [n:127.0.0.1:53294_solr    ] o.a.s.c.CoreContainer No authentication plugin used.
   [junit4]   2> 33838 INFO  (jetty-launcher-18-thread-3) [n:127.0.0.1:53294_solr    ] o.a.s.c.CorePropertiesLocator Looking for core definitions underneath C:\Users\jenkins\workspace\Lucene-Solr-master-Windows\solr\build\solr-solrj\test\J0\temp\solr.common.cloud.TestCollectionStateWatchers_D6D18F617A1C57F6-001\tempDir-001\node3\.
   [junit4]   2> 33839 INFO  (jetty-launcher-18-thread-3) [n:127.0.0.1:53294_solr    ] o.a.s.c.CorePropertiesLocator Found 0 core definitions
   [junit4]   2> 33849 INFO  (jetty-launcher-18-thread-3) [n:127.0.0.1:53294_solr    ] o.a.s.s.SolrDispatchFilter user.dir=C:\Users\jenkins\workspace\Lucene-Solr-master-Windows\solr\build\solr-solrj\test\J0
   [junit4]   2> 33849 INFO  (jetty-launcher-18-thread-3) [n:127.0.0.1:53294_solr    ] o.a.s.s.SolrDispatchFilter SolrDispatchFilter.init() done
   [junit4]   2> 33851 INFO  (jetty-launcher-18-thread-4) [n:127.0.0.1:53297_solr    ] o.a.s.c.CoreContainer Security conf doesn't exist. Skipping setup for authorization module.
   [junit4]   2> 33851 INFO  (jetty-launcher-18-thread-4) [n:127.0.0.1:53297_solr    ] o.a.s.c.CoreContainer No authentication plugin used.
   [junit4]   2> 33851 INFO  (jetty-launcher-18-thread-2) [n:127.0.0.1:53288_solr    ] o.a.s.c.CoreContainer Security conf doesn't exist. Skipping setup for authorization module.
   [junit4]   2> 33851 INFO  (jetty-launcher-18-thread-2) [n:127.0.0.1:53288_solr    ] o.a.s.c.CoreContainer No authentication plugin used.
   [junit4]   2> 33851 INFO  (jetty-launcher-18-thread-4) [n:127.0.0.1:53297_solr    ] o.a.s.c.CorePropertiesLocator Looking for core definitions underneath C:\Users\jenkins\workspace\Lucene-Solr-master-Windows\solr\build\solr-solrj\test\J0\temp\solr.common.cloud.TestCollectionStateWatchers_D6D18F617A1C57F6-001\tempDir-001\node4\.
   [junit4]   2> 33853 INFO  (jetty-launcher-18-thread-2) [n:127.0.0.1:53288_solr    ] o.a.s.c.CorePropertiesLocator Looking for core definitions underneath C:\Users\jenkins\workspace\Lucene-Solr-master-Windows\solr\build\solr-solrj\test\J0\temp\solr.common.cloud.TestCollectionStateWatchers_D6D18F617A1C57F6-001\tempDir-001\node2\.
   [junit4]   2> 33853 INFO  (jetty-launcher-18-thread-4) [n:127.0.0.1:53297_solr    ] o.a.s.c.CorePropertiesLocator Found 0 core definitions
   [junit4]   2> 33853 INFO  (jetty-launcher-18-thread-2) [n:127.0.0.1:53288_solr    ] o.a.s.c.CorePropertiesLocator Found 0 core definitions
   [junit4]   2> 33854 INFO  (jetty-launcher-18-thread-2) [n:127.0.0.1:53288_solr    ] o.a.s.s.SolrDispatchFilter user.dir=C:\Users\jenkins\workspace\Lucene-Solr-master-Windows\solr\build\solr-solrj\test\J0
   [junit4]   2> 33854 INFO  (jetty-launcher-18-thread-2) [n:127.0.0.1:53288_solr    ] o.a.s.s.SolrDispatchFilter SolrDispatchFilter.init() done
   [junit4]   2> 33854 INFO  (jetty-launcher-18-thread-4) [n:127.0.0.1:53297_solr    ] o.a.s.s.SolrDispatchFilter user.dir=C:\Users\jenkins\workspace\Lucene-Solr-master-Windows\solr\build\solr-solrj\test\J0
   [junit4]   2> 33854 INFO  (jetty-launcher-18-thread-4) [n:127.0.0.1:53297_solr    ] o.a.s.s.SolrDispatchFilter SolrDispatchFilter.init() done
   [junit4]   2> 33895 INFO  (jetty-launcher-18-thread-1) [n:127.0.0.1:53290_solr    ] o.a.s.c.OverseerAutoReplicaFailoverThread Starting OverseerAutoReplicaFailoverThread autoReplicaFailoverWorkLoopDelay=10000 autoReplicaFailoverWaitAfterExpiration=30000 autoReplicaFailoverBadNodeExpiration=60000
   [junit4]   2> 33904 INFO  (OverseerCollectionConfigSetProcessor-95903125833383947-127.0.0.1:53290_solr-n_0000000000) [n:127.0.0.1:53290_solr    ] o.a.s.c.OverseerTaskProcessor Process current queue of overseer operations
   [junit4]   2> 33904 INFO  (jetty-launcher-18-thread-1) [n:127.0.0.1:53290_solr    ] o.a.s.c.ZkController Publish node=127.0.0.1:53290_solr as DOWN
   [junit4]   2> 33912 INFO  (OverseerStateUpdate-95903125833383947-127.0.0.1:53290_solr-n_0000000000) [n:127.0.0.1:53290_solr    ] o.a.s.c.Overseer Starting to work on the main queue
   [junit4]   2> 33914 INFO  (OverseerStateUpdate-95903125833383947-127.0.0.1:53290_solr-n_0000000000) [n:127.0.0.1:53290_solr    ] o.a.s.c.c.ZkStateReader Updated live nodes from ZooKeeper... (3) -> (3)
   [junit4]   2> 33923 INFO  (OverseerStateUpdate-95903125833383947-127.0.0.1:53290_solr-n_0000000000) [n:127.0.0.1:53290_solr    ] o.a.s.c.Overseer processMessage: queueSize: 1, message = {
   [junit4]   2>   "operation":"downnode",
   [junit4]   2>   "node_name":"127.0.0.1:53290_solr"} current state version: 0
   [junit4]   2> 33934 INFO  (OverseerStateUpdate-95903125833383947-127.0.0.1:53290_solr-n_0000000000) [n:127.0.0.1:53290_solr    ] o.a.s.c.o.NodeMutator DownNode state invoked for node: 127.0.0.1:53290_solr
   [junit4]   2> 34912 INFO  (jetty-launcher-18-thread-1) [n:127.0.0.1:53290_solr    ] o.a.s.c.ZkController Register node as live in ZooKeeper:/live_nodes/127.0.0.1:53290_solr
   [junit4]   2> 34912 INFO  (jetty-launcher-18-thread-1) [n:127.0.0.1:53290_solr    ] o.a.s.c.c.SolrZkClient makePath: /live_nodes/127.0.0.1:53290_solr
   [junit4]   2> 34915 INFO  (zkCallback-37-thread-1-processing-n:127.0.0.1:53288_solr) [n:127.0.0.1:53288_solr    ] o.a.s.c.c.ZkStateReader A live node change: [WatchedEvent state:SyncConnected type:NodeChildrenChanged path:/live_nodes], has occurred - updating... (live nodes size: [3])
   [junit4]   2> 34916 INFO  (zkCallback-39-thread-1-processing-n:127.0.0.1:53297_solr) [n:127.0.0.1:53297_solr    ] o.a.s.c.c.ZkStateReader A live node change: [WatchedEvent state:SyncConnected type:NodeChildrenChanged path:/live_nodes], has occurred - updating... (live nodes size: [3])
   [junit4]   2> 34917 INFO  (zkCallback-38-thread-1-processing-n:127.0.0.1:53290_solr) [n:127.0.0.1:53290_solr    ] o.a.s.c.c.ZkStateReader A live node change: [WatchedEvent state:SyncConnected type:NodeChildrenChanged path:/live_nodes], has occurred - updating... (live nodes size: [3])
   [junit4]   2> 34918 INFO  (zkCallback-36-thread-1-processing-n:127.0.0.1:53294_solr) [n:127.0.0.1:53294_solr    ] o.a.s.c.c.ZkStateReader A live node change: [WatchedEvent state:SyncConnected type:NodeChildrenChanged path:/live_nodes], has occurred - updating... (live nodes size: [3])
   [junit4]   2> 34919 INFO  (zkCallback-37-thread-1-processing-n:127.0.0.1:53288_solr) [n:127.0.0.1:53288_solr    ] o.a.s.c.c.ZkStateReader Updated live nodes from ZooKeeper... (3) -> (4)
   [junit4]   2> 34919 INFO  (zkCallback-39-thread-1-processing-n:127.0.0.1:53297_solr) [n:127.0.0.1:53297_solr    ] o.a.s.c.c.ZkStateReader Updated live nodes from ZooKeeper... (3) -> (4)
   [junit4]   2> 34920 INFO  (zkCallback-36-thread-1-processing-n:127.0.0.1:53294_solr) [n:127.0.0.1:53294_solr    ] o.a.s.c.c.ZkStateReader Updated live nodes from ZooKeeper... (3) -> (4)
   [junit4]   2> 34920 INFO  (zkCallback-38-thread-1-processing-n:127.0.0.1:53290_solr) [n:127.0.0.1:53290_solr    ] o.a.s.c.c.ZkStateReader Updated live nodes from ZooKeeper... (3) -> (4)
   [junit4]   2> 34948 INFO  (jetty-launcher-18-thread-1) [n:127.0.0.1:53290_solr    ] o.a.s.c.CoreContainer Security conf doesn't exist. Skipping setup for authorization module.
   [junit4]   2> 34948 INFO  (jetty-launcher-18-thread-1) [n:127.0.0.1:53290_solr    ] o.a.s.c.CoreContainer No authentication plugin used.
   [junit4]   2> 34950 INFO  (jetty-launcher-18-thread-1) [n:127.0.0.1:53290_solr    ] o.a.s.c.CorePropertiesLocator Looking for core definitions underneath C:\Users\jenkins\workspace\Lucene-Solr-master-Windows\solr\build\solr-solrj\test\J0\temp\solr.common.cloud.TestCollectionStateWatchers_D6D18F617A1C57F6-001\tempDir-001\node1\.
   [junit4]   2> 34951 INFO  (jetty-launcher-18-thread-1) [n:127.0.0.1:53290_solr    ] o.a.s.c.CorePropertiesLocator Found 0 core definitions
   [junit4]   2> 34953 INFO  (jetty-launcher-18-thread-1) [n:127.0.0.1:53290_solr    ] o.a.s.s.SolrDispatchFilter user.dir=C:\Users\jenkins\workspace\Lucene-Solr-master-Windows\solr\build\solr-solrj\test\J0
   [junit4]   2> 34953 INFO  (jetty-launcher-18-thread-1) [n:127.0.0.1:53290_solr    ] o.a.s.s.SolrDispatchFilter SolrDispatchFilter.init() done
   [junit4]   2> 34953 INFO  (SUITE-TestCollectionStateWatchers-seed#[D6D18F617A1C57F6]-worker) [    ] o.a.s.c.c.SolrZkClient Using default ZkCredentialsProvider
   [junit4]   2> 34955 INFO  (SUITE-TestCollectionStateWatchers-seed#[D6D18F617A1C57F6]-worker) [    ] o.a.s.c.c.ConnectionManager Waiting for client to connect to ZooKeeper
   [junit4]   2> 34957 INFO  (zkCallback-44-thread-1) [    ] o.a.s.c.c.ConnectionManager Watcher org.apache.solr.common.cloud.ConnectionManager@a71910 name:ZooKeeperConnection Watcher:127.0.0.1:53284 got event WatchedEvent state:SyncConnected type:None path:null path:null type:None
   [junit4]   2> 34958 INFO  (SUITE-TestCollectionStateWatchers-seed#[D6D18F617A1C57F6]-worker) [    ] o.a.s.c.c.ConnectionManager Client is connected to ZooKeeper
   [junit4]   2> 34958 INFO  (SUITE-TestCollectionStateWatchers-seed#[D6D18F617A1C57F6]-worker) [    ] o.a.s.c.c.SolrZkClient Using default ZkACLProvider
   [junit4]   2> 34979 INFO  (SUITE-TestCollectionStateWatchers-seed#[D6D18F617A1C57F6]-worker) [    ] o.a.s.c.s.i.CloudSolrClient Final constructed zkHost string: 127.0.0.1:53284/solr
   [junit4]   2> 34985 INFO  (SUITE-TestCollectionStateWatchers-seed#[D6D18F617A1C57F6]-worker) [    ] o.a.s.c.c.SolrZkClient Using default ZkCredentialsProvider
   [junit4]   2> 34986 INFO  (SUITE-TestCollectionStateWatchers-seed#[D6D18F617A1C57F6]-worker) [    ] o.a.s.c.c.ConnectionManager Waiting for client to connect to ZooKeeper
   [junit4]   2> 34989 INFO  (zkCallback-47-thread-1) [    ] o.a.s.c.c.ConnectionManager Watcher org.apache.solr.common.cloud.ConnectionManager@18edfe name:ZooKeeperConnection Watcher:127.0.0.1:53284/solr got event WatchedEvent state:SyncConnected type:None path:null path:null type:None
   [junit4]   2> 34989 INFO  (SUITE-TestCollectionStateWatchers-seed#[D6D18F617A1C57F6]-worker) [    ] o.a.s.c.c.ConnectionManager Client is connected to ZooKeeper
   [junit4]   2> 34989 INFO  (SUITE-TestCollectionStateWatchers-seed#[D6D18F617A1C57F6]-worker) [    ] o.a.s.c.c.SolrZkClient Using default ZkACLProvider
   [junit4]   2> 34989 INFO  (SUITE-TestCollectionStateWatchers-seed#[D6D18F617A1C57F6]-worker) [    ] o.a.s.c.c.ZkStateReader Updating cluster state from ZooKeeper... 
   [junit4]   2> 34991 INFO  (SUITE-TestCollectionStateWatchers-seed#[D6D18F617A1C57F6]-worker) [    ] o.a.s.c.c.ZkStateReader Loaded empty cluster properties
   [junit4]   2> 34993 INFO  (SUITE-TestCollectionStateWatchers-seed#[D6D18F617A1C57F6]-worker) [    ] o.a.s.c.c.ZkStateReader Updated live nodes from ZooKeeper... (0) -> (4)
   [junit4]   2> 35004 INFO  (SUITE-TestCollectionStateWatchers-seed#[D6D18F617A1C57F6]-worker) [    ] o.a.s.c.c.SolrZkClient makePath: /configs/config/schema-replication1.xml
   [junit4]   2> 35012 INFO  (SUITE-TestCollectionStateWatchers-seed#[D6D18F617A1C57F6]-worker) [    ] o.a.s.c.c.SolrZkClient makePath: /configs/config/schema-sql.xml
   [junit4]   2> 35017 INFO  (SUITE-TestCollectionStateWatchers-seed#[D6D18F617A1C57F6]-worker) [    ] o.a.s.c.c.SolrZkClient makePath: /configs/config/schema.xml
   [junit4]   2> 35023 INFO  (SUITE-TestCollectionStateWatchers-seed#[D6D18F617A1C57F6]-worker) [    ] o.a.s.c.c.SolrZkClient makePath: /configs/config/solrconfig-managed-schema.xml
   [junit4]   2> 35029 INFO  (SUITE-TestCollectionStateWatchers-seed#[D6D18F617A1C57F6]-worker) [    ] o.a.s.c.c.SolrZkClient makePath: /configs/config/solrconfig-slave1.xml
   [junit4]   2> 35034 INFO  (SUITE-TestCollectionStateWatchers-seed#[D6D18F617A1C57F6]-worker) [    ] o.a.s.c.c.SolrZkClient makePath: /configs/config/solrconfig-sql.xml
   [junit4]   2> 35040 INFO  (SUITE-TestCollectionStateWatchers-seed#[D6D18F617A1C57F6]-worker) [    ] o.a.s.c.c.SolrZkClient makePath: /configs/config/solrconfig.xml
   [junit4]   2> 35084 INFO  (TEST-TestCollectionStateWatchers.testCanWaitForNonexistantCollection-seed#[D6D18F617A1C57F6]) [    ] o.a.s.SolrTestCaseJ4 ###Starting testCanWaitForNonexistantCollection
   [junit4]   2> 35084 INFO  (TEST-TestCollectionStateWatchers.testCanWaitForNonexistantCollection-seed#[D6D18F617A1C57F6]) [    ] o.a.s.c.c.SolrZkClient Using default ZkCredentialsProvider
   [junit4]   2> 35086 INFO  (TEST-TestCollectionStateWatchers.testCanWaitForNonexistantCollection-seed#[D6D18F617A1C57F6]) [    ] o.a.s.c.c.ConnectionManager Waiting for client to connect to ZooKeeper
   [junit4]   2> 35090 INFO  (zkCallback-48-thread-1) [    ] o.a.s.c.c.ConnectionManager Watcher org.apache.solr.common.cloud.ConnectionManager@1323e6e name:ZooKeeperConnection Watcher:127.0.0.1:53284 got event WatchedEvent state:SyncConnected type:None path:null path:null type:None
   [junit4]   2> 35090 INFO  (TEST-TestCollectionStateWatchers.testCanWaitForNonexistantCollection-seed#[D6D18F617A1C57F6]) [    ] o.a.s.c.c.ConnectionManager Client is connected to ZooKeeper
   [junit4]   2> 35090 INFO  (TEST-TestCollectionStateWatchers.testCanWaitForNonexistantCollection-seed#[D6D18F617A1C57F6]) [    ] o.a.s.c.c.SolrZkClient Using default ZkACLProvider
   [junit4]   2> 35112 INFO  (backgroundWatchers-17-thread-1) [    ] o.a.s.c.c.ZkStateReader Deleting data for [delayed]
   [junit4]   2> 35203 INFO  (qtp13712280-211) [n:127.0.0.1:53297_solr    ] o.a.s.h.a.CollectionsHandler Invoked Collection Action :create with params async=f05a7d44-9095-4672-a4b6-06f7de0c0d87&replicationFactor=1&collection.configName=config&name=delayed&action=CREATE&numShards=1&wt=javabin&version=2 and sendToOCPQueue=true
   [junit4]   2> 35220 INFO  (qtp13712280-211) [n:127.0.0.1:53297_solr    ] o.a.s.s.HttpSolrCall [admin] webapp=null path=/admin/collections params={async=f05a7d44-9095-4672-a4b6-06f7de0c0d87&replicationFactor=1&collection.configName=config&name=delayed&action=CREATE&numShards=1&wt=javabin&version=2} status=0 QTime=107
   [junit4]   2> 35226 INFO  (qtp13712280-227) [n:127.0.0.1:53297_solr    ] o.a.s.h.a.CollectionsHandler Invoked Collection Action :requeststatus with params requestid=f05a7d44-9095-4672-a4b6-06f7de0c0d87&action=REQUESTSTATUS&wt=javabin&version=2 and sendToOCPQueue=true
   [junit4]   2> 35231 INFO  (qtp13712280-227) [n:127.0.0.1:53297_solr    ] o.a.s.s.HttpSolrCall [admin] webapp=null path=/admin/collections params={requestid=f05a7d44-9095-4672-a4b6-06f7de0c0d87&action=REQUESTSTATUS&wt=javabin&version=2} status=0 QTime=5
   [junit4]   2> 35234 INFO  (OverseerCollectionConfigSetProcessor-95903125833383947-127.0.0.1:53290_solr-n_0000000000) [n:127.0.0.1:53290_solr    ] o.a.s.c.c.SolrZkClient makePath: /overseer/collection-map-running/mn-f05a7d44-9095-4672-a4b6-06f7de0c0d87
   [junit4]   2> 35238 INFO  (OverseerCollectionConfigSetProcessor-95903125833383947-127.0.0.1:53290_solr-n_0000000000) [n:127.0.0.1:53290_solr    ] o.a.s.c.OverseerTaskProcessor Overseer Collection Message Handler: Get the message id:/overseer/collection-queue-work/qn-0000000000 message:{
   [junit4]   2>   "name":"delayed",
   [junit4]   2>   "fromApi":"true",
   [junit4]   2>   "replicationFactor":"1",
   [junit4]   2>   "collection.configName":"config",
   [junit4]   2>   "numShards":"1",
   [junit4]   2>   "stateFormat":"2",
   [junit4]   2>   "async":"f05a7d44-9095-4672-a4b6-06f7de0c0d87",
   [junit4]   2>   "operation":"create"}
   [junit4]   2> 35243 INFO  (OverseerThreadFactory-188-thread-1-processing-n:127.0.0.1:53290_solr) [n:127.0.0.1:53290_solr    ] o.a.s.c.OverseerCollectionMessageHandler OverseerCollectionMessageHandler.processMessage : create , {
   [junit4]   2>   "name":"delayed",
   [junit4]   2>   "fromApi":"true",
   [junit4]   2>   "replicationFactor":"1",
   [junit4]   2>   "collection.configName":"config",
   [junit4]   2>   "numShards":"1",
   [junit4]   2>   "stateFormat":"2",
   [junit4]   2>   "async":"f05a7d44-9095-4672-a4b6-06f7de0c0d87",
   [junit4]   2>   "operation":"create"}
   [junit4]   2> 35248 INFO  (OverseerThreadFactory-188-thread-1-processing-n:127.0.0.1:53290_solr) [n:127.0.0.1:53290_solr    ] o.a.s.c.OverseerCollectionMessageHandler Create collection delayed
   [junit4]   2> 35260 INFO  (OverseerThreadFactory-188-thread-1-processing-n:127.0.0.1:53290_solr) [n:127.0.0.1:53290_solr    ] o.a.s.c.OverseerCollectionMessageHandler creating collections conf node /collections/delayed 
   [junit4]   2> 35261 INFO  (OverseerThreadFactory-188-thread-1-processing-n:127.0.0.1:53290_solr) [n:127.0.0.1:53290_solr    ] o.a.s.c.c.SolrZkClient makePath: /collections/delayed
   [junit4]   2> 35264 INFO  (zkCallback-39-thread-1-processing-n:127.0.0.1:53297_solr) [n:127.0.0.1:53297_solr    ] o.a.s.c.c.ZkStateReader A collections change: [WatchedEvent state:SyncConnected type:NodeChildrenChanged path:/collections], has occurred - updating...
   [junit4]   2> 35264 INFO  (zkCallback-37-thread-1-processing-n:127.0.0.1:53288_solr) [n:127.0.0.1:53288_solr    ] o.a.s.c.c.ZkStateReader A collections change: [WatchedEvent state:SyncConnected type:NodeChildrenChanged path:/collections], has occurred - updating...
   [junit4]   2> 35265 INFO  (zkCallback-47-thread-1) [    ] o.a.s.c.c.ZkStateReader A collections change: [WatchedEvent state:SyncConnected type:NodeChildrenChanged path:/collections], has occurred - updating...
   [junit4]   2> 35267 INFO  (zkCallback-38-thread-1-processing-n:127.0.0.1:53290_solr) [n:127.0.0.1:53290_solr    ] o.a.s.c.c.ZkStateReader A collections change: [WatchedEvent state:SyncConnected type:NodeChildrenChanged path:/collections], has occurred - updating...
   [junit4]   2> 35267 INFO  (zkCallback-36-thread-1-processing-n:127.0.0.1:53294_solr) [n:127.0.0.1:53294_solr    ] o.a.s.c.c.ZkStateReader A collections change: [WatchedEvent state:SyncConnected type:NodeChildrenChanged path:/collections], has occurred - updating...
   [junit4]   2> 35275 INFO  (OverseerStateUpdate-95903125833383947-127.0.0.1:53290_solr-n_0000000000) [n:127.0.0.1:53290_solr    ] o.a.s.c.Overseer processMessage: queueSize: 1, message = {
   [junit4]   2>   "name":"delayed",
   [junit4]   2>   "fromApi":"true",
   [junit4]   2>   "replicationFactor":"1",
   [junit4]   2>   "collection.configName":"config",
   [junit4]   2>   "numShards":"1",
   [junit4]   2>   "stateFormat":"2",
   [junit4]   2>   "async":"f05a7d44-9095-4672-a4b6-06f7de0c0d87",
   [junit4]   2>   "operation":"create"} current state version: 0
   [junit4]   2> 35275 INFO  (OverseerStateUpdate-95903125833383947-127.0.0.1:53290_solr-n_0000000000) [n:127.0.0.1:53290_solr    ] o.a.s.c.o.ClusterStateMutator building a new cName: delayed
   [junit4]   2> 35309 INFO  (OverseerStateUpdate-95903125833383947-127.0.0.1:53290_solr-n_0000000000) [n:127.0.0.1:53290_solr    ] o.a.s.c.o.ZkStateWriter going to create_collection /collections/delayed/state.json
   [junit4]   2> 35310 INFO  (zkCallback-47-thread-1) [    ] o.a.s.c.c.ZkStateReader A cluster state change: [WatchedEvent state:SyncConnected type:NodeCreated path:/collections/delayed/state.json] for collection [delayed] has occurred - updating... (live nodes size: [4])
   [junit4]   2> 35312 INFO  (zkCallback-47-thread-1) [    ] o.a.s.c.c.ZkStateReader Add data for [delayed] ver [0]
   [junit4]   2> 35377 INFO  (OverseerThreadFactory-188-thread-1-processing-n:127.0.0.1:53290_solr) [n:127.0.0.1:53290_solr    ] o.a.s.c.OverseerCollectionMessageHandler Creating SolrCores for new collection delayed, shardNames [shard1] , replicationFactor : 1
   [junit4]   2> 35377 INFO  (OverseerThreadFactory-188-thread-1-processing-n:127.0.0.1:53290_solr) [n:127.0.0.1:53290_solr    ] o.a.s.c.OverseerCollectionMessageHandler Creating core delayed_shard1_replica1 as part of shard shard1 of collection delayed on 127.0.0.1:53288_solr
   [junit4]   2> 35396 INFO  (qtp4141383-198) [n:127.0.0.1:53288_solr    ] o.a.s.s.HttpSolrCall [admin] webapp=null path=/admin/cores params={async=f05a7d44-9095-4672-a4b6-06f7de0c0d87823708191226366&qt=/admin/cores&collection.configName=config&name=delayed_shard1_replica1&action=CREATE&numShards=1&collection=delayed&shard=shard1&wt=javabin&version=2} status=0 QTime=1
   [junit4]   2> 35398 INFO  (parallelCoreAdminExecutor-186-thread-1-processing-n:127.0.0.1:53288_solr f05a7d44-9095-4672-a4b6-06f7de0c0d87823708191226366 CREATE) [n:127.0.0.1:53288_solr    ] o.a.s.h.a.CoreAdminOperation core create command async=f05a7d44-9095-4672-a4b6-06f7de0c0d87823708191226366&qt=/admin/cores&collection.configName=config&name=delayed_shard1_replica1&action=CREATE&numShards=1&collection=delayed&shard=shard1&wt=javabin&version=2
   [junit4]   2> 35398 INFO  (qtp4141383-197) [n:127.0.0.1:53288_solr    ] o.a.s.h.a.CoreAdminOperation Checking request status for : f05a7d44-9095-4672-a4b6-06f7de0c0d87823708191226366
   [junit4]   2> 35399 INFO  (qtp4141383-197) [n:127.0.0.1:53288_solr    ] o.a.s.s.HttpSolrCall [admin] webapp=null path=/admin/cores params={qt=/admin/cores&requestid=f05a7d44-9095-4672-a4b6-06f7de0c0d87823708191226366&action=REQUESTSTATUS&wt=javabin&version=2} status=0 QTime=0
   [junit4]   2> 35410 INFO  (parallelCoreAdminExecutor-186-thread-1-processing-n:127.0.0.1:53288_solr f05a7d44-9095-4672-a4b6-06f7de0c0d87823708191226366 CREATE) [n:127.0.0.1:53288_solr    ] o.a.s.c.CoreDescriptor Created CoreDescriptor: {name=delayed_shard1_replica1, collection.configName=config, config=solrconfig.xml, transient=false, schema=schema.xml, loadOnStartup=true, configSetProperties=configsetprops.json, collection=delayed, numShards=1, dataDir=data\, shard=shard1}
   [junit4]   2> 35411 INFO  (parallelCoreAdminExecutor-186-thread-1-processing-n:127.0.0.1:53288_solr f05a7d44-9095-4672-a4b6-06f7de0c0d87823708191226366 CREATE) [n:127.0.0.1:53288_solr c:delayed s:shard1  x:delayed_shard1_replica1] o.a.s.c.ZkController publishing state=down
   [junit4]   2> 35414 INFO  (parallelCoreAdminExecutor-186-thread-1-processing-n:127.0.0.1:53288_solr f05a7d44-9095-4672-a4b6-06f7de0c0d87823708191226366 CREATE) [n:127.0.0.1:53288_solr c:delayed s:shard1  x:delayed_shard1_replica1] o.a.s.c.ZkController Registering watch for collection delayed
   [junit4]   2> 35415 INFO  (parallelCoreAdminExecutor-186-thread-1-processing-n:127.0.0.1:53288_solr f05a7d44-9095-4672-a4b6-06f7de0c0d87823708191226366 CREATE) [n:127.0.0.1:53288_solr c:delayed s:shard1  x:delayed_shard1_replica1] o.a.s.c.c.ZkStateReader Add data for [delayed] ver [0]
   [junit4]   2> 35415 INFO  (parallelCoreAdminExecutor-186-thread-1-processing-n:127.0.0.1:53288_solr f05a7d44-9095-4672-a4b6-06f7de0c0d87823708191226366 CREATE) [n:127.0.0.1:53288_solr c:delayed s:shard1  x:delayed_shard1_replica1] o.a.s.c.ZkController look for our core node name
   [junit4]   2> 35416 INFO  (OverseerStateUpdate-95903125833383947-127.0.0.1:53290_solr-n_0000000000) [n:127.0.0.1:53290_solr    ] o.a.s.c.Overseer processMessage: queueSize: 1, message = {
   [junit4]   2>   "core":"delayed_shard1_replica1",
   [junit4]   2>   "roles":null,
   [junit4]   2>   "base_url":"http://127.0.0.1:53288/solr",
   [junit4]   2>   "node_name":"127.0.0.1:53288_solr",
   [junit4]   2>   "numShards":"1",
   [junit4]   2>   "state":"down",
   [junit4]   2>   "shard":"shard1",
   [junit4]   2>   "collection":"delayed",
   [junit4]   2>   "operation":"state"} current state version: 0
   [junit4]   2> 35425 INFO  (OverseerStateUpdate-95903125833383947-127.0.0.1:53290_solr-n_0000000000) [n:127.0.0.1:53290_solr    ] o.a.s.c.o.ReplicaMutator Update state numShards=1 message={
   [junit4]   2>   "core":"delayed_shard1_replica1",
   [junit4]   2>   "roles":null,
   [junit4]   2>   "base_url":"http://127.0.0.1:53288/solr",
   [junit4]   2>   "node_name":"127.0.0.1:53288_solr",
   [junit4]   2>   "numShards":"1",
   [junit4]   2>   "state":"down",
   [junit4]   2>   "shard":"shard1",
   [junit4]   2>   "collection":"delayed",
   [junit4]   2>   "operation":"state"}
   [junit4]   2> 35536 INFO  (OverseerStateUpdate-95903125833383947-127.0.0.1:53290_solr-n_0000000000) [n:127.0.0.1:53290_solr    ] o.a.s.c.o.ZkStateWriter going to update_collection /collections/delayed/state.json version: 0
   [junit4]   2> 35547 INFO  (zkCallback-37-thread-1-processing-n:127.0.0.1:53288_solr) [n:127.0.0.1:53288_solr    ] o.a.s.c.c.ZkStateReader A cluster state change: [WatchedEvent state:SyncConnected type:NodeDataChanged path:/collections/delayed/state.json] for collection [delayed] has occurred - updating... (live nodes size: [4])
   [junit4]   2> 35550 INFO  (zkCallback-47-thread-1) [    ] o.a.s.c.c.ZkStateReader A cluster state change: [WatchedEvent state:SyncConnected type:NodeDataChanged path:/collections/delayed/state.json] for collection [delayed] has occurred - updating... (live nodes size: [4])
   [junit4]   2> 35550 INFO  (zkCallback-37-thread-1-processing-n:127.0.0.1:53288_solr) [n:127.0.0.1:53288_solr    ] o.a.s.c.c.ZkStateReader Updating data for [delayed] from [0] to [1]
   [junit4]   2> 35551 INFO  (zkCallback-47-thread-1) [    ] o.a.s.c.c.ZkStateReader Updating data for [delayed] from [0] to [1]
   [junit4]   2> 36234 INFO  (qtp13712280-226) [n:127.0.0.1:53297_solr    ] o.a.s.h.a.CollectionsHandler Invoked Collection Action :requeststatus with params requestid=f05a7d44-9095-4672-a4b6-06f7de0c0d87&action=REQUESTSTATUS&wt=javabin&version=2 and sendToOCPQueue=true
   [junit4]   2> 36236 INFO  (qtp13712280-226) [n:127.0.0.1:53297_solr    ] o.a.s.s.HttpSolrCall [admin] webapp=null path=/admin/collections params={requestid=f05a7d44-9095-4672-a4b6-06f7de0c0d87&action=REQUESTSTATUS&wt=javabin&version=2} status=0 QTime=2
   [junit4]   2> 36401 INFO  (qtp4141383-195) [n:127.0.0.1:53288_solr    ] o.a.s.h.a.CoreAdminOperation Checking request status for : f05a7d44-9095-4672-a4b6-06f7de0c0d87823708191226366
   [junit4]   2> 36401 INFO  (qtp4141383-195) [n:127.0.0.1:53288_solr    ] o.a.s.s.HttpSolrCall [admin] webapp=null path=/admin/cores params={qt=/admin/cores&requestid=f05a7d44-9095-4672-a4b6-06f7de0c0d87823708191226366&action=REQUESTSTATUS&wt=javabin&version=2} status=0 QTime=0
   [junit4]   2> 36417 INFO  (parallelCoreAdminExecutor-186-thread-1-processing-n:127.0.0.1:53288_solr f05a7d44-9095-4672-a4b6-06f7de0c0d87823708191226366 CREATE) [n:127.0.0.1:53288_solr c:delayed s:shard1  x:delayed_shard1_replica1] o.a.s.c.ZkController waiting to find shard id in clusterstate for delayed_shard1_replica1
   [junit4]   2> 36417 INFO  (parallelCoreAdminExecutor-186-thread-1-processing-n:127.0.0.1:53288_solr f05a7d44-9095-4672-a4b6-06f7de0c0d87823708191226366 CREATE) [n:127.0.0.1:53288_solr c:delayed s:shard1  x:delayed_shard1_replica1] o.a.s.c.ZkController Check for collection zkNode:delayed
   [junit4]   2> 36417 INFO  (parallelCoreAdminExecutor-186-thread-1-processing-n:127.0.0.1:53288_solr f05a7d44-9095-4672-a4b6-06f7de0c0d87823708191226366 CREATE) [n:127.0.0.1:53288_solr c:delayed s:shard1  x:delayed_shard1_replica1] o.a.s.c.ZkController Collection zkNode exists
   [junit4]   2> 36417 INFO  (parallelCoreAdminExecutor-186-thread-1-processing-n:127.0.0.1:53288_solr f05a7d44-9095-4672-a4b6-06f7de0c0d87823708191226366 CREATE) [n:127.0.0.1:53288_solr c:delayed s:shard1  x:delayed_shard1_replica1] o.a.s.c.c.ZkStateReader Load collection config from: [/collections/delayed]
   [junit4]   2> 36418 INFO  (parallelCoreAdminExecutor-186-thread-1-processing-n:127.0.0.1:53288_solr f05a7d44-9095-4672-a4b6-06f7de0c0d87823708191226366 CREATE) [n:127.0.0.1:53288_solr c:delayed s:shard1  x:delayed_shard1_replica1] o.a.s.c.c.ZkStateReader path=[/collections/delayed] [configName]=[config] specified config exists in ZooKeeper
   [junit4]   2> 36419 INFO  (parallelCoreAdminExecutor-186-thread-1-processing-n:127.0.0.1:53288_solr f05a7d44-9095-4672-a4b6-06f7de0c0d87823708191226366 CREATE) [n:127.0.0.1:53288_solr c:delayed s:shard1  x:delayed_shard1_replica1] o.a.s.c.SolrResourceLoader new SolrResourceLoader for directory: 'C:\Users\jenkins\workspace\Lucene-Solr-master-Windows\solr\build\solr-solrj\test\J0\temp\solr.common.cloud.TestCollectionStateWatchers_D6D18F617A1C57F6-001\tempDir-001\node2\delayed_shard1_replica1'
   [junit4]   2> 36419 INFO  (parallelCoreAdminExecutor-186-thread-1-processing-n:127.0.0.1:53288_solr f05a7d44-9095-4672-a4b6-06f7de0c0d87823708191226366 CREATE) [n:127.0.0.1:53288_solr c:delayed s:shard1  x:delayed_shard1_replica1] o.a.s.c.SolrResourceLoader JNDI not configured for solr (NoInitialContextEx)
   [junit4]   2> 36419 INFO  (parallelCoreAdminExecutor-186-thread-1-processing-n:127.0.0.1:53288_solr f05a7d44-9095-4672-a4b6-06f7de0c0d87823708191226366 CREATE) [n:127.0.0.1:53288_solr c:delayed s:shard1  x:delayed_shard1_replica1] o.a.s.c.SolrResourceLoader solr home defaulted to 'solr/' (could not find system property or JNDI)
   [junit4]   2> 36425 INFO  (parallelCoreAdminExecutor-186-thread-1-processing-n:127.0.0.1:53288_solr f05a7d44-9095-4672-a4b6-06f7de0c0d87823708191226366 CREATE) [n:127.0.0.1:53288_solr c:delayed s:shard1  x:delayed_shard1_replica1] o.a.s.c.Config loaded config solrconfig.xml with version 0 
   [junit4]   2> 36439 INFO  (parallelCoreAdminExecutor-186-thread-1-processing-n:127.0.0.1:53288_solr f05a7d44-9095-4672-a4b6-06f7de0c0d87823708191226366 CREATE) [n:127.0.0.1:53288_solr c:delayed s:shard1  x:delayed_shard1_replica1] o.a.s.c.SolrConfig current version of requestparams : -1
   [junit4]   2> 36450 INFO  (parallelCoreAdminExecutor-186-thread-1-processing-n:127.0.0.1:53288_solr f05a7d44-9095-4672-a4b6-06f7de0c0d87823708191226366 CREATE) [n:127.0.0.1:53288_solr c:delayed s:shard1  x:delayed_shard1_replica1] o.a.s.c.SolrConfig Using Lucene MatchVersion: 7.0.0
   [junit4]   2> 36464 INFO  (parallelCoreAdminExecutor-186-thread-1-processing-n:127.0.0.1:53288_solr f05a7d44-9095-4672-a4b6-06f7de0c0d87823708191226366 CREATE) [n:127.0.0.1:53288_solr c:delayed s:shard1  x:delayed_shard1_replica1] o.a.s.c.SolrConfig Loaded SolrConfig: solrconfig.xml
   [junit4]   2> 36489 INFO  (parallelCoreAdminExecutor-186-thread-1-processing-n:127.0.0.1:53288_solr f05a7d44-9095-4672-a4b6-06f7de0c0d87823708191226366 CREATE) [n:127.0.0.1:53288_solr c:delayed s:shard1  x:delayed_shard1_replica1] o.a.s.s.IndexSchema [delayed_shard1_replica1] Schema name=test
   [junit4]   2> 36805 INFO  (parallelCoreAdminExecutor-186-thread-1-processing-n:127.0.0.1:53288_solr f05a7d44-9095-4672-a4b6-06f7de0c0d87823708191226366 CREATE) [n:127.0.0.1:53288_solr c:delayed s:shard1  x:delayed_shard1_replica1] o.a.s.s.IndexSchema default search field in schema is text
   [junit4]   2> 36807 INFO  (parallelCoreAdminExecutor-186-thread-1-processing-n:127.0.0.1:53288_solr f05a7d44-9095-4672-a4b6-06f7de0c0d87823708191226366 CREATE) [n:127.0.0.1:53288_solr c:delayed s:shard1  x:delayed_shard1_replica1] o.a.s.s.IndexSchema unique key field: id
   [junit4]   2> 36808 WARN  (parallelCoreAdminExecutor-186-thread-1-processing-n:127.0.0.1:53288_solr f05a7d44-9095-4672-a4b6-06f7de0c0d87823708191226366 CREATE) [n:127.0.0.1:53288_solr c:delayed s:shard1  x:delayed_shard1_replica1] o.a.s.s.IndexSchema Field lowerfilt1and2 is not multivalued and destination for multiple copyFields (2)
   [junit4]   2> 36808 WARN  (parallelCoreAdminExecutor-186-thread-1-processing-n:127.0.0.1:53288_solr f05a7d44-9095-4672-a4b6-06f7de0c0d87823708191226366 CREATE) [n:127.0.0.1:53288_solr c:delayed s:shard1  x:delayed_shard1_replica1] o.a.s.s.IndexSchema Field text is not multivalued and destination for multiple copyFields (3)
   [junit4]   2> 36827 INFO  (parallelCoreAdminExecutor-186-thread-1-processing-n:127.0.0.1:53288_solr f05a7d44-9095-4672-a4b6-06f7de0c0d87823708191226366 CREATE) [n:127.0.0.1:53288_solr c:delayed s:shard1  x:delayed_shard1_replica1] o.a.s.c.ConfigSetProperties Did not find ConfigSet properties, assuming default properties: Can't find resource 'configsetprops.json' in classpath or '/configs/config', cwd=C:\Users\jenkins\workspace\Lucene-Solr-master-Windows\solr\build\solr-solrj\test\J0
   [junit4]   2> 36827 INFO  (parallelCoreAdminExecutor-186-thread-1-processing-n:127.0.0.1:53288_solr f05a7d44-9095-4672-a4b6-06f7de0c0d87823708191226366 CREATE) [n:127.0.0.1:53288_solr c:delayed s:shard1  x:delayed_shard1_replica1] o.a.s.c.CoreContainer Creating SolrCore 'delayed_shard1_replica1' using configuration from collection delayed
   [junit4]   2> 36827 INFO  (parallelCoreAdminExecutor-186-thread-1-processing-n:127.0.0.1:53288_solr f05a7d44-9095-4672-a4b6-06f7de0c0d87823708191226366 CREATE) [n:127.0.0.1:53288_solr c:delayed s:shard1 r:core_node1 x:delayed_shard1_replica1] o.a.s.c.SolrCore org.apache.solr.core.MockDirectoryFactory
   [junit4]   2> 36827 INFO  (parallelCoreAdminExecutor-186-thread-1-processing-n:127.0.0.1:53288_solr f05a7d44-9095-4672-a4b6-06f7de0c0d87823708191226366 CREATE) [n:127.0.0.1:53288_solr c:delayed s:shard1 r:core_node1 x:delayed_shard1_replica1] o.a.s.c.SolrCore [[delayed_shard1_replica1] ] Opening new SolrCore at [C:\Users\jenkins\workspace\Lucene-Solr-master-Windows\solr\build\solr-solrj\test\J0\temp\solr.common.cloud.TestCollectionStateWatchers_D6D18F617A1C57F6-001\tempDir-001\node2\delayed_shard1_replica1], dataDir=[C:\Users\jenkins\workspace\Lucene-Solr-master-Windows\solr\build\solr-solrj\test\J0\temp\solr.common.cloud.TestCollectionStateWatchers_D6D18F617A1C57F6-001\tempDir-001\node2\.\delayed_shard1_replica1\data\]
   [junit4]   2> 36828 INFO  (parallelCoreAdminExecutor-186-thread-1-processing-n:127.0.0.1:53288_solr f05a7d44-9095-4672-a4b6-06f7de0c0d87823708191226366 CREATE) [n:127.0.0.1:53288_solr c:delayed s:shard1 r:core_node1 x:delayed_shard1_replica1] o.a.s.c.SolrCore JMX monitoring not detected for core: delayed_shard1_replica1
   [junit4]   2> 36828 INFO  (parallelCoreAdminExecutor-186-thread-1-processing-n:127.0.0.1:53288_solr f05a7d44-9095-4672-a4b6-06f7de0c0d87823708191226366 CREATE) [n:127.0.0.1:53288_solr c:delayed s:shard1 r:core_node1 x:delayed_shard1_replica1] o.a.s.c.CachingDirectoryFactory return new directory for C:\Users\jenkins\workspace\Lucene-Solr-master-Windows\solr\build\solr-solrj\test\J0\temp\solr.common.cloud.TestCollectionStateWatchers_D6D18F617A1C57F6-001\tempDir-001\node2\.\delayed_shard1_replica1\data\
   [junit4]   2> 36828 INFO  (parallelCoreAdminExecutor-186-thread-1-processing-n:127.0.0.1:53288_solr f05a7d44-9095-4672-a4b6-06f7de0c0d87823708191226366 CREATE) [n:127.0.0.1:53288_solr c:delayed s:shard1 r:core_node1 x:delayed_shard1_replica1] o.a.s.c.SolrCore New index directory detected: old=null new=C:\Users\jenkins\workspace\Lucene-Solr-master-Windows\solr\build\solr-solrj\test\J0\temp\solr.common.cloud.TestCollectionStateWatchers_D6D18F617A1C57F6-001\tempDir-001\node2\.\delayed_shard1_replica1\data\index/
   [junit4]   2> 36829 WARN  (parallelCoreAdminExecutor-186-thread-1-processing-n:127.0.0.1:53288_solr f05a7d44-9095-4672-a4b6-06f7de0c0d87823708191226366 CREATE) [n:127.0.0.1:53288_solr c:delayed s:shard1 r:core_node1 x:delayed_shard1_replica1] o.a.s.c.SolrCore [delayed_shard1_replica1] Solr index directory 'C:\Users\jenkins\workspace\Lucene-Solr-master-Windows\solr\build\solr-solrj\test\J0\temp\solr.common.cloud.TestCollectionStateWatchers_D6D18F617A1C57F6-001\tempDir-001\node2\.\delayed_shard1_replica1\data\index' doesn't exist. Creating new index...
   [junit4]   2> 36829 INFO  (parallelCoreAdminExecutor-186-thread-1-processing-n:127.0.0.1:53288_solr f05a7d44-9095-4672-a4b6-06f7de0c0d87823708191226366 CREATE) [n:127.0.0.1:53288_solr c:delayed s:shard1 r:core_node1 x:delayed_shard1_replica1] o.a.s.c.CachingDirectoryFactory return new directory for C:\Users\jenkins\workspace\Lucene-Solr-master-Windows\solr\build\solr-solrj\test\J0\temp\solr.common.cloud.TestCollectionStateWatchers_D6D18F617A1C57F6-001\tempDir-001\node2\.\delayed_shard1_replica1\data\index
   [junit4]   2> 36830 INFO  (parallelCoreAdminExecutor-186-thread-1-processing-n:127.0.0.1:53288_solr f05a7d44-9095-4672-a4b6-06f7de0c0d87823708191226366 CREATE) [n:127.0.0.1:53288_solr c:delayed s:shard1 r:core_node1 x:delayed_shard1_replica1] o.a.s.c.SolrDeletionPolicy SolrDeletionPolicy.onCommit: commits: num=1
   [junit4]   2> 	commit{dir=RawDirectoryWrapper(RAMDirectory@1a7bce2 lockFactory=org.apache.lucene.store.SingleInstanceLockFactory@14aeb56),segFN=segments_1,generation=1}
   [junit4]   2> 36830 INFO  (parallelCoreAdminExecutor-186-thread-1-processing-n:127.0.0.1:53288_solr f05a7d44-9095-4672-a4b6-06f7de0c0d87823708191226366 CREATE) [n:127.0.0.1:53288_solr c:delayed s:shard1 r:core_node1 x:delayed_shard1_replica1] o.a.s.c.SolrDeletionPolicy newest commit generation = 1
   [junit4]   2> 36832 INFO  (OldIndexDirectoryCleanupThreadForCore-delayed_shard1_replica1) [n:127.0.0.1:53288_solr c:delayed s:shard1 r:core_node1 x:delayed_shard1_replica1] o.a.s.c.SolrCore Looking for old index directories to cleanup for core delayed_shard1_replica1 in C:\Users\jenkins\workspace\Lucene-Solr-master-Windows\solr\build\solr-solrj\test\J0\temp\solr.common.cloud.TestCollectionStateWatchers_D6D18F617A1C57F6-001\tempDir-001\node2\.\delayed_shard1_replica1\data\
   [junit4]   2> 36833 INFO  (parallelCoreAdminExecutor-186-thread-1-processing-n:127.0.0.1:53288_solr f05a7d44-9095-4672-a4b6-06f7de0c0d87823708191226366 CREATE) [n:127.0.0.1:53288_solr c:delayed s:shard1 r:core_node1 x:delayed_shard1_replica1] o.a.s.c.SolrCore no updateRequestProcessorChain defined as default, creating implicit default
   [junit4]   2> 36837 WARN  (OldIndexDirectoryCleanupThreadForCore-delayed_shard1_replica1) [n:127.0.0.1:53288_solr c:delayed s:shard1 r:core_node1 x:delayed_shard1_replica1] o.a.s.c.DirectoryFactory C:\Users\jenkins\workspace\Lucene-Solr-master-Windows\solr\build\solr-solrj\test\J0\temp\solr.common.cloud.TestCollectionStateWatchers_D6D18F617A1C57F6-001\tempDir-001\node2\.\delayed_shard1_replica1\data\ does not point to a valid data directory; skipping clean-up of old index directories.
   [junit4]   2> 36844 INFO  (parallelCoreAdminExecutor-186-thread-1-processing-n:127.0.0.1:53288_solr f05a7d44-9095-4672-a4b6-06f7de0c0d87823708191226366 CREATE) [n:127.0.0.1:53288_solr c:delayed s:shard1 r:core_node1 x:delayed_shard1_replica1] o.a.s.h.l.XMLLoader xsltCacheLifetimeSeconds=60
   [junit4]   2> 36845 INFO  (parallelCoreAdminExecutor-186-thread-1-processing-n:127.0.0.1:53288_solr f05a7d44-9095-4672-a4b6-06f7de0c0d87823708191226366 CREATE) [n:127.0.0.1:53288_solr c:delayed s:shard1 r:core_node1 x:delayed_shard1_replica1] o.a.s.h.l.XMLLoader xsltCacheLifetimeSeconds=60
   [junit4]   2> 36848 INFO  (parallelCoreAdminExecutor-186-thread-1-processing-n:127.0.0.1:53288_solr f05a7d44-9095-4672-a4b6-06f7de0c0d87823708191226366 CREATE) [n:127.0.0.1:53288_solr c:delayed s:shard1 r:core_node1 x:delayed_shard1_replica1] o.a.s.h.l.XMLLoader xsltCacheLifetimeSeconds=60
   [junit4]   2> 36850 INFO  (parallelCoreAdminExecutor-186-thread-1-processing-n:127.0.0.1:53288_solr f05a7d44-9095-4672-a4b6-06f7de0c0d87823708191226366 CREATE) [n:127.0.0.1:53288_solr c:delayed s:shard1 r:core_node1 x:delayed_shard1_replica1] o.a.s.h.l.XMLLoader xsltCacheLifetimeSeconds=60
   [junit4]   2> 36855 INFO  (parallelCoreAdminExecutor-186-thread-1-processing-n:127.0.0.1:53288_solr f05a7d44-9095-4672-a4b6-06f7de0c0d87823708191226366 CREATE) [n:127.0.0.1:53288_solr c:delayed s:shard1 r:core_node1 x:delayed_shard1_replica1] o.a.s.c.RequestHandlers Registered paths: /admin/mbeans,standard,,/update/json/docs,/admin/luke,/export,/get,/admin/properties,/update/json,/admin/threads,/update/csv,/sql,/graph,/admin/segments,/admin/system,/replication,/config,/stream,/schema,/admin/plugins,/admin/logging,/admin/ping,/update,/admin/file
   [junit4]   2> 36855 INFO  (parallelCoreAdminExecutor-186-thread-1-processing-n:127.0.0.1:53288_solr f05a7d44-9095-4672-a4b6-06f7de0c0d87823708191226366 CREATE) [n:127.0.0.1:53288_solr c:delayed s:shard1 r:core_node1 x:delayed_shard1_replica1] o.a.s.c.SolrCore Using default statsCache cache: org.apache.solr.search.stats.LocalStatsCache
   [junit4]   2> 36857 INFO  (parallelCoreAdminExecutor-186-thread-1-processing-n:127.0.0.1:53288_solr f05a7d44-9095-4672-a4b6-06f7de0c0d87823708191226366 CREATE) [n:127.0.0.1:53288_solr c:delayed s:shard1 r:core_node1 x:delayed_shard1_replica1] o.a.s.u.UpdateHandler Using UpdateLog implementation: org.apache.solr.update.UpdateLog
   [junit4]   2> 36857 INFO  (parallelCoreAdminExecutor-186-thread-1-processing-n:127.0.0.1:53288_solr f05a7d44-9095-4672-a4b6-06f7de0c0d87823708191226366 CREATE) [n:127.0.0.1:53288_solr c:delayed s:shard1 r:core_node1 x:delayed_shard1_replica1] o.a.s.u.UpdateLog Initializing UpdateLog: dataDir= defaultSyncLevel=FLUSH numRecordsToKeep=100 maxNumLogsToKeep=10 numVersionBuckets=65536
   [junit4]   2> 36859 INFO  (parallelCoreAdminExecutor-186-thread-1-processing-n:127.0.0.1:53288_solr f05a7d44-9095-4672-a4b6-06f7de0c0d87823708191226366 CREATE) [n:127.0.0.1:53288_solr c:delayed s:shard1 r:core_node1 x:delayed_shard1_replica1] o.a.s.u.CommitTracker Hard AutoCommit: disabled
   [junit4]   2> 36859 INFO  (parallelCoreAdminExecutor-186-thread-1-processing-n:127.0.0.1:53288_solr f05a7d44-9095-4672-a4b6-06f7de0c0d87823708191226366 CREATE) [n:127.0.0.1:53288_solr c:delayed s:shard1 r:core_node1 x:delayed_shard1_replica1] o.a.s.u.CommitTracker Soft AutoCommit: disabled
   [junit4]   2> 36862 INFO  (parallelCoreAdminExecutor-186-thread-1-processing-n:127.0.0.1:53288_solr f05a7d44-9095-4672-a4b6-06f7de0c0d87823708191226366 CREATE) [n:127.0.0.1:53288_solr c:delayed s:shard1 r:core_node1 x:delayed_shard1_replica1] o.a.s.c.SolrDeletionPolicy SolrDeletionPolicy.onInit: commits: num=1
   [junit4]   2> 	commit{dir=RawDirectoryWrapper(RAMDirectory@1a7bce2 lockFactory=org.apache.lucene.store.SingleInstanceLockFactory@14aeb56),segFN=segments_1,generation=1}
   [junit4]   2> 36862 INFO  (parallelCoreAdminExecutor-186-thread-1-processing-n:127.0.0.1:53288_solr f05a7d44-9095-4672-a4b6-06f7de0c0d87823708191226366 CREATE) [n:127.0.0.1:53288_solr c:delayed s:shard1 r:core_node1 x:delayed_shard1_replica1] o.a.s.c.SolrDeletionPolicy newest commit generation = 1
   [junit4]   2> 36862 INFO  (parallelCoreAdminExecutor-186-thread-1-processing-n:127.0.0.1:53288_solr f05a7d44-9095-4672-a4b6-06f7de0c0d87823708191226366 CREATE) [n:127.0.0.1:53288_solr c:delayed s:shard1 r:cor

[...truncated too long message...]

(TEST-TestCollectionStateWatchers.testWaitForStateWatcherIsRetainedOnPredicateFailure-seed#[D6D18F617A1C57F6]-EventThread) [n:127.0.0.1:53523_solr    ] o.a.z.ClientCnxn Error while calling watcher 
   [junit4]   2> java.util.concurrent.RejectedExecutionException: Task org.apache.solr.common.util.ExecutorUtil$MDCAwareThreadPoolExecutor$$Lambda$8/23347603@17d09f4 rejected from org.apache.solr.common.util.ExecutorUtil$MDCAwareThreadPoolExecutor@1428f03[Terminated, pool size = 0, active threads = 0, queued tasks = 0, completed tasks = 4]
   [junit4]   2> 	at java.util.concurrent.ThreadPoolExecutor$AbortPolicy.rejectedExecution(ThreadPoolExecutor.java:2047)
   [junit4]   2> 	at java.util.concurrent.ThreadPoolExecutor.reject(ThreadPoolExecutor.java:823)
   [junit4]   2> 	at java.util.concurrent.ThreadPoolExecutor.execute(ThreadPoolExecutor.java:1369)
   [junit4]   2> 	at org.apache.solr.common.util.ExecutorUtil$MDCAwareThreadPoolExecutor.execute(ExecutorUtil.java:214)
   [junit4]   2> 	at java.util.concurrent.AbstractExecutorService.submit(AbstractExecutorService.java:112)
   [junit4]   2> 	at org.apache.solr.common.cloud.SolrZkClient$3.process(SolrZkClient.java:266)
   [junit4]   2> 	at org.apache.zookeeper.ClientCnxn$EventThread.processEvent(ClientCnxn.java:522)
   [junit4]   2> 	at org.apache.zookeeper.ClientCnxn$EventThread.run(ClientCnxn.java:498)
   [junit4]   2> 62549 INFO  (coreCloseExecutor-293-thread-3) [n:127.0.0.1:53290_solr c:falsepredicate s:shard2 r:core_node1 x:falsepredicate_shard2_replica1] o.a.s.c.CachingDirectoryFactory looking to close C:\Users\jenkins\workspace\Lucene-Solr-master-Windows\solr\build\solr-solrj\test\J0\temp\solr.common.cloud.TestCollectionStateWatchers_D6D18F617A1C57F6-001\tempDir-001\node1\.\falsepredicate_shard2_replica1\data\index [CachedDir<<refCount=0;path=C:\Users\jenkins\workspace\Lucene-Solr-master-Windows\solr\build\solr-solrj\test\J0\temp\solr.common.cloud.TestCollectionStateWatchers_D6D18F617A1C57F6-001\tempDir-001\node1\.\falsepredicate_shard2_replica1\data\index;done=false>>]
   [junit4]   2> 62571 INFO  (coreCloseExecutor-293-thread-3) [n:127.0.0.1:53290_solr c:falsepredicate s:shard2 r:core_node1 x:falsepredicate_shard2_replica1] o.a.s.c.CachingDirectoryFactory Closing directory, CoreContainer#isShutdown=true
   [junit4]   2> 62571 INFO  (coreCloseExecutor-293-thread-3) [n:127.0.0.1:53290_solr c:falsepredicate s:shard2 r:core_node1 x:falsepredicate_shard2_replica1] o.a.s.c.CachingDirectoryFactory Closing directory: C:\Users\jenkins\workspace\Lucene-Solr-master-Windows\solr\build\solr-solrj\test\J0\temp\solr.common.cloud.TestCollectionStateWatchers_D6D18F617A1C57F6-001\tempDir-001\node1\.\falsepredicate_shard2_replica1\data\index
   [junit4]   2> 62565 INFO  (jetty-launcher-18-thread-3) [    ] o.e.j.s.h.ContextHandler Stopped o.e.j.s.ServletContextHandler@69d6b8{/solr,null,UNAVAILABLE}
   [junit4]   2> 62565 INFO  (zkCallback-37-thread-2-processing-n:127.0.0.1:53288_solr) [n:127.0.0.1:53288_solr    ] o.a.s.c.c.ZkStateReader A live node change: [WatchedEvent state:SyncConnected type:NodeChildrenChanged path:/live_nodes], has occurred - updating... (live nodes size: [4])
   [junit4]   2> 62572 WARN  (zkCallback-37-thread-2-processing-n:127.0.0.1:53288_solr) [n:127.0.0.1:53288_solr    ] o.a.s.c.c.ZkStateReader ZooKeeper watch triggered, but Solr cannot talk to ZK: [KeeperErrorCode = Session expired for /live_nodes]
   [junit4]   2> 62560 INFO  (zkCallback-66-thread-1-processing-n:127.0.0.1:53294_solr) [n:127.0.0.1:53294_solr    ] o.a.s.c.c.ZkStateReader A live node change: [WatchedEvent state:SyncConnected type:NodeChildrenChanged path:/live_nodes], has occurred - updating... (live nodes size: [4])
   [junit4]   2> 62574 WARN  (zkCallback-66-thread-1-processing-n:127.0.0.1:53294_solr) [n:127.0.0.1:53294_solr    ] o.a.s.c.c.ZkStateReader ZooKeeper watch triggered, but Solr cannot talk to ZK: [KeeperErrorCode = Session expired for /live_nodes]
   [junit4]   2> 62574 INFO  (jetty-launcher-18-thread-1) [    ] o.e.j.s.h.ContextHandler Stopped o.e.j.s.ServletContextHandler@b9d4f7{/solr,null,UNAVAILABLE}
   [junit4]   2> 62576 INFO  (jetty-launcher-18-thread-4) [    ] o.a.s.c.Overseer Overseer (id=95903125833383947-127.0.0.1:53290_solr-n_0000000000) closing
   [junit4]   2> 62551 INFO  (OverseerStateUpdate-95903125833383947-127.0.0.1:53290_solr-n_0000000000) [n:127.0.0.1:53290_solr    ] o.a.s.c.o.ZkStateWriter going to update_collection /collections/stateformat1/state.json version: 7
   [junit4]   2> 62576 INFO  (OverseerStateUpdate-95903125833383947-127.0.0.1:53290_solr-n_0000000000) [n:127.0.0.1:53290_solr    ] o.a.s.c.Overseer Overseer Loop exiting : 127.0.0.1:53290_solr
   [junit4]   2> 62572 INFO  (zkCallback-38-thread-2-processing-n:127.0.0.1:53290_solr) [n:127.0.0.1:53290_solr    ] o.a.s.c.c.ZkStateReader Updated live nodes from ZooKeeper... (4) -> (1)
   [junit4]   2> 62596 INFO  (jetty-launcher-18-thread-2) [    ] o.e.j.s.h.ContextHandler Stopped o.e.j.s.ServletContextHandler@850eb7{/solr,null,UNAVAILABLE}
   [junit4]   2> 62606 INFO  (zkCallback-38-thread-2-processing-n:127.0.0.1:53290_solr) [n:127.0.0.1:53290_solr    ] o.a.s.c.c.ZkStateReader A live node change: [WatchedEvent state:SyncConnected type:NodeChildrenChanged path:/live_nodes], has occurred - updating... (live nodes size: [1])
   [junit4]   2> 62606 WARN  (zkCallback-38-thread-2-processing-n:127.0.0.1:53290_solr) [n:127.0.0.1:53290_solr    ] o.a.s.c.c.ZkStateReader ZooKeeper watch triggered, but Solr cannot talk to ZK: [KeeperErrorCode = Session expired for /live_nodes]
   [junit4]   2> 62608 INFO  (jetty-launcher-18-thread-4) [    ] o.e.j.s.h.ContextHandler Stopped o.e.j.s.ServletContextHandler@19adc6b{/solr,null,UNAVAILABLE}
   [junit4]   2> 62624 INFO  (SUITE-TestCollectionStateWatchers-seed#[D6D18F617A1C57F6]-worker) [    ] o.a.s.c.ZkTestServer connecting to 127.0.0.1:53284 53284
   [junit4]   2> 62633 INFO  (Thread-60) [    ] o.a.s.c.ZkTestServer connecting to 127.0.0.1:53284 53284
   [junit4]   2> 62673 WARN  (Thread-60) [    ] o.a.s.c.ZkTestServer Watch limit violations: 
   [junit4]   2> Maximum concurrent create/delete watches above limit:
   [junit4]   2> 
   [junit4]   2> 	8	/solr/aliases.json
   [junit4]   2> 	8	/solr/clusterprops.json
   [junit4]   2> 	7	/solr/security.json
   [junit4]   2> 	7	/solr/configs/config
   [junit4]   2> 	3	/solr/collections/stateformat1/state.json
   [junit4]   2> 
   [junit4]   2> Maximum concurrent data watches above limit:
   [junit4]   2> 
   [junit4]   2> 	18	/solr/collections/testcollection/state.json
   [junit4]   2> 	17	/solr/collections/falsepredicate/state.json
   [junit4]   2> 	12	/solr/collections/waitforstate/state.json
   [junit4]   2> 	8	/solr/clusterstate.json
   [junit4]   2> 	3	/solr/overseer_elect/election/95903125833383945-127.0.0.1:53288_solr-n_0000000001
   [junit4]   2> 	2	/solr/collections/delayed/state.json
   [junit4]   2> 	2	/solr/collections/tobedeleted/state.json
   [junit4]   2> 	2	/solr/overseer_elect/election/95903125833383948-127.0.0.1:53294_solr-n_0000000002
   [junit4]   2> 	2	/solr/collections/stateformat1/state.json
   [junit4]   2> 
   [junit4]   2> Maximum concurrent children watches above limit:
   [junit4]   2> 
   [junit4]   2> 	8	/solr/collections
   [junit4]   2> 	5	/solr/live_nodes
   [junit4]   2> 
   [junit4]   2> 62673 INFO  (SUITE-TestCollectionStateWatchers-seed#[D6D18F617A1C57F6]-worker) [    ] o.a.s.SolrTestCaseJ4 ###deleteCore
   [junit4]   2> NOTE: leaving temporary files on disk at: C:\Users\jenkins\workspace\Lucene-Solr-master-Windows\solr\build\solr-solrj\test\J0\temp\solr.common.cloud.TestCollectionStateWatchers_D6D18F617A1C57F6-001
   [junit4]   2> May 16, 2016 2:26:37 AM com.carrotsearch.randomizedtesting.ThreadLeakControl checkThreadLeaks
   [junit4]   2> WARNING: Will linger awaiting termination of 2 leaked thread(s).
   [junit4]   2> NOTE: test params are: codec=Asserting(Lucene62): {}, docValues:{}, maxPointsInLeafNode=1868, maxMBSortInHeap=6.252221837763123, sim=ClassicSimilarity, locale=es-EC, timezone=America/North_Dakota/New_Salem
   [junit4]   2> NOTE: Windows 10 10.0 x86/Oracle Corporation 1.8.0_92 (32-bit)/cpus=3,threads=1,free=27126016,total=96370688
   [junit4]   2> NOTE: All tests run in this JVM: [TestSpellCheckResponse, NamedListTest, SolrExampleEmbeddedTest, ModifiableSolrParamsTest, TestUpdateRequestCodec, TestCollectionAdminRequest, SolrDocumentTest, TestDocumentObjectBinder, CollectionAdminRequestRequiredParamsTest, SolrSchemalessExampleTest, TestCoreAdmin, TestCollectionStateWatchers]
   [junit4] Completed [21/83 (1!)] on J0 in 30.83s, 8 tests, 1 failure <<< FAILURES!

[...truncated 196 lines...]
BUILD FAILED
C:\Users\jenkins\workspace\Lucene-Solr-master-Windows\build.xml:740: The following error occurred while executing this line:
C:\Users\jenkins\workspace\Lucene-Solr-master-Windows\build.xml:684: The following error occurred while executing this line:
C:\Users\jenkins\workspace\Lucene-Solr-master-Windows\build.xml:59: The following error occurred while executing this line:
C:\Users\jenkins\workspace\Lucene-Solr-master-Windows\solr\build.xml:246: The following error occurred while executing this line:
C:\Users\jenkins\workspace\Lucene-Solr-master-Windows\solr\common-build.xml:529: The following error occurred while executing this line:
C:\Users\jenkins\workspace\Lucene-Solr-master-Windows\lucene\common-build.xml:1457: The following error occurred while executing this line:
C:\Users\jenkins\workspace\Lucene-Solr-master-Windows\lucene\common-build.xml:1014: There were test failures: 83 suites, 639 tests, 1 failure, 2 ignored [seed: D6D18F617A1C57F6]

Total time: 78 minutes 29 seconds
Build step 'Invoke Ant' marked build as failure
Archiving artifacts
[WARNINGS] Skipping publisher since build result is FAILURE
Recording test results
Email was triggered for: Failure - Any
Sending email for trigger: Failure - Any



Mime
View raw message