lucene-dev mailing list archives

Site index · List index
Message view « Date » · « Thread »
Top « Date » · « Thread »
From Policeman Jenkins Server <jenk...@thetaphi.de>
Subject [JENKINS] Lucene-Solr-6.x-Windows (32bit/jdk1.8.0_92) - Build # 184 - Failure!
Date Mon, 16 May 2016 12:44:38 GMT
Build: http://jenkins.thetaphi.de/job/Lucene-Solr-6.x-Windows/184/
Java: 32bit/jdk1.8.0_92 -client -XX:+UseParallelGC

1 tests failed.
FAILED:  org.apache.lucene.store.TestRAFDirectory.testPendingDeletions

Error Message:
access denied ("java.io.FilePermission" "C:\Users\jenkins\workspace\Lucene-Solr-6.x-Windows\lucene\build\misc\test\J0\temp\lucene.store.TestRAFDirectory_63CCBD496EE0FA39-001\tempDir-006\aux"
"write")

Stack Trace:
java.security.AccessControlException: access denied ("java.io.FilePermission" "C:\Users\jenkins\workspace\Lucene-Solr-6.x-Windows\lucene\build\misc\test\J0\temp\lucene.store.TestRAFDirectory_63CCBD496EE0FA39-001\tempDir-006\aux"
"write")
	at __randomizedtesting.SeedInfo.seed([63CCBD496EE0FA39:F8D0CA311686F69B]:0)
	at java.security.AccessControlContext.checkPermission(AccessControlContext.java:472)
	at java.security.AccessController.checkPermission(AccessController.java:884)
	at java.lang.SecurityManager.checkPermission(SecurityManager.java:549)
	at java.lang.SecurityManager.checkWrite(SecurityManager.java:979)
	at sun.nio.fs.WindowsChannelFactory.open(WindowsChannelFactory.java:295)
	at sun.nio.fs.WindowsChannelFactory.newFileChannel(WindowsChannelFactory.java:162)
	at sun.nio.fs.WindowsFileSystemProvider.newByteChannel(WindowsFileSystemProvider.java:225)
	at java.nio.file.spi.FileSystemProvider.newOutputStream(FileSystemProvider.java:434)
	at org.apache.lucene.mockfile.FilterFileSystemProvider.newOutputStream(FilterFileSystemProvider.java:197)
	at org.apache.lucene.mockfile.FilterFileSystemProvider.newOutputStream(FilterFileSystemProvider.java:197)
	at org.apache.lucene.mockfile.HandleTrackingFS.newOutputStream(HandleTrackingFS.java:129)
	at org.apache.lucene.mockfile.HandleTrackingFS.newOutputStream(HandleTrackingFS.java:129)
	at org.apache.lucene.mockfile.FilterFileSystemProvider.newOutputStream(FilterFileSystemProvider.java:197)
	at org.apache.lucene.mockfile.FilterFileSystemProvider.newOutputStream(FilterFileSystemProvider.java:197)
	at java.nio.file.Files.newOutputStream(Files.java:216)
	at org.apache.lucene.store.FSDirectory$FSIndexOutput.<init>(FSDirectory.java:408)
	at org.apache.lucene.store.FSDirectory$FSIndexOutput.<init>(FSDirectory.java:404)
	at org.apache.lucene.store.FSDirectory.createOutput(FSDirectory.java:253)
	at org.apache.lucene.store.BaseDirectoryTestCase.testPendingDeletions(BaseDirectoryTestCase.java:1215)
	at sun.reflect.NativeMethodAccessorImpl.invoke0(Native Method)
	at sun.reflect.NativeMethodAccessorImpl.invoke(NativeMethodAccessorImpl.java:62)
	at sun.reflect.DelegatingMethodAccessorImpl.invoke(DelegatingMethodAccessorImpl.java:43)
	at java.lang.reflect.Method.invoke(Method.java:498)
	at com.carrotsearch.randomizedtesting.RandomizedRunner.invoke(RandomizedRunner.java:1764)
	at com.carrotsearch.randomizedtesting.RandomizedRunner$8.evaluate(RandomizedRunner.java:871)
	at com.carrotsearch.randomizedtesting.RandomizedRunner$9.evaluate(RandomizedRunner.java:907)
	at com.carrotsearch.randomizedtesting.RandomizedRunner$10.evaluate(RandomizedRunner.java:921)
	at org.apache.lucene.util.TestRuleSetupTeardownChained$1.evaluate(TestRuleSetupTeardownChained.java:49)
	at org.apache.lucene.util.AbstractBeforeAfterRule$1.evaluate(AbstractBeforeAfterRule.java:45)
	at org.apache.lucene.util.TestRuleThreadAndTestName$1.evaluate(TestRuleThreadAndTestName.java:48)
	at org.apache.lucene.util.TestRuleIgnoreAfterMaxFailures$1.evaluate(TestRuleIgnoreAfterMaxFailures.java:64)
	at org.apache.lucene.util.TestRuleMarkFailure$1.evaluate(TestRuleMarkFailure.java:47)
	at com.carrotsearch.randomizedtesting.rules.StatementAdapter.evaluate(StatementAdapter.java:36)
	at com.carrotsearch.randomizedtesting.ThreadLeakControl$StatementRunner.run(ThreadLeakControl.java:367)
	at com.carrotsearch.randomizedtesting.ThreadLeakControl.forkTimeoutingTask(ThreadLeakControl.java:809)
	at com.carrotsearch.randomizedtesting.ThreadLeakControl$3.evaluate(ThreadLeakControl.java:460)
	at com.carrotsearch.randomizedtesting.RandomizedRunner.runSingleTest(RandomizedRunner.java:880)
	at com.carrotsearch.randomizedtesting.RandomizedRunner$5.evaluate(RandomizedRunner.java:781)
	at com.carrotsearch.randomizedtesting.RandomizedRunner$6.evaluate(RandomizedRunner.java:816)
	at com.carrotsearch.randomizedtesting.RandomizedRunner$7.evaluate(RandomizedRunner.java:827)
	at org.apache.lucene.util.AbstractBeforeAfterRule$1.evaluate(AbstractBeforeAfterRule.java:45)
	at com.carrotsearch.randomizedtesting.rules.StatementAdapter.evaluate(StatementAdapter.java:36)
	at org.apache.lucene.util.TestRuleStoreClassName$1.evaluate(TestRuleStoreClassName.java:41)
	at com.carrotsearch.randomizedtesting.rules.NoShadowingOrOverridesOnMethodsRule$1.evaluate(NoShadowingOrOverridesOnMethodsRule.java:40)
	at com.carrotsearch.randomizedtesting.rules.NoShadowingOrOverridesOnMethodsRule$1.evaluate(NoShadowingOrOverridesOnMethodsRule.java:40)
	at com.carrotsearch.randomizedtesting.rules.StatementAdapter.evaluate(StatementAdapter.java:36)
	at com.carrotsearch.randomizedtesting.rules.StatementAdapter.evaluate(StatementAdapter.java:36)
	at com.carrotsearch.randomizedtesting.rules.StatementAdapter.evaluate(StatementAdapter.java:36)
	at org.apache.lucene.util.TestRuleAssertionsRequired$1.evaluate(TestRuleAssertionsRequired.java:53)
	at org.apache.lucene.util.TestRuleMarkFailure$1.evaluate(TestRuleMarkFailure.java:47)
	at org.apache.lucene.util.TestRuleIgnoreAfterMaxFailures$1.evaluate(TestRuleIgnoreAfterMaxFailures.java:64)
	at org.apache.lucene.util.TestRuleIgnoreTestSuites$1.evaluate(TestRuleIgnoreTestSuites.java:54)
	at com.carrotsearch.randomizedtesting.rules.StatementAdapter.evaluate(StatementAdapter.java:36)
	at com.carrotsearch.randomizedtesting.ThreadLeakControl$StatementRunner.run(ThreadLeakControl.java:367)
	at java.lang.Thread.run(Thread.java:745)




Build Log:
[...truncated 7524 lines...]
   [junit4] Suite: org.apache.lucene.store.TestRAFDirectory
   [junit4]   2> NOTE: reproduce with: ant test  -Dtestcase=TestRAFDirectory -Dtests.method=testPendingDeletions
-Dtests.seed=63CCBD496EE0FA39 -Dtests.slow=true -Dtests.locale=es-CR -Dtests.timezone=America/New_York
-Dtests.asserts=true -Dtests.file.encoding=US-ASCII
   [junit4] ERROR   0.36s J0 | TestRAFDirectory.testPendingDeletions <<<
   [junit4]    > Throwable #1: java.security.AccessControlException: access denied ("java.io.FilePermission"
"C:\Users\jenkins\workspace\Lucene-Solr-6.x-Windows\lucene\build\misc\test\J0\temp\lucene.store.TestRAFDirectory_63CCBD496EE0FA39-001\tempDir-006\aux"
"write")
   [junit4]    > 	at __randomizedtesting.SeedInfo.seed([63CCBD496EE0FA39:F8D0CA311686F69B]:0)
   [junit4]    > 	at java.security.AccessControlContext.checkPermission(AccessControlContext.java:472)
   [junit4]    > 	at java.security.AccessController.checkPermission(AccessController.java:884)
   [junit4]    > 	at java.lang.SecurityManager.checkPermission(SecurityManager.java:549)
   [junit4]    > 	at java.lang.SecurityManager.checkWrite(SecurityManager.java:979)
   [junit4]    > 	at sun.nio.fs.WindowsChannelFactory.open(WindowsChannelFactory.java:295)
   [junit4]    > 	at sun.nio.fs.WindowsChannelFactory.newFileChannel(WindowsChannelFactory.java:162)
   [junit4]    > 	at sun.nio.fs.WindowsFileSystemProvider.newByteChannel(WindowsFileSystemProvider.java:225)
   [junit4]    > 	at java.nio.file.spi.FileSystemProvider.newOutputStream(FileSystemProvider.java:434)
   [junit4]    > 	at org.apache.lucene.mockfile.FilterFileSystemProvider.newOutputStream(FilterFileSystemProvider.java:197)
   [junit4]    > 	at org.apache.lucene.mockfile.FilterFileSystemProvider.newOutputStream(FilterFileSystemProvider.java:197)
   [junit4]    > 	at org.apache.lucene.mockfile.HandleTrackingFS.newOutputStream(HandleTrackingFS.java:129)
   [junit4]    > 	at org.apache.lucene.mockfile.HandleTrackingFS.newOutputStream(HandleTrackingFS.java:129)
   [junit4]    > 	at org.apache.lucene.mockfile.FilterFileSystemProvider.newOutputStream(FilterFileSystemProvider.java:197)
   [junit4]    > 	at org.apache.lucene.mockfile.FilterFileSystemProvider.newOutputStream(FilterFileSystemProvider.java:197)
   [junit4]    > 	at java.nio.file.Files.newOutputStream(Files.java:216)
   [junit4]    > 	at org.apache.lucene.store.FSDirectory$FSIndexOutput.<init>(FSDirectory.java:408)
   [junit4]    > 	at org.apache.lucene.store.FSDirectory$FSIndexOutput.<init>(FSDirectory.java:404)
   [junit4]    > 	at org.apache.lucene.store.FSDirectory.createOutput(FSDirectory.java:253)
   [junit4]    > 	at org.apache.lucene.store.BaseDirectoryTestCase.testPendingDeletions(BaseDirectoryTestCase.java:1215)
   [junit4]    > 	at java.lang.Thread.run(Thread.java:745)
   [junit4]   2> NOTE: leaving temporary files on disk at: C:\Users\jenkins\workspace\Lucene-Solr-6.x-Windows\lucene\build\misc\test\J0\temp\lucene.store.TestRAFDirectory_63CCBD496EE0FA39-001
   [junit4]   2> NOTE: test params are: codec=Asserting(Lucene60): {}, docValues:{}, maxPointsInLeafNode=1270,
maxMBSortInHeap=6.159666771032043, sim=ClassicSimilarity, locale=es-CR, timezone=America/New_York
   [junit4]   2> NOTE: Windows 10 10.0 x86/Oracle Corporation 1.8.0_92 (32-bit)/cpus=3,threads=1,free=31504632,total=150732800
   [junit4]   2> NOTE: All tests run in this JVM: [SortingLeafReaderTest, TestFieldCacheWithThreads,
TestFieldCacheSanityChecker, TestSlowCompositeReaderWrapper, TestLazyDocument, TestFieldCache,
TestHighFreqTerms, TestFSTsMisc, TestPKIndexSplitter, TestMultiPassIndexSplitter, SweetSpotSimilarityTest,
IndexSortingTest, TestDiversifiedTopDocsCollector, TestEarlyTerminatingSortingCollector, TestRAFDirectory]
   [junit4] Completed [22/27 (1!)] on J0 in 2.24s, 45 tests, 1 error <<< FAILURES!

[...truncated 25 lines...]
BUILD FAILED
C:\Users\jenkins\workspace\Lucene-Solr-6.x-Windows\build.xml:740: The following error occurred
while executing this line:
C:\Users\jenkins\workspace\Lucene-Solr-6.x-Windows\build.xml:684: The following error occurred
while executing this line:
C:\Users\jenkins\workspace\Lucene-Solr-6.x-Windows\build.xml:59: The following error occurred
while executing this line:
C:\Users\jenkins\workspace\Lucene-Solr-6.x-Windows\lucene\build.xml:476: The following error
occurred while executing this line:
C:\Users\jenkins\workspace\Lucene-Solr-6.x-Windows\lucene\common-build.xml:2187: The following
error occurred while executing this line:
C:\Users\jenkins\workspace\Lucene-Solr-6.x-Windows\lucene\module-build.xml:58: The following
error occurred while executing this line:
C:\Users\jenkins\workspace\Lucene-Solr-6.x-Windows\lucene\common-build.xml:1457: The following
error occurred while executing this line:
C:\Users\jenkins\workspace\Lucene-Solr-6.x-Windows\lucene\common-build.xml:1014: There were
test failures: 27 suites, 217 tests, 1 error, 1 ignored (1 assumption) [seed: 63CCBD496EE0FA39]

Total time: 17 minutes 17 seconds
Build step 'Invoke Ant' marked build as failure
Archiving artifacts
[WARNINGS] Skipping publisher since build result is FAILURE
Recording test results
Email was triggered for: Failure - Any
Sending email for trigger: Failure - Any



Mime
View raw message