lucene-dev mailing list archives

Site index · List index
Message view « Date » · « Thread »
Top « Date » · « Thread »
From Policeman Jenkins Server <jenk...@thetaphi.de>
Subject [JENKINS] Lucene-Solr-master-MacOSX (64bit/jdk1.8.0) - Build # 3259 - Failure!
Date Tue, 10 May 2016 08:31:08 GMT
Build: http://jenkins.thetaphi.de/job/Lucene-Solr-master-MacOSX/3259/
Java: 64bit/jdk1.8.0 -XX:+UseCompressedOops -XX:+UseSerialGC

1 tests failed.
FAILED:  org.apache.solr.cloud.ForceLeaderTest.testReplicasInLIRNoLeader

Error Message:
There are still nodes recoverying - waited for 330 seconds

Stack Trace:
java.lang.AssertionError: There are still nodes recoverying - waited for 330 seconds
	at __randomizedtesting.SeedInfo.seed([8F15F13D3461E6E6:6982C5FD0DE31F87]:0)
	at org.junit.Assert.fail(Assert.java:93)
	at org.apache.solr.cloud.AbstractDistribZkTestBase.waitForRecoveriesToFinish(AbstractDistribZkTestBase.java:182)
	at org.apache.solr.cloud.AbstractDistribZkTestBase.waitForRecoveriesToFinish(AbstractDistribZkTestBase.java:139)
	at org.apache.solr.cloud.AbstractDistribZkTestBase.waitForRecoveriesToFinish(AbstractDistribZkTestBase.java:134)
	at org.apache.solr.cloud.ForceLeaderTest.testReplicasInLIRNoLeader(ForceLeaderTest.java:115)
	at sun.reflect.NativeMethodAccessorImpl.invoke0(Native Method)
	at sun.reflect.NativeMethodAccessorImpl.invoke(NativeMethodAccessorImpl.java:62)
	at sun.reflect.DelegatingMethodAccessorImpl.invoke(DelegatingMethodAccessorImpl.java:43)
	at java.lang.reflect.Method.invoke(Method.java:498)
	at com.carrotsearch.randomizedtesting.RandomizedRunner.invoke(RandomizedRunner.java:1764)
	at com.carrotsearch.randomizedtesting.RandomizedRunner$8.evaluate(RandomizedRunner.java:871)
	at com.carrotsearch.randomizedtesting.RandomizedRunner$9.evaluate(RandomizedRunner.java:907)
	at com.carrotsearch.randomizedtesting.RandomizedRunner$10.evaluate(RandomizedRunner.java:921)
	at org.apache.solr.BaseDistributedSearchTestCase$ShardsRepeatRule$ShardsFixedStatement.callStatement(BaseDistributedSearchTestCase.java:985)
	at org.apache.solr.BaseDistributedSearchTestCase$ShardsRepeatRule$ShardsStatement.evaluate(BaseDistributedSearchTestCase.java:960)
	at com.carrotsearch.randomizedtesting.rules.SystemPropertiesRestoreRule$1.evaluate(SystemPropertiesRestoreRule.java:57)
	at org.apache.lucene.util.TestRuleSetupTeardownChained$1.evaluate(TestRuleSetupTeardownChained.java:49)
	at org.apache.lucene.util.AbstractBeforeAfterRule$1.evaluate(AbstractBeforeAfterRule.java:45)
	at org.apache.lucene.util.TestRuleThreadAndTestName$1.evaluate(TestRuleThreadAndTestName.java:48)
	at org.apache.lucene.util.TestRuleIgnoreAfterMaxFailures$1.evaluate(TestRuleIgnoreAfterMaxFailures.java:64)
	at org.apache.lucene.util.TestRuleMarkFailure$1.evaluate(TestRuleMarkFailure.java:47)
	at com.carrotsearch.randomizedtesting.rules.StatementAdapter.evaluate(StatementAdapter.java:36)
	at com.carrotsearch.randomizedtesting.ThreadLeakControl$StatementRunner.run(ThreadLeakControl.java:367)
	at com.carrotsearch.randomizedtesting.ThreadLeakControl.forkTimeoutingTask(ThreadLeakControl.java:809)
	at com.carrotsearch.randomizedtesting.ThreadLeakControl$3.evaluate(ThreadLeakControl.java:460)
	at com.carrotsearch.randomizedtesting.RandomizedRunner.runSingleTest(RandomizedRunner.java:880)
	at com.carrotsearch.randomizedtesting.RandomizedRunner$5.evaluate(RandomizedRunner.java:781)
	at com.carrotsearch.randomizedtesting.RandomizedRunner$6.evaluate(RandomizedRunner.java:816)
	at com.carrotsearch.randomizedtesting.RandomizedRunner$7.evaluate(RandomizedRunner.java:827)
	at com.carrotsearch.randomizedtesting.rules.StatementAdapter.evaluate(StatementAdapter.java:36)
	at com.carrotsearch.randomizedtesting.rules.SystemPropertiesRestoreRule$1.evaluate(SystemPropertiesRestoreRule.java:57)
	at org.apache.lucene.util.AbstractBeforeAfterRule$1.evaluate(AbstractBeforeAfterRule.java:45)
	at com.carrotsearch.randomizedtesting.rules.StatementAdapter.evaluate(StatementAdapter.java:36)
	at org.apache.lucene.util.TestRuleStoreClassName$1.evaluate(TestRuleStoreClassName.java:41)
	at com.carrotsearch.randomizedtesting.rules.NoShadowingOrOverridesOnMethodsRule$1.evaluate(NoShadowingOrOverridesOnMethodsRule.java:40)
	at com.carrotsearch.randomizedtesting.rules.NoShadowingOrOverridesOnMethodsRule$1.evaluate(NoShadowingOrOverridesOnMethodsRule.java:40)
	at com.carrotsearch.randomizedtesting.rules.StatementAdapter.evaluate(StatementAdapter.java:36)
	at com.carrotsearch.randomizedtesting.rules.StatementAdapter.evaluate(StatementAdapter.java:36)
	at com.carrotsearch.randomizedtesting.rules.StatementAdapter.evaluate(StatementAdapter.java:36)
	at org.apache.lucene.util.TestRuleAssertionsRequired$1.evaluate(TestRuleAssertionsRequired.java:53)
	at org.apache.lucene.util.TestRuleMarkFailure$1.evaluate(TestRuleMarkFailure.java:47)
	at org.apache.lucene.util.TestRuleIgnoreAfterMaxFailures$1.evaluate(TestRuleIgnoreAfterMaxFailures.java:64)
	at org.apache.lucene.util.TestRuleIgnoreTestSuites$1.evaluate(TestRuleIgnoreTestSuites.java:54)
	at com.carrotsearch.randomizedtesting.rules.StatementAdapter.evaluate(StatementAdapter.java:36)
	at com.carrotsearch.randomizedtesting.ThreadLeakControl$StatementRunner.run(ThreadLeakControl.java:367)
	at java.lang.Thread.run(Thread.java:745)




Build Log:
[...truncated 10670 lines...]
   [junit4] Suite: org.apache.solr.cloud.ForceLeaderTest
   [junit4]   2> Creating dataDir: /Users/jenkins/workspace/Lucene-Solr-master-MacOSX/solr/build/solr-core/test/J1/temp/solr.cloud.ForceLeaderTest_8F15F13D3461E6E6-001/init-core-data-001
   [junit4]   2> 0    INFO  (SUITE-ForceLeaderTest-seed#[8F15F13D3461E6E6]-worker) [    ] o.a.s.BaseDistributedSearchTestCase Setting hostContext system property: /
   [junit4]   2> 90   INFO  (TEST-ForceLeaderTest.testLastPublishedStateIsActive-seed#[8F15F13D3461E6E6]) [    ] o.a.s.c.ZkTestServer STARTING ZK TEST SERVER
   [junit4]   2> 99   INFO  (Thread-1) [    ] o.a.s.c.ZkTestServer client port:0.0.0.0/0.0.0.0:0
   [junit4]   2> 100  INFO  (Thread-1) [    ] o.a.s.c.ZkTestServer Starting server
   [junit4]   2> 410  INFO  (TEST-ForceLeaderTest.testLastPublishedStateIsActive-seed#[8F15F13D3461E6E6]) [    ] o.a.s.c.ZkTestServer start zk server on port:54007
   [junit4]   2> 515  INFO  (TEST-ForceLeaderTest.testLastPublishedStateIsActive-seed#[8F15F13D3461E6E6]) [    ] o.a.s.c.c.SolrZkClient Using default ZkCredentialsProvider
   [junit4]   2> 701  INFO  (TEST-ForceLeaderTest.testLastPublishedStateIsActive-seed#[8F15F13D3461E6E6]) [    ] o.a.s.c.c.ConnectionManager Waiting for client to connect to ZooKeeper
   [junit4]   2> 890  INFO  (zkCallback-1-thread-1) [    ] o.a.s.c.c.ConnectionManager Watcher org.apache.solr.common.cloud.ConnectionManager@3a16bd75 name:ZooKeeperConnection Watcher:127.0.0.1:54007 got event WatchedEvent state:SyncConnected type:None path:null path:null type:None
   [junit4]   2> 891  INFO  (TEST-ForceLeaderTest.testLastPublishedStateIsActive-seed#[8F15F13D3461E6E6]) [    ] o.a.s.c.c.ConnectionManager Client is connected to ZooKeeper
   [junit4]   2> 901  INFO  (TEST-ForceLeaderTest.testLastPublishedStateIsActive-seed#[8F15F13D3461E6E6]) [    ] o.a.s.c.c.SolrZkClient Using default ZkACLProvider
   [junit4]   2> 913  INFO  (TEST-ForceLeaderTest.testLastPublishedStateIsActive-seed#[8F15F13D3461E6E6]) [    ] o.a.s.c.c.SolrZkClient makePath: /solr
   [junit4]   2> 1029 INFO  (TEST-ForceLeaderTest.testLastPublishedStateIsActive-seed#[8F15F13D3461E6E6]) [    ] o.a.s.c.c.SolrZkClient Using default ZkCredentialsProvider
   [junit4]   2> 1030 INFO  (TEST-ForceLeaderTest.testLastPublishedStateIsActive-seed#[8F15F13D3461E6E6]) [    ] o.a.s.c.c.ConnectionManager Waiting for client to connect to ZooKeeper
   [junit4]   2> 1036 INFO  (zkCallback-2-thread-1) [    ] o.a.s.c.c.ConnectionManager Watcher org.apache.solr.common.cloud.ConnectionManager@27521b8e name:ZooKeeperConnection Watcher:127.0.0.1:54007/solr got event WatchedEvent state:SyncConnected type:None path:null path:null type:None
   [junit4]   2> 1036 INFO  (TEST-ForceLeaderTest.testLastPublishedStateIsActive-seed#[8F15F13D3461E6E6]) [    ] o.a.s.c.c.ConnectionManager Client is connected to ZooKeeper
   [junit4]   2> 1037 INFO  (TEST-ForceLeaderTest.testLastPublishedStateIsActive-seed#[8F15F13D3461E6E6]) [    ] o.a.s.c.c.SolrZkClient Using default ZkACLProvider
   [junit4]   2> 1060 INFO  (TEST-ForceLeaderTest.testLastPublishedStateIsActive-seed#[8F15F13D3461E6E6]) [    ] o.a.s.c.c.SolrZkClient makePath: /collections/collection1
   [junit4]   2> 1071 INFO  (TEST-ForceLeaderTest.testLastPublishedStateIsActive-seed#[8F15F13D3461E6E6]) [    ] o.a.s.c.c.SolrZkClient makePath: /collections/collection1/shards
   [junit4]   2> 1077 INFO  (TEST-ForceLeaderTest.testLastPublishedStateIsActive-seed#[8F15F13D3461E6E6]) [    ] o.a.s.c.c.SolrZkClient makePath: /collections/control_collection
   [junit4]   2> 1082 INFO  (TEST-ForceLeaderTest.testLastPublishedStateIsActive-seed#[8F15F13D3461E6E6]) [    ] o.a.s.c.c.SolrZkClient makePath: /collections/control_collection/shards
   [junit4]   2> 1087 INFO  (TEST-ForceLeaderTest.testLastPublishedStateIsActive-seed#[8F15F13D3461E6E6]) [    ] o.a.s.c.AbstractZkTestCase put /Users/jenkins/workspace/Lucene-Solr-master-MacOSX/solr/core/src/test-files/solr/collection1/conf/solrconfig-tlog.xml to /configs/conf1/solrconfig.xml
   [junit4]   2> 1123 INFO  (TEST-ForceLeaderTest.testLastPublishedStateIsActive-seed#[8F15F13D3461E6E6]) [    ] o.a.s.c.c.SolrZkClient makePath: /configs/conf1/solrconfig.xml
   [junit4]   2> 1132 INFO  (TEST-ForceLeaderTest.testLastPublishedStateIsActive-seed#[8F15F13D3461E6E6]) [    ] o.a.s.c.AbstractZkTestCase put /Users/jenkins/workspace/Lucene-Solr-master-MacOSX/solr/core/src/test-files/solr/collection1/conf/schema.xml to /configs/conf1/schema.xml
   [junit4]   2> 1133 INFO  (TEST-ForceLeaderTest.testLastPublishedStateIsActive-seed#[8F15F13D3461E6E6]) [    ] o.a.s.c.c.SolrZkClient makePath: /configs/conf1/schema.xml
   [junit4]   2> 1143 INFO  (TEST-ForceLeaderTest.testLastPublishedStateIsActive-seed#[8F15F13D3461E6E6]) [    ] o.a.s.c.AbstractZkTestCase put /Users/jenkins/workspace/Lucene-Solr-master-MacOSX/solr/core/src/test-files/solr/collection1/conf/solrconfig.snippet.randomindexconfig.xml to /configs/conf1/solrconfig.snippet.randomindexconfig.xml
   [junit4]   2> 1145 INFO  (TEST-ForceLeaderTest.testLastPublishedStateIsActive-seed#[8F15F13D3461E6E6]) [    ] o.a.s.c.c.SolrZkClient makePath: /configs/conf1/solrconfig.snippet.randomindexconfig.xml
   [junit4]   2> 1157 INFO  (TEST-ForceLeaderTest.testLastPublishedStateIsActive-seed#[8F15F13D3461E6E6]) [    ] o.a.s.c.AbstractZkTestCase put /Users/jenkins/workspace/Lucene-Solr-master-MacOSX/solr/core/src/test-files/solr/collection1/conf/stopwords.txt to /configs/conf1/stopwords.txt
   [junit4]   2> 1158 INFO  (TEST-ForceLeaderTest.testLastPublishedStateIsActive-seed#[8F15F13D3461E6E6]) [    ] o.a.s.c.c.SolrZkClient makePath: /configs/conf1/stopwords.txt
   [junit4]   2> 1164 INFO  (TEST-ForceLeaderTest.testLastPublishedStateIsActive-seed#[8F15F13D3461E6E6]) [    ] o.a.s.c.AbstractZkTestCase put /Users/jenkins/workspace/Lucene-Solr-master-MacOSX/solr/core/src/test-files/solr/collection1/conf/protwords.txt to /configs/conf1/protwords.txt
   [junit4]   2> 1164 INFO  (TEST-ForceLeaderTest.testLastPublishedStateIsActive-seed#[8F15F13D3461E6E6]) [    ] o.a.s.c.c.SolrZkClient makePath: /configs/conf1/protwords.txt
   [junit4]   2> 1171 INFO  (TEST-ForceLeaderTest.testLastPublishedStateIsActive-seed#[8F15F13D3461E6E6]) [    ] o.a.s.c.AbstractZkTestCase put /Users/jenkins/workspace/Lucene-Solr-master-MacOSX/solr/core/src/test-files/solr/collection1/conf/currency.xml to /configs/conf1/currency.xml
   [junit4]   2> 1172 INFO  (TEST-ForceLeaderTest.testLastPublishedStateIsActive-seed#[8F15F13D3461E6E6]) [    ] o.a.s.c.c.SolrZkClient makePath: /configs/conf1/currency.xml
   [junit4]   2> 1178 INFO  (TEST-ForceLeaderTest.testLastPublishedStateIsActive-seed#[8F15F13D3461E6E6]) [    ] o.a.s.c.AbstractZkTestCase put /Users/jenkins/workspace/Lucene-Solr-master-MacOSX/solr/core/src/test-files/solr/collection1/conf/enumsConfig.xml to /configs/conf1/enumsConfig.xml
   [junit4]   2> 1179 INFO  (TEST-ForceLeaderTest.testLastPublishedStateIsActive-seed#[8F15F13D3461E6E6]) [    ] o.a.s.c.c.SolrZkClient makePath: /configs/conf1/enumsConfig.xml
   [junit4]   2> 1184 INFO  (TEST-ForceLeaderTest.testLastPublishedStateIsActive-seed#[8F15F13D3461E6E6]) [    ] o.a.s.c.AbstractZkTestCase put /Users/jenkins/workspace/Lucene-Solr-master-MacOSX/solr/core/src/test-files/solr/collection1/conf/open-exchange-rates.json to /configs/conf1/open-exchange-rates.json
   [junit4]   2> 1186 INFO  (TEST-ForceLeaderTest.testLastPublishedStateIsActive-seed#[8F15F13D3461E6E6]) [    ] o.a.s.c.c.SolrZkClient makePath: /configs/conf1/open-exchange-rates.json
   [junit4]   2> 1193 INFO  (TEST-ForceLeaderTest.testLastPublishedStateIsActive-seed#[8F15F13D3461E6E6]) [    ] o.a.s.c.AbstractZkTestCase put /Users/jenkins/workspace/Lucene-Solr-master-MacOSX/solr/core/src/test-files/solr/collection1/conf/mapping-ISOLatin1Accent.txt to /configs/conf1/mapping-ISOLatin1Accent.txt
   [junit4]   2> 1203 INFO  (TEST-ForceLeaderTest.testLastPublishedStateIsActive-seed#[8F15F13D3461E6E6]) [    ] o.a.s.c.c.SolrZkClient makePath: /configs/conf1/mapping-ISOLatin1Accent.txt
   [junit4]   2> 1209 INFO  (TEST-ForceLeaderTest.testLastPublishedStateIsActive-seed#[8F15F13D3461E6E6]) [    ] o.a.s.c.AbstractZkTestCase put /Users/jenkins/workspace/Lucene-Solr-master-MacOSX/solr/core/src/test-files/solr/collection1/conf/old_synonyms.txt to /configs/conf1/old_synonyms.txt
   [junit4]   2> 1210 INFO  (TEST-ForceLeaderTest.testLastPublishedStateIsActive-seed#[8F15F13D3461E6E6]) [    ] o.a.s.c.c.SolrZkClient makePath: /configs/conf1/old_synonyms.txt
   [junit4]   2> 1215 INFO  (TEST-ForceLeaderTest.testLastPublishedStateIsActive-seed#[8F15F13D3461E6E6]) [    ] o.a.s.c.AbstractZkTestCase put /Users/jenkins/workspace/Lucene-Solr-master-MacOSX/solr/core/src/test-files/solr/collection1/conf/synonyms.txt to /configs/conf1/synonyms.txt
   [junit4]   2> 1216 INFO  (TEST-ForceLeaderTest.testLastPublishedStateIsActive-seed#[8F15F13D3461E6E6]) [    ] o.a.s.c.c.SolrZkClient makePath: /configs/conf1/synonyms.txt
   [junit4]   2> 5854 INFO  (TEST-ForceLeaderTest.testLastPublishedStateIsActive-seed#[8F15F13D3461E6E6]) [    ] o.a.s.SolrTestCaseJ4 Writing core.properties file to /Users/jenkins/workspace/Lucene-Solr-master-MacOSX/solr/build/solr-core/test/J1/temp/solr.cloud.ForceLeaderTest_8F15F13D3461E6E6-001/control-001/cores/collection1
   [junit4]   2> 6008 INFO  (TEST-ForceLeaderTest.testLastPublishedStateIsActive-seed#[8F15F13D3461E6E6]) [    ] o.e.j.u.log Logging initialized @12335ms
   [junit4]   2> 7421 INFO  (TEST-ForceLeaderTest.testLastPublishedStateIsActive-seed#[8F15F13D3461E6E6]) [    ] o.e.j.s.Server jetty-9.3.8.v20160314
   [junit4]   2> 7588 INFO  (TEST-ForceLeaderTest.testLastPublishedStateIsActive-seed#[8F15F13D3461E6E6]) [    ] o.e.j.s.h.ContextHandler Started o.e.j.s.ServletContextHandler@3ac35717{/,null,AVAILABLE}
   [junit4]   2> 7640 INFO  (TEST-ForceLeaderTest.testLastPublishedStateIsActive-seed#[8F15F13D3461E6E6]) [    ] o.e.j.s.ServerConnector Started ServerConnector@4551e5d8{HTTP/1.1,[http/1.1]}{127.0.0.1:54011}
   [junit4]   2> 7641 INFO  (TEST-ForceLeaderTest.testLastPublishedStateIsActive-seed#[8F15F13D3461E6E6]) [    ] o.e.j.s.Server Started @13971ms
   [junit4]   2> 7641 INFO  (TEST-ForceLeaderTest.testLastPublishedStateIsActive-seed#[8F15F13D3461E6E6]) [    ] o.a.s.c.s.e.JettySolrRunner Jetty properties: {solr.data.dir=/Users/jenkins/workspace/Lucene-Solr-master-MacOSX/solr/build/solr-core/test/J1/temp/solr.cloud.ForceLeaderTest_8F15F13D3461E6E6-001/tempDir-001/control/data, hostContext=/, hostPort=54010, coreRootDirectory=/Users/jenkins/workspace/Lucene-Solr-master-MacOSX/solr/build/solr-core/test/J1/temp/solr.cloud.ForceLeaderTest_8F15F13D3461E6E6-001/control-001/cores}
   [junit4]   2> 7708 INFO  (TEST-ForceLeaderTest.testLastPublishedStateIsActive-seed#[8F15F13D3461E6E6]) [    ] o.a.s.s.SolrDispatchFilter SolrDispatchFilter.init(): sun.misc.Launcher$AppClassLoader@4554617c
   [junit4]   2> 7812 INFO  (TEST-ForceLeaderTest.testLastPublishedStateIsActive-seed#[8F15F13D3461E6E6]) [    ] o.a.s.c.SolrResourceLoader new SolrResourceLoader for directory: '/Users/jenkins/workspace/Lucene-Solr-master-MacOSX/solr/build/solr-core/test/J1/temp/solr.cloud.ForceLeaderTest_8F15F13D3461E6E6-001/control-001'
   [junit4]   2> 7828 INFO  (TEST-ForceLeaderTest.testLastPublishedStateIsActive-seed#[8F15F13D3461E6E6]) [    ] o.a.s.c.SolrResourceLoader JNDI not configured for solr (NoInitialContextEx)
   [junit4]   2> 7828 INFO  (TEST-ForceLeaderTest.testLastPublishedStateIsActive-seed#[8F15F13D3461E6E6]) [    ] o.a.s.c.SolrResourceLoader solr home defaulted to 'solr/' (could not find system property or JNDI)
   [junit4]   2> 7836 INFO  (TEST-ForceLeaderTest.testLastPublishedStateIsActive-seed#[8F15F13D3461E6E6]) [    ] o.a.s.c.c.SolrZkClient Using default ZkCredentialsProvider
   [junit4]   2> 7837 INFO  (TEST-ForceLeaderTest.testLastPublishedStateIsActive-seed#[8F15F13D3461E6E6]) [    ] o.a.s.c.c.ConnectionManager Waiting for client to connect to ZooKeeper
   [junit4]   2> 7846 INFO  (zkCallback-3-thread-1) [    ] o.a.s.c.c.ConnectionManager Watcher org.apache.solr.common.cloud.ConnectionManager@1be6caef name:ZooKeeperConnection Watcher:127.0.0.1:54007/solr got event WatchedEvent state:SyncConnected type:None path:null path:null type:None
   [junit4]   2> 7846 INFO  (TEST-ForceLeaderTest.testLastPublishedStateIsActive-seed#[8F15F13D3461E6E6]) [    ] o.a.s.c.c.ConnectionManager Client is connected to ZooKeeper
   [junit4]   2> 7847 INFO  (TEST-ForceLeaderTest.testLastPublishedStateIsActive-seed#[8F15F13D3461E6E6]) [    ] o.a.s.c.c.SolrZkClient Using default ZkACLProvider
   [junit4]   2> 7863 INFO  (TEST-ForceLeaderTest.testLastPublishedStateIsActive-seed#[8F15F13D3461E6E6]) [    ] o.a.s.s.SolrDispatchFilter Loading solr.xml from SolrHome (not found in ZooKeeper)
   [junit4]   2> 7867 INFO  (TEST-ForceLeaderTest.testLastPublishedStateIsActive-seed#[8F15F13D3461E6E6]) [    ] o.a.s.c.SolrXmlConfig Loading container configuration from /Users/jenkins/workspace/Lucene-Solr-master-MacOSX/solr/build/solr-core/test/J1/temp/solr.cloud.ForceLeaderTest_8F15F13D3461E6E6-001/control-001/solr.xml
   [junit4]   2> 8116 INFO  (TEST-ForceLeaderTest.testLastPublishedStateIsActive-seed#[8F15F13D3461E6E6]) [    ] o.a.s.c.CorePropertiesLocator Config-defined core root directory: /Users/jenkins/workspace/Lucene-Solr-master-MacOSX/solr/build/solr-core/test/J1/temp/solr.cloud.ForceLeaderTest_8F15F13D3461E6E6-001/control-001/cores
   [junit4]   2> 8309 INFO  (TEST-ForceLeaderTest.testLastPublishedStateIsActive-seed#[8F15F13D3461E6E6]) [    ] o.a.s.c.CoreContainer New CoreContainer 1847776009
   [junit4]   2> 8309 INFO  (TEST-ForceLeaderTest.testLastPublishedStateIsActive-seed#[8F15F13D3461E6E6]) [    ] o.a.s.c.CoreContainer Loading cores into CoreContainer [instanceDir=/Users/jenkins/workspace/Lucene-Solr-master-MacOSX/solr/build/solr-core/test/J1/temp/solr.cloud.ForceLeaderTest_8F15F13D3461E6E6-001/control-001]
   [junit4]   2> 8315 WARN  (TEST-ForceLeaderTest.testLastPublishedStateIsActive-seed#[8F15F13D3461E6E6]) [    ] o.a.s.c.CoreContainer Couldn't add files from /Users/jenkins/workspace/Lucene-Solr-master-MacOSX/solr/build/solr-core/test/J1/temp/solr.cloud.ForceLeaderTest_8F15F13D3461E6E6-001/control-001/lib to classpath: /Users/jenkins/workspace/Lucene-Solr-master-MacOSX/solr/build/solr-core/test/J1/temp/solr.cloud.ForceLeaderTest_8F15F13D3461E6E6-001/control-001/lib
   [junit4]   2> 8452 INFO  (TEST-ForceLeaderTest.testLastPublishedStateIsActive-seed#[8F15F13D3461E6E6]) [    ] o.a.s.h.c.HttpShardHandlerFactory created with socketTimeout : 90000,urlScheme : ,connTimeout : 15000,maxConnectionsPerHost : 20,maxConnections : 10000,corePoolSize : 0,maximumPoolSize : 2147483647,maxThreadIdleTime : 5,sizeOfQueue : -1,fairnessPolicy : false,
   [junit4]   2> 9317 INFO  (TEST-ForceLeaderTest.testLastPublishedStateIsActive-seed#[8F15F13D3461E6E6]) [    ] o.a.s.u.UpdateShardHandler Creating UpdateShardHandler HTTP client with params: 
   [junit4]   2> 9333 INFO  (TEST-ForceLeaderTest.testLastPublishedStateIsActive-seed#[8F15F13D3461E6E6]) [    ] o.a.s.l.LogWatcher SLF4J impl is org.slf4j.impl.Log4jLoggerFactory
   [junit4]   2> 9335 INFO  (TEST-ForceLeaderTest.testLastPublishedStateIsActive-seed#[8F15F13D3461E6E6]) [    ] o.a.s.l.LogWatcher Registering Log Listener [Log4j (org.slf4j.impl.Log4jLoggerFactory)]
   [junit4]   2> 9338 INFO  (TEST-ForceLeaderTest.testLastPublishedStateIsActive-seed#[8F15F13D3461E6E6]) [    ] o.a.s.c.ZkContainer Zookeeper client=127.0.0.1:54007/solr
   [junit4]   2> 9407 INFO  (TEST-ForceLeaderTest.testLastPublishedStateIsActive-seed#[8F15F13D3461E6E6]) [    ] o.a.s.c.ZkController zkHost includes chroot
   [junit4]   2> 9408 INFO  (TEST-ForceLeaderTest.testLastPublishedStateIsActive-seed#[8F15F13D3461E6E6]) [    ] o.a.s.c.c.SolrZkClient Using default ZkCredentialsProvider
   [junit4]   2> 9409 INFO  (TEST-ForceLeaderTest.testLastPublishedStateIsActive-seed#[8F15F13D3461E6E6]) [    ] o.a.s.c.c.ConnectionManager Waiting for client to connect to ZooKeeper
   [junit4]   2> 9414 INFO  (zkCallback-6-thread-1) [    ] o.a.s.c.c.ConnectionManager Watcher org.apache.solr.common.cloud.ConnectionManager@1c24fc14 name:ZooKeeperConnection Watcher:127.0.0.1:54007 got event WatchedEvent state:SyncConnected type:None path:null path:null type:None
   [junit4]   2> 9414 INFO  (TEST-ForceLeaderTest.testLastPublishedStateIsActive-seed#[8F15F13D3461E6E6]) [    ] o.a.s.c.c.ConnectionManager Client is connected to ZooKeeper
   [junit4]   2> 9415 INFO  (TEST-ForceLeaderTest.testLastPublishedStateIsActive-seed#[8F15F13D3461E6E6]) [    ] o.a.s.c.c.SolrZkClient Using default ZkACLProvider
   [junit4]   2> 9438 INFO  (TEST-ForceLeaderTest.testLastPublishedStateIsActive-seed#[8F15F13D3461E6E6]) [n:127.0.0.1:54010_    ] o.a.s.c.ZkController Added new OnReconnect listener org.apache.solr.cloud.ZkController$$Lambda$9/359381289@65ab4b6e
   [junit4]   2> 9447 INFO  (TEST-ForceLeaderTest.testLastPublishedStateIsActive-seed#[8F15F13D3461E6E6]) [n:127.0.0.1:54010_    ] o.a.s.c.c.ConnectionManager Waiting for client to connect to ZooKeeper
   [junit4]   2> 9451 INFO  (zkCallback-7-thread-1-processing-n:127.0.0.1:54010_) [n:127.0.0.1:54010_    ] o.a.s.c.c.ConnectionManager Watcher org.apache.solr.common.cloud.ConnectionManager@6c3ba659 name:ZooKeeperConnection Watcher:127.0.0.1:54007/solr got event WatchedEvent state:SyncConnected type:None path:null path:null type:None
   [junit4]   2> 9451 INFO  (TEST-ForceLeaderTest.testLastPublishedStateIsActive-seed#[8F15F13D3461E6E6]) [n:127.0.0.1:54010_    ] o.a.s.c.c.ConnectionManager Client is connected to ZooKeeper
   [junit4]   2> 9476 INFO  (TEST-ForceLeaderTest.testLastPublishedStateIsActive-seed#[8F15F13D3461E6E6]) [n:127.0.0.1:54010_    ] o.a.s.c.c.SolrZkClient makePath: /overseer/queue
   [junit4]   2> 9495 INFO  (TEST-ForceLeaderTest.testLastPublishedStateIsActive-seed#[8F15F13D3461E6E6]) [n:127.0.0.1:54010_    ] o.a.s.c.c.SolrZkClient makePath: /overseer/collection-queue-work
   [junit4]   2> 9510 INFO  (TEST-ForceLeaderTest.testLastPublishedStateIsActive-seed#[8F15F13D3461E6E6]) [n:127.0.0.1:54010_    ] o.a.s.c.c.SolrZkClient makePath: /overseer/collection-map-running
   [junit4]   2> 9522 INFO  (TEST-ForceLeaderTest.testLastPublishedStateIsActive-seed#[8F15F13D3461E6E6]) [n:127.0.0.1:54010_    ] o.a.s.c.c.SolrZkClient makePath: /overseer/collection-map-completed
   [junit4]   2> 9527 INFO  (TEST-ForceLeaderTest.testLastPublishedStateIsActive-seed#[8F15F13D3461E6E6]) [n:127.0.0.1:54010_    ] o.a.s.c.c.SolrZkClient makePath: /overseer/collection-map-failure
   [junit4]   2> 9552 INFO  (TEST-ForceLeaderTest.testLastPublishedStateIsActive-seed#[8F15F13D3461E6E6]) [n:127.0.0.1:54010_    ] o.a.s.c.c.SolrZkClient makePath: /live_nodes
   [junit4]   2> 9556 INFO  (TEST-ForceLeaderTest.testLastPublishedStateIsActive-seed#[8F15F13D3461E6E6]) [n:127.0.0.1:54010_    ] o.a.s.c.c.SolrZkClient makePath: /aliases.json
   [junit4]   2> 9560 INFO  (TEST-ForceLeaderTest.testLastPublishedStateIsActive-seed#[8F15F13D3461E6E6]) [n:127.0.0.1:54010_    ] o.a.s.c.c.SolrZkClient makePath: /clusterstate.json
   [junit4]   2> 9564 INFO  (TEST-ForceLeaderTest.testLastPublishedStateIsActive-seed#[8F15F13D3461E6E6]) [n:127.0.0.1:54010_    ] o.a.s.c.c.SolrZkClient makePath: /security.json
   [junit4]   2> 9566 INFO  (TEST-ForceLeaderTest.testLastPublishedStateIsActive-seed#[8F15F13D3461E6E6]) [n:127.0.0.1:54010_    ] o.a.s.c.c.ZkStateReader Updating cluster state from ZooKeeper... 
   [junit4]   2> 9641 INFO  (TEST-ForceLeaderTest.testLastPublishedStateIsActive-seed#[8F15F13D3461E6E6]) [n:127.0.0.1:54010_    ] o.a.s.c.c.ZkStateReader Updated live nodes from ZooKeeper... (0) -> (0)
   [junit4]   2> 9682 INFO  (TEST-ForceLeaderTest.testLastPublishedStateIsActive-seed#[8F15F13D3461E6E6]) [n:127.0.0.1:54010_    ] o.a.s.c.c.SolrZkClient makePath: /overseer_elect
   [junit4]   2> 9685 INFO  (TEST-ForceLeaderTest.testLastPublishedStateIsActive-seed#[8F15F13D3461E6E6]) [n:127.0.0.1:54010_    ] o.a.s.c.c.SolrZkClient makePath: /overseer_elect/election
   [junit4]   2> 9689 INFO  (TEST-ForceLeaderTest.testLastPublishedStateIsActive-seed#[8F15F13D3461E6E6]) [n:127.0.0.1:54010_    ] o.a.s.c.Overseer Overseer (id=null) closing
   [junit4]   2> 9690 INFO  (TEST-ForceLeaderTest.testLastPublishedStateIsActive-seed#[8F15F13D3461E6E6]) [n:127.0.0.1:54010_    ] o.a.s.c.LeaderElector Joined leadership election with path: /overseer_elect/election/95870339890151428-127.0.0.1:54010_-n_0000000000
   [junit4]   2> 9692 INFO  (TEST-ForceLeaderTest.testLastPublishedStateIsActive-seed#[8F15F13D3461E6E6]) [n:127.0.0.1:54010_    ] o.a.s.c.OverseerElectionContext I am going to be the leader 127.0.0.1:54010_
   [junit4]   2> 9692 INFO  (TEST-ForceLeaderTest.testLastPublishedStateIsActive-seed#[8F15F13D3461E6E6]) [n:127.0.0.1:54010_    ] o.a.s.c.c.SolrZkClient makePath: /overseer_elect/leader
   [junit4]   2> 9696 INFO  (TEST-ForceLeaderTest.testLastPublishedStateIsActive-seed#[8F15F13D3461E6E6]) [n:127.0.0.1:54010_    ] o.a.s.c.Overseer Overseer (id=95870339890151428-127.0.0.1:54010_-n_0000000000) starting
   [junit4]   2> 9713 INFO  (TEST-ForceLeaderTest.testLastPublishedStateIsActive-seed#[8F15F13D3461E6E6]) [n:127.0.0.1:54010_    ] o.a.s.c.c.SolrZkClient makePath: /overseer/queue-work
   [junit4]   2> 9784 INFO  (TEST-ForceLeaderTest.testLastPublishedStateIsActive-seed#[8F15F13D3461E6E6]) [n:127.0.0.1:54010_    ] o.a.s.c.OverseerAutoReplicaFailoverThread Starting OverseerAutoReplicaFailoverThread autoReplicaFailoverWorkLoopDelay=10000 autoReplicaFailoverWaitAfterExpiration=30000 autoReplicaFailoverBadNodeExpiration=60000
   [junit4]   2> 10149 INFO  (OverseerCollectionConfigSetProcessor-95870339890151428-127.0.0.1:54010_-n_0000000000) [n:127.0.0.1:54010_    ] o.a.s.c.OverseerTaskProcessor Process current queue of overseer operations
   [junit4]   2> 10151 INFO  (TEST-ForceLeaderTest.testLastPublishedStateIsActive-seed#[8F15F13D3461E6E6]) [n:127.0.0.1:54010_    ] o.a.s.c.ZkController Register node as live in ZooKeeper:/live_nodes/127.0.0.1:54010_
   [junit4]   2> 10157 INFO  (TEST-ForceLeaderTest.testLastPublishedStateIsActive-seed#[8F15F13D3461E6E6]) [n:127.0.0.1:54010_    ] o.a.s.c.c.SolrZkClient makePath: /live_nodes/127.0.0.1:54010_
   [junit4]   2> 10182 INFO  (zkCallback-7-thread-1-processing-n:127.0.0.1:54010_) [n:127.0.0.1:54010_    ] o.a.s.c.c.ZkStateReader A live node change: [WatchedEvent state:SyncConnected type:NodeChildrenChanged path:/live_nodes], has occurred - updating... (live nodes size: [0])
   [junit4]   2> 10184 INFO  (zkCallback-7-thread-1-processing-n:127.0.0.1:54010_) [n:127.0.0.1:54010_    ] o.a.s.c.c.ZkStateReader Updated live nodes from ZooKeeper... (0) -> (1)
   [junit4]   2> 10220 INFO  (OverseerStateUpdate-95870339890151428-127.0.0.1:54010_-n_0000000000) [n:127.0.0.1:54010_    ] o.a.s.c.Overseer Starting to work on the main queue
   [junit4]   2> 10231 INFO  (OverseerStateUpdate-95870339890151428-127.0.0.1:54010_-n_0000000000) [n:127.0.0.1:54010_    ] o.a.s.c.c.ZkStateReader Updated live nodes from ZooKeeper... (1) -> (1)
   [junit4]   2> 10283 INFO  (TEST-ForceLeaderTest.testLastPublishedStateIsActive-seed#[8F15F13D3461E6E6]) [n:127.0.0.1:54010_    ] o.a.s.c.CoreContainer Security conf doesn't exist. Skipping setup for authorization module.
   [junit4]   2> 10283 INFO  (TEST-ForceLeaderTest.testLastPublishedStateIsActive-seed#[8F15F13D3461E6E6]) [n:127.0.0.1:54010_    ] o.a.s.c.CoreContainer No authentication plugin used.
   [junit4]   2> 10601 INFO  (TEST-ForceLeaderTest.testLastPublishedStateIsActive-seed#[8F15F13D3461E6E6]) [n:127.0.0.1:54010_    ] o.a.s.c.CorePropertiesLocator Looking for core definitions underneath /Users/jenkins/workspace/Lucene-Solr-master-MacOSX/solr/build/solr-core/test/J1/temp/solr.cloud.ForceLeaderTest_8F15F13D3461E6E6-001/control-001/cores
   [junit4]   2> 10616 INFO  (TEST-ForceLeaderTest.testLastPublishedStateIsActive-seed#[8F15F13D3461E6E6]) [n:127.0.0.1:54010_    ] o.a.s.c.CoreDescriptor Created CoreDescriptor: {name=collection1, config=solrconfig.xml, transient=false, schema=schema.xml, loadOnStartup=true, configSetProperties=configsetprops.json, collection=control_collection, coreNodeName=, dataDir=data/, shard=}
   [junit4]   2> 10616 INFO  (TEST-ForceLeaderTest.testLastPublishedStateIsActive-seed#[8F15F13D3461E6E6]) [n:127.0.0.1:54010_    ] o.a.s.c.CorePropertiesLocator Found core collection1 in /Users/jenkins/workspace/Lucene-Solr-master-MacOSX/solr/build/solr-core/test/J1/temp/solr.cloud.ForceLeaderTest_8F15F13D3461E6E6-001/control-001/cores/collection1
   [junit4]   2> 10617 INFO  (TEST-ForceLeaderTest.testLastPublishedStateIsActive-seed#[8F15F13D3461E6E6]) [n:127.0.0.1:54010_    ] o.a.s.c.CorePropertiesLocator Found 1 core definitions
   [junit4]   2> 10634 INFO  (coreLoadExecutor-7-thread-1-processing-n:127.0.0.1:54010_) [n:127.0.0.1:54010_ c:control_collection   x:collection1] o.a.s.c.ZkController publishing state=down
   [junit4]   2> 10634 INFO  (coreLoadExecutor-7-thread-1-processing-n:127.0.0.1:54010_) [n:127.0.0.1:54010_ c:control_collection   x:collection1] o.a.s.c.ZkController numShards not found on descriptor - reading it from system property
   [junit4]   2> 10634 INFO  (TEST-ForceLeaderTest.testLastPublishedStateIsActive-seed#[8F15F13D3461E6E6]) [n:127.0.0.1:54010_    ] o.a.s.s.SolrDispatchFilter user.dir=/Users/jenkins/workspace/Lucene-Solr-master-MacOSX/solr/build/solr-core/test/J1
   [junit4]   2> 10635 INFO  (TEST-ForceLeaderTest.testLastPublishedStateIsActive-seed#[8F15F13D3461E6E6]) [n:127.0.0.1:54010_    ] o.a.s.s.SolrDispatchFilter SolrDispatchFilter.init() done
   [junit4]   2> 10637 INFO  (coreLoadExecutor-7-thread-1-processing-n:127.0.0.1:54010_) [n:127.0.0.1:54010_ c:control_collection   x:collection1] o.a.s.c.ZkController Collection control_collection not visible yet, but flagging it so a watch is registered when it becomes visible
   [junit4]   2> 10637 INFO  (coreLoadExecutor-7-thread-1-processing-n:127.0.0.1:54010_) [n:127.0.0.1:54010_ c:control_collection   x:collection1] o.a.s.c.c.ZkStateReader addZkWatch [control_collection]
   [junit4]   2> 10638 INFO  (OverseerStateUpdate-95870339890151428-127.0.0.1:54010_-n_0000000000) [n:127.0.0.1:54010_    ] o.a.s.c.Overseer processMessage: queueSize: 1, message = {
   [junit4]   2>   "core":"collection1",
   [junit4]   2>   "roles":null,
   [junit4]   2>   "base_url":"http://127.0.0.1:54010",
   [junit4]   2>   "node_name":"127.0.0.1:54010_",
   [junit4]   2>   "numShards":"1",
   [junit4]   2>   "state":"down",
   [junit4]   2>   "shard":null,
   [junit4]   2>   "collection":"control_collection",
   [junit4]   2>   "operation":"state"} current state version: 0
   [junit4]   2> 10641 INFO  (coreLoadExecutor-7-thread-1-processing-n:127.0.0.1:54010_) [n:127.0.0.1:54010_ c:control_collection   x:collection1] o.a.s.c.c.ZkStateReader Deleting data for [control_collection]
   [junit4]   2> 10643 INFO  (coreLoadExecutor-7-thread-1-processing-n:127.0.0.1:54010_) [n:127.0.0.1:54010_ c:control_collection   x:collection1] o.a.s.c.ZkController look for our core node name
   [junit4]   2> 10660 INFO  (OverseerStateUpdate-95870339890151428-127.0.0.1:54010_-n_0000000000) [n:127.0.0.1:54010_    ] o.a.s.c.o.ReplicaMutator Update state numShards=1 message={
   [junit4]   2>   "core":"collection1",
   [junit4]   2>   "roles":null,
   [junit4]   2>   "base_url":"http://127.0.0.1:54010",
   [junit4]   2>   "node_name":"127.0.0.1:54010_",
   [junit4]   2>   "numShards":"1",
   [junit4]   2>   "state":"down",
   [junit4]   2>   "shard":null,
   [junit4]   2>   "collection":"control_collection",
   [junit4]   2>   "operation":"state"}
   [junit4]   2> 10664 INFO  (OverseerStateUpdate-95870339890151428-127.0.0.1:54010_-n_0000000000) [n:127.0.0.1:54010_    ] o.a.s.c.o.ClusterStateMutator building a new cName: control_collection
   [junit4]   2> 10690 INFO  (OverseerStateUpdate-95870339890151428-127.0.0.1:54010_-n_0000000000) [n:127.0.0.1:54010_    ] o.a.s.c.o.ReplicaMutator Assigning new node to shard shard=shard1
   [junit4]   2> 10702 INFO  (zkCallback-7-thread-1-processing-n:127.0.0.1:54010_) [n:127.0.0.1:54010_    ] o.a.s.c.c.ZkStateReader A cluster state change: [WatchedEvent state:SyncConnected type:NodeDataChanged path:/clusterstate.json], has occurred - updating... (live nodes size: [1])
   [junit4]   2> 11653 INFO  (coreLoadExecutor-7-thread-1-processing-n:127.0.0.1:54010_) [n:127.0.0.1:54010_ c:control_collection   x:collection1] o.a.s.c.ZkController waiting to find shard id in clusterstate for collection1
   [junit4]   2> 11653 INFO  (coreLoadExecutor-7-thread-1-processing-n:127.0.0.1:54010_) [n:127.0.0.1:54010_ c:control_collection   x:collection1] o.a.s.c.ZkController Check for collection zkNode:control_collection
   [junit4]   2> 11654 INFO  (coreLoadExecutor-7-thread-1-processing-n:127.0.0.1:54010_) [n:127.0.0.1:54010_ c:control_collection   x:collection1] o.a.s.c.ZkController Collection zkNode exists
   [junit4]   2> 11654 INFO  (coreLoadExecutor-7-thread-1-processing-n:127.0.0.1:54010_) [n:127.0.0.1:54010_ c:control_collection   x:collection1] o.a.s.c.c.ZkStateReader Load collection config from: [/collections/control_collection]
   [junit4]   2> 11656 INFO  (coreLoadExecutor-7-thread-1-processing-n:127.0.0.1:54010_) [n:127.0.0.1:54010_ c:control_collection   x:collection1] o.a.s.c.c.ZkStateReader path=[/collections/control_collection] [configName]=[conf1] specified config exists in ZooKeeper
   [junit4]   2> 11661 INFO  (coreLoadExecutor-7-thread-1-processing-n:127.0.0.1:54010_) [n:127.0.0.1:54010_ c:control_collection   x:collection1] o.a.s.c.SolrResourceLoader new SolrResourceLoader for directory: '/Users/jenkins/workspace/Lucene-Solr-master-MacOSX/solr/build/solr-core/test/J1/temp/solr.cloud.ForceLeaderTest_8F15F13D3461E6E6-001/control-001/cores/collection1'
   [junit4]   2> 11661 INFO  (coreLoadExecutor-7-thread-1-processing-n:127.0.0.1:54010_) [n:127.0.0.1:54010_ c:control_collection   x:collection1] o.a.s.c.SolrResourceLoader JNDI not configured for solr (NoInitialContextEx)
   [junit4]   2> 11661 INFO  (coreLoadExecutor-7-thread-1-processing-n:127.0.0.1:54010_) [n:127.0.0.1:54010_ c:control_collection   x:collection1] o.a.s.c.SolrResourceLoader solr home defaulted to 'solr/' (could not find system property or JNDI)
   [junit4]   2> 11670 INFO  (coreLoadExecutor-7-thread-1-processing-n:127.0.0.1:54010_) [n:127.0.0.1:54010_ c:control_collection   x:collection1] o.a.s.c.Config loaded config solrconfig.xml with version 0 
   [junit4]   2> 11723 INFO  (coreLoadExecutor-7-thread-1-processing-n:127.0.0.1:54010_) [n:127.0.0.1:54010_ c:control_collection   x:collection1] o.a.s.c.SolrConfig current version of requestparams : -1
   [junit4]   2> 11772 WARN  (coreLoadExecutor-7-thread-1-processing-n:127.0.0.1:54010_) [n:127.0.0.1:54010_ c:control_collection   x:collection1] o.a.s.c.Config Beginning with Solr 5.5, <mergePolicy> is deprecated, use <mergePolicyFactory> instead.
   [junit4]   2> 11774 INFO  (coreLoadExecutor-7-thread-1-processing-n:127.0.0.1:54010_) [n:127.0.0.1:54010_ c:control_collection   x:collection1] o.a.s.c.SolrConfig Using Lucene MatchVersion: 7.0.0
   [junit4]   2> 12024 INFO  (coreLoadExecutor-7-thread-1-processing-n:127.0.0.1:54010_) [n:127.0.0.1:54010_ c:control_collection   x:collection1] o.a.s.c.SolrConfig Loaded SolrConfig: solrconfig.xml
   [junit4]   2> 12157 INFO  (coreLoadExecutor-7-thread-1-processing-n:127.0.0.1:54010_) [n:127.0.0.1:54010_ c:control_collection   x:collection1] o.a.s.s.IndexSchema [collection1] Schema name=test
   [junit4]   2> 14574 INFO  (coreLoadExecutor-7-thread-1-processing-n:127.0.0.1:54010_) [n:127.0.0.1:54010_ c:control_collection   x:collection1] o.a.s.s.OpenExchangeRatesOrgProvider Initialized with rates=open-exchange-rates.json, refreshInterval=1440.
   [junit4]   2> 14625 INFO  (coreLoadExecutor-7-thread-1-processing-n:127.0.0.1:54010_) [n:127.0.0.1:54010_ c:control_collection   x:collection1] o.a.s.s.IndexSchema default search field in schema is text
   [junit4]   2> 14627 INFO  (coreLoadExecutor-7-thread-1-processing-n:127.0.0.1:54010_) [n:127.0.0.1:54010_ c:control_collection   x:collection1] o.a.s.s.IndexSchema unique key field: id
   [junit4]   2> 15563 INFO  (coreLoadExecutor-7-thread-1-processing-n:127.0.0.1:54010_) [n:127.0.0.1:54010_ c:control_collection   x:collection1] o.a.s.s.FileExchangeRateProvider Reloading exchange rates from file currency.xml
   [junit4]   2> 15580 INFO  (coreLoadExecutor-7-thread-1-processing-n:127.0.0.1:54010_) [n:127.0.0.1:54010_ c:control_collection   x:collection1] o.a.s.s.FileExchangeRateProvider Reloading exchange rates from file currency.xml
   [junit4]   2> 15585 INFO  (coreLoadExecutor-7-thread-1-processing-n:127.0.0.1:54010_) [n:127.0.0.1:54010_ c:control_collection   x:collection1] o.a.s.s.OpenExchangeRatesOrgProvider Reloading exchange rates from open-exchange-rates.json
   [junit4]   2> 15592 INFO  (coreLoadExecutor-7-thread-1-processing-n:127.0.0.1:54010_) [n:127.0.0.1:54010_ c:control_collection   x:collection1] o.a.s.s.OpenExchangeRatesOrgProvider Reloading exchange rates from open-exchange-rates.json
   [junit4]   2> 15613 INFO  (coreLoadExecutor-7-thread-1-processing-n:127.0.0.1:54010_) [n:127.0.0.1:54010_ c:control_collection   x:collection1] o.a.s.c.ConfigSetProperties Did not find ConfigSet properties, assuming default properties: Can't find resource 'configsetprops.json' in classpath or '/configs/conf1', cwd=/Users/jenkins/workspace/Lucene-Solr-master-MacOSX/solr/build/solr-core/test/J1
   [junit4]   2> 15617 INFO  (coreLoadExecutor-7-thread-1-processing-n:127.0.0.1:54010_) [n:127.0.0.1:54010_ c:control_collection   x:collection1] o.a.s.c.CoreContainer Creating SolrCore 'collection1' using configuration from collection control_collection
   [junit4]   2> 15806 INFO  (coreLoadExecutor-7-thread-1-processing-n:127.0.0.1:54010_) [n:127.0.0.1:54010_ c:control_collection s:shard1 r:core_node1 x:collection1] o.a.s.c.SolrCore org.apache.solr.core.MockDirectoryFactory
   [junit4]   2> 15861 INFO  (coreLoadExecutor-7-thread-1-processing-n:127.0.0.1:54010_) [n:127.0.0.1:54010_ c:control_collection s:shard1 r:core_node1 x:collection1] o.a.s.c.SolrCore [[collection1] ] Opening new SolrCore at [/Users/jenkins/workspace/Lucene-Solr-master-MacOSX/solr/build/solr-core/test/J1/temp/solr.cloud.ForceLeaderTest_8F15F13D3461E6E6-001/control-001/cores/collection1], dataDir=[/Users/jenkins/workspace/Lucene-Solr-master-MacOSX/solr/build/solr-core/test/J1/temp/solr.cloud.ForceLeaderTest_8F15F13D3461E6E6-001/control-001/cores/collection1/data/]
   [junit4]   2> 15869 INFO  (coreLoadExecutor-7-thread-1-processing-n:127.0.0.1:54010_) [n:127.0.0.1:54010_ c:control_collection s:shard1 r:core_node1 x:collection1] o.a.s.c.JmxMonitoredMap JMX monitoring is enabled. Adding Solr mbeans to JMX Server: com.sun.jmx.mbeanserver.JmxMBeanServer@131fbcc6
   [junit4]   2> 16143 INFO  (coreLoadExecutor-7-thread-1-processing-n:127.0.0.1:54010_) [n:127.0.0.1:54010_ c:control_collection s:shard1 r:core_node1 x:collection1] o.a.s.c.CachingDirectoryFactory return new directory for /Users/jenkins/workspace/Lucene-Solr-master-MacOSX/solr/build/solr-core/test/J1/temp/solr.cloud.ForceLeaderTest_8F15F13D3461E6E6-001/control-001/cores/collection1/data
   [junit4]   2> 16143 INFO  (coreLoadExecutor-7-thread-1-processing-n:127.0.0.1:54010_) [n:127.0.0.1:54010_ c:control_collection s:shard1 r:core_node1 x:collection1] o.a.s.c.SolrCore New index directory detected: old=null new=/Users/jenkins/workspace/Lucene-Solr-master-MacOSX/solr/build/solr-core/test/J1/temp/solr.cloud.ForceLeaderTest_8F15F13D3461E6E6-001/control-001/cores/collection1/data/index/
   [junit4]   2> 16144 WARN  (coreLoadExecutor-7-thread-1-processing-n:127.0.0.1:54010_) [n:127.0.0.1:54010_ c:control_collection s:shard1 r:core_node1 x:collection1] o.a.s.c.SolrCore [collection1] Solr index directory '/Users/jenkins/workspace/Lucene-Solr-master-MacOSX/solr/build/solr-core/test/J1/temp/solr.cloud.ForceLeaderTest_8F15F13D3461E6E6-001/control-001/cores/collection1/data/index' doesn't exist. Creating new index...
   [junit4]   2> 16190 INFO  (coreLoadExecutor-7-thread-1-processing-n:127.0.0.1:54010_) [n:127.0.0.1:54010_ c:control_collection s:shard1 r:core_node1 x:collection1] o.a.s.c.CachingDirectoryFactory return new directory for /Users/jenkins/workspace/Lucene-Solr-master-MacOSX/solr/build/solr-core/test/J1/temp/solr.cloud.ForceLeaderTest_8F15F13D3461E6E6-001/control-001/cores/collection1/data/index
   [junit4]   2> 16196 INFO  (coreLoadExecutor-7-thread-1-processing-n:127.0.0.1:54010_) [n:127.0.0.1:54010_ c:control_collection s:shard1 r:core_node1 x:collection1] o.a.s.u.RandomMergePolicy RandomMergePolicy wrapping class org.apache.lucene.index.TieredMergePolicy: [TieredMergePolicy: maxMergeAtOnce=16, maxMergeAtOnceExplicit=16, maxMergedSegmentMB=15.87109375, floorSegmentMB=2.044921875, forceMergeDeletesPctAllowed=22.36289108057932, segmentsPerTier=45.0, maxCFSSegmentSizeMB=8.796093022207999E12, noCFSRatio=0.10155742135067909
   [junit4]   2> 16430 INFO  (coreLoadExecutor-7-thread-1-processing-n:127.0.0.1:54010_) [n:127.0.0.1:54010_ c:control_collection s:shard1 r:core_node1 x:collection1] o.a.s.c.SolrDeletionPolicy SolrDeletionPolicy.onCommit: commits: num=1
   [junit4]   2> 	commit{dir=MockDirectoryWrapper(RAMDirectory@2316c101 lockFactory=org.apache.lucene.store.SingleInstanceLockFactory@2cae949d),segFN=segments_1,generation=1}
   [junit4]   2> 16432 INFO  (coreLoadExecutor-7-thread-1-processing-n:127.0.0.1:54010_) [n:127.0.0.1:54010_ c:control_collection s:shard1 r:core_node1 x:collection1] o.a.s.c.SolrDeletionPolicy newest commit generation = 1
   [junit4]   2> 16434 INFO  (OldIndexDirectoryCleanupThreadForCore-collection1) [n:127.0.0.1:54010_ c:control_collection s:shard1 r:core_node1 x:collection1] o.a.s.c.SolrCore Looking for old index directories to cleanup for core collection1 in /Users/jenkins/workspace/Lucene-Solr-master-MacOSX/solr/build/solr-core/test/J1/temp/solr.cloud.ForceLeaderTest_8F15F13D3461E6E6-001/control-001/cores/collection1/data/
   [junit4]   2> 16435 WARN  (OldIndexDirectoryCleanupThreadForCore-collection1) [n:127.0.0.1:54010_ c:control_collection s:shard1 r:core_node1 x:collection1] o.a.s.c.DirectoryFactory /Users/jenkins/workspace/Lucene-Solr-master-MacOSX/solr/build/solr-core/test/J1/temp/solr.cloud.ForceLeaderTest_8F15F13D3461E6E6-001/control-001/cores/collection1/data/ does not point to a valid data directory; skipping clean-up of old index directories.
   [junit4]   2> 17735 INFO  (coreLoadExecutor-7-thread-1-processing-n:127.0.0.1:54010_) [n:127.0.0.1:54010_ c:control_collection s:shard1 r:core_node1 x:collection1] o.a.s.u.p.UpdateRequestProcessorChain creating updateRequestProcessorChain "nodistrib"
   [junit4]   2> 17826 INFO  (coreLoadExecutor-7-thread-1-processing-n:127.0.0.1:54010_) [n:127.0.0.1:54010_ c:control_collection s:shard1 r:core_node1 x:collection1] o.a.s.u.p.UpdateRequestProcessorChain creating updateRequestProcessorChain "dedupe"
   [junit4]   2> 17845 INFO  (coreLoadExecutor-7-thread-1-processing-n:127.0.0.1:54010_) [n:127.0.0.1:54010_ c:control_collection s:shard1 r:core_node1 x:collection1] o.a.s.u.p.UpdateRequestProcessorChain inserting DistributedUpdateProcessorFactory into updateRequestProcessorChain "dedupe"
   [junit4]   2> 17845 INFO  (coreLoadExecutor-7-thread-1-processing-n:127.0.0.1:54010_) [n:127.0.0.1:54010_ c:control_collection s:shard1 r:core_node1 x:collection1] o.a.s.u.p.UpdateRequestProcessorChain creating updateRequestProcessorChain "stored_sig"
   [junit4]   2> 17846 INFO  (coreLoadExecutor-7-thread-1-processing-n:127.0.0.1:54010_) [n:127.0.0.1:54010_ c:control_collection s:shard1 r:core_node1 x:collection1] o.a.s.u.p.UpdateRequestProcessorChain inserting DistributedUpdateProcessorFactory into updateRequestProcessorChain "stored_sig"
   [junit4]   2> 17853 INFO  (coreLoadExecutor-7-thread-1-processing-n:127.0.0.1:54010_) [n:127.0.0.1:54010_ c:control_collection s:shard1 r:core_node1 x:collection1] o.a.s.u.p.UpdateRequestProcessorChain creating updateRequestProcessorChain "distrib-dup-test-chain-explicit"
   [junit4]   2> 17928 INFO  (coreLoadExecutor-7-thread-1-processing-n:127.0.0.1:54010_) [n:127.0.0.1:54010_ c:control_collection s:shard1 r:core_node1 x:collection1] o.a.s.u.p.UpdateRequestProcessorChain creating updateRequestProcessorChain "distrib-dup-test-chain-implicit"
   [junit4]   2> 17929 INFO  (coreLoadExecutor-7-thread-1-processing-n:127.0.0.1:54010_) [n:127.0.0.1:54010_ c:control_collection s:shard1 r:core_node1 x:collection1] o.a.s.u.p.UpdateRequestProcessorChain inserting DistributedUpdateProcessorFactory into updateRequestProcessorChain "distrib-dup-test-chain-implicit"
   [junit4]   2> 17939 INFO  (coreLoadExecutor-7-thread-1-processing-n:127.0.0.1:54010_) [n:127.0.0.1:54010_ c:control_collection s:shard1 r:core_node1 x:collection1] o.a.s.c.SolrCore no updateRequestProcessorChain defined as default, creating implicit default
   [junit4]   2> 17948 WARN  (coreLoadExecutor-7-thread-1-processing-n:127.0.0.1:54010_) [n:127.0.0.1:54010_ c:control_collection s:shard1 r:core_node1 x:collection1] o.a.s.c.RequestHandlers INVALID paramSet a in requestHandler {type = requestHandler,name = /dump,class = DumpRequestHandler,args = {defaults={a=A,b=B}}}
   [junit4]   2> 18109 INFO  (coreLoadExecutor-7-thread-1-processing-n:127.0.0.1:54010_) [n:127.0.0.1:54010_ c:control_collection s:shard1 r:core_node1 x:collection1] o.a.s.h.l.XMLLoader xsltCacheLifetimeSeconds=60
   [junit4]   2> 18142 INFO  (coreLoadExecutor-7-thread-1-processing-n:127.0.0.1:54010_) [n:127.0.0.1:54010_ c:control_collection s:shard1 r:core_node1 x:collection1] o.a.s.h.l.XMLLoader xsltCacheLifetimeSeconds=60
   [junit4]   2> 18145 INFO  (coreLoadExecutor-7-thread-1-processing-n:127.0.0.1:54010_) [n:127.0.0.1:54010_ c:control_collection s:shard1 r:core_node1 x:collection1] o.a.s.h.l.XMLLoader xsltCacheLifetimeSeconds=60
   [junit4]   2> 18147 INFO  (coreLoadExecutor-7-thread-1-processing-n:127.0.0.1:54010_) [n:127.0.0.1:54010_ c:control_collection s:shard1 r:core_node1 x:collection1] o.a.s.h.l.XMLLoader xsltCacheLifetimeSeconds=60
   [junit4]   2> 19110 INFO  (coreLoadExecutor-7-thread-1-processing-n:127.0.0.1:54010_) [n:127.0.0.1:54010_ c:control_collection s:shard1 r:core_node1 x:collection1] o.a.s.c.RequestHandlers Registered paths: /admin/mbeans,standard,/update/json/docs,/admin/luke,/export,/get,/admin/properties,/update/json,/admin/threads,/dump,/update/csv,/sql,/graph,/admin/segments,/admin/system,/replication,/config,/stream,/schema,/admin/plugins,/admin/logging,/admin/ping,/update,/admin/file
   [junit4]   2> 19110 INFO  (coreLoadExecutor-7-thread-1-processing-n:127.0.0.1:54010_) [n:127.0.0.1:54010_ c:control_collection s:shard1 r:core_node1 x:collection1] o.a.s.c.SolrCore Using default statsCache cache: org.apache.solr.search.stats.LocalStatsCache
   [junit4]   2> 19181 INFO  (coreLoadExecutor-7-thread-1-processing-n:127.0.0.1:54010_) [n:127.0.0.1:54010_ c:control_collection s:shard1 r:core_node1 x:collection1] o.a.s.u.UpdateHandler Using UpdateLog implementation: org.apache.solr.update.UpdateLog
   [junit4]   2> 19181 INFO  (coreLoadExecutor-7-thread-1-processing-n:127.0.0.1:54010_) [n:127.0.0.1:54010_ c:control_collection s:shard1 r:core_node1 x:collection1] o.a.s.u.UpdateLog Initializing UpdateLog: dataDir= defaultSyncLevel=FLUSH numRecordsToKeep=100 maxNumLogsToKeep=10 numVersionBuckets=65536
   [junit4]   2> 19217 INFO  (coreLoadExecutor-7-thread-1-processing-n:127.0.0.1:54010_) [n:127.0.0.1:54010_ c:control_collection s:shard1 r:core_node1 x:collection1] o.a.s.u.CommitTracker Hard AutoCommit: disabled
   [junit4]   2> 19221 INFO  (coreLoadExecutor-7-thread-1-processing-n:127.0.0.1:54010_) [n:127.0.0.1:54010_ c:control_collection s:shard1 r:core_node1 x:collection1] o.a.s.u.CommitTracker Soft AutoCommit: disabled
   [junit4]   2> 19222 INFO  (coreLoadExecutor-7-thread-1-processing-n:127.0.0.1:54010_) [n:127.0.0.1:54010_ c:control_collection s:shard1 r:core_node1 x:collection1] o.a.s.u.RandomMergePolicy RandomMergePolicy wrapping class org.apache.lucene.index.TieredMergePolicy: [TieredMergePolicy: maxMergeAtOnce=26, maxMergeAtOnceExplicit=16, maxMergedSegmentMB=15.5576171875, floorSegmentMB=0.4560546875, forceMergeDeletesPctAllowed=3.332219813406756, segmentsPerTier=42.0, maxCFSSegmentSizeMB=8.796093022207999E12, noCFSRatio=0.0
   [junit4]   2> 19233 INFO  (coreLoadExecutor-7-thread-1-processing-n:127.0.0.1:54010_) [n:127.0.0.1:54010_ c:control_collection s:shard1 r:core_node1 x:collection1] o.a.s.c.SolrDeletionPolicy SolrDeletionPolicy.onInit: commits: num=1
   [junit4]   2> 	commit{dir=MockDirectoryWrapper(RAMDirectory@2316c101 lockFactory=org.apache.lucene.store.SingleInstanceLockFactory@2cae949d),segFN=segments_1,generation=1}
   [junit4]   2> 19233 INFO  (coreLoadExecutor-7-thread-1-processing-n:127.0.0.1:54010_) [n:127.0.0.1:54010_ c:control_collection s:shard1 r:core_node1 x:collection1] o.a.s.c.SolrDeletionPolicy newest commit generation = 1
   [junit4]   2> 19296 INFO  (coreLoadExecutor-7-thread-1-processing-n:127.0.0.1:54010_) [n:127.0.0.1:54010_ c:control_collection s:shard1 r:core_node1 x:collection1] o.a.s.s.SolrIndexSearcher Opening [Searcher@39b88cce[collection1] main]
   [junit4]   2> 19340 INFO  (coreLoadExecutor-7-thread-1-processing-n:127.0.0.1:54010_) [n:127.0.0.1:54010_ c:control_collection s:shard1 r:core_node1 x:collection1] o.a.s.c.c.ZkStateReader Load collection config from: [/collections/control_collection]
   [junit4]   2> 19342 INFO  (coreLoadExecutor-7-thread-1-processing-n:127.0.0.1:54010_) [n:127.0.0.1:54010_ c:control_collection s:shard1 r:core_node1 x:collection1] o.a.s.c.c.ZkStateReader path=[/collections/control_collection] [configName]=[conf1] specified config exists in ZooKeeper
   [junit4]   2> 19342 INFO  (coreLoadExecutor-7-thread-1-processing-n:127.0.0.1:54010_) [n:127.0.0.1:54010_ c:control_collection s:shard1 r:core_node1 x:collection1] o.a.s.r.ManagedResourceStorage Setting up ZooKeeper-based storage for the RestManager with znodeBase: /configs/conf1
   [junit4]   2> 19366 INFO  (coreLoadExecutor-7-thread-1-processing-n:127.0.0.1:54010_) [n:127.0.0.1:54010_ c:control_collection s:shard1 r:core_node1 x:collection1] o.a.s.r.ManagedResourceStorage Configured ZooKeeperStorageIO with znodeBase: /configs/conf1
   [junit4]   2> 19366 INFO  (coreLoadExecutor-7-thread-1-processing-n:127.0.0.1:54010_) [n:127.0.0.1:54010_ c:control_collection s:shard1 r:core_node1 x:collection1] o.a.s.r.RestManager Initializing RestManager with initArgs: {}
   [junit4]   2> 19425 INFO  (coreLoadExecutor-7-thread-1-processing-n:127.0.0.1:54010_) [n:127.0.0.1:54010_ c:control_collection s:shard1 r:core_node1 x:collection1] o.a.s.r.ManagedResourceStorage Reading _rest_managed.json using ZooKeeperStorageIO:path=/configs/conf1
   [junit4]   2> 19426 INFO  (coreLoadExecutor-7-thread-1-processing-n:127.0.0.1:54010_) [n:127.0.0.1:54010_ c:control_collection s:shard1 r:core_node1 x:collection1] o.a.s.r.ManagedResourceStorage No data found for znode /configs/conf1/_rest_managed.json
   [junit4]   2> 19426 INFO  (coreLoadExecutor-7-thread-1-processing-n:127.0.0.1:54010_) [n:127.0.0.1:54010_ c:control_collection s:shard1 r:core_node1 x:collection1] o.a.s.r.ManagedResourceStorage Loaded null at path _rest_managed.json using ZooKeeperStorageIO:path=/configs/conf1
   [junit4]   2> 19426 INFO  (coreLoadExecutor-7-thread-1-processing-n:127.0.0.1:54010_) [n:127.0.0.1:54010_ c:control_collection s:shard1 r:core_node1 x:collection1] o.a.s.r.RestManager Initializing 0 registered ManagedResources
   [junit4]   2> 19505 INFO  (coreLoadExecutor-7-thread-1-processing-n:127.0.0.1:54010_) [n:127.0.0.1:54010_ c:control_collection s:shard1 r:core_node1 x:collection1] o.a.s.h.ReplicationHandler Commits will be reserved for  10000
   [junit4]   2> 19617 INFO  (searcherExecutor-8-thread-1-processing-n:127.0.0.1:54010_ x:collection1 s:shard1 c:control_collection r:core_node1) [n:127.0.0.1:54010_ c:control_collection s:shard1 r:core_node1 x:collection1] o.a.s.c.SolrCore [collection1] Registered new searcher Searcher@39b88cce[collection1] main{ExitableDirectoryReader(UninvertingDirectoryReader())}
   [junit4]   2> 19619 INFO  (coreLoadExecutor-7-thread-1-processing-n:127.0.0.1:54010_) [n:127.0.0.1:54010_ c:control_collection s:shard1 r:core_node1 x:collection1] o.a.s.u.UpdateLog Looking up max value of version field to seed version buckets
   [junit4]   2> 19624 INFO  (coreLoadExecutor-7-thread-1-processing-n:127.0.0.1:54010_) [n:127.0.0.1:54010_ c:control_collection s:shard1 r:core_node1 x:collection1] o.a.s.u.VersionInfo Refreshing highest value of _version_ for 65536 version buckets from index
   [junit4]   2> 19624 INFO  (coreLoadExecutor-7-thread-1-processing-n:127.0.0.1:54010_) [n:127.0.0.1:54010_ c:control_collection s:shard1 r:core_node1 x:collection1] o.a.s.u.VersionInfo No terms found for _version_, cannot seed version bucket highest value from index
   [junit4]   2> 19624 INFO  (coreLoadExecutor-7-thread-1-processing-n:127.0.0.1:54010_) [n:127.0.0.1:54010_ c:control_collection s:shard1 r:core_node1 x:collection1] o.a.s.u.UpdateLog Could not find max version in index or recent updates, using new clock 1533925458407587840
   [junit4]   2> 19632 INFO  (coreLoadExecutor-7-thread-1-processing-n:127.0.0.1:54010_) [n:127.0.0.1:54010_ c:control_collection s:shard1 r:core_node1 x:collection1] o.a.s.u.UpdateLog Took 8.0ms to seed version buckets with highest version 1533925458407587840
   [junit4]   2> 19635 INFO  (coreLoadExecutor-7-thread-1-processing-n:127.0.0.1:54010_) [n:127.0.0.1:54010_ c:control_collection s:shard1 r:core_node1 x:collection1] o.a.s.c.ZkController watch zkdir /configs/conf1
   [junit4]   2> 19640 INFO  (coreLoadExecutor-7-thread-1-processing-n:127.0.0.1:54010_) [n:127.0.0.1:54010_ c:control_collection s:shard1 r:core_node1 x:collection1] o.a.s.c.CoreContainer registering core: collection1
   [junit4]   2> 19641 INFO  (coreZkRegister-1-thread-1-processing-n:127.0.0.1:54010_ x:collection1 s:shard1 c:control_collection r:core_node1) [n:127.0.0.1:54010_ c:control_collection s:shard1 r:core_node1 x:collection1] o.a.s.c.ZkController Register replica - core:collection1 address:http://127.0.0.1:54010 collection:control_collection shard:shard1
   [junit4]   2> 19660 INFO  (coreZkRegister-1-thread-1-processing-n:127.0.0.1:54010_ x:collection1 s:shard1 c:control_collection r:core_node1) [n:127.0.0.1:54010_ c:control_collection s:shard1 r:core_node1 x:collection1] o.a.s.c.c.SolrZkClient makePath: /collections/control_collection/leader_elect/shard1/election
   [junit4]   2> 19671 INFO  (coreZkRegister-1-thread-1-processing-n:127.0.0.1:54010_ x:collection1 s:shard1 c:control_collection r:core_node1) [n:127.0.0.1:54010_ c:control_collection s:shard1 r:core_node1 x:collection1] o.a.s.c.LeaderElector Joined leadership election with path: /collections/control_collection/leader_elect/shard1/election/95870339890151428-core_node1-n_0000000000
   [junit4]   2> 19672 INFO  (coreZkRegister-1-thread-1-processing-n:127.0.0.1:54010_ x:collection1 s:shard1 c:control_collection r:core_node1) [n:127.0.0.1:54010_ c:control_collection s:shard1 r:core_node1 x:collection1] o.a.s.c.ShardLeaderElectionContext Running the leader process for shard=shard1 and weAreReplacement=false and leaderVoteWait=10000
   [junit4]   2> 19677 INFO  (coreZkRegister-1-thread-1-processing-n:127.0.0.1:54010_ x:collection1 s:shard1 c:control_collection r:core_node1) [n:127.0.0.1:54010_ c:control_collection s:shard1 r:core_node1 x:collection1] o.a.s.c.ShardLeaderElectionContext Enough replicas found to continue.
   [junit4]   2> 19677 INFO  (coreZkRegister-1-thread-1-processing-n:127.0.0.1:54010_ x:collection1 s:shard1 c:control_collection r:core_node1) [n:127.0.0.1:54010_ c:control_collection s:shard1 r:core_node1 x:collection1] o.a.s.c.ShardLeaderElectionContext I may be the new leader - try and sync
   [junit4]   2> 19678 INFO  (OverseerStateUpdate-95870339890151428-127.0.0.1:54010_-n_0000000000) [n:127.0.0.1:54010_    ] o.a.s.c.Overseer processMessage: queueSize: 1, message = {
   [junit4]   2>   "operation":"leader",
   [junit4]   2>   "shard":"shard1",
   [junit4]   2>   "collection":"control_collection"} current state version: 1
   [junit4]   2> 19680 INFO  (coreZkRegister-1-thread-1-processing-n:127.0.0.1:54010_ x:collection1 s:shard1 c:control_collection r:core_node1) [n:127.0.0.1:54010_ c:control_collection s:shard1 r:core_node1 x:collection1] o.a.s.c.SyncStrategy Sync replicas to http://127.0.0.1:54010/collection1/
   [junit4]   2> 19680 INFO  (coreZkRegister-1-thread-1-processing-n:127.0.0.1:54010_ x:collection1 s:shard1 c:control_collection r:core_node1) [n:127.0.0.1:54010_ c:control_collection s:shard1 r:core_node1 x:collection1] o.a.s.c.SyncStrategy Sync Success - now sync replicas to me
   [junit4]   2> 19680 INFO  (coreZkRegister-1-thread-1-processing-n:127.0.0.1:54010_ x:collection1 s:shard1 c:control_collection r:core_node1) [n:127.0.0.1:54010_ c:control_collection s:shard1 r:core_node1 x:collection1] o.a.s.c.SyncStrategy http://127.0.0.1:54010/collection1/ has no replicas
   [junit4]   2> 19687 INFO  (zkCallback-7-thread-1-processing-n:127.0.0.1:54010_) [n:127.0.0.1:54010_    ] o.a.s.c.c.ZkStateReader A cluster state change: [WatchedEvent state:SyncConnected type:NodeDataChanged path:/clusterstate.json], has occurred - updating... (live nodes size: [1])
   [junit4]   2> 19701 INFO  (coreZkRegister-1-thread-1-processing-n:127.0.0.1:54010_ x:collection1 s:shard1 c:control_collection r:core_node1) [n:127.0.0.1:54010_ c:control_collection s:shard1 r:core_node1 x:collection1] o.a.s.c.c.SolrZkClient makePath: /collections/control_collection/leaders/shard1
   [junit4]   2> 19716 INFO  (coreZkRegister-1-thread-1-processing-n:127.0.0.1:54010_ x:collection1 s:shard1 c:control_collection r:core_node1) [n:127.0.0.1:54010_ c:control_collection s:shard1 r:core_node1 x:collection1] o.a.s.c.ShardLeaderElectionContextBase Creating leader registration node /collections/control_collection/leaders/shard1/leader after winning as /collections/control_collection/leader_elect/shard1/election/95870339890151428-core_node1-n_0000000000
   [junit4]   2> 19795 INFO  (coreZkRegister-1-thread-1-processing-n:127.0.0.1:54010_ x:collection1 s:shard1 c:control_collection r:core_node1) [n:127.0.0.1:54010_ c:control_collection s:shard1 r:core_node1 x:collection1] o.a.s.c.ShardLeaderElectionContext I am the new leader: http://127.0.0.1:54010/collection1/ shard1
   [junit4]   2> 19799 INFO  (OverseerStateUpdate-95870339890151428-127.0.0.1:54010_-n_0000000000) [n:127.0.0.1:54010_    ] o.a.s.c.Overseer processMessage: queueSize: 1, message = {
   [junit4]   2>   "operation":"leader",
   [junit4]   2>   "shard":"shard1",
   [junit4]   2>   "collection":"control_collection",
   [junit4]   2>   "base_url":"http://127.0.0.1:54010",
   [junit4]   2>   "core":"collection1",
   [junit4]   2>   "state":"active"} current state version: 2
   [junit4]   2> 19835 INFO  (TEST-ForceLeaderTest.testLastPublishedStateIsActive-seed#[8F15F13D3461E6E6]) [    ] o.a.s.c.c.SolrZkClient Using default ZkCredentialsProvider
   [junit4]   2> 19838 INFO  (TEST-ForceLeaderTest.testLastPublishedStateIsActive-seed#[8F15F13D3461E6E6]) [    ] o.a.s.c.c.ConnectionManager Waiting for client to connect to ZooKeeper
   [junit4]   2> 19839 INFO  (zkCallback-9-thread-1) [    ] o.a.s.c.c.ConnectionManager Watcher org.apache.solr.common.cloud.ConnectionManager@26c0c3a4 name:ZooKeeperConnection Watcher:127.0.0.1:54007/solr got event WatchedEvent state:SyncConnected type:None path:null path:null type:None
   [junit4]   2> 19839 INFO  (TEST-ForceLeaderTest.testLastPublishedStateIsActive-seed#[8F15F13D3461E6E6]) [    ] o.a.s.c.c.ConnectionManager Client is connected to ZooKeeper
   [junit4]   2> 19839 INFO  (TEST-ForceLeaderTest.testLastPublishedStateIsActive-seed#[8F15F13D3461E6E6]) [    ] o.a.s.c.c.SolrZkClient Using default ZkACLProvider
   [junit4]   2> 19840 INFO  (TEST-ForceLeaderTest.testLastPublishedStateIsActive-seed#[8F15F13D3461E6E6]) [    ] o.a.s.c.c.ZkStateReader Updating cluster state from ZooKeeper... 
   [junit4]   2> 19843 INFO  (TEST-ForceLeaderTest.testLastPublishedStateIsActive-seed#[8F15F13D3461E6E6]) [    ] o.a.s.c.c.ZkStateReader Updated live nodes from ZooKeeper... (0) -> (1)
   [junit4]   2> 19850 INFO  (TEST-ForceLeaderTest.testLastPublishedStateIsActive-seed#[8F15F13D3461E6E6]) [    ] o.a.s.c.ChaosMonkey monkey: init - expire sessions:false cause connection loss:false
   [junit4]   2> 19910 INFO  (zkCallback-9-thread-1) [    ] o.a.s.c.c.ZkStateReader A cluster state change: [WatchedEvent state:SyncConnected type:NodeDataChanged path:/clusterstate.json], has occurred - updating... (live nodes size: [1])
   [junit4]   2> 19910 INFO  (zkCallback-7-thread-1-processing-n:127.0.0.1:54010_) [n:127.0.0.1:54010_    ] o.a.s.c.c.ZkStateReader A cluster state change: [WatchedEvent state:SyncConnected type:NodeDataChanged path:/clusterstate.json], has occurred - updating... (live nodes size: [1])
   [junit4]   2> 19960 INFO  (coreZkRegister-1-thread-1-processing-n:127.0.0.1:54010_ x:collection1 s:shard1 c:control_collection r:core_node1) [n:127.0.0.1:54010_ c:control_collection s:shard1 r:core_node1 x:collection1] o.a.s.c.ZkController We are http://127.0.0.1:54010/collection1/ and leader is http://127.0.0.1:54010/collection1/
   [junit4]   2> 19962 INFO  (coreZkRegister-1-thread-1-processing-n:127.0.0.1:54010_ x:collection1 s:shard1 c:control_collection r:core_node1) [n:127.0.0.1:54010_ c:control_collection s:shard1 r:core_node1 x:collection1] o.a.s.c.ZkController No LogReplay needed for core=collection1 baseURL=http://127.0.0.1:54010
   [junit4]   2> 19962 INFO  (coreZkRegister-1-thread-1-processing-n:127.0.0.1:54010_ x:collection1 s:shard1 c:control_collection r:core_node1) [n:127.0.0.1:54010_ c:control_collection s:shard1 r:core_node1 x:collection1] o.a.s.c.ZkController I am the leader, no recovery necessary
   [junit4]   2> 19962 INFO  (coreZkRegister-1-thread-1-processing-n:127.0.0.1:54010_ x:collection1 s:shard1 c:control_collection r:core_node1) [n:127.0.0.1:54010_ c:control_collection s:shard1 r:core_node1 x:collection1] o.a.s.c.ZkController publishing state=active
   [junit4]   2> 19962 INFO  (coreZkRegister-1-thread-1-processing-n:127.0.0.1:54010_ x:collection1 s:shard1 c:control_collection r:core_node1) [n:127.0.0.1:54010_ c:control_collection s:shard1 r:core_node1 x:collection1] o.a.s.c.ZkController numShards not found on descriptor - reading it from system property
   [junit4]   2> 19966 INFO  (OverseerStateUpdate-95870339890151428-127.0.0.1:54010_-n_0000000000) [n:127.0.0.1:54010_    ] o.a.s.c.Overseer processMessage: queueSize: 1, message = {
   [junit4]   2>   "core":"collection1",
   [junit4]   2>   "core_node_name":"core_node1",
   [junit4]   2>   "roles":null,
   [junit4]   2>   "base_url":"http://127.0.0.1:54010",
   [junit4]   2>   "node_name":"127.0.0.1:54010_",
   [junit4]   2>   "numShards":"2",
   [junit4]   2>   "state":"active",
   [junit4]   2>   "shard":"shard1",
   [junit4]   2>   "collection":"control_collection",
   [junit4]   2>   "operation":"state"} current state version: 3
   [junit4]   2> 19967 INFO  (OverseerStateUpdate-95870339890151428-127.0.0.1:54010_-n_0000000000) [n:127.0.0.1:54010_    ] o.a.s.c.o.ReplicaMutator Update state numShards=2 message={
   [junit4]   2>   "core":"collection1",
   [junit4]   2>   "core_node_name":"core_node1",
   [junit4]   2>   "roles":null,
   [junit4]   2>   "base_url":"http://127.0.0.1:54010",
   [junit4]   2>   "node_name":"127.0.0.1:54010_",
   [junit4]   2>   "numShards":"2",
   [junit4]   2>   "state":"active",
   [junit4]   2>   "shard":"shard1",
   [junit4]   2>   "collection":"control_collection",
   [junit4]   2>   "operation":"state"}
   [junit4]   2> 20075 INFO  (zkCallback-9-thread-1) [    ] o.a.s.c.c.ZkStateReader A cluster state change: [WatchedEvent state:SyncConnected type:NodeDataChanged path:/clusterstate.json], has occurred - updating... (live nodes size: [1])
   [junit4]   2> 20075 INFO  (zkCallback-7-thread-1-processing-n:127.0.0.1:54010_) [n:127.0.0.1:54010_    ] o.a.s.c.c.ZkStateReader A cluster state change: [WatchedEvent state:SyncConnected type:NodeDataChanged path:/clusterstate.json], has occurred - updating... (live nodes size: [1])
   [junit4]   2> 20253 INFO  (TEST-ForceLeaderTest.testLastPublishedStateIsActive-seed#[8F15F13D3461E6E6]) [    ] o.a.s.SolrTestCaseJ4 Writing core.properties file to /Users/jenkins/workspace/Lucene-Solr-master-MacOSX/solr/build/solr-core/test/J1/temp/solr.cloud.ForceLeaderTest_8F15F13D3461E6E6-001/shard-1-001/cores/collection1
   [junit4]   2> 20257 INFO  (TEST-ForceLeaderTest.testLastPublishedStateIsActive-seed#[8F15F13D3461E6E6]) [    ] o.a.s.c.AbstractFullDistribZkTestBase create jetty 1 in directory /Users/jenkins/workspace/Lucene-Solr-master-MacOSX/solr/build/solr-core/test/J1/temp/solr.cloud.ForceLeaderTest_8F15F13D3461E6E6-001/shard-1-001
   [junit4]   2> 20258 INFO  (TEST-ForceLeaderTest.testLastPublishedStateIsActive-seed#[8F15F13D3461E6E6]) [    ] o.e.j.s.Server jetty-9.3.8.v20160314
   [junit4]   2> 20262 INFO  (TEST-ForceLeaderTest.testLastPublishedStateIsActive-seed#[8F15F13D3461E6E6]) [    ] o.e.j.s.h.ContextHandler Started o.e.j.s.ServletContextHandler@6ca2192f{/,null,AVAILABLE}
   [junit4]   2> 20263 INFO  (TEST-ForceLeaderTest.testLastPublishedStateIsActive-seed#[8F15F13D3461E6E6]) [    ] o.e.j.s.ServerConnector Started ServerConnector@5c695142{HTTP/1.1,[http/1.1]}{127.0.0.1:54017}
   [junit4]   2> 20263 INFO  (TEST-ForceLeaderTest.testLastPublishedStateIsActive-seed#[8F15F13D3461E6E6]) [    ] o.e.j.s.Server Started @26593ms
   [junit4]   2> 20263 INFO  (TEST-ForceLeaderTest.testLastPublishedStateIsActive-seed#[8F15F13D3461E6E6]) [    ] o.a.s.c.s.e.JettySolrRunner Jetty properties: {solr.data.dir=/Users/jenkins/workspace/Lucene-Solr-master-MacOSX/solr/build/solr-core/test/J1/temp/solr.cloud.ForceLeaderTest_8F15F13D3461E6E6-001/tempDir-001/jetty1, solrconfig=solrconfig.xml, hostContext=/, hostPort=54016, coreRootDirectory=/Users/jenkins/workspace/Lucene-Solr-master-MacOSX/solr/build/solr-core/test/J1/temp/solr.cloud.ForceLeaderTest_8F15F13D3461E6E6-001/shard-1-001/cores}
   [junit4]   2> 20263 INFO  (TEST-ForceLeaderTest.testLastPublishedStateIsActive-seed#[8F15F13D3461E6E6]) [    ] o.a.s.s.SolrDispatchFilter SolrDispatchFilter.init(): sun.misc.Launcher$AppClassLoader@4554617c
   [junit4]   2> 20264 INFO  (TEST-ForceLeaderTest.testLastPublishedStateIsActive-seed#[8F15F13D3461E6E6]) [    ] o.a.s.c.SolrResourceLoader new SolrResourceLoader for directory: '/Users/jenkins/workspace/Lucene-Solr-master-MacOSX/solr/build/solr-core/test/J1/temp/solr.cloud.ForceLeaderTest_8F15F13D3461E6E6-001/shard-1-001'
   [junit4]   2> 20266 INFO  (TEST-ForceLeaderTest.testLastPublishedStateIsActive-seed#[8F15F13D3461E6E6]) [    ] o.a.s.c.SolrResourceLoader JNDI not configured for solr (NoInitialContextEx)
   [junit4]   2> 20266 INFO  (TEST-ForceLeaderTest.testLastPublishedStateIsActive-seed#[8F15F13D3461E6E6]) [    ] o.a.s.c.SolrResourceLoader solr home defaulted to 'solr/' (could not find system property or JNDI)
   [junit4]   2> 20268 INFO  (TEST-ForceLeaderTest.testLastPublishedStateIsActive-seed#[8F15F13D3461E6E6]) [    ] o.a.s.c.c.SolrZkClient Using default ZkCredentialsProvider
   [junit4]   2> 20271 INFO  (TEST-ForceLeaderTest.testLastPublishedStateIsActive-seed#[8F15F13D3461E6E6]) [    ] o.a.s.c.c.ConnectionManager Waiting for client to connect to ZooKeeper
   [junit4]   2> 20271 INFO  (zkCallback-10-thread-1) [    ] o.a.s.c.c.ConnectionManager Watcher org.apache.solr.common.cloud.ConnectionManager@11f57fa2 name:ZooKeeperConnection Watcher:127.0.0.1:54007/solr got event WatchedEvent state:SyncConnected type:None path:null path:null type:None
   [junit4]   2> 20272 INFO  (TEST-ForceLeaderTest.testLastPublishedStateIsActive-seed#[8F15F13D3461E6E6]) [    ] o.a.s.c.c.ConnectionManager Client is connected to ZooKeeper
   [junit4]   2> 20272 INFO  (TEST-ForceLeaderTest.testLastPublishedStateIsActive-seed#[8F15F13D3461E6E6]) [    ] o.a.s.c.c.SolrZkClient Using default ZkACLProvider
   [junit4]   2> 20277 INFO  (TEST-ForceLeaderTest.testLastPublishedStateIsActive-seed#[8F15F13D3461E6E6]) [    ] o.a.s.s.SolrDispatchFilter Loading solr.xml from SolrHome (not found in ZooKeeper)
   [junit4]   2> 20277 INFO  (TEST-ForceLeaderTest.testLastPublishedStateIsActive-seed#[8F15F13D3461E6E6]) [    ] o.a.s.c.SolrXmlConfig Loading container configuration from /Users/jenkins/workspace/Lucene-Solr-master-MacOSX/solr/build/solr-core/test/J1/temp/solr.cloud.ForceLeaderTest_8F15F13D3461E6E6-001/shard-1-001/solr.xml
   [junit4]   2> 20351 INFO  (TEST-ForceLeaderTest.testLastPublishedStateIsActive-seed#[8F15F13D3461E6E6]) [    ] o.a.s.c.CorePropertiesLocator Config-defined core root directory: /Users/jenkins/workspace/Lucene-Solr-master-MacOSX/solr/build/solr-core/test/J1/temp/solr.cloud.ForceLeaderTest_8F15F13D3461E6E6-001/shard-1-001/cores
   [junit4]   2> 20352 INFO  (TEST-ForceLeaderTest.testLastPublishedStateIsActive-seed#[8F15F13D3461E6E6]) [    ] o.a.s.c.CoreContainer New CoreContainer 1463839675
   [junit4]   2> 20352 INFO  (TEST-ForceLeaderTest.testLastPublishedStateIsActive-seed#[8F15F13D3461E6E6]) [    ] o.a.s.c.CoreContainer Loading cores into CoreContainer [instanceDir=/Users/jenkins/workspace/Lucene-Solr-master-MacOSX/solr/build/solr-core/test/J1/temp/solr.cloud.ForceLeaderTest_8F15F13D3461E6E6-001/shard-1-001]
   [junit4]   2> 20352 WARN  (TEST-ForceLeaderTest.testLastPublishedStateIsActive-seed#[8F15F13D3461E6E6]) [    ] o.a.s.c.CoreContainer Couldn't add files from /Users/jenkins/workspace/Lucene-Solr-master-MacOSX/solr/build/solr-core/test/J1/temp/solr.cloud.ForceLeaderTest_8F15F13D3461E6E6-001/shard-1-001/lib to classpath: /Users/jenkins/workspace/Lucene-Solr-master-MacOSX/solr/build/solr-core/test/J1/temp/solr.cloud.ForceLeaderTest_8F15F13D3461E6E6-001/shard-1-001/lib
   [junit4]   2> 20352 INFO  (TEST-ForceLeaderTest.testLastPublishedStateIsActive-seed#[8F15F13D3461E6E6]) [    ] o.a.s.h.c.HttpShardHandlerFactory created with socketTimeout : 90000,urlScheme : ,connTimeout : 15000,maxConnectionsPerHost : 20,maxConnections : 10000,corePoolSize : 0,maximumPoolSize : 2147483647,maxThreadIdleTime : 5,sizeOfQueue : -1,fairnessPolicy : false,
   [junit4]   2> 20365 INFO  (TEST-ForceLeaderTest.testLastPublishedStateIsActive-seed#[8F15F13D3461E6E6]) [    ] o.a.s.u.UpdateShardHandler Creating UpdateShardHandler HTTP client with params: 
   [junit4]   2> 20368 INFO  (TEST-ForceLeaderTest.testLastPublishedStateIsActive-seed#[8F15F13D3461E6E6]) [    ] o.a.s.l.LogWatcher SLF4J impl is org.slf4j.impl.Log4jLoggerFactory
   [junit4]   2> 20368 INFO  (TEST-ForceLeaderTest.testLastPublishedStateIsActive-seed#[8F15F13D3461E6E6]) [    ] o.a.s.l.LogWatcher Registering Log Listener [Log4j (org.slf4j.impl.Log4jLoggerFactory)]
   [junit4]   2> 20368 INFO  (TEST-ForceLeaderTest.testLastPublishedStateIsActive-seed#[8F15F13D3461E6E6]) [    ] o.a.s.c.ZkContainer Zookeeper client=127.0.0.1:54007/solr
   [junit4]   2> 20369 INFO  (TEST-ForceLeaderTest.testLastPublishedStateIsActive-seed#[8F15F13D3461E6E6]) [    ] o.a.s.c.ZkController zkHost includes chroot
   [junit4]   2> 20369 INFO  (TEST-ForceLeaderTest.testLastPublishedStateIsActive-seed#[8F15F13D3461E6E6]) [    ] o.a.s.c.c.SolrZkClient Using default ZkCredentialsProvider
   [junit4]   2> 20373 INFO  (zkCallback-13-thread-1) [    ] o.a.s.c.c.ConnectionManager Watcher org.apache.solr.common.cloud.ConnectionManager@44b3fe2d name:ZooKeeperConnection Watcher:127.0.0.1:54007 got event WatchedEvent state:SyncConnected type:None path:null path:null type:None
   [junit4]   2> 20377 INFO  (TEST-ForceLeaderTest.testLastPublishedStateIsActive-seed#[8F15F13D3461E6E6]) [    ] o.a.s.c.c.ConnectionManager Waiting for client to connect to ZooKeeper
   [junit4]   2> 20377 INFO  (TEST-ForceLeaderTest.testLastPublishedStateIsActive-seed#[8F15F13D3461E6E6]) [    ] o.a.s.c.c.ConnectionManager Client is connected to ZooKeeper
   [junit4]   2> 20378 INFO  (TEST-ForceLeaderTest.testLastPublishedStateIsActive-seed#[8F15F13D3461E6E6]) [    ] o.a.s.c.c.SolrZkClient Using default ZkACLProvider
   [junit4]   2> 20397 INFO  (TEST-ForceLeaderTest.testLastPublishedStateIsActive-seed#[8F15F13D3461E6E6]) [n:127.0.0.1:54016_    ] o.a.s.c.ZkController Added new OnReconnect listener org.apache.solr.cloud.ZkController$$Lambda$9/359381289@2d7fbbb4
   [junit4]   2> 20399 INFO  (TEST-ForceLeaderTest.testLastPublishedStateIsActive-seed#[8F15F13D3461E6E6]) [n:127.0.0.1:54016_    ] o.a.s.c.c.ConnectionManager Waiting for client to connect to ZooKeeper
   [junit4]   2> 20401 INFO  (zkCallback-14-thread-1-processing-n:127.0.0.1:54016_) [n:127.0.0.1:54016_    ] o.a.s.c.c.ConnectionManager Watcher org.apache.solr.common.cloud.ConnectionManager@7d7564b6 name:ZooKeeperConnection Watcher:127.0.0.1:54007/solr got event WatchedEvent state:SyncConnected type:None path:null path:null type:None
   [junit4]   2> 20401 INFO  (TEST-ForceLeaderTest.testLastPublishedStateIsActive-seed#[8F15F13D3461E6E6]) [n:127.0.0.1:54016_    ] o.a.s.c.c.ConnectionManager Client is connected to ZooKeeper
   [junit4]   2> 20429 INFO  (TEST-ForceLeaderTest.testLastPublishedStateIsActive-seed#[8F15F13D3461E6E6]) [n:127.0.0.1:54016_    ] o.a.s.c.c.ZkStateReader Updating cluster state from ZooKeeper... 
   [junit4]   2> 20434 INFO  (TEST-ForceLeaderTest.testLastPublishedStateIsActive-seed#[8F15F13D3461E6E6]) [n:127.0.0.1:54016_    ] o.a.s.c.c.ZkStateReader Updated live nodes from ZooKeeper... (0) -> (1)
   [junit4]   2> 20440 INFO  (TEST-ForceLeaderTest.testLastPublishedStateIsActive-seed#[8F15F13D3461E6E6]) [n:127.0.0.1:54016_    ] o.a.s.c.Overseer Overseer (id=null) closing
   [junit4]   2> 20441 INFO  (TEST-ForceLeaderTest.testLastPublishedStateIsActive-seed#[8F15F13D3461E6E6]) [n:127.0.0.1:54016_    ] o.a.s.c.LeaderElector Joined leadership election with path: /overseer_elect/election/95870339890151432-127.0.0.1:54016_-n_0000000001
   [junit4]   2> 20446 INFO  (TEST-ForceLeaderTest.testLastPublishedStateIsActive-seed#[8F15F13D3461E6E6]) [n:127.0.0.1:54016_    ] o.a.s.c.LeaderElector Watching path /overseer_elect/election/95870339890151428-127.0.0.1:54010_-n_0000000000 to know if I could be the leader
   [junit4]   2> 20448 INFO  (TEST-ForceLeaderTest.testLastPublishedStateIsActive-seed#[8F15F13D3461E6E6]) [n:127.0.0.1:54016_    ] o.a.s.c.ZkController Publish node=127.0.0.1:54016_ as DOWN
   [junit4]   2> 20453 INFO  (OverseerStateUpdate-95870339890151428-127.0.0.1:54010_-n_0000000000) [n:127.0.0.1:54010_    ] o.a.s.c.Overseer processMessage: queueSize: 1, message = {
   [junit4]   2>   "operation":"downnode",
   [junit4]   2>   "node_name":"127.0.0.1:54016_"} current state version: 4
   [junit4]   2> 20457 INFO  (OverseerStateUpdate-95870339890151428-127.0.0.1:54010_-n_0000000000) [n:127.0.0.1:54010_    ] o.a.s.c.o.NodeMutator DownNode state invoked for node: 127.0.0.1:54016_
   [junit4]   2> 20576 INFO  (zkCallback-9-thread-1) [    ] o.a.s.c.c.ZkStateReader A cluster state change: [WatchedEvent state:SyncConnected type:NodeDataChanged path:/clusterstate.json], has occurred - updating... (live nodes size: [1])
   [junit4]   2> 20576 INFO  (zkCallback-14-thread-1-processing-n:127.0.0.1:54016_) [n:127.0.0.1:54016_    ] o.a.s.c.c.ZkStateReader A cluster state change: [WatchedEvent state:SyncConnected type:NodeDataChanged path:/clusterstate.json], has occurred - updating... (live nodes size: [1])
   [junit4]   2> 20576 INFO  (zkCallback-7-thread-1-processing-n:127.0.0.1:54010_) [n:127.0.0.1:54010_    ] o.a.s.c.c.ZkStateReader A cluster state change: [WatchedEvent state:SyncConnected type:NodeDataChanged path:/clusterstate.json], has occurred - updating... (live nodes size: [1])
   [junit4]   2> 21456 INFO  (TEST-ForceLeaderTest.testLastPublishedStateIsActive-seed#[8F15F13D3461E6E6]) [n:127.0.0.1:54016_    ] o.a.s.c.ZkController Register node as live in ZooKeeper:/live_nodes/127.0.0.1:54016_
   [junit4]   2> 21458 INFO  (TEST-ForceLeaderTest.testLastPublishedStateIsActive-seed#[8F15F13D3461E6E6]) [n:127.0.0.1:54016_    ] o.a.s.c.c.SolrZkClient makePath: /live_nodes/127.0.0.1:54016_
   [junit4]   2> 21466 INFO  (zkCallback-9-thread-1) [    ] o.a.s.c.c.ZkStateReader A live node change: [WatchedEvent state:SyncConnected type:NodeChildrenChanged path:/live_nodes], has occurred - updating... (live nodes size: [1])
   [junit4]   2> 21466 INFO  (zkCallback-14-thread-1-processing-n:127.0.0.1:54016_) [n:127.0.0.1:54016_    ] o.a.s.c.c.ZkStateReader A live node change: [WatchedEvent state:SyncConnected type:NodeChildrenChanged path:/live_nodes], has occurred - updating... (live nodes size: [1])
   [junit4]   2> 21467 INFO  (zkCallback-7-thread-1-processing-n:127.0.0.1:54010_) [n:127.0.0.1:54010_    ] o.a.s.c.c.ZkStateReader A live node change: [WatchedEvent state:SyncConnected type:NodeChildrenChanged path:/live_nodes], has occurred - updating... (live nodes size: [1])
   [junit4]   2> 21474 INFO  (zkCallback-14-thread-1-processing-n:127.0.0.1:54016_) [n:127.0.0.1:54016_    ] o.a.s.c.c.ZkStateReader Updated live nodes from ZooKeeper... (1) -> (2)
   [junit4]   2> 21474 INFO  (zkCallback-9-thread-1) [    ] o.a.s.c.c.ZkStateReader Updated live nodes from ZooKeeper... (1) -> (2)
   [junit4]   2> 21474 INFO  (zkCallback-7-thread-1-processing-n:127.0.0.1:54010_) [n:127.0.0.1:54010_    ] o.a.s.c.c.ZkStateReader Updated live nodes from ZooKeeper... (1) -> (2)
   [junit4]   2> 21500 INFO  (TEST-ForceLeaderTest.testLastPublishedStateIsActive-seed#[8F15F13D3461E6E6]) [n:127.0.0.1:54016_    ] o.a.s.c.CoreContainer Security conf doesn't exist. Skipping setup for authorization module.
   [junit4]   2> 21500 INFO  (TEST-ForceLeaderTest.testLastPublishedStateIsActive-seed#[8F15F13D3461E6E6]) [n:127.0.0.1:54016_    ] o.a.s.c.CoreContainer No authentication plugin used.
   [junit4]   2> 21504 INFO  (TEST-ForceLeaderTest.testLastPublishedStateIsActive-seed#[8F15F13D3461E6E6]) [n:127.0.0.1:54016_    ] o.a.s.c.CorePropertiesLocator Looking for core definitions underneath /Users/jenkins/workspace/Lucene-Solr-master-MacOSX/solr/build/solr-core/test/J1/temp/solr.cloud.ForceLeaderTest_8F15F13D3461E6E6-001/shard-1-001/cores
   [junit4]   2> 21506 INFO  (TEST-ForceLeaderTest.testLastPublishedStateIsActive-seed#[8F15F13D3461E6E6]) [n:127.0.0.1:54016_    ] o.a.s.c.CoreDescriptor Created CoreDescriptor: {name=collection1, config=solrconfig.xml, transient=false, schema=schema.xml, loadOnStartup=true, configSetProperties=configsetprops.json, collection=collection1, coreNodeName=, dataDir=data/, shard=}
   [junit4]   2> 21506 INFO  (TEST-ForceLeaderTest.testLastPublishedStateIsActive-seed#[8F15F13D3461E6E6]) [n:127.0.0.1:54016_    ] o.a.s.c.CorePropertiesLocator Found core collection1 in /Users/jenkins/workspace/Lucene-Solr-master-MacOSX/solr/build/solr-core/test/J1/temp/solr.cloud.ForceLeaderTest_8F15F13D3461E6E6-001/shard-1-001/cores/collection1
   [junit4]   2> 21506 INFO  (TEST-ForceLeaderTest.testLastPublishedStateIsActive-seed#[8F15F13D3461E6E6]) [n:127.0.0.1:54016_    ] o.a.s.c.CorePropertiesLocator Found 1 core definitions
   [junit4]   2> 21510 INFO  (coreLoadExecutor-18-thread-1-processing-n:127.0.0.1:54016_) [n:127.0.0.1:54016_ c:collection1   x:collection1] o.a.s.c.ZkController publishing state=down
   [junit4]   2> 21511 INFO  (coreLoadExecutor-18-thread-1-processing-n:127.0.0.1:54016_) [n:127.0.0.1:54016_ c:collection1   x:collection1] o.a.s.c.ZkController numShards not found on descriptor - reading it from system property
   [junit4]   2> 21511 INFO  (TEST-ForceLeaderTest.testLastPublishedStateIsActive-seed#[8F15F13D3461E6E6]) [n:127.0.0.1:54016_    ] o.a.s.s.SolrDispatchFilter user.dir=/Users/jenkins/workspace/Lucene-Solr-master-MacOSX/solr/build/solr-core/test/J1
   [junit4]   2> 21511 INFO  (TEST-ForceLeaderTest.testLastPublishedStateIsActive-seed#[8F15F13D3461E6E6]) [n:127.0.0.1:54016_    ] o.a.s.s.SolrDispatchFilter SolrDispatchFilter.init() done
   [junit4]   2> 21513 INFO  (coreLoadExecutor-18-thread-1-processing-n:127.0.0.1:54016_) [n:127.0.0.1:54016_ c:collection1   x:collection1] o.a.s.c.ZkController Collection collection1 not visible yet, but flagging it so a watch is registered when it becomes visible
   [junit4]   2> 21513 INFO  (coreLoadExecutor-18-thread-1-processing-n:127.0.0.1:54016_) [n:127.0.0.1:54016_ c:collection1   x:collection1] o.a.s.c.c.ZkStateReader addZkWatch [collection1]
   [junit4]   2> 21514 INFO  (OverseerStateUpdate-95870339890151428-127.0.0.1:54010_-n_0000000000) [n:127.0.0.1:54010_    ] o.a.s.c.Overseer processMessage: queueSize: 1, message = {
   [junit4]   2>   "core":"collection1",
   [junit4]   2>   "roles":null,
   [junit4]   2>   "base_url":"http://127.0.0.1:54016",
   [junit4]   2>   "node_name":"127.0.0.1:54016_",
   [junit4]   2>   "numShards":"2",
   [junit4]   2>   "state":"down",
   [junit4]   2>   "shard":null,
   [junit4]   2>   "collection":"collection1",
   [junit4]   2>   "operation":"state"} current state version: 5
   [junit4]   2> 21514 INFO  (coreLoadExecutor-18-thread-1-processing-n:127.0.0.1:54016_) [n:127.0.0.1:54016_ c:collection1   x:collection1] o.a.s.c.c.ZkStateReader Deleting data for [collection1]
   [junit4]   2> 21514 INFO  (OverseerStateUpdate-95870339890151428-127.0.0.1:54010_-n_0000000000) [n:127.0.0.1:54010_    ] o.a.s.c.o.ReplicaMutator Update state numShards=2 message={
   [junit4]   2>   "core":"collection1",
   [junit4]   2>   "roles":null,
   [junit4]   2>   "base_url":"http://127.0.0.1:54016",
   [junit4]   2>   "node_name":"127.0.0.1:54016_",
   [junit4]   2>   "numShards":"2",
   [junit4]   2>   "state":"down",
   [junit4]   2>   "shard":null,
   [junit4]   2>   "collection":"collection1",
   [junit4]   2>   "operation":"state"}
   [junit4]   2> 21515 INFO  (OverseerStateUpdate-95870339890151428-127.0.0.1:54010_-n_0000000000) [n:127.0.0.1:54010_    ] o.a.s.c.o.ClusterStateMutator building a new cName: collection1
   [junit4]   2> 21515 INFO  (coreLoadExecutor-18-thread-1-processing-n:127.0.0.1:54016_) [n:127.0.0.1:54016_ c:collection1   x:collection1] o.a.s.c.ZkController look for our core node name
   [junit4]   2> 21515 INFO  (OverseerStateUpdate-95870339890151428-127.0.0.1:54010_-n_0000000000) [n:127.0.0.1:54010_    ] o.a.s.c.o.ReplicaMutator Assigning new node to shard shard=shard2
   [junit4]   2> 21626 INFO  (zkCallback-9-thread-1) [    ] o.a.s.c.c.ZkStateReader A cluster state change: [WatchedEvent state:SyncConnected type:NodeDataChanged path:/clusterstate.json], has occurred - updating... (live nodes size: [2])
   [junit4]   2> 21626 INFO  (zkCallback-14-thread-1-processing-n:127.0.0.1:54016_) [n:127.0.0.1:54016_    ] o.a.s.c.c.ZkStateReader A cluster state change: [WatchedEvent state:SyncConnected type:NodeDataChanged path:/clusterstate.json], has occurred - updating... (live nodes size: [2])
   [junit4]   2> 21627 INFO  (zkCallback-7-thread-1-processing-n:127.0.0.1:54010_) [n:127.0.0.1:54010_    ] o.a.s.c.c.ZkStateReader A cluster state change: [WatchedEvent state:SyncConnected type:NodeDataChanged path:/clusterstate.json], has occurred - updating... (live nodes size: [2])
   [junit4]   2> 22526 INFO  (coreLoadExecutor-18-thread-1-processing-n:127.0.0.1:54016_) [n:127.0.0.1:54016_ c:collection1   x:collection1] o.a.s.c.ZkController waiting to find shard id in clusterstate for collection1
   [junit4]   2> 22526 INFO  (coreLoadExecutor-18-thread-1-processing-n:127.0.0.1:54016_) [n:127.0.0.1:54016_ c:collection1   x:collection1] o.a.s.c.ZkController Check for collection zkNode:collection1
   [junit4]   2> 22527 INFO  (coreLoadExecutor-18-thread-1-processing-n:127.0.0.1:54016_) [n:127.0.0.1:54016_ c:collection1   x:collection1] o.a.s.c.ZkController Collection zkNode exists
   [junit4]   2> 22527 INFO  (coreLoadExecutor-18-thread-1-processing-n:127.0.0.1:54016_) [n:127.0.0.1:54016_ c:collection1   x:collection1] o.a.s.c.c.ZkStateReader Load collection config from: [/collections/collection1]
   [junit4]   2> 22528 INFO  (coreLoadExecutor-18-thread-1-processing-n:127.0.0.1:54016_) [n:127.0.0.1:54016_ c:collection1   x:collection1] o.a.s.c.c.ZkStateReader path=[/collections/collection1] [configName]=[conf1] specified config exists in ZooKeeper
   [junit4]   2> 22528 INFO  (coreLoadExecutor-18-thread-1-processing-n:127.0.0.1:54016_) [n:127.0.0.1:54016_ c:collection1   x:collection1] o.a.s.c.SolrResourceLoader new SolrResourceLoader for directory: '/Users/jenkins/workspace/Lucene-Solr-master-MacOSX/solr/build/solr-core/test/J1/temp/solr.cloud.ForceLeaderTest_8F15F13D3461E6E6-001/shard-1-001/cores/collection1'
   [junit4]   2> 22529 INFO  (coreLoadExecutor-18-thread-1-processing-n:127.0.0.1:54016_) [n:127.0.0.1:54016_ c:collection1   x:collection1] o.a.s.c.SolrResourceLoader JNDI not configured for solr (NoInitialContextEx)
   [junit4]   2> 22529 INFO  (coreLoadExecutor-18-thread-1-processing-n:127.0.0.1:54016_) [n:127.0.0.1:54016_ c:collection1   x:collection1] o.a.s.c.SolrResourceLoader solr home defaulted to 'solr/' (could not find system property or JNDI)
   [junit4]   2> 22531 INFO  (coreLoadExecutor-18-thread-1-processing-n:127.0.0.1:54016_) [n:127.0.0.1:54016_ c:collection1   x:collection1] o.a.s.c.Config loaded config solrconfig.xml with version 0 
   [junit4]   2> 22553 INFO  (coreLoadExecutor-18-thread-1-processing-n:127.0.0.1:54016_) [n:127.0.0.1:54016_ c:collection1   x:collection1] o.a.s.c.SolrConfig current version of requestparams : -1
   [junit4]   2> 22557 WARN  (coreLoadExecutor-18-thread-1-processing-n:127.0.0.1:54016_) [n:127.0.0.1:54016_ c:collection1   x:collection1] o.a.s.c.Config Beginning with Solr 5.5, <mergePolicy> is deprecated, use <mergePolicyFactory> instead.
   [junit4]   2> 22558 INFO  (coreLoadExecutor-18-thread-1-processing-n:127.0.0.1:54016_) [n:127.0.0.1:54016_ c:collection1   x:collection1] o.a.s.c.SolrConfig Using Lucene MatchVersion: 7.0.0
   [junit4]   2> 22580 INFO  (coreLoadExecutor-18-thread-1-processing-n:127.0.0.1:54016_) [n:127.0.0.1:54016_ c:collection1   x:collection1] o.a.s.c.SolrConfig Loaded SolrConfig: solrconfig.xml
   [junit4]   2> 22604 INFO  (coreLoadExecutor-18-thread-1-processing-n:127.0.0.1:54016_) [n:127.0.0.1:54016_ c:collection1   x:collection1] o.a.s.s.IndexSchema [collection1] Schema name=test
   [junit4]   2> 22785 INFO  (coreLoadExecutor-18-thread-1-processing-n:127.0.0.1:54016_) [n:127.0.0.1:54016_ c:collection1   x:collection1] o.a.s.s.OpenExchangeRatesOrgProvider Initialized with rates=open-exchange-rates.json, refreshInterval=1440.
   [junit4]   2> 22804 INFO  (coreLoadExecutor-18-thread-1-processing-n:127.0.0.1:54016_) [n:127.0.0.1:54016_ c:collection1   x:collection1] o.a.s.s.IndexSchema default search field in schema is text
   [junit4]   2> 22813 INFO  (coreLoadExecutor-18-thread-1-processing-n:127.0.0.1:54016_) [n:127.0.0.1:54016_ c:collection1   x:collection1] o.a.s.s.IndexSchema unique key field: id
   [junit4]   2> 22846 INFO  (coreLoadExecutor-18-thread-1-processing-n:127.0.0.1:54016_) [n:127.0.0.1:54016_ c:collection1   x:collection1] o.a.s.s.FileExchangeRateProvider Reloading exchange rates from file currency.xml
   [junit4]   2> 22852 INFO  (coreLoadExecutor-18-thread-1-processing-n:127.0.0.1:54016_) [n:127.0.0.1:54016_ c:collection1   x:collection1] o.a.s.s.FileExchangeRateProvider Reloading exchange rates from file currency.xml
   [junit4]   2> 22861 INFO  (coreLoadExecutor-18-thread-1-processing-n:127.0.0.1:54016_) [n:127.0.0.1:54016_ c:collection1   x:collection1] o.a.s.s.OpenExchangeRatesOrgProvider Reloading exchange rates from open-exchange-rates.json
   [junit4]   2> 22862 INFO  (coreLoadExecutor-18-thread-1-processing-n:127.0.0.1:54016_) [n:127.0.0.1:54016_ c:collection1   x:collection1] o.a.s.s.OpenExchangeRatesOrgProvider Reloading exchange rates from open-exchange-rates.json
   [junit4]   2> 22866 INFO  (coreLoadExecutor-18-thread-1-processing-n:127.0.0.1:54016_) [n:127.0.0.1:54016_ c:collection1   x:collection1] o.a.s.c.ConfigSetProperties Did not find ConfigSet properties, assuming default properties: Can't find resource 'configsetprops.json' in classpath or '/configs/conf1', cwd=/Users/jenkins/workspace/Lucene-Solr-master-MacOSX/solr/build/solr-core/test/J1
   [junit4]   2> 22867 INFO  (coreLoadExecutor-18-thread-1-processing-n:127.0.0.1:54016_) [n:127.0.0.1:54016_ c:collection1   x:collection1] o.a.s.c.CoreContainer Creating SolrCore 'collection1' using configuration from collection collection1
   [junit4]   2> 22868 INFO  (coreLoadExecutor-18-thread-1-processing-n:127.0.0.1:54016_) [n:127.0.0.1:54016_ c:collection1 s:sha

[...truncated too long message...]

p/solr.cloud.ForceLeaderTest_8F15F13D3461E6E6-001/shard-3-002/cores/collection1/data;done=false>>]
   [junit4]   2> 472237 INFO  (zkCallback-51-thread-3-processing-n:127.0.0.1:54194_) [n:127.0.0.1:54194_ c:collection1 s:shard2 r:core_node3 x:collection1] o.a.s.c.CachingDirectoryFactory Closing directory, CoreContainer#isShutdown=true
   [junit4]   2> 472237 INFO  (zkCallback-51-thread-3-processing-n:127.0.0.1:54194_) [n:127.0.0.1:54194_ c:collection1 s:shard2 r:core_node3 x:collection1] o.a.s.c.CachingDirectoryFactory Closing directory: /Users/jenkins/workspace/Lucene-Solr-master-MacOSX/solr/build/solr-core/test/J1/temp/solr.cloud.ForceLeaderTest_8F15F13D3461E6E6-001/shard-3-002/cores/collection1/data
   [junit4]   2> 472238 INFO  (zkCallback-51-thread-3-processing-n:127.0.0.1:54194_) [n:127.0.0.1:54194_ c:collection1 s:shard2 r:core_node3 x:collection1] o.a.s.c.ElectionContext Canceling election /collections/collection1/leader_elect/shard2/election/95870346272833550-core_node3-n_0000000001
   [junit4]   2> 472238 WARN  (zkCallback-51-thread-3-processing-n:127.0.0.1:54194_) [n:127.0.0.1:54194_ c:collection1 s:shard2 r:core_node3 x:collection1] o.a.s.c.LeaderElector 
   [junit4]   2> org.apache.zookeeper.KeeperException$SessionExpiredException: KeeperErrorCode = Session expired for /collections/collection1/leader_elect/shard2/election/95870346272833550-core_node3-n_0000000001
   [junit4]   2> 	at org.apache.zookeeper.KeeperException.create(KeeperException.java:127)
   [junit4]   2> 	at org.apache.zookeeper.KeeperException.create(KeeperException.java:51)
   [junit4]   2> 	at org.apache.zookeeper.ZooKeeper.delete(ZooKeeper.java:873)
   [junit4]   2> 	at org.apache.solr.common.cloud.SolrZkClient$2.execute(SolrZkClient.java:244)
   [junit4]   2> 	at org.apache.solr.common.cloud.SolrZkClient$2.execute(SolrZkClient.java:241)
   [junit4]   2> 	at org.apache.solr.common.cloud.ZkCmdExecutor.retryOperation(ZkCmdExecutor.java:60)
   [junit4]   2> 	at org.apache.solr.common.cloud.SolrZkClient.delete(SolrZkClient.java:241)
   [junit4]   2> 	at org.apache.solr.cloud.ElectionContext.cancelElection(ElectionContext.java:86)
   [junit4]   2> 	at org.apache.solr.cloud.ShardLeaderElectionContextBase.cancelElection(ElectionContext.java:143)
   [junit4]   2> 	at org.apache.solr.cloud.ShardLeaderElectionContext.cancelElection(ElectionContext.java:279)
   [junit4]   2> 	at org.apache.solr.cloud.ShardLeaderElectionContext.runLeaderProcess(ElectionContext.java:455)
   [junit4]   2> 	at org.apache.solr.cloud.LeaderElector.runIamLeaderProcess(LeaderElector.java:170)
   [junit4]   2> 	at org.apache.solr.cloud.LeaderElector.checkIfIamLeader(LeaderElector.java:135)
   [junit4]   2> 	at org.apache.solr.cloud.LeaderElector.access$200(LeaderElector.java:56)
   [junit4]   2> 	at org.apache.solr.cloud.LeaderElector$ElectionWatcher.process(LeaderElector.java:348)
   [junit4]   2> 	at org.apache.solr.common.cloud.SolrZkClient$3.lambda$process$0(SolrZkClient.java:266)
   [junit4]   2> 	at java.util.concurrent.Executors$RunnableAdapter.call(Executors.java:511)
   [junit4]   2> 	at java.util.concurrent.FutureTask.run(FutureTask.java:266)
   [junit4]   2> 	at org.apache.solr.common.util.ExecutorUtil$MDCAwareThreadPoolExecutor.lambda$execute$0(ExecutorUtil.java:229)
   [junit4]   2> 	at java.util.concurrent.ThreadPoolExecutor.runWorker(ThreadPoolExecutor.java:1142)
   [junit4]   2> 	at java.util.concurrent.ThreadPoolExecutor$Worker.run(ThreadPoolExecutor.java:617)
   [junit4]   2> 	at java.lang.Thread.run(Thread.java:745)
   [junit4]   2> 472240 INFO  (TEST-ForceLeaderTest.testReplicasInLIRNoLeader-seed#[8F15F13D3461E6E6]) [    ] o.e.j.s.ServerConnector Stopped ServerConnector@5085e743{HTTP/1.1,[http/1.1]}{127.0.0.1:0}
   [junit4]   2> 472240 INFO  (TEST-ForceLeaderTest.testReplicasInLIRNoLeader-seed#[8F15F13D3461E6E6]) [    ] o.e.j.s.h.ContextHandler Stopped o.e.j.s.ServletContextHandler@3fde2ef6{/,null,UNAVAILABLE}
   [junit4]   2> 472243 INFO  (TEST-ForceLeaderTest.testReplicasInLIRNoLeader-seed#[8F15F13D3461E6E6]) [    ] o.a.s.c.ZkTestServer connecting to 127.0.0.1:54143 54143
   [junit4]   2> 472254 INFO  (Thread-63) [    ] o.a.s.c.ZkTestServer connecting to 127.0.0.1:54143 54143
   [junit4]   2> 473558 WARN  (Thread-63) [    ] o.a.s.c.ZkTestServer Watch limit violations: 
   [junit4]   2> Maximum concurrent create/delete watches above limit:
   [junit4]   2> 
   [junit4]   2> 	5	/solr/aliases.json
   [junit4]   2> 	4	/solr/security.json
   [junit4]   2> 	4	/solr/configs/conf1
   [junit4]   2> 	3	/solr/collections/forceleader_test_collection/state.json
   [junit4]   2> 	3	/solr/collections/collection1/state.json
   [junit4]   2> 
   [junit4]   2> Maximum concurrent data watches above limit:
   [junit4]   2> 
   [junit4]   2> 	5	/solr/clusterstate.json
   [junit4]   2> 
   [junit4]   2> Maximum concurrent children watches above limit:
   [junit4]   2> 
   [junit4]   2> 	5	/solr/live_nodes
   [junit4]   2> 	5	/solr/collections
   [junit4]   2> 	3	/solr/overseer/queue
   [junit4]   2> 	3	/solr/overseer/collection-queue-work
   [junit4]   2> 	2	/solr/overseer/queue-work
   [junit4]   2> 
   [junit4]   2> 473559 WARN  (TEST-ForceLeaderTest.testReplicasInLIRNoLeader-seed#[8F15F13D3461E6E6]) [    ] o.a.s.c.SocketProxy Closing 3 connections to: http://127.0.0.1:54155/, target: http://127.0.0.1:54156/
   [junit4]   2> 473559 WARN  (TEST-ForceLeaderTest.testReplicasInLIRNoLeader-seed#[8F15F13D3461E6E6]) [    ] o.a.s.c.SocketProxy Closing 0 connections to: http://127.0.0.1:54146/, target: http://127.0.0.1:54147/
   [junit4]   2> 473559 WARN  (TEST-ForceLeaderTest.testReplicasInLIRNoLeader-seed#[8F15F13D3461E6E6]) [    ] o.a.s.c.SocketProxy Closing 6 connections to: http://127.0.0.1:54194/, target: http://127.0.0.1:54195/
   [junit4]   2> 473559 WARN  (TEST-ForceLeaderTest.testReplicasInLIRNoLeader-seed#[8F15F13D3461E6E6]) [    ] o.a.s.c.SocketProxy Closing 1 connections to: http://127.0.0.1:54189/, target: http://127.0.0.1:54190/
   [junit4]   2> NOTE: reproduce with: ant test  -Dtestcase=ForceLeaderTest -Dtests.method=testReplicasInLIRNoLeader -Dtests.seed=8F15F13D3461E6E6 -Dtests.slow=true -Dtests.locale=no -Dtests.timezone=America/Matamoros -Dtests.asserts=true -Dtests.file.encoding=ISO-8859-1
   [junit4] FAILURE  376s J1 | ForceLeaderTest.testReplicasInLIRNoLeader <<<
   [junit4]    > Throwable #1: java.lang.AssertionError: There are still nodes recoverying - waited for 330 seconds
   [junit4]    > 	at __randomizedtesting.SeedInfo.seed([8F15F13D3461E6E6:6982C5FD0DE31F87]:0)
   [junit4]    > 	at org.apache.solr.cloud.AbstractDistribZkTestBase.waitForRecoveriesToFinish(AbstractDistribZkTestBase.java:182)
   [junit4]    > 	at org.apache.solr.cloud.AbstractDistribZkTestBase.waitForRecoveriesToFinish(AbstractDistribZkTestBase.java:139)
   [junit4]    > 	at org.apache.solr.cloud.AbstractDistribZkTestBase.waitForRecoveriesToFinish(AbstractDistribZkTestBase.java:134)
   [junit4]    > 	at org.apache.solr.cloud.ForceLeaderTest.testReplicasInLIRNoLeader(ForceLeaderTest.java:115)
   [junit4]    > 	at org.apache.solr.BaseDistributedSearchTestCase$ShardsRepeatRule$ShardsFixedStatement.callStatement(BaseDistributedSearchTestCase.java:985)
   [junit4]    > 	at org.apache.solr.BaseDistributedSearchTestCase$ShardsRepeatRule$ShardsStatement.evaluate(BaseDistributedSearchTestCase.java:960)
   [junit4]    > 	at java.lang.Thread.run(Thread.java:745)
   [junit4]   2> 473573 INFO  (SUITE-ForceLeaderTest-seed#[8F15F13D3461E6E6]-worker) [    ] o.a.s.SolrTestCaseJ4 ###deleteCore
   [junit4]   2> NOTE: leaving temporary files on disk at: /Users/jenkins/workspace/Lucene-Solr-master-MacOSX/solr/build/solr-core/test/J1/temp/solr.cloud.ForceLeaderTest_8F15F13D3461E6E6-001
   [junit4]   2> NOTE: test params are: codec=Asserting(Lucene60): {range_facet_l_dv=PostingsFormat(name=LuceneVarGapFixedInterval), _version_=BlockTreeOrds(blocksize=128), multiDefault=FSTOrd50, a_t=FSTOrd50, intDefault=BlockTreeOrds(blocksize=128), id=PostingsFormat(name=LuceneVarGapFixedInterval), range_facet_i_dv=FSTOrd50, text=PostingsFormat(name=Direct), range_facet_l=FSTOrd50, timestamp=FSTOrd50}, docValues:{range_facet_l_dv=DocValuesFormat(name=Lucene54), range_facet_i_dv=DocValuesFormat(name=Direct), timestamp=DocValuesFormat(name=Direct)}, maxPointsInLeafNode=1715, maxMBSortInHeap=6.639931298437142, sim=ClassicSimilarity, locale=no, timezone=America/Matamoros
   [junit4]   2> NOTE: Mac OS X 10.11.4 x86_64/Oracle Corporation 1.8.0_72 (64-bit)/cpus=3,threads=1,free=71811816,total=136232960
   [junit4]   2> NOTE: All tests run in this JVM: [ForceLeaderTest]
   [junit4] Completed [63/597 (1!)] on J1 in 477.13s, 3 tests, 1 failure, 1 skipped <<< FAILURES!

[...truncated 1739 lines...]
BUILD FAILED
/Users/jenkins/workspace/Lucene-Solr-master-MacOSX/build.xml:740: The following error occurred while executing this line:
/Users/jenkins/workspace/Lucene-Solr-master-MacOSX/build.xml:684: The following error occurred while executing this line:
/Users/jenkins/workspace/Lucene-Solr-master-MacOSX/build.xml:59: The following error occurred while executing this line:
/Users/jenkins/workspace/Lucene-Solr-master-MacOSX/solr/build.xml:233: The following error occurred while executing this line:
/Users/jenkins/workspace/Lucene-Solr-master-MacOSX/solr/common-build.xml:529: The following error occurred while executing this line:
/Users/jenkins/workspace/Lucene-Solr-master-MacOSX/lucene/common-build.xml:1457: The following error occurred while executing this line:
/Users/jenkins/workspace/Lucene-Solr-master-MacOSX/lucene/common-build.xml:1014: There were test failures: 597 suites (10 ignored), 2412 tests, 1 failure, 121 ignored (71 assumptions) [seed: 8F15F13D3461E6E6]

Total time: 84 minutes 57 seconds
Build step 'Invoke Ant' marked build as failure
Archiving artifacts
[WARNINGS] Skipping publisher since build result is FAILURE
Recording test results
Email was triggered for: Failure - Any
Sending email for trigger: Failure - Any



Mime
View raw message