lucene-dev mailing list archives

Site index · List index
Message view « Date » · « Thread »
Top « Date » · « Thread »
From Policeman Jenkins Server <jenk...@thetaphi.de>
Subject [JENKINS] Lucene-Solr-6.0-Linux (32bit/jdk1.8.0_92) - Build # 187 - Still Failing!
Date Thu, 26 May 2016 15:44:33 GMT
Build: http://jenkins.thetaphi.de/job/Lucene-Solr-6.0-Linux/187/
Java: 32bit/jdk1.8.0_92 -client -XX:+UseConcMarkSweepGC

2 tests failed.
FAILED:  junit.framework.TestSuite.org.apache.solr.security.BasicAuthIntegrationTest

Error Message:
Suite timeout exceeded (>= 7200000 msec).

Stack Trace:
java.lang.Exception: Suite timeout exceeded (>= 7200000 msec).
	at __randomizedtesting.SeedInfo.seed([50E423FCC1606504]:0)


FAILED:  org.apache.solr.security.BasicAuthIntegrationTest.testBasics

Error Message:
Test abandoned because suite timeout was reached.

Stack Trace:
java.lang.Exception: Test abandoned because suite timeout was reached.
	at __randomizedtesting.SeedInfo.seed([50E423FCC1606504]:0)




Build Log:
[...truncated 18 lines...]
ERROR: Error fetching remote repo 'origin'
hudson.plugins.git.GitException: Failed to fetch from git://git.apache.org/lucene-solr.git
	at hudson.plugins.git.GitSCM.fetchFrom(GitSCM.java:810)
	at hudson.plugins.git.GitSCM.retrieveChanges(GitSCM.java:1066)
	at hudson.plugins.git.GitSCM.checkout(GitSCM.java:1097)
	at hudson.scm.SCM.checkout(SCM.java:485)
	at hudson.model.AbstractProject.checkout(AbstractProject.java:1269)
	at hudson.model.AbstractBuild$AbstractBuildExecution.defaultCheckout(AbstractBuild.java:604)
	at jenkins.scm.SCMCheckoutStrategy.checkout(SCMCheckoutStrategy.java:86)
	at hudson.model.AbstractBuild$AbstractBuildExecution.run(AbstractBuild.java:529)
	at hudson.model.Run.execute(Run.java:1741)
	at hudson.model.FreeStyleBuild.run(FreeStyleBuild.java:43)
	at hudson.model.ResourceController.execute(ResourceController.java:98)
	at hudson.model.Executor.run(Executor.java:410)
Caused by: hudson.plugins.git.GitException: org.eclipse.jgit.api.errors.TransportException: Connection reset
	at org.jenkinsci.plugins.gitclient.JGitAPIImpl$2.execute(JGitAPIImpl.java:639)
	at hudson.plugins.git.GitSCM.fetchFrom(GitSCM.java:808)
	... 11 more
Caused by: org.eclipse.jgit.api.errors.TransportException: Connection reset
	at org.eclipse.jgit.api.FetchCommand.call(FetchCommand.java:139)
	at org.jenkinsci.plugins.gitclient.JGitAPIImpl$2.execute(JGitAPIImpl.java:637)
	... 12 more
Caused by: org.eclipse.jgit.errors.TransportException: Connection reset
	at org.eclipse.jgit.transport.BasePackConnection.readAdvertisedRefs(BasePackConnection.java:182)
	at org.eclipse.jgit.transport.TransportGitAnon$TcpFetchConnection.<init>(TransportGitAnon.java:194)
	at org.eclipse.jgit.transport.TransportGitAnon.openFetch(TransportGitAnon.java:120)
	at org.eclipse.jgit.transport.FetchProcess.executeImp(FetchProcess.java:136)
	at org.eclipse.jgit.transport.FetchProcess.execute(FetchProcess.java:122)
	at org.eclipse.jgit.transport.Transport.fetch(Transport.java:1138)
	at org.eclipse.jgit.api.FetchCommand.call(FetchCommand.java:130)
	... 13 more
Caused by: java.net.SocketException: Connection reset
	at java.net.SocketInputStream.read(SocketInputStream.java:196)
	at java.net.SocketInputStream.read(SocketInputStream.java:122)
	at java.io.BufferedInputStream.fill(BufferedInputStream.java:235)
	at java.io.BufferedInputStream.read1(BufferedInputStream.java:275)
	at java.io.BufferedInputStream.read(BufferedInputStream.java:334)
	at org.eclipse.jgit.util.IO.readFully(IO.java:246)
	at org.eclipse.jgit.transport.PacketLineIn.readLength(PacketLineIn.java:186)
	at org.eclipse.jgit.transport.PacketLineIn.readString(PacketLineIn.java:138)
	at org.eclipse.jgit.transport.BasePackConnection.readAdvertisedRefsImpl(BasePackConnection.java:195)
	at org.eclipse.jgit.transport.BasePackConnection.readAdvertisedRefs(BasePackConnection.java:176)
	... 19 more
ERROR: null
Retrying after 10 seconds
Fetching changes from the remote Git repository
Cleaning workspace
ERROR: Error fetching remote repo 'origin'
hudson.plugins.git.GitException: Failed to fetch from git://git.apache.org/lucene-solr.git
	at hudson.plugins.git.GitSCM.fetchFrom(GitSCM.java:810)
	at hudson.plugins.git.GitSCM.retrieveChanges(GitSCM.java:1066)
	at hudson.plugins.git.GitSCM.checkout(GitSCM.java:1097)
	at hudson.scm.SCM.checkout(SCM.java:485)
	at hudson.model.AbstractProject.checkout(AbstractProject.java:1269)
	at hudson.model.AbstractBuild$AbstractBuildExecution.defaultCheckout(AbstractBuild.java:604)
	at jenkins.scm.SCMCheckoutStrategy.checkout(SCMCheckoutStrategy.java:86)
	at hudson.model.AbstractBuild$AbstractBuildExecution.run(AbstractBuild.java:529)
	at hudson.model.Run.execute(Run.java:1741)
	at hudson.model.FreeStyleBuild.run(FreeStyleBuild.java:43)
	at hudson.model.ResourceController.execute(ResourceController.java:98)
	at hudson.model.Executor.run(Executor.java:410)
Caused by: hudson.plugins.git.GitException: org.eclipse.jgit.api.errors.TransportException: Connection reset
	at org.jenkinsci.plugins.gitclient.JGitAPIImpl$2.execute(JGitAPIImpl.java:639)
	at hudson.plugins.git.GitSCM.fetchFrom(GitSCM.java:808)
	... 11 more
Caused by: org.eclipse.jgit.api.errors.TransportException: Connection reset
	at org.eclipse.jgit.api.FetchCommand.call(FetchCommand.java:139)
	at org.jenkinsci.plugins.gitclient.JGitAPIImpl$2.execute(JGitAPIImpl.java:637)
	... 12 more
Caused by: org.eclipse.jgit.errors.TransportException: Connection reset
	at org.eclipse.jgit.transport.BasePackConnection.readAdvertisedRefs(BasePackConnection.java:182)
	at org.eclipse.jgit.transport.TransportGitAnon$TcpFetchConnection.<init>(TransportGitAnon.java:194)
	at org.eclipse.jgit.transport.TransportGitAnon.openFetch(TransportGitAnon.java:120)
	at org.eclipse.jgit.transport.FetchProcess.executeImp(FetchProcess.java:136)
	at org.eclipse.jgit.transport.FetchProcess.execute(FetchProcess.java:122)
	at org.eclipse.jgit.transport.Transport.fetch(Transport.java:1138)
	at org.eclipse.jgit.api.FetchCommand.call(FetchCommand.java:130)
	... 13 more
Caused by: java.net.SocketException: Connection reset
	at java.net.SocketInputStream.read(SocketInputStream.java:196)
	at java.net.SocketInputStream.read(SocketInputStream.java:122)
	at java.io.BufferedInputStream.fill(BufferedInputStream.java:235)
	at java.io.BufferedInputStream.read1(BufferedInputStream.java:275)
	at java.io.BufferedInputStream.read(BufferedInputStream.java:334)
	at org.eclipse.jgit.util.IO.readFully(IO.java:246)
	at org.eclipse.jgit.transport.PacketLineIn.readLength(PacketLineIn.java:186)
	at org.eclipse.jgit.transport.PacketLineIn.readString(PacketLineIn.java:138)
	at org.eclipse.jgit.transport.BasePackConnection.readAdvertisedRefsImpl(BasePackConnection.java:195)
	at org.eclipse.jgit.transport.BasePackConnection.readAdvertisedRefs(BasePackConnection.java:176)
	... 19 more
ERROR: null
Retrying after 10 seconds
Fetching changes from the remote Git repository
Cleaning workspace
ERROR: Error fetching remote repo 'origin'
hudson.plugins.git.GitException: Failed to fetch from git://git.apache.org/lucene-solr.git
	at hudson.plugins.git.GitSCM.fetchFrom(GitSCM.java:810)
	at hudson.plugins.git.GitSCM.retrieveChanges(GitSCM.java:1066)
	at hudson.plugins.git.GitSCM.checkout(GitSCM.java:1097)
	at hudson.scm.SCM.checkout(SCM.java:485)
	at hudson.model.AbstractProject.checkout(AbstractProject.java:1269)
	at hudson.model.AbstractBuild$AbstractBuildExecution.defaultCheckout(AbstractBuild.java:604)
	at jenkins.scm.SCMCheckoutStrategy.checkout(SCMCheckoutStrategy.java:86)
	at hudson.model.AbstractBuild$AbstractBuildExecution.run(AbstractBuild.java:529)
	at hudson.model.Run.execute(Run.java:1741)
	at hudson.model.FreeStyleBuild.run(FreeStyleBuild.java:43)
	at hudson.model.ResourceController.execute(ResourceController.java:98)
	at hudson.model.Executor.run(Executor.java:410)
Caused by: hudson.plugins.git.GitException: org.eclipse.jgit.api.errors.TransportException: Connection reset
	at org.jenkinsci.plugins.gitclient.JGitAPIImpl$2.execute(JGitAPIImpl.java:639)
	at hudson.plugins.git.GitSCM.fetchFrom(GitSCM.java:808)
	... 11 more
Caused by: org.eclipse.jgit.api.errors.TransportException: Connection reset
	at org.eclipse.jgit.api.FetchCommand.call(FetchCommand.java:139)
	at org.jenkinsci.plugins.gitclient.JGitAPIImpl$2.execute(JGitAPIImpl.java:637)
	... 12 more
Caused by: org.eclipse.jgit.errors.TransportException: Connection reset
	at org.eclipse.jgit.transport.BasePackConnection.readAdvertisedRefs(BasePackConnection.java:182)
	at org.eclipse.jgit.transport.TransportGitAnon$TcpFetchConnection.<init>(TransportGitAnon.java:194)
	at org.eclipse.jgit.transport.TransportGitAnon.openFetch(TransportGitAnon.java:120)
	at org.eclipse.jgit.transport.FetchProcess.executeImp(FetchProcess.java:136)
	at org.eclipse.jgit.transport.FetchProcess.execute(FetchProcess.java:122)
	at org.eclipse.jgit.transport.Transport.fetch(Transport.java:1138)
	at org.eclipse.jgit.api.FetchCommand.call(FetchCommand.java:130)
	... 13 more
Caused by: java.net.SocketException: Connection reset
	at java.net.SocketInputStream.read(SocketInputStream.java:196)
	at java.net.SocketInputStream.read(SocketInputStream.java:122)
	at java.io.BufferedInputStream.fill(BufferedInputStream.java:235)
	at java.io.BufferedInputStream.read1(BufferedInputStream.java:275)
	at java.io.BufferedInputStream.read(BufferedInputStream.java:334)
	at org.eclipse.jgit.util.IO.readFully(IO.java:246)
	at org.eclipse.jgit.transport.PacketLineIn.readLength(PacketLineIn.java:186)
	at org.eclipse.jgit.transport.PacketLineIn.readString(PacketLineIn.java:138)
	at org.eclipse.jgit.transport.BasePackConnection.readAdvertisedRefsImpl(BasePackConnection.java:195)
	at org.eclipse.jgit.transport.BasePackConnection.readAdvertisedRefs(BasePackConnection.java:176)
	... 19 more
ERROR: null
Retrying after 10 seconds
Fetching changes from the remote Git repository
Cleaning workspace
ERROR: Error fetching remote repo 'origin'
hudson.plugins.git.GitException: Failed to fetch from git://git.apache.org/lucene-solr.git
	at hudson.plugins.git.GitSCM.fetchFrom(GitSCM.java:810)
	at hudson.plugins.git.GitSCM.retrieveChanges(GitSCM.java:1066)
	at hudson.plugins.git.GitSCM.checkout(GitSCM.java:1097)
	at hudson.scm.SCM.checkout(SCM.java:485)
	at hudson.model.AbstractProject.checkout(AbstractProject.java:1269)
	at hudson.model.AbstractBuild$AbstractBuildExecution.defaultCheckout(AbstractBuild.java:604)
	at jenkins.scm.SCMCheckoutStrategy.checkout(SCMCheckoutStrategy.java:86)
	at hudson.model.AbstractBuild$AbstractBuildExecution.run(AbstractBuild.java:529)
	at hudson.model.Run.execute(Run.java:1741)
	at hudson.model.FreeStyleBuild.run(FreeStyleBuild.java:43)
	at hudson.model.ResourceController.execute(ResourceController.java:98)
	at hudson.model.Executor.run(Executor.java:410)
Caused by: hudson.plugins.git.GitException: org.eclipse.jgit.api.errors.TransportException: Connection reset
	at org.jenkinsci.plugins.gitclient.JGitAPIImpl$2.execute(JGitAPIImpl.java:639)
	at hudson.plugins.git.GitSCM.fetchFrom(GitSCM.java:808)
	... 11 more
Caused by: org.eclipse.jgit.api.errors.TransportException: Connection reset
	at org.eclipse.jgit.api.FetchCommand.call(FetchCommand.java:139)
	at org.jenkinsci.plugins.gitclient.JGitAPIImpl$2.execute(JGitAPIImpl.java:637)
	... 12 more
Caused by: org.eclipse.jgit.errors.TransportException: Connection reset
	at org.eclipse.jgit.transport.BasePackConnection.readAdvertisedRefs(BasePackConnection.java:182)
	at org.eclipse.jgit.transport.TransportGitAnon$TcpFetchConnection.<init>(TransportGitAnon.java:194)
	at org.eclipse.jgit.transport.TransportGitAnon.openFetch(TransportGitAnon.java:120)
	at org.eclipse.jgit.transport.FetchProcess.executeImp(FetchProcess.java:136)
	at org.eclipse.jgit.transport.FetchProcess.execute(FetchProcess.java:122)
	at org.eclipse.jgit.transport.Transport.fetch(Transport.java:1138)
	at org.eclipse.jgit.api.FetchCommand.call(FetchCommand.java:130)
	... 13 more
Caused by: java.net.SocketException: Connection reset
	at java.net.SocketInputStream.read(SocketInputStream.java:196)
	at java.net.SocketInputStream.read(SocketInputStream.java:122)
	at java.io.BufferedInputStream.fill(BufferedInputStream.java:235)
	at java.io.BufferedInputStream.read1(BufferedInputStream.java:275)
	at java.io.BufferedInputStream.read(BufferedInputStream.java:334)
	at org.eclipse.jgit.util.IO.readFully(IO.java:246)
	at org.eclipse.jgit.transport.PacketLineIn.readLength(PacketLineIn.java:186)
	at org.eclipse.jgit.transport.PacketLineIn.readString(PacketLineIn.java:138)
	at org.eclipse.jgit.transport.BasePackConnection.readAdvertisedRefsImpl(BasePackConnection.java:195)
	at org.eclipse.jgit.transport.BasePackConnection.readAdvertisedRefs(BasePackConnection.java:176)
	... 19 more
ERROR: null
Retrying after 10 seconds
Fetching changes from the remote Git repository
Cleaning workspace
ERROR: Error fetching remote repo 'origin'
hudson.plugins.git.GitException: Failed to fetch from git://git.apache.org/lucene-solr.git
	at hudson.plugins.git.GitSCM.fetchFrom(GitSCM.java:810)
	at hudson.plugins.git.GitSCM.retrieveChanges(GitSCM.java:1066)
	at hudson.plugins.git.GitSCM.checkout(GitSCM.java:1097)
	at hudson.scm.SCM.checkout(SCM.java:485)
	at hudson.model.AbstractProject.checkout(AbstractProject.java:1269)
	at hudson.model.AbstractBuild$AbstractBuildExecution.defaultCheckout(AbstractBuild.java:604)
	at jenkins.scm.SCMCheckoutStrategy.checkout(SCMCheckoutStrategy.java:86)
	at hudson.model.AbstractBuild$AbstractBuildExecution.run(AbstractBuild.java:529)
	at hudson.model.Run.execute(Run.java:1741)
	at hudson.model.FreeStyleBuild.run(FreeStyleBuild.java:43)
	at hudson.model.ResourceController.execute(ResourceController.java:98)
	at hudson.model.Executor.run(Executor.java:410)
Caused by: hudson.plugins.git.GitException: org.eclipse.jgit.api.errors.TransportException: Connection reset
	at org.jenkinsci.plugins.gitclient.JGitAPIImpl$2.execute(JGitAPIImpl.java:639)
	at hudson.plugins.git.GitSCM.fetchFrom(GitSCM.java:808)
	... 11 more
Caused by: org.eclipse.jgit.api.errors.TransportException: Connection reset
	at org.eclipse.jgit.api.FetchCommand.call(FetchCommand.java:139)
	at org.jenkinsci.plugins.gitclient.JGitAPIImpl$2.execute(JGitAPIImpl.java:637)
	... 12 more
Caused by: org.eclipse.jgit.errors.TransportException: Connection reset
	at org.eclipse.jgit.transport.BasePackConnection.readAdvertisedRefs(BasePackConnection.java:182)
	at org.eclipse.jgit.transport.TransportGitAnon$TcpFetchConnection.<init>(TransportGitAnon.java:194)
	at org.eclipse.jgit.transport.TransportGitAnon.openFetch(TransportGitAnon.java:120)
	at org.eclipse.jgit.transport.FetchProcess.executeImp(FetchProcess.java:136)
	at org.eclipse.jgit.transport.FetchProcess.execute(FetchProcess.java:122)
	at org.eclipse.jgit.transport.Transport.fetch(Transport.java:1138)
	at org.eclipse.jgit.api.FetchCommand.call(FetchCommand.java:130)
	... 13 more
Caused by: java.net.SocketException: Connection reset
	at java.net.SocketInputStream.read(SocketInputStream.java:196)
	at java.net.SocketInputStream.read(SocketInputStream.java:122)
	at java.io.BufferedInputStream.fill(BufferedInputStream.java:235)
	at java.io.BufferedInputStream.read1(BufferedInputStream.java:275)
	at java.io.BufferedInputStream.read(BufferedInputStream.java:334)
	at org.eclipse.jgit.util.IO.readFully(IO.java:246)
	at org.eclipse.jgit.transport.PacketLineIn.readLength(PacketLineIn.java:186)
	at org.eclipse.jgit.transport.PacketLineIn.readString(PacketLineIn.java:138)
	at org.eclipse.jgit.transport.BasePackConnection.readAdvertisedRefsImpl(BasePackConnection.java:195)
	at org.eclipse.jgit.transport.BasePackConnection.readAdvertisedRefs(BasePackConnection.java:176)
	... 19 more
ERROR: null
Retrying after 10 seconds
Fetching changes from the remote Git repository
Cleaning workspace
ERROR: Error fetching remote repo 'origin'
hudson.plugins.git.GitException: Failed to fetch from git://git.apache.org/lucene-solr.git
	at hudson.plugins.git.GitSCM.fetchFrom(GitSCM.java:810)
	at hudson.plugins.git.GitSCM.retrieveChanges(GitSCM.java:1066)
	at hudson.plugins.git.GitSCM.checkout(GitSCM.java:1097)
	at hudson.scm.SCM.checkout(SCM.java:485)
	at hudson.model.AbstractProject.checkout(AbstractProject.java:1269)
	at hudson.model.AbstractBuild$AbstractBuildExecution.defaultCheckout(AbstractBuild.java:604)
	at jenkins.scm.SCMCheckoutStrategy.checkout(SCMCheckoutStrategy.java:86)
	at hudson.model.AbstractBuild$AbstractBuildExecution.run(AbstractBuild.java:529)
	at hudson.model.Run.execute(Run.java:1741)
	at hudson.model.FreeStyleBuild.run(FreeStyleBuild.java:43)
	at hudson.model.ResourceController.execute(ResourceController.java:98)
	at hudson.model.Executor.run(Executor.java:410)
Caused by: hudson.plugins.git.GitException: org.eclipse.jgit.api.errors.TransportException: Connection reset
	at org.jenkinsci.plugins.gitclient.JGitAPIImpl$2.execute(JGitAPIImpl.java:639)
	at hudson.plugins.git.GitSCM.fetchFrom(GitSCM.java:808)
	... 11 more
Caused by: org.eclipse.jgit.api.errors.TransportException: Connection reset
	at org.eclipse.jgit.api.FetchCommand.call(FetchCommand.java:139)
	at org.jenkinsci.plugins.gitclient.JGitAPIImpl$2.execute(JGitAPIImpl.java:637)
	... 12 more
Caused by: org.eclipse.jgit.errors.TransportException: Connection reset
	at org.eclipse.jgit.transport.BasePackConnection.readAdvertisedRefs(BasePackConnection.java:182)
	at org.eclipse.jgit.transport.TransportGitAnon$TcpFetchConnection.<init>(TransportGitAnon.java:194)
	at org.eclipse.jgit.transport.TransportGitAnon.openFetch(TransportGitAnon.java:120)
	at org.eclipse.jgit.transport.FetchProcess.executeImp(FetchProcess.java:136)
	at org.eclipse.jgit.transport.FetchProcess.execute(FetchProcess.java:122)
	at org.eclipse.jgit.transport.Transport.fetch(Transport.java:1138)
	at org.eclipse.jgit.api.FetchCommand.call(FetchCommand.java:130)
	... 13 more
Caused by: java.net.SocketException: Connection reset
	at java.net.SocketInputStream.read(SocketInputStream.java:196)
	at java.net.SocketInputStream.read(SocketInputStream.java:122)
	at java.io.BufferedInputStream.fill(BufferedInputStream.java:235)
	at java.io.BufferedInputStream.read1(BufferedInputStream.java:275)
	at java.io.BufferedInputStream.read(BufferedInputStream.java:334)
	at org.eclipse.jgit.util.IO.readFully(IO.java:246)
	at org.eclipse.jgit.transport.PacketLineIn.readLength(PacketLineIn.java:186)
	at org.eclipse.jgit.transport.PacketLineIn.readString(PacketLineIn.java:138)
	at org.eclipse.jgit.transport.BasePackConnection.readAdvertisedRefsImpl(BasePackConnection.java:195)
	at org.eclipse.jgit.transport.BasePackConnection.readAdvertisedRefs(BasePackConnection.java:176)
	... 19 more
ERROR: null
Retrying after 10 seconds
Fetching changes from the remote Git repository
Cleaning workspace
ERROR: Error fetching remote repo 'origin'
hudson.plugins.git.GitException: Failed to fetch from git://git.apache.org/lucene-solr.git
	at hudson.plugins.git.GitSCM.fetchFrom(GitSCM.java:810)
	at hudson.plugins.git.GitSCM.retrieveChanges(GitSCM.java:1066)
	at hudson.plugins.git.GitSCM.checkout(GitSCM.java:1097)
	at hudson.scm.SCM.checkout(SCM.java:485)
	at hudson.model.AbstractProject.checkout(AbstractProject.java:1269)
	at hudson.model.AbstractBuild$AbstractBuildExecution.defaultCheckout(AbstractBuild.java:604)
	at jenkins.scm.SCMCheckoutStrategy.checkout(SCMCheckoutStrategy.java:86)
	at hudson.model.AbstractBuild$AbstractBuildExecution.run(AbstractBuild.java:529)
	at hudson.model.Run.execute(Run.java:1741)
	at hudson.model.FreeStyleBuild.run(FreeStyleBuild.java:43)
	at hudson.model.ResourceController.execute(ResourceController.java:98)
	at hudson.model.Executor.run(Executor.java:410)
Caused by: hudson.plugins.git.GitException: org.eclipse.jgit.api.errors.TransportException: Connection reset
	at org.jenkinsci.plugins.gitclient.JGitAPIImpl$2.execute(JGitAPIImpl.java:639)
	at hudson.plugins.git.GitSCM.fetchFrom(GitSCM.java:808)
	... 11 more
Caused by: org.eclipse.jgit.api.errors.TransportException: Connection reset
	at org.eclipse.jgit.api.FetchCommand.call(FetchCommand.java:139)
	at org.jenkinsci.plugins.gitclient.JGitAPIImpl$2.execute(JGitAPIImpl.java:637)
	... 12 more
Caused by: org.eclipse.jgit.errors.TransportException: Connection reset
	at org.eclipse.jgit.transport.BasePackConnection.readAdvertisedRefs(BasePackConnection.java:182)
	at org.eclipse.jgit.transport.TransportGitAnon$TcpFetchConnection.<init>(TransportGitAnon.java:194)
	at org.eclipse.jgit.transport.TransportGitAnon.openFetch(TransportGitAnon.java:120)
	at org.eclipse.jgit.transport.FetchProcess.executeImp(FetchProcess.java:136)
	at org.eclipse.jgit.transport.FetchProcess.execute(FetchProcess.java:122)
	at org.eclipse.jgit.transport.Transport.fetch(Transport.java:1138)
	at org.eclipse.jgit.api.FetchCommand.call(FetchCommand.java:130)
	... 13 more
Caused by: java.net.SocketException: Connection reset
	at java.net.SocketInputStream.read(SocketInputStream.java:196)
	at java.net.SocketInputStream.read(SocketInputStream.java:122)
	at java.io.BufferedInputStream.fill(BufferedInputStream.java:235)
	at java.io.BufferedInputStream.read1(BufferedInputStream.java:275)
	at java.io.BufferedInputStream.read(BufferedInputStream.java:334)
	at org.eclipse.jgit.util.IO.readFully(IO.java:246)
	at org.eclipse.jgit.transport.PacketLineIn.readLength(PacketLineIn.java:186)
	at org.eclipse.jgit.transport.PacketLineIn.readString(PacketLineIn.java:138)
	at org.eclipse.jgit.transport.BasePackConnection.readAdvertisedRefsImpl(BasePackConnection.java:195)
	at org.eclipse.jgit.transport.BasePackConnection.readAdvertisedRefs(BasePackConnection.java:176)
	... 19 more
ERROR: null
Retrying after 10 seconds
Fetching changes from the remote Git repository
Cleaning workspace
ERROR: Error fetching remote repo 'origin'
hudson.plugins.git.GitException: Failed to fetch from git://git.apache.org/lucene-solr.git
	at hudson.plugins.git.GitSCM.fetchFrom(GitSCM.java:810)
	at hudson.plugins.git.GitSCM.retrieveChanges(GitSCM.java:1066)
	at hudson.plugins.git.GitSCM.checkout(GitSCM.java:1097)
	at hudson.scm.SCM.checkout(SCM.java:485)
	at hudson.model.AbstractProject.checkout(AbstractProject.java:1269)
	at hudson.model.AbstractBuild$AbstractBuildExecution.defaultCheckout(AbstractBuild.java:604)
	at jenkins.scm.SCMCheckoutStrategy.checkout(SCMCheckoutStrategy.java:86)
	at hudson.model.AbstractBuild$AbstractBuildExecution.run(AbstractBuild.java:529)
	at hudson.model.Run.execute(Run.java:1741)
	at hudson.model.FreeStyleBuild.run(FreeStyleBuild.java:43)
	at hudson.model.ResourceController.execute(ResourceController.java:98)
	at hudson.model.Executor.run(Executor.java:410)
Caused by: hudson.plugins.git.GitException: org.eclipse.jgit.api.errors.TransportException: Connection reset
	at org.jenkinsci.plugins.gitclient.JGitAPIImpl$2.execute(JGitAPIImpl.java:639)
	at hudson.plugins.git.GitSCM.fetchFrom(GitSCM.java:808)
	... 11 more
Caused by: org.eclipse.jgit.api.errors.TransportException: Connection reset
	at org.eclipse.jgit.api.FetchCommand.call(FetchCommand.java:139)
	at org.jenkinsci.plugins.gitclient.JGitAPIImpl$2.execute(JGitAPIImpl.java:637)
	... 12 more
Caused by: org.eclipse.jgit.errors.TransportException: Connection reset
	at org.eclipse.jgit.transport.BasePackConnection.readAdvertisedRefs(BasePackConnection.java:182)
	at org.eclipse.jgit.transport.TransportGitAnon$TcpFetchConnection.<init>(TransportGitAnon.java:194)
	at org.eclipse.jgit.transport.TransportGitAnon.openFetch(TransportGitAnon.java:120)
	at org.eclipse.jgit.transport.FetchProcess.executeImp(FetchProcess.java:136)
	at org.eclipse.jgit.transport.FetchProcess.execute(FetchProcess.java:122)
	at org.eclipse.jgit.transport.Transport.fetch(Transport.java:1138)
	at org.eclipse.jgit.api.FetchCommand.call(FetchCommand.java:130)
	... 13 more
Caused by: java.net.SocketException: Connection reset
	at java.net.SocketInputStream.read(SocketInputStream.java:196)
	at java.net.SocketInputStream.read(SocketInputStream.java:122)
	at java.io.BufferedInputStream.fill(BufferedInputStream.java:235)
	at java.io.BufferedInputStream.read1(BufferedInputStream.java:275)
	at java.io.BufferedInputStream.read(BufferedInputStream.java:334)
	at org.eclipse.jgit.util.IO.readFully(IO.java:246)
	at org.eclipse.jgit.transport.PacketLineIn.readLength(PacketLineIn.java:186)
	at org.eclipse.jgit.transport.PacketLineIn.readString(PacketLineIn.java:138)
	at org.eclipse.jgit.transport.BasePackConnection.readAdvertisedRefsImpl(BasePackConnection.java:195)
	at org.eclipse.jgit.transport.BasePackConnection.readAdvertisedRefs(BasePackConnection.java:176)
	... 19 more
ERROR: null
Retrying after 10 seconds
Fetching changes from the remote Git repository
Cleaning workspace
Checking out Revision 5bf8cb56758c073958eb9601e92e8ca603ead402 (refs/remotes/origin/branch_6_0)
No emails were triggered.
[description-setter] Description set: Java: 32bit/jdk1.8.0_92 -client -XX:+UseConcMarkSweepGC
[Lucene-Solr-6.0-Linux] $ /var/lib/jenkins/tools/hudson.tasks.Ant_AntInstallation/ANT_1.8.2/bin/ant "-Dargs=-client -XX:+UseConcMarkSweepGC" jenkins-hourly
Buildfile: /home/jenkins/workspace/Lucene-Solr-6.0-Linux/build.xml

jenkins-hourly:

-print-java-info:
[java-info] java version "1.8.0_92"
[java-info] Java(TM) SE Runtime Environment (1.8.0_92-b14, Oracle Corporation)
[java-info] Java HotSpot(TM) Server VM (25.92-b14, Oracle Corporation)
[java-info] Test args: [-client -XX:+UseConcMarkSweepGC]

clean:

clean:

clean:

ivy-availability-check:

ivy-fail:

ivy-configure:
[ivy:configure] :: Apache Ivy 2.3.0 - 20130110142753 :: http://ant.apache.org/ivy/ ::
[ivy:configure] :: loading settings :: file = /home/jenkins/workspace/Lucene-Solr-6.0-Linux/lucene/ivy-settings.xml

resolve-groovy:
[ivy:cachepath] :: resolving dependencies :: org.codehaus.groovy#groovy-all-caller;working
[ivy:cachepath] 	confs: [default]
[ivy:cachepath] 	found org.codehaus.groovy#groovy-all;2.4.6 in public
[ivy:cachepath] :: resolution report :: resolve 170ms :: artifacts dl 2ms
	---------------------------------------------------------------------
	|                  |            modules            ||   artifacts   |
	|       conf       | number| search|dwnlded|evicted|| number|dwnlded|
	---------------------------------------------------------------------
	|      default     |   1   |   0   |   0   |   0   ||   1   |   0   |
	---------------------------------------------------------------------

-test-with-heapdumps-enabled:
     [echo] Java HotSpot(TM) Server VM: Enabling heap dumps on OutOfMemoryError to dir '/home/jenkins/workspace/Lucene-Solr-6.0-Linux/heapdumps'.
    [mkdir] Created dir: /home/jenkins/workspace/Lucene-Solr-6.0-Linux/heapdumps

ivy-availability-check:

ivy-fail:

ivy-configure:
[ivy:configure] :: loading settings :: file = /home/jenkins/workspace/Lucene-Solr-6.0-Linux/lucene/ivy-settings.xml

resolve-groovy:

test:

ivy-availability-check:

ivy-fail:

ivy-configure:
[ivy:configure] :: loading settings :: file = /home/jenkins/workspace/Lucene-Solr-6.0-Linux/lucene/ivy-settings.xml

-clover.load:

resolve-groovy:

-init-totals:

test-core:

-clover.disable:

ivy-availability-check:

ivy-fail:

ivy-configure:
[ivy:configure] :: loading settings :: file = /home/jenkins/workspace/Lucene-Solr-6.0-Linux/lucene/ivy-settings.xml

-clover.load:

-clover.classpath:

-clover.setup:

clover:

-check-git-state:

-git-cleanroot:

-copy-git-state:
     [copy] Copying 1 file to /home/jenkins/workspace/Lucene-Solr-6.0-Linux/lucene/build

git-autoclean:

resolve:

init:

compile-core:
    [mkdir] Created dir: /home/jenkins/workspace/Lucene-Solr-6.0-Linux/lucene/build/core/classes/java
    [javac] Compiling 746 source files to /home/jenkins/workspace/Lucene-Solr-6.0-Linux/lucene/build/core/classes/java
    [javac] Note: Some input files use or override a deprecated API.
    [javac] Note: Recompile with -Xlint:deprecation for details.
    [javac] Creating empty /home/jenkins/workspace/Lucene-Solr-6.0-Linux/lucene/build/core/classes/java/org/apache/lucene/document/package-info.class
    [javac] Creating empty /home/jenkins/workspace/Lucene-Solr-6.0-Linux/lucene/build/core/classes/java/org/apache/lucene/package-info.class
    [javac] Creating empty /home/jenkins/workspace/Lucene-Solr-6.0-Linux/lucene/build/core/classes/java/org/apache/lucene/util/bkd/package-info.class
    [javac] Creating empty /home/jenkins/workspace/Lucene-Solr-6.0-Linux/lucene/build/core/classes/java/org/apache/lucene/util/packed/package-info.class
    [javac] Creating empty /home/jenkins/workspace/Lucene-Solr-6.0-Linux/lucene/build/core/classes/java/org/apache/lucene/util/mutable/package-info.class
    [javac] Creating empty /home/jenkins/workspace/Lucene-Solr-6.0-Linux/lucene/build/core/classes/java/org/apache/lucene/codecs/compressing/package-info.class
    [javac] Creating empty /home/jenkins/workspace/Lucene-Solr-6.0-Linux/lucene/build/core/classes/java/org/apache/lucene/codecs/lucene60/package-info.class
    [javac] Creating empty /home/jenkins/workspace/Lucene-Solr-6.0-Linux/lucene/build/core/classes/java/org/apache/lucene/codecs/package-info.class
    [javac] Creating empty /home/jenkins/workspace/Lucene-Solr-6.0-Linux/lucene/build/core/classes/java/org/apache/lucene/codecs/perfield/package-info.class
    [javac] Creating empty /home/jenkins/workspace/Lucene-Solr-6.0-Linux/lucene/build/core/classes/java/org/apache/lucene/util/package-info.class
    [javac] Creating empty /home/jenkins/workspace/Lucene-Solr-6.0-Linux/lucene/build/core/classes/java/org/apache/lucene/analysis/package-info.class
    [javac] Creating empty /home/jenkins/workspace/Lucene-Solr-6.0-Linux/lucene/build/core/classes/java/org/apache/lucene/index/package-info.class
    [javac] Creating empty /home/jenkins/workspace/Lucene-Solr-6.0-Linux/lucene/build/core/classes/java/org/apache/lucene/store/package-info.class
    [javac] Creating empty /home/jenkins/workspace/Lucene-Solr-6.0-Linux/lucene/build/core/classes/java/org/apache/lucene/codecs/blocktree/package-info.class
    [javac] Creating empty /home/jenkins/workspace/Lucene-Solr-6.0-Linux/lucene/build/core/classes/java/org/apache/lucene/util/fst/package-info.class
    [javac] Creating empty /home/jenkins/workspace/Lucene-Solr-6.0-Linux/lucene/build/core/classes/java/org/apache/lucene/search/spans/package-info.class
    [javac] Creating empty /home/jenkins/workspace/Lucene-Solr-6.0-Linux/lucene/build/core/classes/java/org/apache/lucene/analysis/tokenattributes/package-info.class
    [javac] Creating empty /home/jenkins/workspace/Lucene-Solr-6.0-Linux/lucene/build/core/classes/java/org/apache/lucene/codecs/lucene54/package-info.class
    [javac] Creating empty /home/jenkins/workspace/Lucene-Solr-6.0-Linux/lucene/build/core/classes/java/org/apache/lucene/search/package-info.class
    [javac] Creating empty /home/jenkins/workspace/Lucene-Solr-6.0-Linux/lucene/build/core/classes/java/org/apache/lucene/search/similarities/package-info.class
    [javac] Creating empty /home/jenkins/workspace/Lucene-Solr-6.0-Linux/lucene/build/core/classes/java/org/apache/lucene/util/automaton/package-info.class
    [javac] Creating empty /home/jenkins/workspace/Lucene-Solr-6.0-Linux/lucene/build/core/classes/java/org/apache/lucene/codecs/lucene53/package-info.class
    [javac] Creating empty /home/jenkins/workspace/Lucene-Solr-6.0-Linux/lucene/build/core/classes/java/org/apache/lucene/codecs/lucene50/package-info.class
     [copy] Copying 3 files to /home/jenkins/workspace/Lucene-Solr-6.0-Linux/lucene/build/core/classes/java

compile-test-framework:

-check-git-state:

-git-cleanroot:

-copy-git-state:

git-autoclean:

ivy-availability-check:

ivy-fail:

ivy-configure:
[ivy:configure] :: loading settings :: file = /home/jenkins/workspace/Lucene-Solr-6.0-Linux/lucene/ivy-settings.xml

resolve:

init:

compile-lucene-core:

-check-git-state:

-git-cleanroot:

-copy-git-state:

git-autoclean:

ivy-availability-check:

ivy-fail:

ivy-configure:
[ivy:configure] :: loading settings :: file = /home/jenkins/workspace/Lucene-Solr-6.0-Linux/lucene/ivy-settings.xml

resolve:

init:

-clover.disable:

-clover.load:

-clover.classpath:

-clover.setup:

clover:

compile-core:

compile-codecs:

-check-git-state:

-git-cleanroot:

-copy-git-state:

git-autoclean:

ivy-availability-check:

ivy-fail:

ivy-configure:
[ivy:configure] :: loading settings :: file = /home/jenkins/workspace/Lucene-Solr-6.0-Linux/lucene/ivy-settings.xml

resolve:

common.init:

compile-lucene-core:

init:

-clover.disable:

-clover.load:

-clover.classpath:

-clover.setup:

clover:

compile-core:
    [mkdir] Created dir: /home/jenkins/workspace/Lucene-Solr-6.0-Linux/lucene/build/codecs/classes/java
    [javac] Compiling 68 source files to /home/jenkins/workspace/Lucene-Solr-6.0-Linux/lucene/build/codecs/classes/java
    [javac] Creating empty /home/jenkins/workspace/Lucene-Solr-6.0-Linux/lucene/build/codecs/classes/java/org/apache/lucene/codecs/bloom/package-info.class
    [javac] Creating empty /home/jenkins/workspace/Lucene-Solr-6.0-Linux/lucene/build/codecs/classes/java/org/apache/lucene/codecs/memory/package-info.class
    [javac] Creating empty /home/jenkins/workspace/Lucene-Solr-6.0-Linux/lucene/build/codecs/classes/java/org/apache/lucene/codecs/simpletext/package-info.class
    [javac] Creating empty /home/jenkins/workspace/Lucene-Solr-6.0-Linux/lucene/build/codecs/classes/java/org/apache/lucene/codecs/blockterms/package-info.class
    [javac] Creating empty /home/jenkins/workspace/Lucene-Solr-6.0-Linux/lucene/build/codecs/classes/java/org/apache/lucene/codecs/blocktreeords/package-info.class
    [javac] Creating empty /home/jenkins/workspace/Lucene-Solr-6.0-Linux/lucene/build/codecs/classes/java/org/apache/lucene/codecs/autoprefix/package-info.class
     [copy] Copying 3 files to /home/jenkins/workspace/Lucene-Solr-6.0-Linux/lucene/build/codecs/classes/java

-clover.disable:

-clover.load:

-clover.classpath:

-clover.setup:

clover:

common.compile-core:
    [mkdir] Created dir: /home/jenkins/workspace/Lucene-Solr-6.0-Linux/lucene/build/test-framework/classes/java
    [javac] Compiling 177 source files to /home/jenkins/workspace/Lucene-Solr-6.0-Linux/lucene/build/test-framework/classes/java
    [javac] Note: Some input files use or override a deprecated API.
    [javac] Note: Recompile with -Xlint:deprecation for details.
    [javac] Creating empty /home/jenkins/workspace/Lucene-Solr-6.0-Linux/lucene/build/test-framework/classes/java/org/apache/lucene/codecs/asserting/package-info.class
    [javac] Creating empty /home/jenkins/workspace/Lucene-Solr-6.0-Linux/lucene/build/test-framework/classes/java/org/apache/lucene/codecs/ramonly/package-info.class
    [javac] Creating empty /home/jenkins/workspace/Lucene-Solr-6.0-Linux/lucene/build/test-framework/classes/java/org/apache/lucene/mockfile/package-info.class
    [javac] Creating empty /home/jenkins/workspace/Lucene-Solr-6.0-Linux/lucene/build/test-framework/classes/java/org/apache/lucene/codecs/cheapbastard/package-info.class
    [javac] Creating empty /home/jenkins/workspace/Lucene-Solr-6.0-Linux/lucene/build/test-framework/classes/java/org/apache/lucene/codecs/mockrandom/package-info.class
    [javac] Creating empty /home/jenkins/workspace/Lucene-Solr-6.0-Linux/lucene/build/test-framework/classes/java/org/apache/lucene/codecs/cranky/package-info.class
    [javac] Creating empty /home/jenkins/workspace/Lucene-Solr-6.0-Linux/lucene/build/test-framework/classes/java/org/apache/lucene/codecs/compressing/dummy/package-info.class
     [copy] Copying 4 files to /home/jenkins/workspace/Lucene-Solr-6.0-Linux/lucene/build/test-framework/classes/java

compile-core:

compile-test:
    [mkdir] Created dir: /home/jenkins/workspace/Lucene-Solr-6.0-Linux/lucene/build/core/classes/test
    [javac] Compiling 421 source files to /home/jenkins/workspace/Lucene-Solr-6.0-Linux/lucene/build/core/classes/test
    [javac] Note: Some input files use or override a deprecated API.
    [javac] Note: Recompile with -Xlint:deprecation for details.
     [copy] Copying 3 files to /home/jenkins/workspace/Lucene-Solr-6.0-Linux/lucene/build/core/classes/test

install-junit4-taskdef:

validate:

resolve-groovy:

-init-totals:

-test:
    [mkdir] Created dir: /home/jenkins/workspace/Lucene-Solr-6.0-Linux/lucene/build/core/test
[loadresource] Do not set property tests.explicitclass as its length is 0.
    [mkdir] Created dir: /home/jenkins/workspace/Lucene-Solr-6.0-Linux/lucene/build/core/test/temp
    [mkdir] Created dir: /home/jenkins/workspace/Lucene-Solr-6.0-Linux/.caches/test-stats/core
   [junit4] <JUnit4> says jolly good day! Master seed: BD5062BD3E69E92B
   [junit4] Executing 414 suites with 3 JVMs.
   [junit4] 
   [junit4] Started J0 PID(7620@localhost).
   [junit4] Started J2 PID(7628@localhost).
   [junit4] Started J1 PID(7619@localhost).
   [junit4] Suite: org.apache.lucene.search.TestSameScoresWithThreads
   [junit4] Completed [1/414] on J1 in 2.14s, 1 test
   [junit4] 
   [junit4] Suite: org.apache.lucene.search.TestMultiTermConstantScore
   [junit4] Completed [2/414] on J0 in 2.78s, 8 tests
   [junit4] 
   [junit4] Suite: org.apache.lucene.index.TestReaderClosed
   [junit4] Completed [3/414] on J0 in 0.08s, 2 tests
   [junit4] 
   [junit4] Suite: org.apache.lucene.search.TestMatchNoDocsQuery
   [junit4] Completed [4/414] on J0 in 0.03s, 2 tests
   [junit4] 
   [junit4] Suite: org.apache.lucene.index.Test2BSortedDocValuesOrds
   [junit4] IGNOR/A 0.02s J0 | Test2BSortedDocValuesOrds.test2BOrds
   [junit4]    > Assumption #1: 'monster' test group is disabled (@Monster(value=Takes ~ 6 hours if the heap is 5gb))
   [junit4] Completed [5/414] on J0 in 0.02s, 1 test, 1 skipped
   [junit4] 
   [junit4] Suite: org.apache.lucene.index.Test2BTerms
   [junit4] IGNOR/A 0.00s J0 | Test2BTerms.test2BTerms
   [junit4]    > Assumption #1: 'monster' test group is disabled (@Monster(value=very slow, use 5g minimum heap))
   [junit4] Completed [6/414] on J0 in 0.00s, 1 test, 1 skipped
   [junit4] 
   [junit4] Suite: org.apache.lucene.store.TestMultiMMap
   [junit4] Completed [7/414] on J2 in 5.05s, 57 tests
   [junit4] 
   [junit4] Suite: org.apache.lucene.index.TestStressAdvance
   [junit4] Completed [8/414] on J1 in 6.75s, 1 test
   [junit4] 
   [junit4] Suite: org.apache.lucene.search.TestPrefixRandom
   [junit4] Completed [9/414] on J1 in 1.01s, 1 test
   [junit4] 
   [junit4] Suite: org.apache.lucene.index.Test2BPostingsBytes
   [junit4] IGNOR/A 0.04s J1 | Test2BPostingsBytes.test
   [junit4]    > Assumption #1: 'monster' test group is disabled (@Monster(value=takes ~20GB-30GB of space and 10 minutes))
   [junit4] Completed [10/414] on J1 in 0.05s, 1 test, 1 skipped
   [junit4] 
   [junit4] Suite: org.apache.lucene.codecs.lucene50.TestLucene50CompoundFormat
   [junit4] Completed [11/414] on J0 in 7.26s, 24 tests
   [junit4] 
   [junit4] Suite: org.apache.lucene.index.TestIndexWriterMerging
   [junit4] Completed [12/414] on J2 in 5.76s, 6 tests
   [junit4] 
   [junit4] Suite: org.apache.lucene.index.TestManyFields
   [junit4] Completed [13/414] on J0 in 1.71s, 3 tests
   [junit4] 
   [junit4] Suite: org.apache.lucene.index.TestDirectoryReader
   [junit4] Completed [14/414] on J2 in 1.27s, 24 tests
   [junit4] 
   [junit4] Suite: org.apache.lucene.util.TestCharsRef
   [junit4] Completed [15/414] on J2 in 0.07s, 5 tests
   [junit4] 
   [junit4] Suite: org.apache.lucene.index.TestAddIndexes
   [junit4] Completed [16/414] on J1 in 3.08s, 23 tests
   [junit4] 
   [junit4] Suite: org.apache.lucene.index.TestIndexWriterCommit
   [junit4] Completed [17/414] on J0 in 2.17s, 13 tests
   [junit4] 
   [junit4] Suite: org.apache.lucene.index.TestRollingUpdates
   [junit4] Completed [18/414] on J2 in 2.91s, 2 tests
   [junit4] 
   [junit4] Suite: org.apache.lucene.util.TestWeakIdentityMap
   [junit4] Completed [19/414] on J0 in 5.74s, 2 tests
   [junit4] 
   [junit4] Suite: org.apache.lucene.util.TestBytesRefHash
   [junit4] Completed [20/414] on J2 in 4.84s, 8 tests
   [junit4] 
   [junit4] Suite: org.apache.lucene.search.TestFuzzyQuery
   [junit4] Completed [21/414] on J2 in 0.23s, 10 tests
   [junit4] 
   [junit4] Suite: org.apache.lucene.index.TestCustomNorms
   [junit4] Completed [22/414] on J0 in 1.47s, 1 test
   [junit4] 
   [junit4] Suite: org.apache.lucene.util.TestRoaringDocIdSet
   [junit4] Completed [23/414] on J0 in 0.15s, 5 tests
   [junit4] 
   [junit4] Suite: org.apache.lucene.index.TestTermVectors
   [junit4] Completed [24/414] on J0 in 0.48s, 3 tests
   [junit4] 
   [junit4] Suite: org.apache.lucene.util.packed.TestDirectPacked
   [junit4] Completed [25/414] on J2 in 1.70s, 4 tests
   [junit4] 
   [junit4] Suite: org.apache.lucene.search.TestBooleanOr
   [junit4] Completed [26/414] on J2 in 2.64s, 7 tests
   [junit4] 
   [junit4] Suite: org.apache.lucene.index.TestIndexWriterOutOfFileDescriptors
   [junit4] Completed [27/414] on J2 in 2.70s, 1 test
   [junit4] 
   [junit4] Suite: org.apache.lucene.index.TestExitableDirectoryReader
   [junit4] Completed [28/414] on J2 in 0.46s, 1 test
   [junit4] 
   [junit4] Suite: org.apache.lucene.search.spans.TestSpanNotQuery
   [junit4] Completed [29/414] on J2 in 0.04s, 3 tests
   [junit4] 
   [junit4] Suite: org.apache.lucene.util.TestStringHelper
   [junit4] Completed [30/414] on J2 in 0.03s, 7 tests
   [junit4] 
   [junit4] Suite: org.apache.lucene.index.TestTermsEnum2
   [junit4] Completed [31/414] on J2 in 1.65s, 4 tests
   [junit4] 
   [junit4] Suite: org.apache.lucene.index.TestIndexableField
   [junit4] Completed [32/414] on J2 in 0.52s, 2 tests
   [junit4] 
   [junit4] Suite: org.apache.lucene.store.TestRateLimiter
   [junit4] Completed [33/414] on J2 in 0.42s, 2 tests
   [junit4] 
   [junit4] Suite: org.apache.lucene.search.TestSearchWithThreads
   [junit4] Completed [34/414] on J2 in 5.92s, 1 test
   [junit4] 
   [junit4] Suite: org.apache.lucene.index.TestDocValues
   [junit4] Completed [35/414] on J2 in 0.09s, 7 tests
   [junit4] 
   [junit4] Suite: org.apache.lucene.search.TestNumericRangeQuery64
   [junit4] Completed [36/414] on J0 in 17.30s, 29 tests
   [junit4] 
   [junit4] Suite: org.apache.lucene.index.TestIndexWriterLockRelease
   [junit4] Completed [37/414] on J0 in 0.03s, 1 test
   [junit4] 
   [junit4] Suite: org.apache.lucene.search.spans.TestSpanOrQuery
   [junit4] Completed [38/414] on J0 in 0.02s, 3 tests
   [junit4] 
   [junit4] Suite: org.apache.lucene.search.similarities.TestSimilarity2
   [junit4] Completed [39/414] on J0 in 0.23s, 8 tests
   [junit4] 
   [junit4] Suite: org.apache.lucene.index.TestCrash
   [junit4] Completed [40/414] on J0 in 0.41s, 5 tests
   [junit4] 
   [junit4] Suite: org.apache.lucene.search.TestLiveFieldValues
   [junit4] Completed [41/414] on J2 in 3.40s, 1 test
   [junit4] 
   [junit4] Suite: org.apache.lucene.analysis.TestNumericTokenStream
   [junit4] Completed [42/414] on J2 in 0.07s, 6 tests
   [junit4] 
   [junit4] Suite: org.apache.lucene.index.TestIndexCommit
   [junit4] Completed [43/414] on J2 in 0.02s, 1 test
   [junit4] 
   [junit4] Suite: org.apache.lucene.search.TestTopDocsCollector
   [junit4] Completed [44/414] on J2 in 0.08s, 8 tests
   [junit4] 
   [junit4] Suite: org.apache.lucene.index.TestIndexWriterDelete
   [junit4] IGNOR/A 0.01s J0 | TestIndexWriterDelete.testApplyDeletesOnFlush
   [junit4]    > Assumption #1: 'nightly' test group is disabled (@Nightly())
   [junit4] IGNOR/A 0.00s J0 | TestIndexWriterDelete.testIndexingThenDeleting
   [junit4]    > Assumption #1: This test cannot run with Memory codec
   [junit4] Completed [45/414] on J0 in 3.62s, 27 tests, 2 skipped
   [junit4] 
   [junit4] Suite: org.apache.lucene.util.TestArrayUtil
   [junit4] Completed [46/414] on J2 in 3.95s, 13 tests
   [junit4] 
   [junit4] Suite: org.apache.lucene.TestExternalCodecs
   [junit4] Completed [47/414] on J2 in 0.52s, 1 test
   [junit4] 
   [junit4] Suite: org.apache.lucene.index.TestTransactions
   [junit4] Completed [48/414] on J2 in 2.09s, 1 test
   [junit4] 
   [junit4] Suite: org.apache.lucene.index.TestLazyProxSkipping
   [junit4] Completed [49/414] on J2 in 0.24s, 2 tests
   [junit4] 
   [junit4] Suite: org.apache.lucene.index.TestOrdinalMap
   [junit4] Completed [50/414] on J2 in 0.13s, 1 test
   [junit4] 
   [junit4] Suite: org.apache.lucene.search.TestComplexExplanations
   [junit4] Completed [51/414] on J2 in 0.83s, 21 tests
   [junit4] 
   [junit4] Suite: org.apache.lucene.util.TestLongBitSet
   [junit4] IGNOR/A 0.01s J2 | TestLongBitSet.testHugeCapacity
   [junit4]    > Assumption #1: 'nightly' test group is disabled (@Nightly())
   [junit4] Completed [52/414] on J2 in 0.42s, 9 tests, 1 skipped
   [junit4] 
   [junit4] Suite: org.apache.lucene.codecs.lucene50.TestForUtil
   [junit4] Completed [53/414] on J2 in 0.04s, 1 test
   [junit4] 
   [junit4] Suite: org.apache.lucene.TestSearchForDuplicates
   [junit4] Completed [54/414] on J2 in 0.30s, 1 test
   [junit4] 
   [junit4] Suite: org.apache.lucene.index.TestTwoPhaseCommitTool
   [junit4] Completed [55/414] on J2 in 0.02s, 3 tests
   [junit4] 
   [junit4] Suite: org.apache.lucene.search.TestElevationComparator
   [junit4] Completed [56/414] on J2 in 0.04s, 1 test
   [junit4] 
   [junit4] Suite: org.apache.lucene.analysis.tokenattributes.TestCharTermAttributeImpl
   [junit4] Completed [57/414] on J2 in 0.73s, 12 tests
   [junit4] 
   [junit4] Suite: org.apache.lucene.index.TestPrefixCodedTerms
   [junit4] Completed [58/414] on J2 in 0.29s, 5 tests
   [junit4] 
   [junit4] Suite: org.apache.lucene.search.TestTotalHitCountCollector
   [junit4] Completed [59/414] on J2 in 0.04s, 1 test
   [junit4] 
   [junit4] Suite: org.apache.lucene.index.TestSwappedIndexFiles
   [junit4] Completed [60/414] on J2 in 0.12s, 1 test
   [junit4] 
   [junit4] Suite: org.apache.lucene.index.TestReaderWrapperDVTypeCheck
   [junit4] Completed [61/414] on J2 in 0.05s, 1 test
   [junit4] 
   [junit4] Suite: org.apache.lucene.index.TestPointValues
   [junit4] Completed [62/414] on J0 in 7.00s, 32 tests
   [junit4] 
   [junit4] Suite: org.apache.lucene.index.TestMixedCodecs
   [junit4] Completed [63/414] on J2 in 1.07s, 1 test
   [junit4] 
   [junit4] Suite: org.apache.lucene.util.TestAttributeSource
   [junit4] Completed [64/414] on J2 in 0.02s, 7 tests
   [junit4] 
   [junit4] Suite: org.apache.lucene.store.TestDirectory
   [junit4] Completed [65/414] on J2 in 0.83s, 3 tests
   [junit4] 
   [junit4] Suite: org.apache.lucene.index.TestDeletionPolicy
   [junit4] Completed [66/414] on J0 in 3.05s, 6 tests
   [junit4] 
   [junit4] Suite: org.apache.lucene.index.TestIndexWriterDeleteByQuery
   [junit4] Completed [67/414] on J0 in 0.04s, 1 test
   [junit4] 
   [junit4] Suite: org.apache.lucene.search.TestUsageTrackingFilterCachingPolicy
   [junit4] Completed [68/414] on J0 in 0.02s, 2 tests
   [junit4] 
   [junit4] Suite: org.apache.lucene.index.TestPerSegmentDeletes
   [junit4] Completed [69/414] on J0 in 0.07s, 1 test
   [junit4] 
   [junit4] Suite: org.apache.lucene.util.TestUnicodeUtil
   [junit4] Completed [70/414] on J0 in 0.91s, 5 tests
   [junit4] 
   [junit4] Suite: org.apache.lucene.util.TestCloseableThreadLocal
   [junit4] Completed [71/414] on J0 in 0.03s, 3 tests
   [junit4] 
   [junit4] Suite: org.apache.lucene.index.TestIndexWriterMergePolicy
   [junit4] Completed [72/414] on J0 in 3.16s, 7 tests
   [junit4] 
   [junit4] Suite: org.apache.lucene.index.TestNRTReaderCleanup
   [junit4] Completed [73/414] on J0 in 0.06s, 1 test
   [junit4] 
   [junit4] Suite: org.apache.lucene.search.TestTermRangeQuery
   [junit4] Completed [74/414] on J0 in 0.11s, 7 tests
   [junit4] 
   [junit4] Suite: org.apache.lucene.index.TestMultiDocValues
   [junit4] Completed [75/414] on J0 in 0.43s, 8 tests
   [junit4] 
   [junit4] Suite: org.apache.lucene.index.TestTryDelete
   [junit4] Completed [76/414] on J0 in 0.03s, 3 tests
   [junit4] 
   [junit4] Suite: org.apache.lucene.search.TestNGramPhraseQuery
   [junit4] Completed [77/414] on J0 in 0.02s, 1 test
   [junit4] 
   [junit4] Suite: org.apache.lucene.store.TestBufferedChecksum
   [junit4] Completed [78/414] on J0 in 0.13s, 2 tests
   [junit4] 
   [junit4] Suite: org.apache.lucene.search.spans.TestFilterSpans
   [junit4] Completed [79/414] on J0 in 0.02s, 1 test
   [junit4] 
   [junit4] Suite: org.apache.lucene.search.TestPrefixQuery
   [junit4] Completed [80/414] on J2 in 7.99s, 3 tests
   [junit4] 
   [junit4] Suite: org.apache.lucene.search.TestMultiThreadTermVectors
   [junit4] Completed [82/414] on J2 in 2.04s, 1 test
   [junit4] 
   [junit4] Suite: org.apache.lucene.index.TestMergePolicyWrapper
   [junit4] Completed [83/414] on J2 in 0.01s, 1 test
   [junit4] 
   [junit4] Suite: org.apache.lucene.util.TestBytesRefArray
   [junit4] Completed [84/414] on J2 in 0.10s, 2 tests
   [junit4] 
   [junit4] Suite: org.apache.lucene.index.TestIndexInput
   [junit4] Completed [85/414] on J2 in 3.01s, 2 tests
   [junit4] 
   [junit4] Suite: org.apache.lucene.codecs.compressing.TestFastCompressionMode
   [junit4] Completed [86/414] on J2 in 1.31s, 11 tests
   [junit4] 
   [junit4] Suite: org.apache.lucene.codecs.perfield.TestPerFieldPostingsFormat
   [junit4] IGNOR/A 0.00s J0 | TestPerFieldPostingsFormat.testPostingsEnumReuse
   [junit4]    > Assumption #1: The MockRandom PF randomizes content on the fly, so we can't check it
   [junit4] IGNOR/A 0.00s J0 | TestPerFieldPostingsFormat.testMergeStability
   [junit4]    > Assumption #1: The MockRandom PF randomizes content on the fly, so we can't check it
   [junit4] Completed [87/414] on J0 in 8.43s, 24 tests, 2 skipped
   [junit4] 
   [junit4] Suite: org.apache.lucene.index.TestAllFilesHaveChecksumFooter
   [junit4] Completed [88/414] on J0 in 0.53s, 1 test
   [junit4] 
   [junit4] Suite: org.apache.lucene.util.mutable.TestMutableValues
   [junit4] Completed [89/414] on J0 in 0.03s, 6 tests
   [junit4] 
   [junit4] Suite: org.apache.lucene.index.TestNorms
   [junit4] Completed [90/414] on J2 in 1.49s, 2 tests
   [junit4] 
   [junit4] Suite: org.apache.lucene.index.Test2BPositions
   [junit4] IGNOR/A 0.00s J2 | Test2BPositions.test
   [junit4]    > Assumption #1: 'monster' test group is disabled (@Monster(value=uses lots of space and takes a few minutes))
   [junit4] Completed [91/414] on J2 in 0.00s, 1 test, 1 skipped
   [junit4] 
   [junit4] Suite: org.apache.lucene.index.TestLogMergePolicy
   [junit4] Completed [92/414] on J2 in 0.06s, 2 tests
   [junit4] 
   [junit4] Suite: org.apache.lucene.store.TestSingleInstanceLockFactory
   [junit4] Completed [93/414] on J2 in 1.21s, 7 tests
   [junit4] 
   [junit4] Suite: org.apache.lucene.codecs.lucene50.TestLucene50SegmentInfoFormat
   [junit4] Completed [94/414] on J2 in 0.31s, 15 tests
   [junit4] 
   [junit4] Suite: org.apache.lucene.index.TestTermVectorsReader
   [junit4] Completed [95/414] on J2 in 0.14s, 13 tests
   [junit4] 
   [junit4] Suite: org.apache.lucene.search.TestAutomatonQuery
   [junit4] Completed [96/414] on J0 in 4.55s, 8 tests
   [junit4] 
   [junit4] Suite: org.apache.lucene.index.TestIndexReaderClose
   [junit4] Completed [97/414] on J2 in 2.66s, 2 tests
   [junit4] 
   [junit4] Suite: org.apache.lucene.util.TestIntroSorter
   [junit4] Completed [98/414] on J0 in 0.09s, 9 tests
   [junit4] 
   [junit4] Suite: org.apache.lucene.search.TestTermScorer
   [junit4] Completed [99/414] on J0 in 0.06s, 4 tests
   [junit4] 
   [junit4] Suite: org.apache.lucene.index.Test4GBStoredFields
   [junit4] IGNOR/A 0.00s J0 | Test4GBStoredFields.test
   [junit4]    > Assumption #1: 'nightly' test group is disabled (@Nightly())
   [junit4] Completed [100/414] on J0 in 0.00s, 1 test, 1 skipped
   [junit4] 
   [junit4] Suite: org.apache.lucene.index.TestNewestSegment
   [junit4] Completed [101/414] on J0 in 0.02s, 1 test
   [junit4] 
   [junit4] Suite: org.apache.lucene.search.spans.TestSpans
   [junit4] Completed [102/414] on J2 in 0.47s, 26 tests
   [junit4] 
   [junit4] Suite: org.apache.lucene.search.TestReqExclBulkScorer
   [junit4] Completed [103/414] on J0 in 0.03s, 1 test
   [junit4] 
   [junit4] Suite: org.apache.lucene.index.TestFilterLeafReader
   [junit4] Completed [104/414] on J0 in 0.05s, 3 tests
   [junit4] 
   [junit4] Suite: org.apache.lucene.search.TestSloppyPhraseQuery
   [junit4] Completed [105/414] on J2 in 0.89s, 9 tests
   [junit4] 
   [junit4] Suite: org.apache.lucene.search.TestConjunctions
   [junit4] Completed [106/414] on J2 in 0.02s, 1 test
   [junit4] 
   [junit4] Suite: org.apache.lucene.util.TestNotDocIdSet
   [junit4] Completed [107/414] on J2 in 0.28s, 6 tests
   [junit4] 
   [junit4] Suite: org.apache.lucene.util.TestFixedBitSet
   [junit4] Completed [108/414] on J0 in 7.44s, 19 tests
   [junit4] 
   [junit4] Suite: org.apache.lucene.index.TestDemoParallelLeafReader
   [junit4] Completed [109/414] on J0 in 4.16s, 5 tests
   [junit4] 
   [junit4] Suite: org.apache.lucene.store.TestSimpleFSDirectory
   [junit4] Completed [110/414] on J0 in 1.16s, 45 tests
   [junit4] 
   [junit4] Suite: org.apache.lucene.index.TestNoDeletionPolicy
   [junit4] Completed [111/414] on J0 in 0.08s, 4 tests
   [junit4] 
   [junit4] Suite: org.apache.lucene.index.TestBagOfPositions
   [junit4] Completed [112/414] on J2 in 14.64s, 1 test
   [junit4] 
   [junit4] Suite: org.apache.lucene.search.TestNot
   [junit4] Completed [113/414] on J2 in 0.04s, 1 test
   [junit4] 
   [junit4] Suite: org.apache.lucene.search.TestSearcherManager
   [junit4] Completed [114/414] on J0 in 4.83s, 10 tests
   [junit4] 
   [junit4] Suite: org.apache.lucene.index.TestUniqueTermCount
   [junit4] Completed [115/414] on J0 in 0.06s, 1 test
   [junit4] 
   [junit4] Suite: org.apache.lucene.search.TestConstantScoreQuery
   [junit4] Completed [116/414] on J0 in 0.06s, 5 tests
   [junit4] 
   [junit4] Suite: org.apache.lucene.search.TestTopDocsMerge
   [junit4] Completed [117/414] on J2 in 2.51s, 2 tests
   [junit4] 
   [junit4] Suite: org.apache.lucene.index.TestMultiFields
   [junit4] Completed [118/414] on J0 in 2.50s, 3 tests
   [junit4] 
   [junit4] Suite: org.apache.lucene.search.TestBooleanRewrites
   [junit4] Completed [119/414] on J0 in 0.36s, 7 tests
   [junit4] 
   [junit4] Suite: org.apache.lucene.util.bkd.TestBKD
   [junit4] IGNOR/A 0.00s J2 | TestBKD.testRandomBinaryBig
   [junit4]    > Assumption #1: 'nightly' test group is disabled (@Nightly())
   [junit4] Completed [120/414] on J2 in 4.24s, 14 tests, 1 skipped
   [junit4] 
   [junit4] Suite: org.apache.lucene.index.TestIndexFileDeleter
   [junit4] Completed [121/414] on J2 in 0.92s, 10 tests
   [junit4] 
   [junit4] Suite: org.apache.lucene.index.TestIndexWriterUnicode
   [junit4] Completed [122/414] on J0 in 6.50s, 5 tests
   [junit4] 
   [junit4] Suite: org.apache.lucene.index.TestPersistentSnapshotDeletionPolicy
   [junit4] Completed [123/414] on J0 in 1.33s, 13 tests
   [junit4] 
   [junit4] Suite: org.apache.lucene.index.TestIndexWriterReader
   [junit4] IGNOR/A 0.00s J2 | TestIndexWriterReader.testDuringAddIndexes
   [junit4]    > Assumption #1: 'nightly' test group is disabled (@Nightly())
   [junit4] Completed [124/414] on J2 in 5.84s, 23 tests, 1 skipped
   [junit4] 
   [junit4] Suite: org.apache.lucene.util.TestIntArrayDocIdSet
   [junit4] Completed [125/414] on J2 in 0.20s, 5 tests
   [junit4] 
   [junit4] Suite: org.apache.lucene.search.TestSynonymQuery
   [junit4] Completed [126/414] on J2 in 0.03s, 4 tests
   [junit4] 
   [junit4] Suite: org.apache.lucene.index.Test2BNumericDocValues
   [junit4] IGNOR/A 0.00s J2 | Test2BNumericDocValues.testNumerics
   [junit4]    > Assumption #1: 'monster' test group is disabled (@Monster(value=takes ~ 2 hours if the heap is 5gb))
   [junit4] Completed [127/414] on J2 in 0.00s, 1 test, 1 skipped
   [junit4] 
   [junit4] Suite: org.apache.lucene.search.TestPhraseQuery
   [junit4] Completed [128/414] on J0 in 1.45s, 21 tests
   [junit4] 
   [junit4] Suite: org.apache.lucene.analysis.TestCharFilter
   [junit4] Completed [129/414] on J0 in 0.03s, 4 tests
   [junit4] 
   [junit4] Suite: org.apache.lucene.index.TestForceMergeForever
   [junit4] Completed [130/414] on J2 in 0.55s, 1 test
   [junit4] 
   [junit4] Suite: org.apache.lucene.index.TestMaxTermFrequency
   [junit4] Completed [131/414] on J2 in 0.18s, 1 test
   [junit4] 
   [junit4] Suite: org.apache.lucene.index.TestIndexWriterForceMerge
   [junit4] Completed [132/414] on J0 in 1.16s, 4 tests
   [junit4] 
   [junit4] Suite: org.apache.lucene.index.TestDuelingCodecsAtNight
   [junit4] IGNOR/A 0.00s J0 | TestDuelingCodecsAtNight.testCrazyReaderEquals
   [junit4]    > Assumption #1: 'nightly' test group is disabled (@Nightly())
   [junit4] IGNOR/A 0.00s J0 | TestDuelingCodecsAtNight.testEquals
   [junit4]    > Assumption #1: 'nightly' test group is disabled (@Nightly())
   [junit4] IGNOR/A 0.00s J0 | TestDuelingCodecsAtNight.testBigEquals
   [junit4]    > Assumption #1: 'nightly' test group is disabled (@Nightly())
   [junit4] Completed [133/414] on J0 in 0.01s, 3 tests, 3 skipped
   [junit4] 
   [junit4] Suite: org.apache.lucene.util.automaton.TestRegExp
   [junit4] Completed [134/414] on J0 in 0.15s, 5 tests
   [junit4] 
   [junit4] Suite: org.apache.lucene.util.TestRecyclingByteBlockAllocator
   [junit4] Completed [135/414] on J0 in 0.05s, 3 tests
   [junit4] 
   [junit4] Suite: org.apache.lucene.util.TestPagedBytes
   [junit4] Completed [136/414] on J0 in 9.36s, 4 tests, 1 skipped
   [junit4] 
   [junit4] Suite: org.apache.lucene.util.TestMathUtil
   [junit4] Completed [137/414] on J0 in 0.02s, 5 tests
   [junit4] 
   [junit4] Suite: org.apache.lucene.codecs.compressing.TestHighCompressionMode
   [junit4] Completed [138/414] on J0 in 1.68s, 7 tests
   [junit4] 
   [junit4] Suite: org.apache.lucene.util.TestFilterIterator
   [junit4] Completed [139/414] on J0 in 0.03s, 8 tests
   [junit4] 
   [junit4] Suite: org.apache.lucene.index.TestIndexWriter
   [junit4] Completed [140/414] on J0 in 6.83s, 71 tests
   [junit4] 
   [junit4] Suite: org.apache.lucene.store.TestSleepingLockWrapper
   [junit4] Completed [141/414] on J0 in 7.69s, 6 tests
   [junit4] 
   [junit4] Suite: org.apache.lucene.util.TestTimSorter
   [junit4] Completed [142/414] on J0 in 0.08s, 9 tests
   [junit4] 
   [junit4] Suite: org.apache.lucene.codecs.lucene53.TestLucene53NormsFormat
   [junit4] IGNOR/A 0.00s J0 | TestLucene53NormsFormat.testMergeStability
   [junit4]    > Assumption #1: The MockRandom PF randomizes content on the fly, so we can't check it
   [junit4] IGNOR/A 0.00s J0 | TestLucene53NormsFormat.testNCommonBig
   [junit4]    > Assumption #1: 'nightly' test group is disabled (@Nightly())
   [junit4] Completed [143/414] on J0 in 9.80s, 17 tests, 2 skipped
   [junit4] 
   [junit4] Suite: org.apache.lucene.index.TestDocCount
   [junit4] Completed [144/414] on J0 in 0.07s, 1 test
   [junit4] 
   [junit4] Suite: org.apache.lucene.codecs.perfield.TestPerFieldDocValuesFormat
   [junit4] Completed [145/414] on J2 in 36.58s, 96 tests
   [junit4] 
   [junit4] Suite: org.apache.lucene.util.fst.TestBytesStore
   [junit4] Completed [146/414] on J0 in 2.37s, 1 test
   [junit4] 
   [junit4] Suite: org.apache.lucene.index.TestIndexWriterWithThreads
   [junit4] IGNOR/A 0.03s J2 | TestIndexWriterWithThreads.testOpenTwoIndexWritersOnDifferentThreads
   [junit4]    > Assumption #1: aborting test: timeout obtaining lock
   [junit4] Completed [147/414] on J2 in 2.93s, 12 tests, 1 skipped
   [junit4] 
   [junit4] Suite: org.apache.lucene.search.TestNumericRangeQuery32
   [junit4] Completed [148/414] on J0 in 6.05s, 23 tests
   [junit4] 
   [junit4] Suite: org.apache.lucene.search.spans.TestBasics
   [junit4] Completed [149/414] on J0 in 4.17s, 25 tests
   [junit4] 
   [junit4] Suite: org.apache.lucene.search.TestShardSearching
   [junit4] Completed [150/414] on J2 in 12.08s, 1 test
   [junit4] 
   [junit4] Suite: org.apache.lucene.index.TestFlushByRamOrCountsPolicy
   [junit4] Completed [151/414] on J0 in 2.31s, 5 tests
   [junit4] 
   [junit4] Suite: org.apache.lucene.search.TestBoolean2
   [junit4] Completed [152/414] on J0 in 5.58s, 11 tests
   [junit4] 
   [junit4] Suite: org.apache.lucene.index.TestNRTThreads
   [junit4] Completed [153/414] on J2 in 6.21s, 1 test
   [junit4] 
   [junit4] Suite: org.apache.lucene.index.TestAtomicUpdate
   [junit4] Completed [154/414] on J0 in 3.81s, 1 test
   [junit4] 
   [junit4] Suite: org.apache.lucene.search.TestTimeLimitingCollector
   [junit4] Completed [155/414] on J2 in 3.62s, 7 tests
   [junit4] 
   [junit4] Suite: org.apache.lucene.index.TestConcurrentMergeScheduler
   [junit4] Completed [156/414] on J0 in 2.24s, 16 tests
   [junit4] 
   [junit4] Suite: org.apache.lucene.index.TestDocumentsWriterStallControl
   [junit4] Completed [157/414] on J2 in 4.65s, 3 tests
   [junit4] 
   [junit4] Suite: org.apache.lucene.index.TestNeverDelete
   [junit4] Completed [158/414] on J0 in 3.18s, 1 test
   [junit4] 
   [junit4] Suite: org.apache.lucene.index.TestStressIndexing
   [junit4] Completed [159/414] on J0 in 4.24s, 1 test
   [junit4] 
   [junit4] Suite: org.apache.lucene.index.TestLongPostings
   [junit4] Completed [160/414] on J2 in 5.82s, 2 tests
   [junit4] 
   [junit4] Suite: org.apache.lucene.index.TestNRTReaderWithThreads
   [junit4] Completed [161/414] on J2 in 1.21s, 1 test
   [junit4] 
   [junit4] Suite: org.apache.lucene.util.automaton.TestMinimize
   [junit4] Completed [162/414] on J0 in 2.19s, 3 tests
   [junit4] 
   [junit4] Suite: org.apache.lucene.util.automaton.TestLevenshteinAutomata
   [junit4] Completed [163/414] on J0 in 1.81s, 4 tests
   [junit4] 
   [junit4] Suite: org.apache.lucene.index.TestTieredMergePolicy
   [junit4] Completed [164/414] on J2 in 5.81s, 6 tests
   [junit4] 
   [junit4] Suite: org.apache.lucene.store.TestBufferedIndexInput
   [junit4] Completed [165/414] on J2 in 0.61s, 4 tests
   [junit4] 
   [junit4] Suite: org.apache.lucene.index.TestByteSlices
   [junit4] Completed [166/414] on J0 in 6.49s, 1 test
   [junit4] 
   [junit4] Suite: org.apache.lucene.index.TestConsistentFieldNumbers
   [junit4] Completed [167/414] on J0 in 4.02s, 4 tests
   [junit4] 
   [junit4] Suite: org.apache.lucene.store.TestLockFactory
   [junit4] Completed [168/414] on J0 in 0.04s, 2 tests
   [junit4] 
   [junit4] Suite: org.apache.lucene.index.TestSegmentMerger
   [junit4] Completed [169/414] on J0 in 0.84s, 3 tests
   [junit4] 
   [junit4] Suite: org.apache.lucene.index.TestOmitNorms
   [junit4] Completed [170/414] on J0 in 0.58s, 5 tests
   [junit4] 
   [junit4] Suite: org.apache.lucene.search.TestRegexpRandom2
   [junit4] Completed [171/414] on J0 in 8.31s, 1 test
   [junit4] 
   [junit4] Suite: org.apache.lucene.store.TestNRTCachingDirectory
   [junit4] IGNOR/A 0.00s J0 | TestNRTCachingDirectory.testFsyncDoesntCreateNewFiles
   [junit4]    > Assumption #1: test only works for FSDirectory subclasses
   [junit4] IGNOR/A 0.00s J0 | TestNRTCachingDirectory.testPendingDeletions
   [junit4]    > Assumption #1: we can only install VirusCheckingFS on an FSDirectory
   [junit4] Completed [172/414] on J0 in 1.80s, 47 tests, 2 skipped
   [junit4] 
   [junit4] Suite: org.apache.lucene.index.TestSegmentReader
   [junit4] Completed [173/414] on J0 in 0.95s, 7 tests
   [junit4] 
   [junit4] Suite: org.apache.lucene.codecs.compressing.TestFastDecompressionMode
   [junit4] Completed [174/414] on J0 in 3.30s, 11 tests
   [junit4] 
   [junit4] Suite: org.apache.lucene.index.TestParallelCompositeReader
   [junit4] Completed [175/414] on J0 in 0.39s, 15 tests
   [junit4] 
   [junit4] Suite: org.apache.lucene.search.TestFieldCacheRewriteMethod
   [junit4] Completed [176/414] on J0 in 2.40s, 2 tests
   [junit4] 
   [junit4] Suite: org.apache.lucene.search.TestSort
   [junit4] Completed [177/414] on J0 in 0.13s, 25 tests
   [junit4] 
   [junit4] Suite: org.apache.lucene.analysis.TestToken
   [junit4] Completed [178/414] on J0 in 0.02s, 5 tests
   [junit4] 
   [junit4] Suite: org.apache.lucene.search.TestSimpleSearchEquivalence
   [junit4] Completed [179/414] on J0 in 0.75s, 17 tests
   [junit4] 
   [junit4] Suite: org.apache.lucene.search.TestCustomSearcherSort
   [junit4] Completed [180/414] on J0 in 1.46s, 2 tests
   [junit4] 
   [junit4] Suite: org.apache.lucene.index.TestDocValuesIndexing
   [junit4] Completed [181/414] on J0 in 0.22s, 34 tests
   [junit4] 
   [junit4] Suite: org.apache.lucene.search.similarities.TestSimilarityBase
   [junit4] Completed [182/414] on J0 in 1.16s, 32 tests
   [junit4] 
   [junit4] Suite: org.apache.lucene.search.TestBooleanMinShouldMatch
   [junit4] Completed [183/414] on J0 in 2.38s, 17 tests
   [junit4] 
   [junit4] Suite: org.apache.lucene.util.automaton.TestDeterminizeLexicon
   [junit4] Completed [184/414] on J0 in 2.53s, 1 test
   [junit4] 
   [junit4] Suite: org.apache.lucene.index.TestIndexWriterOnDiskFull
   [junit4] Completed [185/414] on J0 in 0.33s, 4 tests
   [junit4] 
   [junit4] Suite: org.apache.lucene.index.TestPostingsOffsets
   [junit4] Completed [186/414] on J0 in 1.42s, 13 tests
   [junit4] 
   [junit4] Suite: org.apache.lucene.index.TestTransactionRollback
   [junit4] Completed [187/414] on J0 in 0.09s, 2 tests
   [junit4] 
   [junit4] Suite: org.apache.lucene.util.automaton.TestUTF32ToUTF8
   [junit4] Completed [188/414] on J0 in 16.80s, 6 tests
   [junit4] 
   [junit4] Suite: org.apache.lucene.index.TestStressIndexing2
   [junit4] Completed [189/414] on J0 in 0.42s, 3 tests
   [junit4] 
   [junit4] Suite: org.apache.lucene.search.TestMultiPhraseQuery
   [junit4] Completed [190/414] on J0 in 0.17s, 17 tests, 1 skipped
   [junit4] 
   [junit4] Suite: org.apache.lucene.util.automaton.TestDeterminism
   [junit4] Completed [191/414] on J0 in 0.80s, 2 tests
   [junit4] 
   [junit4] Suite: org.apache.lucene.TestMergeSchedulerExternal
   [junit4] Completed [192/414] on J0 in 0.53s, 2 tests
   [junit4] 
   [junit4] Suite: org.apache.lucene.index.TestBagOfPostings
   [junit4] Completed [193/414] on J0 in 5.33s, 1 test
   [junit4] 
   [junit4] Suite: org.apache.lucene.index.TestTermVectorsWriter
   [junit4] Completed [194/414] on J0 in 0.30s, 15 tests
   [junit4] 
   [junit4] Suite: org.apache.lucene.index.TestCodecs
   [junit4] Completed [195/414] on J0 in 0.39s, 3 tests
   [junit4] 
   [junit4] Suite: org.apache.lucene.index.TestOmitPositions
   [junit4] Completed [196/414] on J0 in 0.19s, 4 tests
   [junit4] 
   [junit4] Suite: org.apache.lucene.index.TestParallelLeafReader
   [junit4] Completed [197/414] on J0 in 0.09s, 7 tests
   [junit4] 
   [junit4] Suite: org.apache.lucene.index.TestThreadedForceMerge
   [junit4] Completed [198/414] on J0 in 0.41s, 1 test
   [junit4] 
   [junit4] Suite: org.apache.lucene.index.TestStressNRT
   [junit4] Completed [199/414] on J0 in 0.71s, 1 test
   [junit4] 
   [junit4] HEARTBEAT J2 PID(7628@localhost): 2016-05-26T12:31:25, stalled for 66.5s at: TestTermsEnum.testVaryingTermsPerSegment
   [junit4] Suite: org.apache.lucene.search.TestSloppyPhraseQuery2
   [junit4] Completed [200/414] on J0 in 1.01s, 9 tests
   [junit4] 
   [junit4] Suite: org.apache.lucene.search.TestDisjunctionMaxQuery
   [junit4] Completed [201/414] on J0 in 0.30s, 11 tests
   [junit4] 
   [junit4] Suite: org.apache.lucene.search.spans.TestNearSpansOrdered
   [junit4] Completed [202/414] on J0 in 0.22s, 19 tests
   [junit4] 
   [junit4] Suite: org.apache.lucene.codecs.lucene54.TestLucene54DocValuesFormat
   [junit4] IGNOR/A 0.00s J1 | TestLucene54DocValuesFormat.testTermsEnumRandomMany
   [junit4]    > Assumption #1: 'nightly' test group is disabled (@Nightly())
   [junit4] IGNOR/A 0.00s J1 | TestLucene54DocValuesFormat.testSortedSetVariableLengthManyVsStoredFields
   [junit4]    > Assumption #1: 'nightly' test group is disabled (@Nightly())
   [junit4] IGNOR/A 0.00s J1 | TestLucene54DocValuesFormat.testSortedVariableLengthManyVsStoredFields
   [junit4]    > Assumption #1: 'nightly' test group is disabled (@Nightly())
   [junit4] Completed [203/414] on J1 in 239.12s, 109 tests, 3 skipped
   [junit4] 
   [junit4] Suite: org.apache.lucene.index.TestOmitTf
   [junit4] Completed [204/414] on J1 in 0.33s, 6 tests
   [junit4] 
   [junit4] Suite: org.apache.lucene.index.TestDocumentWriter
   [junit4] Completed [205/414] on J0 in 0.25s, 6 tests
   [junit4] 
   [junit4] Suite: org.apache.lucene.index.TestCrashCausesCorruptIndex
   [junit4] Completed [206/414] on J0 in 0.09s, 1 test
   [junit4] 
   [junit4] Suite: org.apache.lucene.index.TestIndexWriterExceptions2
   [junit4] Completed [207/414] on J1 in 8.03s, 1 test
   [junit4] 
   [junit4] Suite: org.apache.lucene.util.TestVersion
   [junit4] Completed [208/414] on J1 in 0.06s, 11 tests
   [junit4] 
   [junit4] Suite: org.apache.lucene.index.TestDocInverterPerFieldErrorInfo
   [junit4] Completed [209/414] on J1 in 0.05s, 2 tests
   [junit4] 
   [junit4] Suite: org.apache.lucene.util.TestRollingBuffer
   [junit4] Completed [210/414] on J1 in 0.56s, 1 test
   [junit4] 
   [junit4] Suite: org.apache.lucene.index.TestUpgradeIndexMergePolicy
   [junit4] Completed [211/414] on J1 in 0.03s, 1 test
   [junit4] 
   [junit4] Suite: org.apache.lucene.search.TestSimilarity
   [junit4] Completed [212/414] on J1 in 0.02s, 1 test
   [junit4] 
   [junit4] Suite: org.apache.lucene.index.TestInfoStream
   [junit4] Completed [213/414] on J1 in 0.02s, 2 tests
   [junit4] 
   [junit4] Suite: org.apache.lucene.store.TestFilterDirectory
   [junit4] IGNOR/A 0.00s J1 | TestFilterDirectory.testFsyncDoesntCreateNewFiles
   [junit4]    > Assumption #1: test only works for FSDirectory subclasses
   [junit4] IGNOR/A 0.00s J1 | TestFilterDirectory.testPendingDeletions
   [junit4]    > Assumption #1: we can only install VirusCheckingFS on an FSDirectory
   [junit4] Completed [214/414] on J1 in 1.16s, 47 tests, 2 skipped
   [junit4] 
   [junit4] Suite: org.apache.lucene.search.spans.TestSpanTermQuery
   [junit4] Completed [215/414] on J1 in 0.03s, 2 tests
   [junit4] 
   [junit4] Suite: org.apache.lucene.search.TestScorerPerf
   [junit4] Completed [216/414] on J0 in 10.71s, 1 test
   [junit4] 
   [junit4] Suite: org.apache.lucene.index.TestForTooMuchCloning
   [junit4] Completed [217/414] on J0 in 0.09s, 1 test
   [junit4] 
   [junit4] Suite: org.apache.lucene.index.TestDoc
   [junit4] Completed [218/414] on J0 in 0.14s, 1 test
   [junit4] 
   [junit4] Suite: org.apache.lucene.index.TestDirectoryReaderReopen
   [junit4] Completed [219/414] on J1 in 1.67s, 9 tests
   [junit4] 
   [junit4] Suite: org.apache.lucene.search.TestWildcard
   [junit4] Completed [220/414] on J0 in 0.08s, 8 tests
   [junit4] 
   [junit4] Suite: org.apache.lucene.search.spans.TestFieldMaskingSpanQuery
   [junit4] IGNOR/A 0.00s J0 | TestFieldMaskingSpanQuery.testSpans2
   [junit4]    > Assumption #1: Broken scoring: LUCENE-3723
   [junit4] IGNOR/A 0.00s J0 | TestFieldMaskingSpanQuery.testSimple2
   [junit4]    > Assumption #1: Broken scoring: LUCENE-3723
   [junit4] Completed [221/414] on J0 in 0.18s, 11 tests, 2 skipped
   [junit4] 
   [junit4] Suite: org.apache.lucene.search.TestSimpleExplanationsOfNonMatches
   [junit4] Completed [222/414] on J0 in 0.08s, 68 tests
   [junit4] 
   [junit4] Suite: org.apache.lucene.search.TestRegexpQuery
   [junit4] Completed [223/414] on J0 in 0.08s, 7 tests
   [junit4] 
   [junit4] Suite: org.apache.lucene.search.TestMultiValuedNumericRangeQuery
   [junit4] Completed [224/414] on J0 in 0.92s, 1 test
   [junit4] 
   [junit4] Suite: org.apache.lucene.index.TestIndexWriterNRTIsCurrent
   [junit4] Completed [225/414] on J1 in 2.40s, 1 test
   [junit4] 
   [junit4] Suite: org.apache.lucene.index.TestIntBlockPool
   [junit4] Completed [226/414] on J0 in 0.62s, 2 tests
   [junit4] 
   [junit4] Suite: org.apache.lucene.search.TestPrefixInBooleanQuery
   [junit4] Completed [227/414] on J0 in 0.49s, 4 tests
   [junit4] 
   [junit4] Suite: org.apache.lucene.search.TestComplexExplanationsOfNonMatches
   [junit4] Completed [228/414] on J0 in 0.06s, 21 tests
   [junit4] 
   [junit4] Suite: org.apache.lucene.index.TestSnapshotDeletionPolicy
   [junit4] Completed [229/414] on J1 in 1.42s, 7 tests
   [junit4] 
   [junit4] Suite: org.apache.lucene.search.TestSortRandom
   [junit4] Completed [230/414] on J0 in 0.50s, 2 tests
   [junit4] 
   [junit4] Suite: org.apache.lucene.index.TestParallelReaderEmptyIndex
   [junit4] Completed [231/414] on J0 in 0.04s, 2 tests
   [junit4] 
   [junit4] Suite: org.apache.lucene.index.TestDocsAndPositions
   [junit4] Completed [232/414] on J1 in 1.33s, 6 tests
   [junit4] 
   [junit4] Suite: org.apache.lucene.index.TestIndexWriterOnJRECrash
   [junit4] IGNOR/A 0.00s J1 | TestIndexWriterOnJRECrash.testNRTThreads
   [junit4]    > Assumption #1: 'nightly' test group is disabled (@Nightly())
   [junit4] Completed [233/414] on J1 in 0.00s, 1 test, 1 skipped
   [junit4] 
   [junit4] Suite: org.apache.lucene.store.TestFileSwitchDirectory
   [junit4] IGNOR/A 0.01s J0 | TestFileSwitchDirectory.testPendingDeletions
   [junit4]    > Assumption #1: we can only install VirusCheckingFS on an FSDirectory
   [junit4] IGNOR/A 0.01s J0 | TestFileSwitchDirectory.testFsyncDoesntCreateNewFiles
   [junit4]    > Assumption #1: test only works for FSDirectory subclasses
   [junit4] Completed [234/414] on J0 in 1.26s, 46 tests, 2 skipped
   [junit4] 
   [junit4] Suite: org.apache.lucene.index.TestSumDocFreq
   [junit4] Completed [235/414] on J0 in 0.30s, 1 test
   [junit4] 
   [junit4] Suite: org.apache.lucene.search.TestDocValuesScoring
   [junit4] Completed [236/414] on J0 in 0.08s, 1 test
   [junit4] 
   [junit4] Suite: org.apache.lucene.util.TestSentinelIntSet
   [junit4] Completed [237/414] on J0 in 0.11s, 2 tests
   [junit4] 
   [junit4] Suite: org.apache.lucene.search.TestWildcardRandom
   [junit4] Completed [238/414] on J0 in 0.13s, 1 test
   [junit4] 
   [junit4] Suite: org.apache.lucene.search.spans.TestSpanSearchEquivalence
   [junit4] Completed [239/414] on J1 in 2.06s, 33 tests
   [junit4] 
   [junit4] Suite: org.apache.lucene.search.TestRegexpRandom
   [junit4] Completed [240/414] on J0 in 0.18s, 1 test
   [junit4] 
   [junit4] Suite: org.apache.lucene.index.TestMultiLevelSkipList
   [junit4] Completed [241/414] on J0 in 0.11s, 1 test
   [junit4] 
   [junit4] Suite: org.apache.lucene.index.TestSegmentTermDocs
   [junit4] Completed [242/414] on J1 in 0.46s, 4 tests
   [junit4] 
   [junit4] Suite: org.apache.lucene.index.TestCheckIndex
   [junit4] Completed [243/414] on J0 in 0.49s, 5 tests
   [junit4] 
   [junit4] Suite: org.apache.lucene.search.TestBooleanQueryVisitSubscorers
   [junit4] Completed [244/414] on J0 in 0.05s, 5 tests
   [junit4] 
   [junit4] Suite: org.apache.lucene.index.TestSizeBoundedForceMerge
   [junit4] Completed [245/414] on J0 in 0.10s, 11 tests
   [junit4] 
   [junit4] Suite: org.apache.lucene.util.automaton.TestCompiledAutomaton
   [junit4] Completed [246/414] on J0 in 0.19s, 6 tests
   [junit4] 
   [junit4] Suite: org.apache.lucene.index.TestBinaryTerms
   [junit4] Completed [247/414] on J0 in 0.06s, 2 tests
   [junit4] 
   [junit4] Suite: org.apache.lucene.search.TestSubScorerFreqs
   [junit4] Completed [248/414] on J0 in 0.04s, 3 tests
   [junit4] 
   [junit4] Suite: org.apache.lucene.index.TestIndexWriterConfig
   [junit4] Completed [249/414] on J0 in 0.03s, 8 tests
   [junit4] 
   [junit4] Suite: org.apache.lucene.search.TestMultiTermQueryRewrites
   [junit4] Completed [250/414] on J0 in 0.03s, 3 tests
   [junit4] 
   [junit4] Suite: org.apache.lucene.search.TestPositionIncrement
   [junit4] Completed [251/414] on J0 in 0.03s, 2 tests
   [junit4] 
   [junit4] Suite: org.apache.lucene.document.TestField
   [junit4] Completed [252/414] on J0 in 0.05s, 27 tests
   [junit4] 
   [junit4] Suite: org.apache.lucene.search.TestDateSort
   [junit4] Completed [253/414] on J0 in 0.02s, 1 test
   [junit4] 
   [junit4] Suite: org.apache.lucene.search.spans.TestSpanExplanationsOfNonMatches
   [junit4] Completed [254/414] on J0 in 0.05s, 30 tests
   [junit4] 
   [junit4] Suite: org.apache.lucene.util.TestVirtualMethod
   [junit4] Completed [255/414] on J0 in 0.04s, 2 tests
   [junit4] 
   [junit4] Suite: org.apache.lucene.search.TestSimilarityProvider
   [junit4] Completed [256/414] on J0 in 0.02s, 1 test
   [junit4] 
   [junit4] Suite: org.apache.lucene.util.TestSetOnce
   [junit4] Completed [257/414] on J0 in 0.02s, 4 tests
   [junit4] 
   [junit4] Suite: org.apache.lucene.TestSearch
   [junit4] Completed [258/414] on J0 in 0.03s, 2 tests
   [junit4] 
   [junit4] Suite: org.apache.lucene.analysis.TestCachingTokenFilter
   [junit4] Completed [259/414] on J0 in 0.02s, 2 tests
   [junit4] 
   [junit4] Suite: org.apache.lucene.document.TestDateTools
   [junit4] Completed [260/414] on J0 in 0.02s, 5 tests
   [junit4] 
   [junit4] Suite: org.apache.lucene.util.TestSparseFixedBitSet
   [junit4] Completed [261/414] on J1 in 5.26s, 11 tests
   [junit4] 
   [junit4] Suite: org.apache.lucene.util.TestPriorityQueue
   [junit4] Completed [262/414] on J0 in 1.10s, 9 tests
   [junit4] 
   [junit4] Suite: org.apache.lucene.index.Test2BPostings
   [junit4] IGNOR/A 0.00s J0 | Test2BPostings.test
   [junit4]    > Assumption #1: 'nightly' test group is disabled (@Nightly())
   [junit4] Completed [263/414] on J0 in 0.00s, 1 test, 1 skipped
   [junit4] 
   [junit4] Suite: org.apache.lucene.index.TestSameTokenSamePosition
   [junit4] Completed [264/414] on J0 in 0.06s, 2 tests
   [junit4] 
   [junit4] Suite: org.apache.lucene.search.TestCachingCollector
   [junit4] Completed [265/414] on J0 in 0.02s, 4 tests
   [junit4] 
   [junit4] Suite: org.apache.lucene.document.TestBinaryDocument
   [junit4] Completed [266/414] on J0 in 0.02s, 2 tests
   [junit4] 
   [junit4] Suite: org.apache.lucene.search.TestAutomatonQueryUnicode
   [junit4] Completed [267/414] on J0 in 0.02s, 1 test
   [junit4] 
   [junit4] Suite: org.apache.lucene.util.TestRamUsageEstimator
   [junit4] IGNOR/A 0.00s J0 | TestRamUsageEstimator.testPrintValues
   [junit4]    > Assumption #1: Specify -Dtests.verbose=true to print constants of RamUsageEstimator.
   [junit4] IGNOR/A 0.00s J0 | TestRamUsageEstimator.testHotspotBean
   [junit4]    > Assumption #1: testHotspotBean only works on 64bit JVMs.
   [junit4] Completed [268/414] on J0 in 0.02s, 5 tests, 2 skipped
   [junit4] 
   [junit4] Suite: org.apache.lucene.search.spans.TestSpanFirstQuery
   [junit4] Completed [269/414] on J0 in 0.02s, 1 test
   [junit4] 
   [junit4] Suite: org.apache.lucene.index.TestIsCurrent
   [junit4] Completed [270/414] on J0 in 0.03s, 2 tests
   [junit4] 
   [junit4] Suite: org.apache.lucene.index.TestNoMergePolicy
   [junit4] Completed [271/414] on J0 in 0.06s, 4 tests
   [junit4] 
   [junit4] Suite: org.apache.lucene.index.TestNoMergeScheduler
   [junit4] Completed [272/414] on J0 in 0.01s, 3 tests
   [junit4] 
   [junit4] Suite: org.apache.lucene.util.TestNamedSPILoader
   [junit4] Completed [273/414] on J0 in 0.01s, 3 tests
   [junit4] 
   [junit4] Suite: org.apache.lucene.search.TestPhrasePrefixQuery
   [junit4] Completed [274/414] on J0 in 0.02s, 1 test
   [junit4] 
   [junit4] Suite: org.apache.lucene.util.TestByteBlockPool
   [junit4] Completed [275/414] on J0 in 0.06s, 1 test
   [junit4] 
   [junit4] Suite: org.apache.lucene.util.TestBytesRef
   [junit4] Completed [276/414] on J0 in 0.01s, 3 tests
   [junit4] 
   [junit4] Suite: org.apache.lucene.TestDemo
   [junit4] Completed [277/414] on J0 in 0.02s, 1 test
   [junit4] 
   [junit4] Suite: org.apache.lucene.index.TestCodecHoldsOpenFiles
   [junit4] Completed [278/414] on J0 in 0.07s, 1 test
   [junit4] 
   [junit4] Suite: org.apache.lucene.search.MultiCollectorTest
   [junit4] Completed [279/414] on J0 in 0.02s, 4 tests
   [junit4] 
   [junit4] Suite: org.apache.lucene.search.TestDocBoost
   [junit4] Completed [280/414] on J0 in 0.02s, 1 test
   [junit4] 
   [junit4] Suite: org.apache.lucene.search.TestScoreCachingWrappingScorer
   [junit4] Completed [281/414] on J0 in 0.01s, 1 test
   [junit4] 
   [junit4] Suite: org.apache.lucene.util.TestIntsRef
   [junit4] Completed [282/414] on J0 in 0.01s, 2 tests
   [junit4] 
   [junit4] Suite: org.apache.lucene.analysis.tokenattributes.TestSimpleAttributeImpl
   [junit4] Completed [283/414] on J0 in 0.02s, 1 test
   [junit4] 
   [junit4] Suite: org.apache.lucene.index.TestTermdocPerf
   [junit4] Completed [284/414] on J0 in 0.01s, 1 test
   [junit4] 
   [junit4] Suite: org.apache.lucene.index.TestTerm
   [junit4] Completed [285/414] on J0 in 0.01s, 1 test
   [junit4] 
   [junit4] Suite: org.apache.lucene.search.TestPositiveScoresOnlyCollector
   [junit4] Completed [286/414] on J0 in 0.02s, 1 test
   [junit4] 
   [junit4] Suite: org.apache.lucene.util.TestIOUtils
   [junit4] Completed [287/414] on J0 in 0.11s, 18 tests
   [junit4] 
   [junit4] Suite: org.apache.lucene.index.Test2BBinaryDocValues
   [junit4] IGNOR/A 0.00s J0 | Test2BBinaryDocValues.testFixedBinary
   [junit4]    > Assumption #1: 'monster' test group is disabled (@Monster(value=takes ~ 6 hours if the heap is 5gb))
   [junit4] IGNOR/A 0.00s J0 | Test2BBinaryDocValues.testVariableBinary
   [junit4]    > Assumption #1: 'monster' test group is disabled (@Monster(value=takes ~ 6 hours if the heap is 5gb))
   [junit4] Completed [288/414] on J0 in 0.00s, 2 tests, 2 skipped
   [junit4] 
   [junit4] Suite: org.apache.lucene.util.Test2BPagedBytes
   [junit4] IGNOR/A 0.00s J0 | Test2BPagedBytes.test
   [junit4]    > Assumption #1: 'monster' test group is disabled (@Monster(value=You must increase heap to > 2 G to run this))
   [junit4] Completed [289/414] on J0 in 0.00s, 1 test, 1 skipped
   [junit4] 
   [junit4] Suite: org.apache.lucene.analysis.TestReusableStringReader
   [junit4] Completed [290/414] on J0 in 0.01s, 1 test
   [junit4] 
   [junit4] Suite: org.apache.lucene.analysis.tokenattributes.TestBytesRefAttImpl
   [junit4] Completed [291/414] on J0 in 0.01s, 1 test
   [junit4] 
   [junit4] Suite: org.apache.lucene.analysis.tokenattributes.TestPackedTokenAttributeImpl
   [junit4] Completed [292/414] on J0 in 0.01s, 4 tests
   [junit4] 
   [junit4] Suite: org.apache.lucene.codecs.TestCodecLoadingDeadlock
   [junit4] Completed [293/414] on J0 in 0.22s, 1 test
   [junit4] 
   [junit4] Suite: org.apache.lucene.util.TestCollectionUtil
   [junit4] Completed [294/414] on J1 in 12.09s, 4 tests
   [junit4] 
   [junit4] Suite: org.apache.lucene.index.TestMixedDocValuesUpdates
   [junit4] IGNOR/A 0.00s J1 | TestMixedDocValuesUpdates.testTonsOfUpdates
   [junit4]    > Assumption #1: 'nightly' test group is disabled (@Nightly())
   [junit4] Completed [295/414] on J1 in 4.83s, 4 tests, 1 skipped
   [junit4] 
   [junit4] Suite: org.apache.lucene.index.TestPayloadsOnVectors
   [junit4] Completed [296/414] on J1 in 0.03s, 3 tests
   [junit4] 
   [junit4] Suite: org.apache.lucene.search.spans.TestSpanExplanations
   [junit4] Completed [297/414] on J1 in 0.37s, 30 tests
   [junit4] 
   [junit4] Suite: org.apache.lucene.index.TestParallelTermEnum
   [junit4] Completed [298/414] on J1 in 0.02s, 1 test
   [junit4] 
   [junit4] Suite: org.apache.lucene.search.TestBooleanQuery
   [junit4] Completed [299/414] on J1 in 0.26s, 22 tests
   [junit4] 
   [junit4] Suite: org.apache.lucene.search.TestSearchAfter
   [junit4] Completed [300/414] on J1 in 0.66s, 1 test
   [junit4] 
   [junit4] Suite: org.apache.lucene.store.TestHugeRamFile
   [junit4] Completed [301/414] on J1 in 1.65s, 1 test
   [junit4] 
   [junit4] Suite: org.apache.lucene.store.TestByteArrayDataInput
   [junit4] Completed [302/414] on J1 in 0.01s, 1 test
   [junit4] 
   [junit4] Suite: org.apache.lucene.document.TestDocument
   [junit4] Completed [303/414] on J1 in 0.05s, 12 tests
   [junit4] 
   [junit4] Suite: org.apache.lucene.index.TestAllFilesHaveCodecHeader
   [junit4] Completed [304/414] on J1 in 0.32s, 1 test
   [junit4] 
   [junit4] Suite: org.apache.lucene.index.TestTermsEnum
   [junit4] Completed [305/414] on J2 in 123.41s, 11 tests
   [junit4] 
   [junit4] Suite: org.apache.lucene.util.packed.TestPackedInts
   [junit4] IGNOR/A 0.00s J1 | TestPackedInts.testBlockReaderOverflow
   [junit4]    > Assumption #1: 'nightly' test group is disabled (@Nightly())
   [junit4] Completed [306/414] on J1 in 10.52s, 28 tests, 3 skipped
   [junit4] 
   [junit4] Suite: org.apache.lucene.search.TestDocValuesRewriteMethod
   [junit4] Completed [307/414] on J1 in 2.76s, 2 tests
   [junit4] 
   [junit4] Suite: org.apache.lucene.codecs.lucene50.TestBlockPostingsFormat
   [junit4] Completed [308/414] on J2 in 5.26s, 26 tests
   [junit4] 
   [junit4] Suite: org.apache.lucene.codecs.lucene50.TestBlockPostingsFormat2
   [junit4] Completed [309/414] on J2 in 1.84s, 4 tests
   [junit4] 
   [junit4] Suite: org.apache.lucene.codecs.lucene50.TestBlockPostingsFormat3
   [junit4] Completed [310/414] on J2 in 0.80s, 1 test
   [junit4] 
   [junit4] Suite: org.apache.lucene.util.TestLegacyNumericUtils
   [junit4] Completed [311/414] on J1 in 7.99s, 12 tests
   [junit4] 
   [junit4] Suite: org.apache.lucene.codecs.lucene50.TestLucene50StoredFieldsFormat
   [junit4] IGNOR/A 0.00s J2 | TestLucene50StoredFieldsFormat.testBigDocuments
   [junit4]    > Assumption #1: 'nightly' test group is disabled (@Nightly())
   [junit4] Completed [312/414] on J2 in 2.52s, 17 tests, 1 skipped
   [junit4] 
   [junit4] Suite: org.apache.lucene.search.spans.TestSpanMultiTermQueryWrapper
   [junit4] Completed [313/414] on J1 in 0.09s, 9 tests
   [junit4] 
   [junit4] Suite: org.apache.lucene.index.TestAllFilesCheckIndexHeader
   [junit4] Completed [314/414] on J1 in 0.32s, 1 test
   [junit4] 
   [junit4] Suite: org.apache.lucene.index.TestReadOnlyIndex
   [junit4] Completed [315/414] on J1 in 0.15s, 1 test
   [junit4] 
   [junit4] Suite: org.apache.lucene.search.TestSortedSetSortField
   [junit4] Completed [316/414] on J1 in 0.07s, 7 tests
   [junit4] 
   [junit4] Suite: org.apache.lucene.index.TestFlex
   [junit4] Completed [317/414] on J1 in 0.13s, 2 tests
   [junit4] 
   [junit4] Suite: org.apache.lucene.util.TestInPlaceMergeSorter
   [junit4] Completed [318/414] on J1 in 0.09s, 9 tests
   [junit4] 
   [junit4] Suite: org.apache.lucene.index.TestDocumentsWriterDeleteQueue
   [junit4] Completed [319/414] on J1 in 0.12s, 5 tests
   [junit4] 
   [junit4] Suite: org.apache.lucene.store.TestRAMDirectory
   [junit4] IGNOR/A 0.00s J1 | TestRAMDirectory.testPendingDeletions
   [junit4]    > Assumption #1: we can only install VirusCheckingFS on an FSDirectory
   [junit4] IGNOR/A 0.00s J1 | TestRAMDirectory.testFsyncDoesntCreateNewFiles
   [junit4]    > Assumption #1: test only works for FSDirectory subclasses
   [junit4] Completed [320/414] on J1 in 1.50s, 49 tests, 2 skipped
   [junit4] 
   [junit4] Suite: org.apache.lucene.index.TestRollback
   [junit4] Completed [321/414] on J1 in 0.02s, 1 test
   [junit4] 
   [junit4] Suite: org.apache.lucene.search.TestTopFieldCollector
   [junit4] Completed [322/414] on J1 in 0.20s, 7 tests
   [junit4] 
   [junit4] Suite: org.apache.lucene.codecs.lucene50.TestLucene50StoredFieldsFormatHighCompression
   [junit4] IGNOR/A 0.00s J2 | TestLucene50StoredFieldsFormatHighCompression.testBigDocuments
   [junit4]    > Assumption #1: 'nightly' test group is disabled (@Nightly())
   [junit4] Completed [323/414] on J2 in 7.17s, 19 tests, 1 skipped
   [junit4] 
   [junit4] Suite: org.apache.lucene.search.TestBooleanScorer
   [junit4] Completed [324/414] on J1 in 4.91s, 5 tests
   [junit4] 
   [junit4] Suite: org.apache.lucene.search.TestMinShouldMatch2
   [junit4] Completed [325/414] on J1 in 5.22s, 6 tests
   [junit4] 
   [junit4] Suite: org.apache.lucene.index.TestPayloads
   [junit4] Completed [326/414] on J1 in 0.16s, 7 tests
   [junit4] 
   [junit4] Suite: org.apache.lucene.search.TestMatchAllDocsQuery
   [junit4] Completed [327/414] on J1 in 0.03s, 2 tests
   [junit4] 
   [junit4] Suite: org.apache.lucene.index.TestNumericDocValuesUpdates
   [junit4] IGNOR/A 0.00s J1 | TestNumericDocValuesUpdates.testTonsOfUpdates
   [junit4]    > Assumption #1: 'nightly' test group is disabled (@Nightly())
   [junit4] Completed [328/414] on J1 in 5.35s, 29 tests, 1 skipped
   [junit4] 
   [junit4] Suite: org.apache.lucene.index.TestSegmentTermEnum
   [junit4] Completed [329/414] on J1 in 0.05s, 2 tests
   [junit4] 
   [junit4] Suite: org.apache.lucene.search.TestSimpleExplanations
   [junit4] Completed [330/414] on J1 in 1.27s, 68 tests
   [junit4] 
   [junit4] Suite: org.apache.lucene.TestAssertions
   [junit4] Completed [331/414] on J1 in 0.03s, 1 test
   [junit4] 
   [junit4] Suite: org.apache.lucene.index.TestIndexWriterOnVMError
   [junit4] IGNOR/A 0.00s J1 | TestIndexWriterOnVMError.testCheckpoint
   [junit4]    > Assumption #1: 'nightly' test group is disabled (@Nightly())
   [junit4] Completed [332/414] on J1 in 0.61s, 3 tests, 1 skipped
   [junit4] 
   [junit4] Suite: org.apache.lucene.index.TestFieldsReader
   [junit4] Completed [333/414] on J1 in 0.42s, 2 tests
   [junit4] 
   [junit4] Suite: org.apache.lucene.codecs.lucene50.TestLucene50TermVectorsFormat
   [junit4] Completed [334/414] on J2 in 17.83s, 17 tests
   [junit4] 
   [junit4] HEARTBEAT J0 PID(7620@localhost): 2016-05-26T12:33:01, stalled for 60.5s at: TestGrowableByteArrayDataOutput.testWriteLargeStrings
   [junit4] Suite: org.apache.lucene.codecs.lucene60.TestLucene60PointsFormat
   [junit4] IGNOR/A 0.00s J2 | TestLucene60PointsFormat.testRandomBinaryBig
   [junit4]    > Assumption #1: 'nightly' test group is disabled (@Nightly())
   [junit4] IGNOR/A 0.00s J2 | TestLucene60PointsFormat.testMergeStability
   [junit4]    > Assumption #1: TODO: mess with the parameters and test gets angry!
   [junit4] Completed [335/414] on J2 in 4.79s, 16 tests, 2 skipped
   [junit4] 
   [junit4] Suite: org.apache.lucene.document.TestFieldType
   [junit4] Completed [336/414] on J2 in 0.01s, 3 tests
   [junit4] 
   [junit4] Suite: org.apache.lucene.index.Test2BPoints
   [junit4] IGNOR/A 0.00s J2 | Test2BPoints.test1D
   [junit4]    > Assumption #1: 'monster' test group is disabled (@Monster(value=takes at least 4 hours and consumes many GB of temp disk space))
   [junit4] IGNOR/A 0.00s J2 | Test2BPoints.test2D
   [junit4]    > Assumption #1: 'monster' test group is disabled (@Monster(value=takes at least 4 hours and consumes many GB of temp disk space))
   [junit4] Completed [337/414] on J2 in 0.00s, 2 tests, 2 skipped
   [junit4] 
   [junit4] Su

[...truncated too long message...]

 com.carrotsearch.randomizedtesting.ThreadLeakControl.forkTimeoutingTask(ThreadLeakControl.java:809)
   [junit4]   2>         at com.carrotsearch.randomizedtesting.ThreadLeakControl$3.evaluate(ThreadLeakControl.java:460)
   [junit4]   2>         at com.carrotsearch.randomizedtesting.RandomizedRunner.runSingleTest(RandomizedRunner.java:880)
   [junit4]   2>         at com.carrotsearch.randomizedtesting.RandomizedRunner$5.evaluate(RandomizedRunner.java:781)
   [junit4]   2>         at com.carrotsearch.randomizedtesting.RandomizedRunner$6.evaluate(RandomizedRunner.java:816)
   [junit4]   2>         at com.carrotsearch.randomizedtesting.RandomizedRunner$7.evaluate(RandomizedRunner.java:827)
   [junit4]   2>         at com.carrotsearch.randomizedtesting.rules.StatementAdapter.evaluate(StatementAdapter.java:36)
   [junit4]   2>         at com.carrotsearch.randomizedtesting.rules.SystemPropertiesRestoreRule$1.evaluate(SystemPropertiesRestoreRule.java:57)
   [junit4]   2>         at org.apache.lucene.util.AbstractBeforeAfterRule$1.evaluate(AbstractBeforeAfterRule.java:45)
   [junit4]   2>         at com.carrotsearch.randomizedtesting.rules.StatementAdapter.evaluate(StatementAdapter.java:36)
   [junit4]   2>         at org.apache.lucene.util.TestRuleStoreClassName$1.evaluate(TestRuleStoreClassName.java:41)
   [junit4]   2>         at com.carrotsearch.randomizedtesting.rules.NoShadowingOrOverridesOnMethodsRule$1.evaluate(NoShadowingOrOverridesOnMethodsRule.java:40)
   [junit4]   2>         at com.carrotsearch.randomizedtesting.rules.NoShadowingOrOverridesOnMethodsRule$1.evaluate(NoShadowingOrOverridesOnMethodsRule.java:40)
   [junit4]   2>         at com.carrotsearch.randomizedtesting.rules.StatementAdapter.evaluate(StatementAdapter.java:36)
   [junit4]   2>         at com.carrotsearch.randomizedtesting.rules.StatementAdapter.evaluate(StatementAdapter.java:36)
   [junit4]   2>         at com.carrotsearch.randomizedtesting.rules.StatementAdapter.evaluate(StatementAdapter.java:36)
   [junit4]   2>         at org.apache.lucene.util.TestRuleAssertionsRequired$1.evaluate(TestRuleAssertionsRequired.java:53)
   [junit4]   2>         at org.apache.lucene.util.TestRuleMarkFailure$1.evaluate(TestRuleMarkFailure.java:47)
   [junit4]   2>         at org.apache.lucene.util.TestRuleIgnoreAfterMaxFailures$1.evaluate(TestRuleIgnoreAfterMaxFailures.java:64)
   [junit4]   2>         at org.apache.lucene.util.TestRuleIgnoreTestSuites$1.evaluate(TestRuleIgnoreTestSuites.java:54)
   [junit4]   2>         at com.carrotsearch.randomizedtesting.rules.StatementAdapter.evaluate(StatementAdapter.java:36)
   [junit4]   2>         at com.carrotsearch.randomizedtesting.ThreadLeakControl$StatementRunner.run(ThreadLeakControl.java:367)
   [junit4]   2>         at java.lang.Thread.run(Thread.java:745)
   [junit4]   2> NOTE: test params are: codec=HighCompressionCompressingStoredFields(storedFieldsFormat=CompressingStoredFieldsFormat(compressionMode=HIGH_COMPRESSION, chunkSize=10, maxDocsPerChunk=876, blockSize=26), termVectorsFormat=CompressingTermVectorsFormat(compressionMode=HIGH_COMPRESSION, chunkSize=10, blockSize=26)), sim=RandomSimilarity(queryNorm=false,coord=yes): {}, locale=es-PE, timezone=Pacific/Rarotonga
   [junit4]   2> NOTE: Linux 4.4.0-21-generic i386/Oracle Corporation 1.8.0_92 (32-bit)/cpus=12,threads=2,free=153367152,total=518979584
   [junit4]   2> NOTE: leaving temporary files on disk at: /home/jenkins/workspace/Lucene-Solr-6.0-Linux/solr/build/solr-core/test/J0/temp/solr.security.BasicAuthIntegrationTest_50E423FCC1606504-001
   [junit4]   2> NOTE: All tests run in this JVM: [TestInitQParser, StressHdfsTest, IndexSchemaRuntimeFieldTest, HighlighterMaxOffsetTest, AlternateDirectoryTest, ZkNodePropsTest, VMParamsZkACLAndCredentialsProvidersTest, TestSolrDynamicMBean, TestIBSimilarityFactory, CloneFieldUpdateProcessorFactoryTest, SortSpecParsingTest, TestArbitraryIndexDir, TestUniqueKeyFieldResource, HdfsTlogReplayBufferedWhileIndexingTest, TestCollapseQParserPlugin, OverseerCollectionConfigSetProcessorTest, TestCSVLoader, ReturnFieldsTest, ReplicationFactorTest, AsyncCallRequestStatusResponseTest, TestDistributedSearch, DocValuesMissingTest, TestValueSourceCache, TestConfigSets, DeleteStatusTest, TestPerFieldSimilarityClassic, CloudExitableDirectoryReaderTest, CdcrReplicationDistributedZkTest, TestBinaryField, SolrCoreTest, TestDocSet, AnalysisErrorHandlingTest, TestCollectionAPI, TestRemoteStreaming, DocumentAnalysisRequestHandlerTest, TestAnalyzedSuggestions, BasicZkTest, TestSchemaResource, RAMDirectoryFactoryTest, SignatureUpdateProcessorFactoryTest, OverseerTaskQueueTest, TestRawResponseWriter, JSONWriterTest, TestFieldSortValues, TestLeaderInitiatedRecoveryThread, ZkStateWriterTest, PKIAuthenticationIntegrationTest, DefaultValueUpdateProcessorTest, TestCrossCoreJoin, MultiThreadedOCPTest, TestLuceneMatchVersion, DeleteLastCustomShardedReplicaTest, BasicDistributedZkTest, SuggestComponentTest, SharedFSAutoReplicaFailoverTest, GraphQueryTest, TestRealTimeGet, TestReloadAndDeleteDocs, EchoParamsTest, SOLR749Test, JsonLoaderTest, TestSolr4Spatial, CoreAdminRequestStatusTest, SystemInfoHandlerTest, CacheHeaderTest, TestBadConfig, HdfsNNFailoverTest, CollectionTooManyReplicasTest, ForceLeaderTest, TestSolrConfigHandlerCloud, TestCloudSchemaless, ExitableDirectoryReaderTest, SyncSliceTest, TestCloudDeleteByQuery, PrimUtilsTest, ConjunctionSolrSpellCheckerTest, TestConfig, DistributedExpandComponentTest, AnalysisAfterCoreReloadTest, FacetPivotSmallTest, TestRestManager, TestPseudoReturnFields, TestDefaultStatsCache, CursorPagingTest, TestManagedSchemaAPI, TestOmitPositions, ExternalFileFieldSortTest, PeerSyncTest, TestFoldingMultitermQuery, PreAnalyzedFieldTest, FileBasedSpellCheckerTest, PingRequestHandlerTest, TestRandomDVFaceting, BlockJoinFacetDistribTest, BigEndianAscendingWordDeserializerTest, LeaderInitiatedRecoveryOnCommitTest, ZkCLITest, OutputWriterTest, TestPostingsSolrHighlighter, DirectSolrConnectionTest, TestCharFilters, SynonymTokenizerTest, TestXIncludeConfig, TestSweetSpotSimilarityFactory, TestDFRSimilarityFactory, TestLMDirichletSimilarityFactory, TestLMJelinekMercerSimilarityFactory, TestFastWriter, ResourceLoaderTest, URLClassifyProcessorTest, TestSystemIdResolver, SpellingQueryConverterTest, TestUtils, SliceStateTest, CircularListTest, TestRTGBase, DistributedIntervalFacetingTest, AsyncMigrateRouteKeyTest, CollectionsAPISolrJTest, DistribCursorPagingTest, LeaderFailoverAfterPartitionTest, RollingRestartTest, SSLMigrationTest, SaslZkACLProviderTest, SolrCloudExampleTest, TestConfigSetsAPIExclusivity, TestConfigSetsAPIZkFailure, TestCryptoKeys, TestDownShardTolerantSearch, TestLeaderElectionZkExpiry, TestMiniSolrCloudClusterBase, TestMiniSolrCloudClusterSSL, TestRandomRequestDistribution, TestReplicaProperties, TestRequestForwarding, TestShortCircuitedRequests, TriLevelCompositeIdRoutingTest, HdfsSyncSliceTest, RulesTest, JavabinLoaderTest, WrapperMergePolicyFactoryTest, SmileWriterTest, TestIntervalFaceting, TestMacros, TestChildDocTransformer, TestSortingResponseWriter, TestManagedResource, TestManagedResourceStorage, TestCopyFieldCollectionResource, TestDefaultSearchFieldResource, TestDynamicFieldResource, TestFieldResource, TestFieldTypeResource, TestSerializedLuceneMatchVersion, TestSolrQueryParserResource, ChangedSchemaMergeTest, TestBulkSchemaConcurrent, TestRecoveryHdfs, TestSimpleQParserPlugin, TestStandardQParsers, TestJsonFacets, SimpleMLTQParserTest, TestClassicSimilarityFactory, TestDistribIDF, BasicAuthIntegrationTest]
   [junit4]   2> NOTE: reproduce with: ant test  -Dtestcase=BasicAuthIntegrationTest -Dtests.seed=50E423FCC1606504 -Dtests.multiplier=3 -Dtests.slow=true -Dtests.locale=es-PE -Dtests.timezone=Pacific/Rarotonga -Dtests.asserts=true -Dtests.file.encoding=UTF-8
   [junit4] ERROR   0.00s J0 | BasicAuthIntegrationTest (suite) <<<
   [junit4]    > Throwable #1: java.lang.Exception: Suite timeout exceeded (>= 7200000 msec).
   [junit4]    > 	at __randomizedtesting.SeedInfo.seed([50E423FCC1606504]:0)
   [junit4] Completed [584/584 (1!)] on J0 in 7226.14s, 1 test, 2 errors <<< FAILURES!
   [junit4] 
   [junit4] 
   [junit4] Tests with failures [seed: 50E423FCC1606504]:
   [junit4]   - org.apache.solr.security.BasicAuthIntegrationTest.testBasics
   [junit4]   - org.apache.solr.security.BasicAuthIntegrationTest (suite)
   [junit4] 
   [junit4] 
   [junit4] JVM J0:     0.33 .. 10162.96 = 10162.62s
   [junit4] JVM J1:     0.34 ..  2980.96 =  2980.63s
   [junit4] JVM J2:     0.33 ..  2980.93 =  2980.59s
   [junit4] Execution time total: 2 hours 49 minutes 22 seconds
   [junit4] Tests summary: 584 suites (10 ignored), 2340 tests, 1 suite-level error, 1 error, 114 ignored (70 assumptions)

BUILD FAILED
/home/jenkins/workspace/Lucene-Solr-6.0-Linux/build.xml:740: The following error occurred while executing this line:
/home/jenkins/workspace/Lucene-Solr-6.0-Linux/build.xml:684: The following error occurred while executing this line:
/home/jenkins/workspace/Lucene-Solr-6.0-Linux/build.xml:59: The following error occurred while executing this line:
/home/jenkins/workspace/Lucene-Solr-6.0-Linux/solr/build.xml:233: The following error occurred while executing this line:
/home/jenkins/workspace/Lucene-Solr-6.0-Linux/solr/common-build.xml:527: The following error occurred while executing this line:
/home/jenkins/workspace/Lucene-Solr-6.0-Linux/lucene/common-build.xml:1457: The following error occurred while executing this line:
/home/jenkins/workspace/Lucene-Solr-6.0-Linux/lucene/common-build.xml:1014: There were test failures: 584 suites (10 ignored), 2340 tests, 1 suite-level error, 1 error, 114 ignored (70 assumptions) [seed: 50E423FCC1606504]

Total time: 197 minutes 29 seconds
Build step 'Invoke Ant' marked build as failure
Archiving artifacts
[WARNINGS] Skipping publisher since build result is FAILURE
Recording test results
Email was triggered for: Failure - Any
Sending email for trigger: Failure - Any



Mime
View raw message