lucene-dev mailing list archives

Site index · List index
Message view « Date » · « Thread »
Top « Date » · « Thread »
From Policeman Jenkins Server <jenk...@thetaphi.de>
Subject [JENKINS] Lucene-Solr-master-Solaris (64bit/jdk1.8.0) - Build # 582 - Failure!
Date Sun, 15 May 2016 12:50:02 GMT
Build: http://jenkins.thetaphi.de/job/Lucene-Solr-master-Solaris/582/
Java: 64bit/jdk1.8.0 -XX:+UseCompressedOops -XX:+UseSerialGC

1 tests failed.
FAILED:  junit.framework.TestSuite.org.apache.solr.cloud.TestTolerantUpdateProcessorCloud

Error Message:
Could not find collection:test_col

Stack Trace:
java.lang.AssertionError: Could not find collection:test_col
	at __randomizedtesting.SeedInfo.seed([971B2403FEDE5916]:0)
	at org.junit.Assert.fail(Assert.java:93)
	at org.junit.Assert.assertTrue(Assert.java:43)
	at org.junit.Assert.assertNotNull(Assert.java:526)
	at org.apache.solr.cloud.AbstractDistribZkTestBase.waitForRecoveriesToFinish(AbstractDistribZkTestBase.java:154)
	at org.apache.solr.cloud.TestTolerantUpdateProcessorCloud.createMiniSolrCloudCluster(TestTolerantUpdateProcessorCloud.java:129)
	at sun.reflect.NativeMethodAccessorImpl.invoke0(Native Method)
	at sun.reflect.NativeMethodAccessorImpl.invoke(NativeMethodAccessorImpl.java:62)
	at sun.reflect.DelegatingMethodAccessorImpl.invoke(DelegatingMethodAccessorImpl.java:43)
	at java.lang.reflect.Method.invoke(Method.java:498)
	at com.carrotsearch.randomizedtesting.RandomizedRunner.invoke(RandomizedRunner.java:1764)
	at com.carrotsearch.randomizedtesting.RandomizedRunner$6.evaluate(RandomizedRunner.java:811)
	at com.carrotsearch.randomizedtesting.RandomizedRunner$7.evaluate(RandomizedRunner.java:827)
	at com.carrotsearch.randomizedtesting.rules.StatementAdapter.evaluate(StatementAdapter.java:36)
	at com.carrotsearch.randomizedtesting.rules.SystemPropertiesRestoreRule$1.evaluate(SystemPropertiesRestoreRule.java:57)
	at org.apache.lucene.util.AbstractBeforeAfterRule$1.evaluate(AbstractBeforeAfterRule.java:45)
	at com.carrotsearch.randomizedtesting.rules.StatementAdapter.evaluate(StatementAdapter.java:36)
	at org.apache.lucene.util.TestRuleStoreClassName$1.evaluate(TestRuleStoreClassName.java:41)
	at com.carrotsearch.randomizedtesting.rules.NoShadowingOrOverridesOnMethodsRule$1.evaluate(NoShadowingOrOverridesOnMethodsRule.java:40)
	at com.carrotsearch.randomizedtesting.rules.NoShadowingOrOverridesOnMethodsRule$1.evaluate(NoShadowingOrOverridesOnMethodsRule.java:40)
	at com.carrotsearch.randomizedtesting.rules.StatementAdapter.evaluate(StatementAdapter.java:36)
	at com.carrotsearch.randomizedtesting.rules.StatementAdapter.evaluate(StatementAdapter.java:36)
	at com.carrotsearch.randomizedtesting.rules.StatementAdapter.evaluate(StatementAdapter.java:36)
	at org.apache.lucene.util.TestRuleAssertionsRequired$1.evaluate(TestRuleAssertionsRequired.java:53)
	at org.apache.lucene.util.TestRuleMarkFailure$1.evaluate(TestRuleMarkFailure.java:47)
	at org.apache.lucene.util.TestRuleIgnoreAfterMaxFailures$1.evaluate(TestRuleIgnoreAfterMaxFailures.java:64)
	at org.apache.lucene.util.TestRuleIgnoreTestSuites$1.evaluate(TestRuleIgnoreTestSuites.java:54)
	at com.carrotsearch.randomizedtesting.rules.StatementAdapter.evaluate(StatementAdapter.java:36)
	at com.carrotsearch.randomizedtesting.ThreadLeakControl$StatementRunner.run(ThreadLeakControl.java:367)
	at java.lang.Thread.run(Thread.java:745)




Build Log:
[...truncated 11199 lines...]
   [junit4] Suite: org.apache.solr.cloud.TestTolerantUpdateProcessorCloud
   [junit4]   2> Creating dataDir: /export/home/jenkins/workspace/Lucene-Solr-master-Solaris/solr/build/solr-core/test/J1/temp/solr.cloud.TestTolerantUpdateProcessorCloud_971B2403FEDE5916-001/init-core-data-001
   [junit4]   2> 1743924 INFO  (SUITE-TestTolerantUpdateProcessorCloud-seed#[971B2403FEDE5916]-worker) [    ] o.a.s.SolrTestCaseJ4 Randomized ssl (false) and clientAuth (false)
   [junit4]   2> 1743927 INFO  (SUITE-TestTolerantUpdateProcessorCloud-seed#[971B2403FEDE5916]-worker) [    ] o.a.s.c.ZkTestServer STARTING ZK TEST SERVER
   [junit4]   2> 1743927 INFO  (Thread-5363) [    ] o.a.s.c.ZkTestServer client port:0.0.0.0/0.0.0.0:0
   [junit4]   2> 1743927 INFO  (Thread-5363) [    ] o.a.s.c.ZkTestServer Starting server
   [junit4]   2> 1744027 INFO  (SUITE-TestTolerantUpdateProcessorCloud-seed#[971B2403FEDE5916]-worker) [    ] o.a.s.c.ZkTestServer start zk server on port:47620
   [junit4]   2> 1744027 INFO  (SUITE-TestTolerantUpdateProcessorCloud-seed#[971B2403FEDE5916]-worker) [    ] o.a.s.c.c.SolrZkClient Using default ZkCredentialsProvider
   [junit4]   2> 1744027 INFO  (SUITE-TestTolerantUpdateProcessorCloud-seed#[971B2403FEDE5916]-worker) [    ] o.a.s.c.c.ConnectionManager Waiting for client to connect to ZooKeeper
   [junit4]   2> 1744031 INFO  (zkCallback-1807-thread-1) [    ] o.a.s.c.c.ConnectionManager Watcher org.apache.solr.common.cloud.ConnectionManager@6e9d58b9 name:ZooKeeperConnection Watcher:127.0.0.1:47620 got event WatchedEvent state:SyncConnected type:None path:null path:null type:None
   [junit4]   2> 1744031 INFO  (SUITE-TestTolerantUpdateProcessorCloud-seed#[971B2403FEDE5916]-worker) [    ] o.a.s.c.c.ConnectionManager Client is connected to ZooKeeper
   [junit4]   2> 1744031 INFO  (SUITE-TestTolerantUpdateProcessorCloud-seed#[971B2403FEDE5916]-worker) [    ] o.a.s.c.c.SolrZkClient Using default ZkACLProvider
   [junit4]   2> 1744031 INFO  (SUITE-TestTolerantUpdateProcessorCloud-seed#[971B2403FEDE5916]-worker) [    ] o.a.s.c.c.SolrZkClient makePath: /solr/solr.xml
   [junit4]   2> 1744039 INFO  (jetty-launcher-1806-thread-3) [    ] o.e.j.s.Server jetty-9.3.8.v20160314
   [junit4]   2> 1744039 INFO  (jetty-launcher-1806-thread-4) [    ] o.e.j.s.Server jetty-9.3.8.v20160314
   [junit4]   2> 1744042 INFO  (jetty-launcher-1806-thread-4) [    ] o.e.j.s.h.ContextHandler Started o.e.j.s.ServletContextHandler@61a204e7{/solr,null,AVAILABLE}
   [junit4]   2> 1744044 INFO  (jetty-launcher-1806-thread-3) [    ] o.e.j.s.h.ContextHandler Started o.e.j.s.ServletContextHandler@103d1b3f{/solr,null,AVAILABLE}
   [junit4]   2> 1744046 INFO  (jetty-launcher-1806-thread-5) [    ] o.e.j.s.Server jetty-9.3.8.v20160314
   [junit4]   2> 1744048 INFO  (jetty-launcher-1806-thread-5) [    ] o.e.j.s.h.ContextHandler Started o.e.j.s.ServletContextHandler@2295d352{/solr,null,AVAILABLE}
   [junit4]   2> 1744062 INFO  (jetty-launcher-1806-thread-5) [    ] o.e.j.s.ServerConnector Started ServerConnector@35c7a017{HTTP/1.1,[http/1.1]}{127.0.0.1:๔๒๖๘๔}
   [junit4]   2> 1744062 INFO  (jetty-launcher-1806-thread-5) [    ] o.e.j.s.Server Started @๑๗๔๘๘๓๑ms
   [junit4]   2> 1744062 INFO  (jetty-launcher-1806-thread-5) [    ] o.a.s.c.s.e.JettySolrRunner Jetty properties: {hostContext=/solr, hostPort=42684}
   [junit4]   2> 1744063 INFO  (jetty-launcher-1806-thread-3) [    ] o.e.j.s.ServerConnector Started ServerConnector@3edad346{HTTP/1.1,[http/1.1]}{127.0.0.1:๖๔๙๑๙}
   [junit4]   2> 1744063 INFO  (jetty-launcher-1806-thread-3) [    ] o.e.j.s.Server Started @๑๗๔๘๘๓๒ms
   [junit4]   2> 1744063 INFO  (jetty-launcher-1806-thread-3) [    ] o.a.s.c.s.e.JettySolrRunner Jetty properties: {hostContext=/solr, hostPort=64919}
   [junit4]   2> 1744063 INFO  (jetty-launcher-1806-thread-3) [    ] o.a.s.s.SolrDispatchFilter SolrDispatchFilter.init(): sun.misc.Launcher$AppClassLoader@6d06d69c
   [junit4]   2> 1744063 INFO  (jetty-launcher-1806-thread-3) [    ] o.a.s.c.SolrResourceLoader new SolrResourceLoader for directory: '/export/home/jenkins/workspace/Lucene-Solr-master-Solaris/solr/build/solr-core/test/J1/temp/solr.cloud.TestTolerantUpdateProcessorCloud_971B2403FEDE5916-001/tempDir-001/node3'
   [junit4]   2> 1744064 INFO  (jetty-launcher-1806-thread-3) [    ] o.a.s.c.SolrResourceLoader JNDI not configured for solr (NoInitialContextEx)
   [junit4]   2> 1744064 INFO  (jetty-launcher-1806-thread-3) [    ] o.a.s.c.SolrResourceLoader solr home defaulted to 'solr/' (could not find system property or JNDI)
   [junit4]   2> 1744064 INFO  (jetty-launcher-1806-thread-3) [    ] o.a.s.c.c.SolrZkClient Using default ZkCredentialsProvider
   [junit4]   2> 1744065 INFO  (jetty-launcher-1806-thread-3) [    ] o.a.s.c.c.ConnectionManager Waiting for client to connect to ZooKeeper
   [junit4]   2> 1744067 INFO  (jetty-launcher-1806-thread-4) [    ] o.e.j.s.ServerConnector Started ServerConnector@1d3f6212{HTTP/1.1,[http/1.1]}{127.0.0.1:๕๔๗๓๒}
   [junit4]   2> 1744067 INFO  (jetty-launcher-1806-thread-4) [    ] o.e.j.s.Server Started @๑๗๔๘๘๓๖ms
   [junit4]   2> 1744067 INFO  (jetty-launcher-1806-thread-4) [    ] o.a.s.c.s.e.JettySolrRunner Jetty properties: {hostContext=/solr, hostPort=54732}
   [junit4]   2> 1744067 INFO  (jetty-launcher-1806-thread-4) [    ] o.a.s.s.SolrDispatchFilter SolrDispatchFilter.init(): sun.misc.Launcher$AppClassLoader@6d06d69c
   [junit4]   2> 1744068 INFO  (jetty-launcher-1806-thread-4) [    ] o.a.s.c.SolrResourceLoader new SolrResourceLoader for directory: '/export/home/jenkins/workspace/Lucene-Solr-master-Solaris/solr/build/solr-core/test/J1/temp/solr.cloud.TestTolerantUpdateProcessorCloud_971B2403FEDE5916-001/tempDir-001/node4'
   [junit4]   2> 1744068 INFO  (jetty-launcher-1806-thread-4) [    ] o.a.s.c.SolrResourceLoader JNDI not configured for solr (NoInitialContextEx)
   [junit4]   2> 1744068 INFO  (jetty-launcher-1806-thread-4) [    ] o.a.s.c.SolrResourceLoader solr home defaulted to 'solr/' (could not find system property or JNDI)
   [junit4]   2> 1744067 INFO  (jetty-launcher-1806-thread-5) [    ] o.a.s.s.SolrDispatchFilter SolrDispatchFilter.init(): sun.misc.Launcher$AppClassLoader@6d06d69c
   [junit4]   2> 1744068 INFO  (jetty-launcher-1806-thread-5) [    ] o.a.s.c.SolrResourceLoader new SolrResourceLoader for directory: '/export/home/jenkins/workspace/Lucene-Solr-master-Solaris/solr/build/solr-core/test/J1/temp/solr.cloud.TestTolerantUpdateProcessorCloud_971B2403FEDE5916-001/tempDir-001/node5'
   [junit4]   2> 1744068 INFO  (jetty-launcher-1806-thread-4) [    ] o.a.s.c.c.SolrZkClient Using default ZkCredentialsProvider
   [junit4]   2> 1744068 INFO  (jetty-launcher-1806-thread-5) [    ] o.a.s.c.SolrResourceLoader JNDI not configured for solr (NoInitialContextEx)
   [junit4]   2> 1744068 INFO  (jetty-launcher-1806-thread-5) [    ] o.a.s.c.SolrResourceLoader solr home defaulted to 'solr/' (could not find system property or JNDI)
   [junit4]   2> 1744069 INFO  (jetty-launcher-1806-thread-5) [    ] o.a.s.c.c.SolrZkClient Using default ZkCredentialsProvider
   [junit4]   2> 1744069 INFO  (jetty-launcher-1806-thread-4) [    ] o.a.s.c.c.ConnectionManager Waiting for client to connect to ZooKeeper
   [junit4]   2> 1744069 INFO  (jetty-launcher-1806-thread-5) [    ] o.a.s.c.c.ConnectionManager Waiting for client to connect to ZooKeeper
   [junit4]   2> 1744072 INFO  (zkCallback-1810-thread-1) [    ] o.a.s.c.c.ConnectionManager Watcher org.apache.solr.common.cloud.ConnectionManager@78319eb3 name:ZooKeeperConnection Watcher:127.0.0.1:47620/solr got event WatchedEvent state:SyncConnected type:None path:null path:null type:None
   [junit4]   2> 1744072 INFO  (zkCallback-1809-thread-1) [    ] o.a.s.c.c.ConnectionManager Watcher org.apache.solr.common.cloud.ConnectionManager@1bb21909 name:ZooKeeperConnection Watcher:127.0.0.1:47620/solr got event WatchedEvent state:SyncConnected type:None path:null path:null type:None
   [junit4]   2> 1744072 INFO  (jetty-launcher-1806-thread-2) [    ] o.e.j.s.Server jetty-9.3.8.v20160314
   [junit4]   2> 1744072 INFO  (jetty-launcher-1806-thread-1) [    ] o.e.j.s.Server jetty-9.3.8.v20160314
   [junit4]   2> 1744073 INFO  (jetty-launcher-1806-thread-5) [    ] o.a.s.c.c.ConnectionManager Client is connected to ZooKeeper
   [junit4]   2> 1744073 INFO  (zkCallback-1808-thread-1) [    ] o.a.s.c.c.ConnectionManager Watcher org.apache.solr.common.cloud.ConnectionManager@2a48f09b name:ZooKeeperConnection Watcher:127.0.0.1:47620/solr got event WatchedEvent state:SyncConnected type:None path:null path:null type:None
   [junit4]   2> 1744073 INFO  (jetty-launcher-1806-thread-5) [    ] o.a.s.c.c.SolrZkClient Using default ZkACLProvider
   [junit4]   2> 1744073 INFO  (jetty-launcher-1806-thread-5) [    ] o.a.s.s.SolrDispatchFilter solr.xml found in ZooKeeper. Loading...
   [junit4]   2> 1744075 INFO  (jetty-launcher-1806-thread-4) [    ] o.a.s.c.c.ConnectionManager Client is connected to ZooKeeper
   [junit4]   2> 1744075 INFO  (jetty-launcher-1806-thread-4) [    ] o.a.s.c.c.SolrZkClient Using default ZkACLProvider
   [junit4]   2> 1744075 INFO  (jetty-launcher-1806-thread-4) [    ] o.a.s.s.SolrDispatchFilter solr.xml found in ZooKeeper. Loading...
   [junit4]   2> 1744076 INFO  (jetty-launcher-1806-thread-2) [    ] o.e.j.s.h.ContextHandler Started o.e.j.s.ServletContextHandler@270c798a{/solr,null,AVAILABLE}
   [junit4]   2> 1744076 INFO  (jetty-launcher-1806-thread-2) [    ] o.e.j.s.ServerConnector Started ServerConnector@2d9abf21{HTTP/1.1,[http/1.1]}{127.0.0.1:๔๐๑๖๓}
   [junit4]   2> 1744076 INFO  (jetty-launcher-1806-thread-2) [    ] o.e.j.s.Server Started @๑๗๔๘๘๔๕ms
   [junit4]   2> 1744076 INFO  (jetty-launcher-1806-thread-2) [    ] o.a.s.c.s.e.JettySolrRunner Jetty properties: {hostContext=/solr, hostPort=40163}
   [junit4]   2> 1744076 INFO  (jetty-launcher-1806-thread-2) [    ] o.a.s.s.SolrDispatchFilter SolrDispatchFilter.init(): sun.misc.Launcher$AppClassLoader@6d06d69c
   [junit4]   2> 1744077 INFO  (jetty-launcher-1806-thread-2) [    ] o.a.s.c.SolrResourceLoader new SolrResourceLoader for directory: '/export/home/jenkins/workspace/Lucene-Solr-master-Solaris/solr/build/solr-core/test/J1/temp/solr.cloud.TestTolerantUpdateProcessorCloud_971B2403FEDE5916-001/tempDir-001/node2'
   [junit4]   2> 1744077 INFO  (jetty-launcher-1806-thread-2) [    ] o.a.s.c.SolrResourceLoader JNDI not configured for solr (NoInitialContextEx)
   [junit4]   2> 1744077 INFO  (jetty-launcher-1806-thread-2) [    ] o.a.s.c.SolrResourceLoader solr home defaulted to 'solr/' (could not find system property or JNDI)
   [junit4]   2> 1744077 INFO  (jetty-launcher-1806-thread-2) [    ] o.a.s.c.c.SolrZkClient Using default ZkCredentialsProvider
   [junit4]   2> 1744077 INFO  (jetty-launcher-1806-thread-3) [    ] o.a.s.c.c.ConnectionManager Client is connected to ZooKeeper
   [junit4]   2> 1744077 INFO  (jetty-launcher-1806-thread-3) [    ] o.a.s.c.c.SolrZkClient Using default ZkACLProvider
   [junit4]   2> 1744078 INFO  (jetty-launcher-1806-thread-2) [    ] o.a.s.c.c.ConnectionManager Waiting for client to connect to ZooKeeper
   [junit4]   2> 1744081 INFO  (jetty-launcher-1806-thread-1) [    ] o.e.j.s.h.ContextHandler Started o.e.j.s.ServletContextHandler@5b33d95e{/solr,null,AVAILABLE}
   [junit4]   2> 1744082 INFO  (jetty-launcher-1806-thread-1) [    ] o.e.j.s.ServerConnector Started ServerConnector@292664e0{HTTP/1.1,[http/1.1]}{127.0.0.1:๔๕๑๙๖}
   [junit4]   2> 1744082 INFO  (jetty-launcher-1806-thread-1) [    ] o.e.j.s.Server Started @๑๗๔๘๘๕๑ms
   [junit4]   2> 1744082 INFO  (jetty-launcher-1806-thread-1) [    ] o.a.s.c.s.e.JettySolrRunner Jetty properties: {hostContext=/solr, hostPort=45196}
   [junit4]   2> 1744082 INFO  (jetty-launcher-1806-thread-1) [    ] o.a.s.s.SolrDispatchFilter SolrDispatchFilter.init(): sun.misc.Launcher$AppClassLoader@6d06d69c
   [junit4]   2> 1744082 INFO  (jetty-launcher-1806-thread-1) [    ] o.a.s.c.SolrResourceLoader new SolrResourceLoader for directory: '/export/home/jenkins/workspace/Lucene-Solr-master-Solaris/solr/build/solr-core/test/J1/temp/solr.cloud.TestTolerantUpdateProcessorCloud_971B2403FEDE5916-001/tempDir-001/node1'
   [junit4]   2> 1744083 INFO  (jetty-launcher-1806-thread-1) [    ] o.a.s.c.SolrResourceLoader JNDI not configured for solr (NoInitialContextEx)
   [junit4]   2> 1744083 INFO  (jetty-launcher-1806-thread-1) [    ] o.a.s.c.SolrResourceLoader solr home defaulted to 'solr/' (could not find system property or JNDI)
   [junit4]   2> 1744083 INFO  (jetty-launcher-1806-thread-1) [    ] o.a.s.c.c.SolrZkClient Using default ZkCredentialsProvider
   [junit4]   2> 1744083 INFO  (jetty-launcher-1806-thread-1) [    ] o.a.s.c.c.ConnectionManager Waiting for client to connect to ZooKeeper
   [junit4]   2> 1744085 WARN  (NIOServerCxn.Factory:0.0.0.0/0.0.0.0:0) [    ] o.a.z.s.NIOServerCnxn caught end of stream exception
   [junit4]   2> EndOfStreamException: Unable to read additional data from client sessionid 0x154b4534b3f0002, likely client has closed socket
   [junit4]   2> 	at org.apache.zookeeper.server.NIOServerCnxn.doIO(NIOServerCnxn.java:228)
   [junit4]   2> 	at org.apache.zookeeper.server.NIOServerCnxnFactory.run(NIOServerCnxnFactory.java:208)
   [junit4]   2> 	at java.lang.Thread.run(Thread.java:745)
   [junit4]   2> 1744086 INFO  (jetty-launcher-1806-thread-4) [    ] o.a.s.c.CorePropertiesLocator Config-defined core root directory: /export/home/jenkins/workspace/Lucene-Solr-master-Solaris/solr/build/solr-core/test/J1/temp/solr.cloud.TestTolerantUpdateProcessorCloud_971B2403FEDE5916-001/tempDir-001/node4/.
   [junit4]   2> 1744088 INFO  (jetty-launcher-1806-thread-4) [    ] o.a.s.c.CoreContainer New CoreContainer 1687247203
   [junit4]   2> 1744088 INFO  (jetty-launcher-1806-thread-4) [    ] o.a.s.c.CoreContainer Loading cores into CoreContainer [instanceDir=/export/home/jenkins/workspace/Lucene-Solr-master-Solaris/solr/build/solr-core/test/J1/temp/solr.cloud.TestTolerantUpdateProcessorCloud_971B2403FEDE5916-001/tempDir-001/node4]
   [junit4]   2> 1744088 WARN  (jetty-launcher-1806-thread-4) [    ] o.a.s.c.CoreContainer Couldn't add files from /export/home/jenkins/workspace/Lucene-Solr-master-Solaris/solr/build/solr-core/test/J1/temp/solr.cloud.TestTolerantUpdateProcessorCloud_971B2403FEDE5916-001/tempDir-001/node4/lib to classpath: /export/home/jenkins/workspace/Lucene-Solr-master-Solaris/solr/build/solr-core/test/J1/temp/solr.cloud.TestTolerantUpdateProcessorCloud_971B2403FEDE5916-001/tempDir-001/node4/lib
   [junit4]   2> 1744088 INFO  (jetty-launcher-1806-thread-4) [    ] o.a.s.h.c.HttpShardHandlerFactory created with socketTimeout : 90000,urlScheme : ,connTimeout : 15000,maxConnectionsPerHost : 20,maxConnections : 10000,corePoolSize : 0,maximumPoolSize : 2147483647,maxThreadIdleTime : 5,sizeOfQueue : -1,fairnessPolicy : false,
   [junit4]   2> 1744088 INFO  (jetty-launcher-1806-thread-3) [    ] o.a.s.s.SolrDispatchFilter solr.xml found in ZooKeeper. Loading...
   [junit4]   2> 1744089 INFO  (jetty-launcher-1806-thread-4) [    ] o.a.s.u.UpdateShardHandler Creating UpdateShardHandler HTTP client with params: 
   [junit4]   2> 1744090 INFO  (jetty-launcher-1806-thread-4) [    ] o.a.s.l.LogWatcher SLF4J impl is org.slf4j.impl.Log4jLoggerFactory
   [junit4]   2> 1744090 INFO  (jetty-launcher-1806-thread-4) [    ] o.a.s.l.LogWatcher Registering Log Listener [Log4j (org.slf4j.impl.Log4jLoggerFactory)]
   [junit4]   2> 1744090 INFO  (jetty-launcher-1806-thread-4) [    ] o.a.s.c.ZkContainer Zookeeper client=127.0.0.1:47620/solr
   [junit4]   2> 1744090 INFO  (jetty-launcher-1806-thread-4) [    ] o.a.s.c.ZkController zkHost includes chroot
   [junit4]   2> 1744091 INFO  (jetty-launcher-1806-thread-4) [    ] o.a.s.c.c.SolrZkClient Using default ZkCredentialsProvider
   [junit4]   2> 1744091 INFO  (jetty-launcher-1806-thread-4) [    ] o.a.s.c.c.ConnectionManager Waiting for client to connect to ZooKeeper
   [junit4]   2> 1744095 INFO  (zkCallback-1812-thread-1) [    ] o.a.s.c.c.ConnectionManager Watcher org.apache.solr.common.cloud.ConnectionManager@496fc8b2 name:ZooKeeperConnection Watcher:127.0.0.1:47620/solr got event WatchedEvent state:SyncConnected type:None path:null path:null type:None
   [junit4]   2> 1744095 INFO  (zkCallback-1815-thread-1) [    ] o.a.s.c.c.ConnectionManager Watcher org.apache.solr.common.cloud.ConnectionManager@3cae0336 name:ZooKeeperConnection Watcher:127.0.0.1:47620 got event WatchedEvent state:SyncConnected type:None path:null path:null type:None
   [junit4]   2> 1744097 INFO  (zkCallback-1811-thread-1) [    ] o.a.s.c.c.ConnectionManager Watcher org.apache.solr.common.cloud.ConnectionManager@593e90b name:ZooKeeperConnection Watcher:127.0.0.1:47620/solr got event WatchedEvent state:SyncConnected type:None path:null path:null type:None
   [junit4]   2> 1744097 INFO  (jetty-launcher-1806-thread-4) [    ] o.a.s.c.c.ConnectionManager Client is connected to ZooKeeper
   [junit4]   2> 1744097 INFO  (jetty-launcher-1806-thread-5) [    ] o.a.s.c.CorePropertiesLocator Config-defined core root directory: /export/home/jenkins/workspace/Lucene-Solr-master-Solaris/solr/build/solr-core/test/J1/temp/solr.cloud.TestTolerantUpdateProcessorCloud_971B2403FEDE5916-001/tempDir-001/node5/.
   [junit4]   2> 1744097 INFO  (jetty-launcher-1806-thread-3) [    ] o.a.s.c.CorePropertiesLocator Config-defined core root directory: /export/home/jenkins/workspace/Lucene-Solr-master-Solaris/solr/build/solr-core/test/J1/temp/solr.cloud.TestTolerantUpdateProcessorCloud_971B2403FEDE5916-001/tempDir-001/node3/.
   [junit4]   2> 1744097 INFO  (jetty-launcher-1806-thread-5) [    ] o.a.s.c.CoreContainer New CoreContainer 962519994
   [junit4]   2> 1744097 INFO  (jetty-launcher-1806-thread-3) [    ] o.a.s.c.CoreContainer New CoreContainer 676713012
   [junit4]   2> 1744097 INFO  (jetty-launcher-1806-thread-4) [    ] o.a.s.c.c.SolrZkClient Using default ZkACLProvider
   [junit4]   2> 1744096 INFO  (jetty-launcher-1806-thread-1) [    ] o.a.s.c.c.ConnectionManager Client is connected to ZooKeeper
   [junit4]   2> 1744097 INFO  (jetty-launcher-1806-thread-2) [    ] o.a.s.c.c.ConnectionManager Client is connected to ZooKeeper
   [junit4]   2> 1744097 INFO  (jetty-launcher-1806-thread-2) [    ] o.a.s.c.c.SolrZkClient Using default ZkACLProvider
   [junit4]   2> 1744097 INFO  (jetty-launcher-1806-thread-1) [    ] o.a.s.c.c.SolrZkClient Using default ZkACLProvider
   [junit4]   2> 1744097 INFO  (jetty-launcher-1806-thread-3) [    ] o.a.s.c.CoreContainer Loading cores into CoreContainer [instanceDir=/export/home/jenkins/workspace/Lucene-Solr-master-Solaris/solr/build/solr-core/test/J1/temp/solr.cloud.TestTolerantUpdateProcessorCloud_971B2403FEDE5916-001/tempDir-001/node3]
   [junit4]   2> 1744098 WARN  (jetty-launcher-1806-thread-3) [    ] o.a.s.c.CoreContainer Couldn't add files from /export/home/jenkins/workspace/Lucene-Solr-master-Solaris/solr/build/solr-core/test/J1/temp/solr.cloud.TestTolerantUpdateProcessorCloud_971B2403FEDE5916-001/tempDir-001/node3/lib to classpath: /export/home/jenkins/workspace/Lucene-Solr-master-Solaris/solr/build/solr-core/test/J1/temp/solr.cloud.TestTolerantUpdateProcessorCloud_971B2403FEDE5916-001/tempDir-001/node3/lib
   [junit4]   2> 1744098 INFO  (jetty-launcher-1806-thread-2) [    ] o.a.s.s.SolrDispatchFilter solr.xml found in ZooKeeper. Loading...
   [junit4]   2> 1744098 INFO  (jetty-launcher-1806-thread-3) [    ] o.a.s.h.c.HttpShardHandlerFactory created with socketTimeout : 90000,urlScheme : ,connTimeout : 15000,maxConnectionsPerHost : 20,maxConnections : 10000,corePoolSize : 0,maximumPoolSize : 2147483647,maxThreadIdleTime : 5,sizeOfQueue : -1,fairnessPolicy : false,
   [junit4]   2> 1744098 INFO  (jetty-launcher-1806-thread-1) [    ] o.a.s.s.SolrDispatchFilter solr.xml found in ZooKeeper. Loading...
   [junit4]   2> 1744097 INFO  (jetty-launcher-1806-thread-5) [    ] o.a.s.c.CoreContainer Loading cores into CoreContainer [instanceDir=/export/home/jenkins/workspace/Lucene-Solr-master-Solaris/solr/build/solr-core/test/J1/temp/solr.cloud.TestTolerantUpdateProcessorCloud_971B2403FEDE5916-001/tempDir-001/node5]
   [junit4]   2> 1744099 WARN  (jetty-launcher-1806-thread-5) [    ] o.a.s.c.CoreContainer Couldn't add files from /export/home/jenkins/workspace/Lucene-Solr-master-Solaris/solr/build/solr-core/test/J1/temp/solr.cloud.TestTolerantUpdateProcessorCloud_971B2403FEDE5916-001/tempDir-001/node5/lib to classpath: /export/home/jenkins/workspace/Lucene-Solr-master-Solaris/solr/build/solr-core/test/J1/temp/solr.cloud.TestTolerantUpdateProcessorCloud_971B2403FEDE5916-001/tempDir-001/node5/lib
   [junit4]   2> 1744100 INFO  (jetty-launcher-1806-thread-5) [    ] o.a.s.h.c.HttpShardHandlerFactory created with socketTimeout : 90000,urlScheme : ,connTimeout : 15000,maxConnectionsPerHost : 20,maxConnections : 10000,corePoolSize : 0,maximumPoolSize : 2147483647,maxThreadIdleTime : 5,sizeOfQueue : -1,fairnessPolicy : false,
   [junit4]   2> 1744100 INFO  (jetty-launcher-1806-thread-3) [    ] o.a.s.u.UpdateShardHandler Creating UpdateShardHandler HTTP client with params: 
   [junit4]   2> 1744101 INFO  (jetty-launcher-1806-thread-5) [    ] o.a.s.u.UpdateShardHandler Creating UpdateShardHandler HTTP client with params: 
   [junit4]   2> 1744101 INFO  (jetty-launcher-1806-thread-3) [    ] o.a.s.l.LogWatcher SLF4J impl is org.slf4j.impl.Log4jLoggerFactory
   [junit4]   2> 1744101 INFO  (jetty-launcher-1806-thread-3) [    ] o.a.s.l.LogWatcher Registering Log Listener [Log4j (org.slf4j.impl.Log4jLoggerFactory)]
   [junit4]   2> 1744101 INFO  (jetty-launcher-1806-thread-3) [    ] o.a.s.c.ZkContainer Zookeeper client=127.0.0.1:47620/solr
   [junit4]   2> 1744101 INFO  (jetty-launcher-1806-thread-3) [    ] o.a.s.c.ZkController zkHost includes chroot
   [junit4]   2> 1744101 INFO  (jetty-launcher-1806-thread-3) [    ] o.a.s.c.c.SolrZkClient Using default ZkCredentialsProvider
   [junit4]   2> 1744102 INFO  (jetty-launcher-1806-thread-5) [    ] o.a.s.l.LogWatcher SLF4J impl is org.slf4j.impl.Log4jLoggerFactory
   [junit4]   2> 1744104 INFO  (jetty-launcher-1806-thread-5) [    ] o.a.s.l.LogWatcher Registering Log Listener [Log4j (org.slf4j.impl.Log4jLoggerFactory)]
   [junit4]   2> 1744104 INFO  (jetty-launcher-1806-thread-5) [    ] o.a.s.c.ZkContainer Zookeeper client=127.0.0.1:47620/solr
   [junit4]   2> 1744104 INFO  (jetty-launcher-1806-thread-5) [    ] o.a.s.c.ZkController zkHost includes chroot
   [junit4]   2> 1744105 INFO  (jetty-launcher-1806-thread-5) [    ] o.a.s.c.c.SolrZkClient Using default ZkCredentialsProvider
   [junit4]   2> 1744105 INFO  (jetty-launcher-1806-thread-5) [    ] o.a.s.c.c.ConnectionManager Waiting for client to connect to ZooKeeper
   [junit4]   2> 1744106 INFO  (zkCallback-1820-thread-1) [    ] o.a.s.c.c.ConnectionManager Watcher org.apache.solr.common.cloud.ConnectionManager@43ba603b name:ZooKeeperConnection Watcher:127.0.0.1:47620 got event WatchedEvent state:SyncConnected type:None path:null path:null type:None
   [junit4]   2> 1744107 INFO  (jetty-launcher-1806-thread-2) [    ] o.a.s.c.CorePropertiesLocator Config-defined core root directory: /export/home/jenkins/workspace/Lucene-Solr-master-Solaris/solr/build/solr-core/test/J1/temp/solr.cloud.TestTolerantUpdateProcessorCloud_971B2403FEDE5916-001/tempDir-001/node2/.
   [junit4]   2> 1744107 INFO  (zkCallback-1821-thread-1) [    ] o.a.s.c.c.ConnectionManager Watcher org.apache.solr.common.cloud.ConnectionManager@3bcded53 name:ZooKeeperConnection Watcher:127.0.0.1:47620 got event WatchedEvent state:SyncConnected type:None path:null path:null type:None
   [junit4]   2> 1744107 INFO  (jetty-launcher-1806-thread-2) [    ] o.a.s.c.CoreContainer New CoreContainer 747280223
   [junit4]   2> 1744108 INFO  (jetty-launcher-1806-thread-2) [    ] o.a.s.c.CoreContainer Loading cores into CoreContainer [instanceDir=/export/home/jenkins/workspace/Lucene-Solr-master-Solaris/solr/build/solr-core/test/J1/temp/solr.cloud.TestTolerantUpdateProcessorCloud_971B2403FEDE5916-001/tempDir-001/node2]
   [junit4]   2> 1744108 INFO  (jetty-launcher-1806-thread-5) [    ] o.a.s.c.c.ConnectionManager Client is connected to ZooKeeper
   [junit4]   2> 1744108 WARN  (jetty-launcher-1806-thread-2) [    ] o.a.s.c.CoreContainer Couldn't add files from /export/home/jenkins/workspace/Lucene-Solr-master-Solaris/solr/build/solr-core/test/J1/temp/solr.cloud.TestTolerantUpdateProcessorCloud_971B2403FEDE5916-001/tempDir-001/node2/lib to classpath: /export/home/jenkins/workspace/Lucene-Solr-master-Solaris/solr/build/solr-core/test/J1/temp/solr.cloud.TestTolerantUpdateProcessorCloud_971B2403FEDE5916-001/tempDir-001/node2/lib
   [junit4]   2> 1744108 INFO  (jetty-launcher-1806-thread-5) [    ] o.a.s.c.c.SolrZkClient Using default ZkACLProvider
   [junit4]   2> 1744108 INFO  (jetty-launcher-1806-thread-2) [    ] o.a.s.h.c.HttpShardHandlerFactory created with socketTimeout : 90000,urlScheme : ,connTimeout : 15000,maxConnectionsPerHost : 20,maxConnections : 10000,corePoolSize : 0,maximumPoolSize : 2147483647,maxThreadIdleTime : 5,sizeOfQueue : -1,fairnessPolicy : false,
   [junit4]   2> 1744103 INFO  (jetty-launcher-1806-thread-4) [n:127.0.0.1:54732_solr    ] o.a.s.c.ZkController Added new OnReconnect listener org.apache.solr.cloud.ZkController$$Lambda$46/721355558@bb3fe29
   [junit4]   2> 1744102 INFO  (jetty-launcher-1806-thread-3) [    ] o.a.s.c.c.ConnectionManager Waiting for client to connect to ZooKeeper
   [junit4]   2> 1744109 INFO  (jetty-launcher-1806-thread-4) [n:127.0.0.1:54732_solr    ] o.a.s.c.c.ConnectionManager Waiting for client to connect to ZooKeeper
   [junit4]   2> 1744109 INFO  (jetty-launcher-1806-thread-3) [    ] o.a.s.c.c.ConnectionManager Client is connected to ZooKeeper
   [junit4]   2> 1744109 INFO  (jetty-launcher-1806-thread-2) [    ] o.a.s.u.UpdateShardHandler Creating UpdateShardHandler HTTP client with params: 
   [junit4]   2> 1744109 INFO  (jetty-launcher-1806-thread-3) [    ] o.a.s.c.c.SolrZkClient Using default ZkACLProvider
   [junit4]   2> 1744110 INFO  (jetty-launcher-1806-thread-2) [    ] o.a.s.l.LogWatcher SLF4J impl is org.slf4j.impl.Log4jLoggerFactory
   [junit4]   2> 1744110 INFO  (jetty-launcher-1806-thread-2) [    ] o.a.s.l.LogWatcher Registering Log Listener [Log4j (org.slf4j.impl.Log4jLoggerFactory)]
   [junit4]   2> 1744110 INFO  (jetty-launcher-1806-thread-2) [    ] o.a.s.c.ZkContainer Zookeeper client=127.0.0.1:47620/solr
   [junit4]   2> 1744110 INFO  (jetty-launcher-1806-thread-2) [    ] o.a.s.c.ZkController zkHost includes chroot
   [junit4]   2> 1744110 INFO  (jetty-launcher-1806-thread-2) [    ] o.a.s.c.c.SolrZkClient Using default ZkCredentialsProvider
   [junit4]   2> 1744111 INFO  (jetty-launcher-1806-thread-2) [    ] o.a.s.c.c.ConnectionManager Waiting for client to connect to ZooKeeper
   [junit4]   2> 1744111 INFO  (zkCallback-1822-thread-1-processing-n:127.0.0.1:54732_solr) [n:127.0.0.1:54732_solr    ] o.a.s.c.c.ConnectionManager Watcher org.apache.solr.common.cloud.ConnectionManager@2ddb184c name:ZooKeeperConnection Watcher:127.0.0.1:47620/solr got event WatchedEvent state:SyncConnected type:None path:null path:null type:None
   [junit4]   2> 1744112 INFO  (jetty-launcher-1806-thread-4) [n:127.0.0.1:54732_solr    ] o.a.s.c.c.ConnectionManager Client is connected to ZooKeeper
   [junit4]   2> 1744114 INFO  (jetty-launcher-1806-thread-5) [n:127.0.0.1:42684_solr    ] o.a.s.c.ZkController Added new OnReconnect listener org.apache.solr.cloud.ZkController$$Lambda$46/721355558@2fef5b0
   [junit4]   2> 1744114 INFO  (jetty-launcher-1806-thread-1) [    ] o.a.s.c.CorePropertiesLocator Config-defined core root directory: /export/home/jenkins/workspace/Lucene-Solr-master-Solaris/solr/build/solr-core/test/J1/temp/solr.cloud.TestTolerantUpdateProcessorCloud_971B2403FEDE5916-001/tempDir-001/node1/.
   [junit4]   2> 1744114 INFO  (jetty-launcher-1806-thread-1) [    ] o.a.s.c.CoreContainer New CoreContainer 962875080
   [junit4]   2> 1744114 INFO  (jetty-launcher-1806-thread-1) [    ] o.a.s.c.CoreContainer Loading cores into CoreContainer [instanceDir=/export/home/jenkins/workspace/Lucene-Solr-master-Solaris/solr/build/solr-core/test/J1/temp/solr.cloud.TestTolerantUpdateProcessorCloud_971B2403FEDE5916-001/tempDir-001/node1]
   [junit4]   2> 1744114 WARN  (jetty-launcher-1806-thread-1) [    ] o.a.s.c.CoreContainer Couldn't add files from /export/home/jenkins/workspace/Lucene-Solr-master-Solaris/solr/build/solr-core/test/J1/temp/solr.cloud.TestTolerantUpdateProcessorCloud_971B2403FEDE5916-001/tempDir-001/node1/lib to classpath: /export/home/jenkins/workspace/Lucene-Solr-master-Solaris/solr/build/solr-core/test/J1/temp/solr.cloud.TestTolerantUpdateProcessorCloud_971B2403FEDE5916-001/tempDir-001/node1/lib
   [junit4]   2> 1744116 INFO  (jetty-launcher-1806-thread-1) [    ] o.a.s.h.c.HttpShardHandlerFactory created with socketTimeout : 90000,urlScheme : ,connTimeout : 15000,maxConnectionsPerHost : 20,maxConnections : 10000,corePoolSize : 0,maximumPoolSize : 2147483647,maxThreadIdleTime : 5,sizeOfQueue : -1,fairnessPolicy : false,
   [junit4]   2> 1744116 INFO  (jetty-launcher-1806-thread-4) [n:127.0.0.1:54732_solr    ] o.a.s.c.c.SolrZkClient makePath: /overseer/queue
   [junit4]   2> 1744115 INFO  (zkCallback-1825-thread-1) [    ] o.a.s.c.c.ConnectionManager Watcher org.apache.solr.common.cloud.ConnectionManager@7148d6e5 name:ZooKeeperConnection Watcher:127.0.0.1:47620 got event WatchedEvent state:SyncConnected type:None path:null path:null type:None
   [junit4]   2> 1744114 INFO  (jetty-launcher-1806-thread-5) [n:127.0.0.1:42684_solr    ] o.a.s.c.c.ConnectionManager Waiting for client to connect to ZooKeeper
   [junit4]   2> 1744116 INFO  (jetty-launcher-1806-thread-2) [    ] o.a.s.c.c.ConnectionManager Client is connected to ZooKeeper
   [junit4]   2> 1744117 INFO  (jetty-launcher-1806-thread-3) [n:127.0.0.1:64919_solr    ] o.a.s.c.ZkController Added new OnReconnect listener org.apache.solr.cloud.ZkController$$Lambda$46/721355558@7211c49d
   [junit4]   2> 1744117 INFO  (jetty-launcher-1806-thread-1) [    ] o.a.s.u.UpdateShardHandler Creating UpdateShardHandler HTTP client with params: 
   [junit4]   2> 1744117 INFO  (jetty-launcher-1806-thread-2) [    ] o.a.s.c.c.SolrZkClient Using default ZkACLProvider
   [junit4]   2> 1744117 INFO  (jetty-launcher-1806-thread-3) [n:127.0.0.1:64919_solr    ] o.a.s.c.c.ConnectionManager Waiting for client to connect to ZooKeeper
   [junit4]   2> 1744117 INFO  (jetty-launcher-1806-thread-1) [    ] o.a.s.l.LogWatcher SLF4J impl is org.slf4j.impl.Log4jLoggerFactory
   [junit4]   2> 1744117 INFO  (jetty-launcher-1806-thread-1) [    ] o.a.s.l.LogWatcher Registering Log Listener [Log4j (org.slf4j.impl.Log4jLoggerFactory)]
   [junit4]   2> 1744117 INFO  (jetty-launcher-1806-thread-1) [    ] o.a.s.c.ZkContainer Zookeeper client=127.0.0.1:47620/solr
   [junit4]   2> 1744118 INFO  (jetty-launcher-1806-thread-1) [    ] o.a.s.c.ZkController zkHost includes chroot
   [junit4]   2> 1744118 INFO  (jetty-launcher-1806-thread-1) [    ] o.a.s.c.c.SolrZkClient Using default ZkCredentialsProvider
   [junit4]   2> 1744118 INFO  (jetty-launcher-1806-thread-1) [    ] o.a.s.c.c.ConnectionManager Waiting for client to connect to ZooKeeper
   [junit4]   2> 1744119 INFO  (jetty-launcher-1806-thread-2) [n:127.0.0.1:40163_solr    ] o.a.s.c.ZkController Added new OnReconnect listener org.apache.solr.cloud.ZkController$$Lambda$46/721355558@6a59b356
   [junit4]   2> 1744120 INFO  (zkCallback-1826-thread-1-processing-n:127.0.0.1:42684_solr) [n:127.0.0.1:42684_solr    ] o.a.s.c.c.ConnectionManager Watcher org.apache.solr.common.cloud.ConnectionManager@6ad196b1 name:ZooKeeperConnection Watcher:127.0.0.1:47620/solr got event WatchedEvent state:SyncConnected type:None path:null path:null type:None
   [junit4]   2> 1744121 INFO  (jetty-launcher-1806-thread-2) [n:127.0.0.1:40163_solr    ] o.a.s.c.c.ConnectionManager Waiting for client to connect to ZooKeeper
   [junit4]   2> 1744121 INFO  (jetty-launcher-1806-thread-5) [n:127.0.0.1:42684_solr    ] o.a.s.c.c.ConnectionManager Client is connected to ZooKeeper
   [junit4]   2> 1744121 INFO  (zkCallback-1827-thread-1-processing-n:127.0.0.1:64919_solr) [n:127.0.0.1:64919_solr    ] o.a.s.c.c.ConnectionManager Watcher org.apache.solr.common.cloud.ConnectionManager@16140399 name:ZooKeeperConnection Watcher:127.0.0.1:47620/solr got event WatchedEvent state:SyncConnected type:None path:null path:null type:None
   [junit4]   2> 1744121 INFO  (jetty-launcher-1806-thread-3) [n:127.0.0.1:64919_solr    ] o.a.s.c.c.ConnectionManager Client is connected to ZooKeeper
   [junit4]   2> 1744122 INFO  (zkCallback-1831-thread-1-processing-n:127.0.0.1:40163_solr) [n:127.0.0.1:40163_solr    ] o.a.s.c.c.ConnectionManager Watcher org.apache.solr.common.cloud.ConnectionManager@612d4e34 name:ZooKeeperConnection Watcher:127.0.0.1:47620/solr got event WatchedEvent state:SyncConnected type:None path:null path:null type:None
   [junit4]   2> 1744123 INFO  (zkCallback-1830-thread-1) [    ] o.a.s.c.c.ConnectionManager Watcher org.apache.solr.common.cloud.ConnectionManager@5ee5aff1 name:ZooKeeperConnection Watcher:127.0.0.1:47620 got event WatchedEvent state:SyncConnected type:None path:null path:null type:None
   [junit4]   2> 1744123 INFO  (jetty-launcher-1806-thread-2) [n:127.0.0.1:40163_solr    ] o.a.s.c.c.ConnectionManager Client is connected to ZooKeeper
   [junit4]   2> 1744123 INFO  (jetty-launcher-1806-thread-1) [    ] o.a.s.c.c.ConnectionManager Client is connected to ZooKeeper
   [junit4]   2> 1744123 INFO  (jetty-launcher-1806-thread-1) [    ] o.a.s.c.c.SolrZkClient Using default ZkACLProvider
   [junit4]   2> 1744124 INFO  (jetty-launcher-1806-thread-1) [n:127.0.0.1:45196_solr    ] o.a.s.c.ZkController Added new OnReconnect listener org.apache.solr.cloud.ZkController$$Lambda$46/721355558@26ef56e9
   [junit4]   2> 1744125 INFO  (jetty-launcher-1806-thread-5) [n:127.0.0.1:42684_solr    ] o.a.s.c.c.SolrZkClient makePath: /overseer/collection-queue-work
   [junit4]   2> 1744125 INFO  (jetty-launcher-1806-thread-4) [n:127.0.0.1:54732_solr    ] o.a.s.c.c.SolrZkClient makePath: /overseer/collection-queue-work
   [junit4]   2> 1744125 INFO  (jetty-launcher-1806-thread-1) [n:127.0.0.1:45196_solr    ] o.a.s.c.c.ConnectionManager Waiting for client to connect to ZooKeeper
   [junit4]   2> 1744126 INFO  (jetty-launcher-1806-thread-3) [n:127.0.0.1:64919_solr    ] o.a.s.c.c.SolrZkClient makePath: /overseer/collection-queue-work
   [junit4]   2> 1744126 INFO  (zkCallback-1832-thread-1-processing-n:127.0.0.1:45196_solr) [n:127.0.0.1:45196_solr    ] o.a.s.c.c.ConnectionManager Watcher org.apache.solr.common.cloud.ConnectionManager@3f4241c5 name:ZooKeeperConnection Watcher:127.0.0.1:47620/solr got event WatchedEvent state:SyncConnected type:None path:null path:null type:None
   [junit4]   2> 1744127 INFO  (jetty-launcher-1806-thread-2) [n:127.0.0.1:40163_solr    ] o.a.s.c.c.SolrZkClient makePath: /overseer/collection-queue-work
   [junit4]   2> 1744127 INFO  (jetty-launcher-1806-thread-1) [n:127.0.0.1:45196_solr    ] o.a.s.c.c.ConnectionManager Client is connected to ZooKeeper
   [junit4]   2> 1744131 INFO  (jetty-launcher-1806-thread-4) [n:127.0.0.1:54732_solr    ] o.a.s.c.c.SolrZkClient makePath: /overseer/collection-map-running
   [junit4]   2> 1744132 INFO  (jetty-launcher-1806-thread-5) [n:127.0.0.1:42684_solr    ] o.a.s.c.c.SolrZkClient makePath: /overseer/collection-map-running
   [junit4]   2> 1744132 INFO  (jetty-launcher-1806-thread-1) [n:127.0.0.1:45196_solr    ] o.a.s.c.c.SolrZkClient makePath: /overseer/collection-map-running
   [junit4]   2> 1744132 INFO  (jetty-launcher-1806-thread-2) [n:127.0.0.1:40163_solr    ] o.a.s.c.c.SolrZkClient makePath: /overseer/collection-map-running
   [junit4]   2> 1744133 INFO  (jetty-launcher-1806-thread-3) [n:127.0.0.1:64919_solr    ] o.a.s.c.c.SolrZkClient makePath: /overseer/collection-map-running
   [junit4]   2> 1744135 INFO  (jetty-launcher-1806-thread-1) [n:127.0.0.1:45196_solr    ] o.a.s.c.c.SolrZkClient makePath: /overseer/collection-map-completed
   [junit4]   2> 1744135 INFO  (jetty-launcher-1806-thread-4) [n:127.0.0.1:54732_solr    ] o.a.s.c.c.SolrZkClient makePath: /overseer/collection-map-completed
   [junit4]   2> 1744136 INFO  (jetty-launcher-1806-thread-5) [n:127.0.0.1:42684_solr    ] o.a.s.c.c.SolrZkClient makePath: /overseer/collection-map-completed
   [junit4]   2> 1744137 INFO  (jetty-launcher-1806-thread-2) [n:127.0.0.1:40163_solr    ] o.a.s.c.c.SolrZkClient makePath: /overseer/collection-map-completed
   [junit4]   2> 1744139 INFO  (jetty-launcher-1806-thread-3) [n:127.0.0.1:64919_solr    ] o.a.s.c.c.SolrZkClient makePath: /overseer/collection-map-failure
   [junit4]   2> 1744139 INFO  (jetty-launcher-1806-thread-5) [n:127.0.0.1:42684_solr    ] o.a.s.c.c.SolrZkClient makePath: /overseer/collection-map-failure
   [junit4]   2> 1744139 INFO  (jetty-launcher-1806-thread-4) [n:127.0.0.1:54732_solr    ] o.a.s.c.c.SolrZkClient makePath: /overseer/collection-map-failure
   [junit4]   2> 1744139 INFO  (jetty-launcher-1806-thread-1) [n:127.0.0.1:45196_solr    ] o.a.s.c.c.SolrZkClient makePath: /overseer/collection-map-failure
   [junit4]   2> 1744142 INFO  (jetty-launcher-1806-thread-5) [n:127.0.0.1:42684_solr    ] o.a.s.c.c.SolrZkClient makePath: /live_nodes
   [junit4]   2> 1744142 INFO  (jetty-launcher-1806-thread-4) [n:127.0.0.1:54732_solr    ] o.a.s.c.c.SolrZkClient makePath: /live_nodes
   [junit4]   2> 1744142 INFO  (jetty-launcher-1806-thread-3) [n:127.0.0.1:64919_solr    ] o.a.s.c.c.SolrZkClient makePath: /live_nodes
   [junit4]   2> 1744142 INFO  (jetty-launcher-1806-thread-2) [n:127.0.0.1:40163_solr    ] o.a.s.c.c.SolrZkClient makePath: /live_nodes
   [junit4]   2> 1744143 INFO  (jetty-launcher-1806-thread-1) [n:127.0.0.1:45196_solr    ] o.a.s.c.c.SolrZkClient makePath: /live_nodes
   [junit4]   2> 1744144 INFO  (jetty-launcher-1806-thread-5) [n:127.0.0.1:42684_solr    ] o.a.s.c.c.SolrZkClient makePath: /collections
   [junit4]   2> 1744144 INFO  (jetty-launcher-1806-thread-3) [n:127.0.0.1:64919_solr    ] o.a.s.c.c.SolrZkClient makePath: /collections
   [junit4]   2> 1744144 INFO  (jetty-launcher-1806-thread-2) [n:127.0.0.1:40163_solr    ] o.a.s.c.c.SolrZkClient makePath: /collections
   [junit4]   2> 1744145 INFO  (jetty-launcher-1806-thread-4) [n:127.0.0.1:54732_solr    ] o.a.s.c.c.SolrZkClient makePath: /collections
   [junit4]   2> 1744145 INFO  (jetty-launcher-1806-thread-1) [n:127.0.0.1:45196_solr    ] o.a.s.c.c.SolrZkClient makePath: /collections
   [junit4]   2> 1744146 INFO  (jetty-launcher-1806-thread-3) [n:127.0.0.1:64919_solr    ] o.a.s.c.c.SolrZkClient makePath: /aliases.json
   [junit4]   2> 1744147 INFO  (jetty-launcher-1806-thread-4) [n:127.0.0.1:54732_solr    ] o.a.s.c.c.SolrZkClient makePath: /aliases.json
   [junit4]   2> 1744147 INFO  (jetty-launcher-1806-thread-2) [n:127.0.0.1:40163_solr    ] o.a.s.c.c.SolrZkClient makePath: /aliases.json
   [junit4]   2> 1744148 INFO  (jetty-launcher-1806-thread-1) [n:127.0.0.1:45196_solr    ] o.a.s.c.c.SolrZkClient makePath: /aliases.json
   [junit4]   2> 1744148 INFO  (jetty-launcher-1806-thread-5) [n:127.0.0.1:42684_solr    ] o.a.s.c.c.SolrZkClient makePath: /aliases.json
   [junit4]   2> 1744149 INFO  (jetty-launcher-1806-thread-3) [n:127.0.0.1:64919_solr    ] o.a.s.c.c.SolrZkClient makePath: /clusterstate.json
   [junit4]   2> 1744149 INFO  (jetty-launcher-1806-thread-4) [n:127.0.0.1:54732_solr    ] o.a.s.c.c.SolrZkClient makePath: /clusterstate.json
   [junit4]   2> 1744149 INFO  (jetty-launcher-1806-thread-2) [n:127.0.0.1:40163_solr    ] o.a.s.c.c.SolrZkClient makePath: /clusterstate.json
   [junit4]   2> 1744152 INFO  (jetty-launcher-1806-thread-1) [n:127.0.0.1:45196_solr    ] o.a.s.c.c.SolrZkClient makePath: /security.json
   [junit4]   2> 1744152 INFO  (jetty-launcher-1806-thread-2) [n:127.0.0.1:40163_solr    ] o.a.s.c.c.SolrZkClient makePath: /security.json
   [junit4]   2> 1744152 INFO  (jetty-launcher-1806-thread-3) [n:127.0.0.1:64919_solr    ] o.a.s.c.c.SolrZkClient makePath: /security.json
   [junit4]   2> 1744152 INFO  (jetty-launcher-1806-thread-5) [n:127.0.0.1:42684_solr    ] o.a.s.c.c.SolrZkClient makePath: /security.json
   [junit4]   2> 1744152 INFO  (jetty-launcher-1806-thread-4) [n:127.0.0.1:54732_solr    ] o.a.s.c.c.SolrZkClient makePath: /security.json
   [junit4]   2> 1744153 INFO  (jetty-launcher-1806-thread-4) [n:127.0.0.1:54732_solr    ] o.a.s.c.c.ZkStateReader Updating cluster state from ZooKeeper... 
   [junit4]   2> 1744153 INFO  (jetty-launcher-1806-thread-1) [n:127.0.0.1:45196_solr    ] o.a.s.c.c.ZkStateReader Updating cluster state from ZooKeeper... 
   [junit4]   2> 1744153 INFO  (jetty-launcher-1806-thread-2) [n:127.0.0.1:40163_solr    ] o.a.s.c.c.ZkStateReader Updating cluster state from ZooKeeper... 
   [junit4]   2> 1744154 INFO  (jetty-launcher-1806-thread-3) [n:127.0.0.1:64919_solr    ] o.a.s.c.c.ZkStateReader Updating cluster state from ZooKeeper... 
   [junit4]   2> 1744154 INFO  (jetty-launcher-1806-thread-5) [n:127.0.0.1:42684_solr    ] o.a.s.c.c.ZkStateReader Updating cluster state from ZooKeeper... 
   [junit4]   2> 1744155 INFO  (jetty-launcher-1806-thread-1) [n:127.0.0.1:45196_solr    ] o.a.s.c.c.ZkStateReader Loaded empty cluster properties
   [junit4]   2> 1744155 INFO  (jetty-launcher-1806-thread-2) [n:127.0.0.1:40163_solr    ] o.a.s.c.c.ZkStateReader Loaded empty cluster properties
   [junit4]   2> 1744156 INFO  (jetty-launcher-1806-thread-4) [n:127.0.0.1:54732_solr    ] o.a.s.c.c.ZkStateReader Loaded empty cluster properties
   [junit4]   2> 1744156 INFO  (jetty-launcher-1806-thread-1) [n:127.0.0.1:45196_solr    ] o.a.s.c.c.ZkStateReader Updated live nodes from ZooKeeper... (0) -> (0)
   [junit4]   2> 1744157 INFO  (jetty-launcher-1806-thread-5) [n:127.0.0.1:42684_solr    ] o.a.s.c.c.ZkStateReader Loaded empty cluster properties
   [junit4]   2> 1744157 INFO  (jetty-launcher-1806-thread-2) [n:127.0.0.1:40163_solr    ] o.a.s.c.c.ZkStateReader Updated live nodes from ZooKeeper... (0) -> (0)
   [junit4]   2> 1744157 INFO  (jetty-launcher-1806-thread-4) [n:127.0.0.1:54732_solr    ] o.a.s.c.c.ZkStateReader Updated live nodes from ZooKeeper... (0) -> (0)
   [junit4]   2> 1744159 INFO  (jetty-launcher-1806-thread-5) [n:127.0.0.1:42684_solr    ] o.a.s.c.c.ZkStateReader Updated live nodes from ZooKeeper... (0) -> (0)
   [junit4]   2> 1744161 INFO  (jetty-launcher-1806-thread-3) [n:127.0.0.1:64919_solr    ] o.a.s.c.c.ZkStateReader Loaded empty cluster properties
   [junit4]   2> 1744164 INFO  (jetty-launcher-1806-thread-3) [n:127.0.0.1:64919_solr    ] o.a.s.c.c.ZkStateReader Updated live nodes from ZooKeeper... (0) -> (0)
   [junit4]   2> 1744164 INFO  (jetty-launcher-1806-thread-1) [n:127.0.0.1:45196_solr    ] o.a.s.c.c.SolrZkClient makePath: /overseer_elect
   [junit4]   2> 1744166 INFO  (jetty-launcher-1806-thread-4) [n:127.0.0.1:54732_solr    ] o.a.s.c.c.SolrZkClient makePath: /overseer_elect/election
   [junit4]   2> 1744167 INFO  (jetty-launcher-1806-thread-1) [n:127.0.0.1:45196_solr    ] o.a.s.c.c.SolrZkClient makePath: /overseer_elect/election
   [junit4]   2> 1744167 INFO  (jetty-launcher-1806-thread-2) [n:127.0.0.1:40163_solr    ] o.a.s.c.c.SolrZkClient makePath: /overseer_elect/election
   [junit4]   2> 1744168 INFO  (jetty-launcher-1806-thread-5) [n:127.0.0.1:42684_solr    ] o.a.s.c.c.SolrZkClient makePath: /overseer_elect/election
   [junit4]   2> 1744169 INFO  (jetty-launcher-1806-thread-3) [n:127.0.0.1:64919_solr    ] o.a.s.c.Overseer Overseer (id=null) closing
   [junit4]   2> 1744169 INFO  (jetty-launcher-1806-thread-4) [n:127.0.0.1:54732_solr    ] o.a.s.c.Overseer Overseer (id=null) closing
   [junit4]   2> 1744169 INFO  (jetty-launcher-1806-thread-1) [n:127.0.0.1:45196_solr    ] o.a.s.c.Overseer Overseer (id=null) closing
   [junit4]   2> 1744169 INFO  (jetty-launcher-1806-thread-2) [n:127.0.0.1:40163_solr    ] o.a.s.c.Overseer Overseer (id=null) closing
   [junit4]   2> 1744170 INFO  (jetty-launcher-1806-thread-3) [n:127.0.0.1:64919_solr    ] o.a.s.c.LeaderElector Joined leadership election with path: /overseer_elect/election/95899761919328268-127.0.0.1:64919_solr-n_0000000000
   [junit4]   2> 1744170 INFO  (jetty-launcher-1806-thread-5) [n:127.0.0.1:42684_solr    ] o.a.s.c.Overseer Overseer (id=null) closing
   [junit4]   2> 1744171 INFO  (jetty-launcher-1806-thread-4) [n:127.0.0.1:54732_solr    ] o.a.s.c.LeaderElector Joined leadership election with path: /overseer_elect/election/95899761919328265-127.0.0.1:54732_solr-n_0000000001
   [junit4]   2> 1744171 INFO  (jetty-launcher-1806-thread-1) [n:127.0.0.1:45196_solr    ] o.a.s.c.LeaderElector Joined leadership election with path: /overseer_elect/election/95899761919328271-127.0.0.1:45196_solr-n_0000000002
   [junit4]   2> 1744171 INFO  (jetty-launcher-1806-thread-2) [n:127.0.0.1:40163_solr    ] o.a.s.c.LeaderElector Joined leadership election with path: /overseer_elect/election/95899761919328270-127.0.0.1:40163_solr-n_0000000003
   [junit4]   2> 1744171 INFO  (jetty-launcher-1806-thread-3) [n:127.0.0.1:64919_solr    ] o.a.s.c.OverseerElectionContext I am going to be the leader 127.0.0.1:64919_solr
   [junit4]   2> 1744171 INFO  (jetty-launcher-1806-thread-3) [n:127.0.0.1:64919_solr    ] o.a.s.c.c.SolrZkClient makePath: /overseer_elect/leader
   [junit4]   2> 1744171 INFO  (jetty-launcher-1806-thread-5) [n:127.0.0.1:42684_solr    ] o.a.s.c.LeaderElector Joined leadership election with path: /overseer_elect/election/95899761919328267-127.0.0.1:42684_solr-n_0000000004
   [junit4]   2> 1744172 INFO  (jetty-launcher-1806-thread-4) [n:127.0.0.1:54732_solr    ] o.a.s.c.LeaderElector Watching path /overseer_elect/election/95899761919328268-127.0.0.1:64919_solr-n_0000000000 to know if I could be the leader
   [junit4]   2> 1744172 INFO  (jetty-launcher-1806-thread-1) [n:127.0.0.1:45196_solr    ] o.a.s.c.LeaderElector Watching path /overseer_elect/election/95899761919328265-127.0.0.1:54732_solr-n_0000000001 to know if I could be the leader
   [junit4]   2> 1744172 INFO  (jetty-launcher-1806-thread-2) [n:127.0.0.1:40163_solr    ] o.a.s.c.LeaderElector Watching path /overseer_elect/election/95899761919328271-127.0.0.1:45196_solr-n_0000000002 to know if I could be the leader
   [junit4]   2> 1744173 INFO  (jetty-launcher-1806-thread-5) [n:127.0.0.1:42684_solr    ] o.a.s.c.LeaderElector Watching path /overseer_elect/election/95899761919328270-127.0.0.1:40163_solr-n_0000000003 to know if I could be the leader
   [junit4]   2> 1744173 INFO  (jetty-launcher-1806-thread-4) [n:127.0.0.1:54732_solr    ] o.a.s.c.ZkController Register node as live in ZooKeeper:/live_nodes/127.0.0.1:54732_solr
   [junit4]   2> 1744173 INFO  (jetty-launcher-1806-thread-5) [n:127.0.0.1:42684_solr    ] o.a.s.c.ZkController Register node as live in ZooKeeper:/live_nodes/127.0.0.1:42684_solr
   [junit4]   2> 1744173 INFO  (jetty-launcher-1806-thread-1) [n:127.0.0.1:45196_solr    ] o.a.s.c.ZkController Register node as live in ZooKeeper:/live_nodes/127.0.0.1:45196_solr
   [junit4]   2> 1744174 INFO  (jetty-launcher-1806-thread-3) [n:127.0.0.1:64919_solr    ] o.a.s.c.Overseer Overseer (id=95899761919328268-127.0.0.1:64919_solr-n_0000000000) starting
   [junit4]   2> 1744174 INFO  (jetty-launcher-1806-thread-2) [n:127.0.0.1:40163_solr    ] o.a.s.c.ZkController Register node as live in ZooKeeper:/live_nodes/127.0.0.1:40163_solr
   [junit4]   2> 1744174 INFO  (jetty-launcher-1806-thread-4) [n:127.0.0.1:54732_solr    ] o.a.s.c.c.SolrZkClient makePath: /live_nodes/127.0.0.1:54732_solr
   [junit4]   2> 1744174 INFO  (jetty-launcher-1806-thread-5) [n:127.0.0.1:42684_solr    ] o.a.s.c.c.SolrZkClient makePath: /live_nodes/127.0.0.1:42684_solr
   [junit4]   2> 1744174 INFO  (jetty-launcher-1806-thread-1) [n:127.0.0.1:45196_solr    ] o.a.s.c.c.SolrZkClient makePath: /live_nodes/127.0.0.1:45196_solr
   [junit4]   2> 1744175 INFO  (jetty-launcher-1806-thread-2) [n:127.0.0.1:40163_solr    ] o.a.s.c.c.SolrZkClient makePath: /live_nodes/127.0.0.1:40163_solr
   [junit4]   2> 1744177 INFO  (zkCallback-1822-thread-1-processing-n:127.0.0.1:54732_solr) [n:127.0.0.1:54732_solr    ] o.a.s.c.c.ZkStateReader A live node change: [WatchedEvent state:SyncConnected type:NodeChildrenChanged path:/live_nodes], has occurred - updating... (live nodes size: [0])
   [junit4]   2> 1744177 INFO  (zkCallback-1826-thread-1-processing-n:127.0.0.1:42684_solr) [n:127.0.0.1:42684_solr    ] o.a.s.c.c.ZkStateReader A live node change: [WatchedEvent state:SyncConnected type:NodeChildrenChanged path:/live_nodes], has occurred - updating... (live nodes size: [0])
   [junit4]   2> 1744177 INFO  (zkCallback-1832-thread-1-processing-n:127.0.0.1:45196_solr) [n:127.0.0.1:45196_solr    ] o.a.s.c.c.ZkStateReader A live node change: [WatchedEvent state:SyncConnected type:NodeChildrenChanged path:/live_nodes], has occurred - updating... (live nodes size: [0])
   [junit4]   2> 1744179 INFO  (zkCallback-1826-thread-1-processing-n:127.0.0.1:42684_solr) [n:127.0.0.1:42684_solr    ] o.a.s.c.c.ZkStateReader Updated live nodes from ZooKeeper... (0) -> (4)
   [junit4]   2> 1744181 INFO  (zkCallback-1822-thread-1-processing-n:127.0.0.1:54732_solr) [n:127.0.0.1:54732_solr    ] o.a.s.c.c.ZkStateReader Updated live nodes from ZooKeeper... (0) -> (4)
   [junit4]   2> 1744183 INFO  (zkCallback-1832-thread-1-processing-n:127.0.0.1:45196_solr) [n:127.0.0.1:45196_solr    ] o.a.s.c.c.ZkStateReader Updated live nodes from ZooKeeper... (0) -> (4)
   [junit4]   2> 1744182 INFO  (zkCallback-1827-thread-1-processing-n:127.0.0.1:64919_solr) [n:127.0.0.1:64919_solr    ] o.a.s.c.c.ZkStateReader A live node change: [WatchedEvent state:SyncConnected type:NodeChildrenChanged path:/live_nodes], has occurred - updating... (live nodes size: [0])
   [junit4]   2> 1744187 INFO  (zkCallback-1831-thread-1-processing-n:127.0.0.1:40163_solr) [n:127.0.0.1:40163_solr    ] o.a.s.c.c.ZkStateReader A live node change: [WatchedEvent state:SyncConnected type:NodeChildrenChanged path:/live_nodes], has occurred - updating... (live nodes size: [0])
   [junit4]   2> 1744188 INFO  (zkCallback-1827-thread-1-processing-n:127.0.0.1:64919_solr) [n:127.0.0.1:64919_solr    ] o.a.s.c.c.ZkStateReader Updated live nodes from ZooKeeper... (0) -> (4)
   [junit4]   2> 1744190 INFO  (jetty-launcher-1806-thread-3) [n:127.0.0.1:64919_solr    ] o.a.s.c.c.SolrZkClient makePath: /overseer/queue-work
   [junit4]   2> 1744192 INFO  (zkCallback-1831-thread-1-processing-n:127.0.0.1:40163_solr) [n:127.0.0.1:40163_solr    ] o.a.s.c.c.ZkStateReader Updated live nodes from ZooKeeper... (0) -> (4)
   [junit4]   2> 1744216 INFO  (jetty-launcher-1806-thread-4) [n:127.0.0.1:54732_solr    ] o.a.s.c.CoreContainer Security conf doesn't exist. Skipping setup for authorization module.
   [junit4]   2> 1744216 INFO  (jetty-launcher-1806-thread-4) [n:127.0.0.1:54732_solr    ] o.a.s.c.CoreContainer No authentication plugin used.
   [junit4]   2> 1744217 INFO  (jetty-launcher-1806-thread-4) [n:127.0.0.1:54732_solr    ] o.a.s.c.CorePropertiesLocator Looking for core definitions underneath /export/home/jenkins/workspace/Lucene-Solr-master-Solaris/solr/build/solr-core/test/J1/temp/solr.cloud.TestTolerantUpdateProcessorCloud_971B2403FEDE5916-001/tempDir-001/node4/.
   [junit4]   2> 1744217 INFO  (jetty-launcher-1806-thread-4) [n:127.0.0.1:54732_solr    ] o.a.s.c.CorePropertiesLocator Found 0 core definitions
   [junit4]   2> 1744219 INFO  (jetty-launcher-1806-thread-3) [n:127.0.0.1:64919_solr    ] o.a.s.c.OverseerAutoReplicaFailoverThread Starting OverseerAutoReplicaFailoverThread autoReplicaFailoverWorkLoopDelay=10000 autoReplicaFailoverWaitAfterExpiration=30000 autoReplicaFailoverBadNodeExpiration=60000
   [junit4]   2> 1744220 INFO  (OverseerStateUpdate-95899761919328268-127.0.0.1:64919_solr-n_0000000000) [n:127.0.0.1:64919_solr    ] o.a.s.c.Overseer Starting to work on the main queue
   [junit4]   2> 1744220 INFO  (jetty-launcher-1806-thread-3) [n:127.0.0.1:64919_solr    ] o.a.s.c.ZkController Publish node=127.0.0.1:64919_solr as DOWN
   [junit4]   2> 1744221 INFO  (jetty-launcher-1806-thread-4) [n:127.0.0.1:54732_solr    ] o.a.s.s.SolrDispatchFilter user.dir=/export/home/jenkins/workspace/Lucene-Solr-master-Solaris/solr/build/solr-core/test/J1
   [junit4]   2> 1744221 INFO  (jetty-launcher-1806-thread-4) [n:127.0.0.1:54732_solr    ] o.a.s.s.SolrDispatchFilter SolrDispatchFilter.init() done
   [junit4]   2> 1744222 INFO  (OverseerStateUpdate-95899761919328268-127.0.0.1:64919_solr-n_0000000000) [n:127.0.0.1:64919_solr    ] o.a.s.c.c.ZkStateReader Updated live nodes from ZooKeeper... (4) -> (4)
   [junit4]   2> 1744224 INFO  (OverseerCollectionConfigSetProcessor-95899761919328268-127.0.0.1:64919_solr-n_0000000000) [n:127.0.0.1:64919_solr    ] o.a.s.c.OverseerTaskProcessor Process current queue of overseer operations
   [junit4]   2> 1744224 INFO  (jetty-launcher-1806-thread-1) [n:127.0.0.1:45196_solr    ] o.a.s.c.CoreContainer Security conf doesn't exist. Skipping setup for authorization module.
   [junit4]   2> 1744224 INFO  (jetty-launcher-1806-thread-1) [n:127.0.0.1:45196_solr    ] o.a.s.c.CoreContainer No authentication plugin used.
   [junit4]   2> 1744225 INFO  (jetty-launcher-1806-thread-1) [n:127.0.0.1:45196_solr    ] o.a.s.c.CorePropertiesLocator Looking for core definitions underneath /export/home/jenkins/workspace/Lucene-Solr-master-Solaris/solr/build/solr-core/test/J1/temp/solr.cloud.TestTolerantUpdateProcessorCloud_971B2403FEDE5916-001/tempDir-001/node1/.
   [junit4]   2> 1744226 INFO  (jetty-launcher-1806-thread-1) [n:127.0.0.1:45196_solr    ] o.a.s.c.CorePropertiesLocator Found 0 core definitions
   [junit4]   2> 1744227 INFO  (jetty-launcher-1806-thread-1) [n:127.0.0.1:45196_solr    ] o.a.s.s.SolrDispatchFilter user.dir=/export/home/jenkins/workspace/Lucene-Solr-master-Solaris/solr/build/solr-core/test/J1
   [junit4]   2> 1744227 INFO  (jetty-launcher-1806-thread-1) [n:127.0.0.1:45196_solr    ] o.a.s.s.SolrDispatchFilter SolrDispatchFilter.init() done
   [junit4]   2> 1744228 INFO  (OverseerStateUpdate-95899761919328268-127.0.0.1:64919_solr-n_0000000000) [n:127.0.0.1:64919_solr    ] o.a.s.c.Overseer processMessage: queueSize: 1, message = {
   [junit4]   2>   "operation":"downnode",
   [junit4]   2>   "node_name":"127.0.0.1:64919_solr"} current state version: 0
   [junit4]   2> 1744228 INFO  (OverseerStateUpdate-95899761919328268-127.0.0.1:64919_solr-n_0000000000) [n:127.0.0.1:64919_solr    ] o.a.s.c.o.NodeMutator DownNode state invoked for node: 127.0.0.1:64919_solr
   [junit4]   2> 1744233 INFO  (jetty-launcher-1806-thread-5) [n:127.0.0.1:42684_solr    ] o.a.s.c.CoreContainer Security conf doesn't exist. Skipping setup for authorization module.
   [junit4]   2> 1744233 INFO  (jetty-launcher-1806-thread-5) [n:127.0.0.1:42684_solr    ] o.a.s.c.CoreContainer No authentication plugin used.
   [junit4]   2> 1744234 INFO  (jetty-launcher-1806-thread-5) [n:127.0.0.1:42684_solr    ] o.a.s.c.CorePropertiesLocator Looking for core definitions underneath /export/home/jenkins/workspace/Lucene-Solr-master-Solaris/solr/build/solr-core/test/J1/temp/solr.cloud.TestTolerantUpdateProcessorCloud_971B2403FEDE5916-001/tempDir-001/node5/.
   [junit4]   2> 1744234 INFO  (jetty-launcher-1806-thread-5) [n:127.0.0.1:42684_solr    ] o.a.s.c.CorePropertiesLocator Found 0 core definitions
   [junit4]   2> 1744235 INFO  (jetty-launcher-1806-thread-5) [n:127.0.0.1:42684_solr    ] o.a.s.s.SolrDispatchFilter user.dir=/export/home/jenkins/workspace/Lucene-Solr-master-Solaris/solr/build/solr-core/test/J1
   [junit4]   2> 1744235 INFO  (jetty-launcher-1806-thread-5) [n:127.0.0.1:42684_solr    ] o.a.s.s.SolrDispatchFilter SolrDispatchFilter.init() done
   [junit4]   2> 1744273 INFO  (jetty-launcher-1806-thread-2) [n:127.0.0.1:40163_solr    ] o.a.s.c.CoreContainer Security conf doesn't exist. Skipping setup for authorization module.
   [junit4]   2> 1744273 INFO  (jetty-launcher-1806-thread-2) [n:127.0.0.1:40163_solr    ] o.a.s.c.CoreContainer No authentication plugin used.
   [junit4]   2> 1744274 INFO  (jetty-launcher-1806-thread-2) [n:127.0.0.1:40163_solr    ] o.a.s.c.CorePropertiesLocator Looking for core definitions underneath /export/home/jenkins/workspace/Lucene-Solr-master-Solaris/solr/build/solr-core/test/J1/temp/solr.cloud.TestTolerantUpdateProcessorCloud_971B2403FEDE5916-001/tempDir-001/node2/.
   [junit4]   2> 1744274 INFO  (jetty-launcher-1806-thread-2) [n:127.0.0.1:40163_solr    ] o.a.s.c.CorePropertiesLocator Found 0 core definitions
   [junit4]   2> 1744276 INFO  (jetty-launcher-1806-thread-2) [n:127.0.0.1:40163_solr    ] o.a.s.s.SolrDispatchFilter user.dir=/export/home/jenkins/workspace/Lucene-Solr-master-Solaris/solr/build/solr-core/test/J1
   [junit4]   2> 1744276 INFO  (jetty-launcher-1806-thread-2) [n:127.0.0.1:40163_solr    ] o.a.s.s.SolrDispatchFilter SolrDispatchFilter.init() done
   [junit4]   2> 1745228 INFO  (jetty-launcher-1806-thread-3) [n:127.0.0.1:64919_solr    ] o.a.s.c.ZkController Register node as live in ZooKeeper:/live_nodes/127.0.0.1:64919_solr
   [junit4]   2> 1745230 INFO  (jetty-launcher-1806-thread-3) [n:127.0.0.1:64919_solr    ] o.a.s.c.c.SolrZkClient makePath: /live_nodes/127.0.0.1:64919_solr
   [junit4]   2> 1745232 INFO  (zkCallback-1826-thread-1-processing-n:127.0.0.1:42684_solr) [n:127.0.0.1:42684_solr    ] o.a.s.c.c.ZkStateReader A live node change: [WatchedEvent state:SyncConnected type:NodeChildrenChanged path:/live_nodes], has occurred - updating... (live nodes size: [4])
   [junit4]   2> 1745232 INFO  (zkCallback-1831-thread-1-processing-n:127.0.0.1:40163_solr) [n:127.0.0.1:40163_solr    ] o.a.s.c.c.ZkStateReader A live node change: [WatchedEvent state:SyncConnected type:NodeChildrenChanged path:/live_nodes], has occurred - updating... (live nodes size: [4])
   [junit4]   2> 1745232 INFO  (zkCallback-1822-thread-1-processing-n:127.0.0.1:54732_solr) [n:127.0.0.1:54732_solr    ] o.a.s.c.c.ZkStateReader A live node change: [WatchedEvent state:SyncConnected type:NodeChildrenChanged path:/live_nodes], has occurred - updating... (live nodes size: [4])
   [junit4]   2> 1745232 INFO  (zkCallback-1832-thread-1-processing-n:127.0.0.1:45196_solr) [n:127.0.0.1:45196_solr    ] o.a.s.c.c.ZkStateReader A live node change: [WatchedEvent state:SyncConnected type:NodeChildrenChanged path:/live_nodes], has occurred - updating... (live nodes size: [4])
   [junit4]   2> 1745232 INFO  (zkCallback-1827-thread-1-processing-n:127.0.0.1:64919_solr) [n:127.0.0.1:64919_solr    ] o.a.s.c.c.ZkStateReader A live node change: [WatchedEvent state:SyncConnected type:NodeChildrenChanged path:/live_nodes], has occurred - updating... (live nodes size: [4])
   [junit4]   2> 1745232 INFO  (zkCallback-1826-thread-1-processing-n:127.0.0.1:42684_solr) [n:127.0.0.1:42684_solr    ] o.a.s.c.c.ZkStateReader Updated live nodes from ZooKeeper... (4) -> (5)
   [junit4]   2> 1745232 INFO  (zkCallback-1831-thread-1-processing-n:127.0.0.1:40163_solr) [n:127.0.0.1:40163_solr    ] o.a.s.c.c.ZkStateReader Updated live nodes from ZooKeeper... (4) -> (5)
   [junit4]   2> 1745233 INFO  (zkCallback-1822-thread-1-processing-n:127.0.0.1:54732_solr) [n:127.0.0.1:54732_solr    ] o.a.s.c.c.ZkStateReader Updated live nodes from ZooKeeper... (4) -> (5)
   [junit4]   2> 1745233 INFO  (zkCallback-1832-thread-1-processing-n:127.0.0.1:45196_solr) [n:127.0.0.1:45196_solr    ] o.a.s.c.c.ZkStateReader Updated live nodes from ZooKeeper... (4) -> (5)
   [junit4]   2> 1745233 INFO  (zkCallback-1827-thread-1-processing-n:127.0.0.1:64919_solr) [n:127.0.0.1:64919_solr    ] o.a.s.c.c.ZkStateReader Updated live nodes from ZooKeeper... (4) -> (5)
   [junit4]   2> 1745252 INFO  (jetty-launcher-1806-thread-3) [n:127.0.0.1:64919_solr    ] o.a.s.c.CoreContainer Security conf doesn't exist. Skipping setup for authorization module.
   [junit4]   2> 1745252 INFO  (jetty-launcher-1806-thread-3) [n:127.0.0.1:64919_solr    ] o.a.s.c.CoreContainer No authentication plugin used.
   [junit4]   2> 1745253 INFO  (jetty-launcher-1806-thread-3) [n:127.0.0.1:64919_solr    ] o.a.s.c.CorePropertiesLocator Looking for core definitions underneath /export/home/jenkins/workspace/Lucene-Solr-master-Solaris/solr/build/solr-core/test/J1/temp/solr.cloud.TestTolerantUpdateProcessorCloud_971B2403FEDE5916-001/tempDir-001/node3/.
   [junit4]   2> 1745253 INFO  (jetty-launcher-1806-thread-3) [n:127.0.0.1:64919_solr    ] o.a.s.c.CorePropertiesLocator Found 0 core definitions
   [junit4]   2> 1745255 INFO  (jetty-launcher-1806-thread-3) [n:127.0.0.1:64919_solr    ] o.a.s.s.SolrDispatchFilter user.dir=/export/home/jenkins/workspace/Lucene-Solr-master-Solaris/solr/build/solr-core/test/J1
   [junit4]   2> 1745255 INFO  (jetty-launcher-1806-thread-3) [n:127.0.0.1:64919_solr    ] o.a.s.s.SolrDispatchFilter SolrDispatchFilter.init() done
   [junit4]   2> 1745255 INFO  (SUITE-TestTolerantUpdateProcessorCloud-seed#[971B2403FEDE5916]-worker) [    ] o.a.s.c.c.SolrZkClient Using default ZkCredentialsProvider
   [junit4]   2> 1745256 INFO  (SUITE-TestTolerantUpdateProcessorCloud-seed#[971B2403FEDE5916]-worker) [    ] o.a.s.c.c.ConnectionManager Waiting for client to connect to ZooKeeper
   [junit4]   2> 1745257 INFO  (zkCallback-1838-thread-1) [    ] o.a.s.c.c.ConnectionManager Watcher org.apache.solr.common.cloud.ConnectionManager@f0967a1 name:ZooKeeperConnection Watcher:127.0.0.1:47620 got event WatchedEvent state:SyncConnected type:None path:null path:null type:None
   [junit4]   2> 1745257 INFO  (SUITE-TestTolerantUpdateProcessorCloud-seed#[971B2403FEDE5916]-worker) [    ] o.a.s.c.c.ConnectionManager Client is connected to ZooKeeper
   [junit4]   2> 1745258 INFO  (SUITE-TestTolerantUpdateProcessorCloud-seed#[971B2403FEDE5916]-worker) [    ] o.a.s.c.c.SolrZkClient Using default ZkACLProvider
   [junit4]   2> 1745260 INFO  (SUITE-TestTolerantUpdateProcessorCloud-seed#[971B2403FEDE5916]-worker) [    ] o.a.s.c.s.i.CloudSolrClient Final constructed zkHost string: 127.0.0.1:47620/solr
   [junit4]   2> 1745261 INFO  (SUITE-TestTolerantUpdateProcessorCloud-seed#[971B2403FEDE5916]-worker) [    ] o.a.s.c.c.SolrZkClient Using default ZkCredentialsProvider
   [junit4]   2> 1745262 INFO  (SUITE-TestTolerantUpdateProcessorCloud-seed#[971B2403FEDE5916]-worker) [    ] o.a.s.c.c.ConnectionManager Waiting for client to connect to ZooKeeper
   [junit4]   2> 1745263 INFO  (zkCallback-1841-thread-1) [    ] o.a.s.c.c.ConnectionManager Watcher org.apache.solr.common.cloud.ConnectionManager@807328b name:ZooKeeperConnection Watcher:127.0.0.1:47620/solr got event WatchedEvent state:SyncConnected type:None path:null path:null type:None
   [junit4]   2> 1745264 INFO  (SUITE-TestTolerantUpdateProcessorCloud-seed#[971B2403FEDE5916]-worker) [    ] o.a.s.c.c.ConnectionManager Client is connected to ZooKeeper
   [junit4]   2> 1745264 INFO  (SUITE-TestTolerantUpdateProcessorCloud-seed#[971B2403FEDE5916]-worker) [    ] o.a.s.c.c.SolrZkClient Using default ZkACLProvider
   [junit4]   2> 1745264 INFO  (SUITE-TestTolerantUpdateProcessorCloud-seed#[971B2403FEDE5916]-worker) [    ] o.a.s.c.c.ZkStateReader Updating cluster state from ZooKeeper... 
   [junit4]   2> 1745265 INFO  (SUITE-TestTolerantUpdateProcessorCloud-seed#[971B2403FEDE5916]-worker) [    ] o.a.s.c.c.ZkStateReader Loaded empty cluster properties
   [junit4]   2> 1745266 INFO  (SUITE-TestTolerantUpdateProcessorCloud-seed#[971B2403FEDE5916]-worker) [    ] o.a.s.c.c.ZkStateReader Updated live nodes from ZooKeeper... (0) -> (5)
   [junit4]   2> 1745269 INFO  (SUITE-TestTolerantUpdateProcessorCloud-seed#[971B2403FEDE5916]-worker) [    ] o.a.s.c.c.SolrZkClient makePath: /configs/solrCloudCollectionConfig/schema-copyfield-test.xml
   [junit4]   2> 1745273 INFO  (SUITE-TestTolerantUpdateProcessorCloud-seed#[971B2403FEDE5916]-worker) [    ] o.a.s.c.c.SolrZkClient makePath: /configs/solrCloudCollectionConfig/bad-schema-currency-ft-oer-norates.xml
   [junit4]   2> 1745277 INFO  (SUITE-TestTolerantUpdateProcessorCloud-seed#[971B2403FEDE5916]-worker) [    ] o.a.s.c.c.SolrZkClient makePath: /configs/solrCloudCollectionConfig/solrconfig-slave.xml
   [junit4]   2> 1745280 INFO  (SUITE-TestTolerantUpdateProcessorCloud-seed#[971B2403FEDE5916]-worker) [    ] o.a.s.c.c.SolrZkClient makePath: /configs/solrCloudCollectionConfig/solrconfig-cdcr.xml
   [junit4]   2> 1745283 INFO  (SUITE-TestTolerantUpdateProcessorCloud-seed#[971B2403FEDE5916]-worker) [    ] o.a.s.c.c.SolrZkClient makePath: /configs/solrCloudCollectionConfig/schema-HighlighterMaxOffsetTest.xml
   [junit4]   2> 1745286 INFO  (SUITE-TestTolerantUpdateProcessorCloud-seed#[971B2403FEDE5916]-worker) [    ] o.a.s.c.c.SolrZkClient makePath: /configs/solrCloudCollectionConfig/phrasesuggest.txt
   [junit4]   2> 1745289 INFO  (SUITE-TestTolerantUpdateProcessorCloud-seed#[971B2403FEDE5916]-worker) [    ] o.a.s.c.c.SolrZkClient makePath: /configs/solrCloudCollectionConfig/solrconfig-classification.xml
   [junit4]   2> 1745292 INFO  (SUITE-TestTolerantUpdateProcessorCloud-seed#[971B2403FEDE5916]-worker) [    ] o.a.s.c.c.SolrZkClient makePath: /configs/solrCloudCollectionConfig/solrconfig-script-updateprocessor.xml
   [junit4]   2> 1745295 INFO  (SUITE-TestTolerantUpdateProcessorCloud-seed#[971B2403FEDE5916]-worker) [    ] o.a.s.c.c.SolrZkClient makePath: /configs/solrCloudCollectionConfig/bad-schema-init-error.xml
   [junit4]   2> 1745298 INFO  (SUITE-TestTolerantUpdateProcessorCloud-seed#[971B2403FEDE5916]-worker) [    ] o.a.s.c.c.SolrZkClient makePath: /configs/solrCloudCollectionConfig/schema-class-name-shortening-on-serialization.xml
   [junit4]   2> 1745301 INFO  (SUITE-TestTolerantUpdateProcessorCloud-seed#[971B2403FEDE5916]-worker) [    ] o.a.s.c.c.SolrZkClient makePath: /configs/solrCloudCollectionConfig/solrconfig-cdcrupdatelog.xml
   [junit4]   2> 1745304 INFO  (SUITE-TestTolerantUpdateProcessorCloud-seed#[971B2403FEDE5916]-worker) [    ] o.a.s.c.c.SolrZkClient makePath: /configs/solrCloudCollectionConfig/solrconfig-logmergepolicy.xml
   [junit4]   2> 1745307 INFO  (SUITE-TestTolerantUpdateProcessorCloud-seed#[971B2403FEDE5916]-worker) [    ] o.a.s.c.c.SolrZkClient makePath: /configs/solrCloudCollectionConfig/bad-schema-dup-field.xml
   [junit4]   2> 1745310 INFO  (SUITE-TestTolerantUpdateProcessorCloud-seed#[971B2403FEDE5916]-worker) [    ] o.a.s.c.c.SolrZkClient makePath: /configs/solrCloudCollectionConfig/bad-schema-currency-dynamic-multivalued.xml
   [junit4]   2> 1745313 INFO  (SUITE-TestTolerantUpdateProcessorCloud-seed#[971B2403FEDE5916]-worker) [    ] o.a.s.c.c.SolrZkClient makePath: /configs/solrCloudCollectionConfig/schema-docValuesMulti.xml
   [junit4]   2> 1745316 INFO  (SUITE-TestTolerantUpdateProcessorCloud-seed#[971B2403FEDE5916]-worker) [    ] o.a.s.c.c.SolrZkClient makePath: /configs/solrCloudCollectionConfig/schema-lmjelinekmercer.xml
   [junit4]   2> 1745320 INFO  (SUITE-TestTolerantUpdateProcessorCloud-seed#[971B2403FEDE5916]-worker) [    ] o.a.s.c.c.SolrZkClient makePath: /configs/solrCloudCollectionConfig/solrconfig-tieredmergepolicyfactory.xml
   [junit4]   2> 1745324 INFO  (SUITE-TestTolerantUpdateProcessorCloud-seed#[971B2403FEDE5916]-worker) [    ] o.a.s.c.c.SolrZkClient makePath: /configs/solrCloudCollectionConfig/bad-schema-sweetspot-partial-norms.xml
   [junit4]   2> 1745327 INFO  (SUITE-TestTolerantUpdateProcessorCloud-seed#[971B2403FEDE5916]-worker) [    ] o.a.s.c.c.SolrZkClient makePath: /configs/solrCloudCollectionConfig/solrconfig-collapseqparser.xml
   [junit4]   2> 1745331 INFO  (SUITE-TestTolerantUpdateProcessorCloud-seed#[971B2403FEDE5916]-worker) [    ] o.a.s.c.c.SolrZkClient makePath: /configs/solrCloudCollectionConfig/solrconfig-externalversionconstraint.xml
   [junit4]   2> 1745335 INFO  (SUITE-TestTolerantUpdateProcessorCloud-seed#[971B2403FEDE5916]-worker) [    ] o.a.s.c.c.SolrZkClient makePath: /configs/solrCloudCollectionConfig/bad-schema-dynamicfield-required.xml
   [junit4]   2> 1745338 INFO  (SUITE-TestTolerantUpdateProcessorCloud-seed#[971B2403FEDE5916]-worker) [    ] o.a.s.c.c.SolrZkClient makePath: /configs/solrCloudCollectionConfig/schema-complex-phrase.xml
   [junit4]   2> 1745341 INFO  (SUITE-TestTolerantUpdateProcessorCloud-seed#[971B2403FEDE5916]-worker) [    ] o.a.s.c.c.SolrZkClient makePath: /configs/solrCloudCollectionConfig/protwords.txt
   [junit4]   2> 1745345 INFO  (SUITE-TestTolerantUpdateProcessorCloud-seed#[971B2403FEDE5916]-worker) [    ] o.a.s.c.c.SolrZkClient makePath: /configs/solrCloudCollectionConfig/old_synonyms.txt
   [junit4]   2> 1745348 INFO  (SUITE-TestTolerantUpdateProcessorCloud-seed#[971B2403FEDE5916]-worker) [    ] o.a.s.c.c.SolrZkClient makePath: /configs/solrCloudCollectionConfig/schema-docValuesMissing.xml
   [junit4]   2> 1745351 INFO  (SUITE-TestTolerantUpdateProcessorCloud-seed#[971B2403FEDE5916]-worker) [    ] o.a.s.c.c.SolrZkClient makePath: /configs/solrCloudCollectionConfig/bad-schema-bogus-analysis-parameters.xml
   [junit4]   2> 1745355 INFO  (SUITE-TestTolerantUpdateProcessorCloud-seed#[971B2403FEDE5916]-worker) [    ] o.a.s.c.c.SolrZkClient makePath: /configs/solrCloudCollectionConfig/schema-eff.xml
   [junit4]   2> 1745358 INFO  (SUITE-TestTolerantUpdateProcessorCloud-seed#[971B2403FEDE5916]-worker) [    ] o.a.s.c.c.SolrZkClient makePath: /configs/solrCloudCollectionConfig/schema-rest.xml
   [junit4]   2> 1745368 INFO  (SUITE-TestTolerantUpdateProcessorCloud-seed#[971B2403FEDE5916]-worker) [    ] o.a.s.c.c.SolrZkClient makePath: /configs/solrCloudCollectionConfig/schema-distrib-interval-faceting.xml
   [junit4]   2> 1745372 INFO  (SUITE-TestTolerantUpdateProcessorCloud-seed#[971B2403FEDE5916]-worker) [    ] o.a.s.c.c.SolrZkClient makePath: /configs/solrCloudCollectionConfig/bad-schema-uniquekey-multivalued.xml
   [junit4]   2> 1745376 INFO  (SUITE-TestTolerantUpdateProcessorCloud-seed#[971B2403FEDE5916]-worker) [    ] o.a.s.c.c.SolrZkClient makePath: /configs/solrCloudCollectionConfig/stop-1.txt
   [junit4]   2> 1745379 INFO  (SUITE-TestTolerantUpdateProcessorCloud-seed#[971B2403FEDE5916]-worker) [    ] o.a.s.c.c.SolrZkClient makePath: /configs/solrCloudCollectionConfig/schema-sorts.xml
   [junit4]   2> 1745382 INFO  (SUITE-TestTolerantUpdateProcessorCloud-seed#[971B2403FEDE5916]-worker) [    ] o.a.s.c.c.SolrZkClient makePath: /configs/solrCloudCollectionConfig/solrconfig-querysender.xml
   [junit4]   2> 1745385 INFO  (SUITE-TestTolerantUpdateProcessorCloud-seed#[971B2403FEDE5916]-worker) [    ] o.a.s.c.c.SolrZkClient makePath: /configs/solrCloudCollectionConfig/bad-schema-sim-global-vs-ft-mismatch.xml
   [junit4]   2> 1745388 INFO  (SUITE-TestTolerantUpdateProcessorCloud-seed#[971B2403FEDE5916]-worker) [    ] o.a.s.c.c.SolrZkClient makePath: /configs/solrCloudCollectionConfig/bad-schema-currency-multivalued.xml
   [junit4]   2> 1745392 INFO  (SUITE-TestTolerantUpdateProcessorCloud-seed#[971B2403FEDE5916]-worker) [    ] o.a.s.c.c.SolrZkClient makePath: /configs/solrCloudCollectionConfig/schema-minimal.xml
   [junit4]   2> 1745396 INFO  (SUITE-TestTolerantUpdateProcessorCloud-seed#[971B2403FEDE5916]-worker) [    ] o.a.s.c.c.SolrZkClient makePath: /configs/solrCloudCollectionConfig/solrconfig-plugcollector.xml
   [junit4]   2> 1745399 INFO  (SUITE-TestTolerantUpdateProcessorCloud-seed#[971B2403FEDE5916]-worker) [    ] o.a.s.c.c.SolrZkClient makePath: /configs/solrCloudCollectionConfig/bad-mpf-solrconfig.xml
   [junit4]   2> 1745402 INFO  (SUITE-TestTolerantUpdateProcessorCloud-seed#[971B2403FEDE5916]-worker) [    ] o.a.s.c.c.SolrZkClient makePath: /configs/solrCloudCollectionConfig/da_UTF8.xml
   [junit4]   2> 1745406 INFO  (SUITE-TestTolerantUpdateProcessorCloud-seed#[971B2403FEDE5916]-worker) [    ] o.a.s.c.c.SolrZkClient makePath: /configs/solrCloudCollectionConfig/schema-replication2.xml
   [junit4]   2> 1745409 INFO  (SUITE-TestTolerantUpdateProcessorCloud-seed#[971B2403FEDE5916]-worker) [    ] o.a.s.c.c.SolrZkClient makePath: /configs/solrCloudCollectionConfig/throw.error.on.add.updateprocessor.js
   [junit4]   2> 1745414 INFO  (SUITE-TestTolerantUpdateProcessorCloud-seed#[971B2403FEDE5916]-worker) [    ] o.a.s.c.c.SolrZkClient makePath: /configs/solrCloudCollectionConfig/analyzingInfixSuggest.txt
   [junit4]   2> 1745418 INFO  (SUITE-TestTolerantUpdateProcessorCloud-seed#[971B2403FEDE5916]-worker) [    ] o.a.s.c.c.SolrZkClient makePath: /configs/solrCloudCollectionConfig/frenchArticles.txt
   [junit4]   2> 1745421 INFO  (SUITE-TestTolerantUpdateProcessorCloud-seed#[971B2403FEDE5916]-worker) [    ] o.a.s.c.c.SolrZkClient makePath: /configs/solrCloudCollectionConfig/solrconfig-basic.xml
   [junit4]   2> 1745424 INFO  (SUITE-TestTolerantUpdateProcessorCloud-seed#[971B2403FEDE5916]-worker) [    ] o.a.s.c.c.SolrZkClient makePath: /configs/solrCloudCollectionConfig/solrconfig-phrasesuggest.xml
   [junit4]   2> 1745427 INFO  (SUITE-TestTolerantUpdateProcessorCloud-seed#[971B2403FEDE5916]-worker) [    ] o.a.s.c.c.SolrZkClient makePath: /configs/solrCloudCollectionConfig/bad-schema-codec-global-vs-ft-mismatch.xml
   [junit4]   2> 1745430 INFO  (SUITE-TestTolerantUpdateProcessorCloud-seed#[971B2403FEDE5916]-worker) [    ] o.a.s.c.c.SolrZkClient makePath: /configs/solrCloudCollectionConfig/solrconfig-functionquery.xml
   [junit4]   2> 1745438 INFO  (SUITE-TestTolerantUpdateProcessorCloud-seed#[971B2403FEDE5916]-worker) [    ] o.a.s.c.c.SolrZkClient makePath: /configs/solrCloudCollectionConfig/bad-mp-solrconfig.xml
   [junit4]   2> 1745441 INFO  (SUITE-TestTolerantUpdateProcessorCloud-seed#[971B2403FEDE5916]-worker) [    ] o.a.s.c.c.SolrZkClient makePath: /configs/solrCloudCollectionConfig/bad-error-solrconfig.xml
   [junit4]   2> 1745445 INFO  (SUITE-TestTolerantUpdateProcessorCloud-seed#[971B2403FEDE5916]-worker) [    ] o.a.s.c.c.SolrZkClient makePath: /configs/solrCloudCollectionConfig/bad-schema-sweetspot-partial-hyperbolic.xml
   [junit4]   2> 1745464 INFO  (SUITE-TestTolerantUpdateProcessorCloud-seed#[971B2403FEDE5916]-worker) [    ] o.a.s.c.c.SolrZkClient makePath: /configs/solrCloudCollectionConfig/bad-solrconfig-multiple-cfs.xml
   [junit4]   2> 1745469 INFO  (SUITE-TestTolerantUpdateProcessorCloud-seed#[971B2403FEDE5916]-worker) [    ] o.a.s.c.c.SolrZkClient makePath: /configs/solrCloudCollectionConfig/solrconfig-spellchecker.xml
   [junit4]   2> 1745472 INFO  (SUITE-TestTolerantUpdateProcessorCloud-seed#[971B2403FEDE5916]-worker) [    ] o.a.s.c.c.SolrZkClient makePath: /configs/solrCloudCollectionConfig/solrconfig-sortingresponse.xml
   [junit4]   2> 1745475 INFO  (SUITE-TestTolerantUpdateProcessorCloud-seed#[971B2403FEDE5916]-worker) [    ] o.a.s.c.c.SolrZkClient makePath: /configs/solrCloudCollectionConfig/currency.xml
   [junit4]   2> 1745478 INFO  (SUITE-TestTolerantUpdateProcessorCloud-seed#[971B2403FEDE5916]-worker) [    ] o.a.s.c.c.SolrZkClient makePath: /configs/solrCloudCollectionConfig/bad-schema-multiple-asterisk-copyfield-dest-should-fail-test.xml
   [junit4]   2> 1745482 INFO  (SUITE-TestTolerantUpdateProcessorCloud-seed#[971B2403FEDE5916]-worker) [    ] o.a.s.c.c.SolrZkClient makePath: /configs/solrCloudCollectionConfig/compoundDictionary.txt
   [junit4]   2> 1745485 INFO  (SUITE-TestTolerantUpdateProcessorCloud-seed#[971B2403FEDE5916]-worker) [    ] o.a.s.c.c.SolrZkClient makePath: /configs/solrCloudCollectionConfig/solrconfig-caching.xml
   [junit4]   2> 1745488 INFO  (SUITE-TestTolerantUpdateProcessorCloud-seed#[971B2403FEDE5916]-worker) [    ] o.a.s.c.c.SolrZkClient makePath: /configs/solrCloudCollectionConfig/solrconfig_codec2.xml
   [junit4]   2> 1745492 INFO  (SUITE-TestTolerantUpdateProcessorCloud-seed#[971B2403FEDE5916]-worker) [    ] o.a.s.c.c.SolrZkClient makePath: /configs/solrCloudCollectionConfig/solrconfig-spatial.xml
   [junit4]   2> 1745495 INFO  (SUITE-TestTolerantUpdateProcessorCloud-seed#[971B2403FEDE5916]-worker) [    ] o.a.s.c.c.SolrZkClient makePath: /configs/solrCloudCollectionConfig/schema-single-dynamic-copy-field.xml
   [junit4]   2> 1745499 INFO  (SUITE-TestTolerantUpdateProcessorCloud-seed#[971B2403FEDE5916]-worker) [    ] o.a.s.c.c.SolrZkClient makePath: /configs/solrCloudCollectionConfig/schema-synonym-tokenizer.xml
   [junit4]   2> 1745502 INFO  (SUITE-TestTolerantUpdateProcessorCloud-seed#[971B2403FEDE5916]-worker) [    ] o.a.s.c.c.SolrZkClient makePath: /configs/solrCloudCollectionConfig/schema-sql.xml
   [junit4]   2> 1745522 INFO  (SUITE-TestTolerantUpdateProcessorCloud-seed#[971B2403FEDE5916]-worker) [    ] o.a.s.c.c.SolrZkClient makePath: /configs/solrCloudCollectionConfig/solrconfig-master-throttled.xml
   [junit4]   2> 1745525 INFO  (SUITE-TestTolerantUpdateProcessorCloud-seed#[971B2403FEDE5916]-worker) [    ] o.a.s.c.c.SolrZkClient makePath: /configs/solrCloudCollectionConfig/schema-trie.xml
   [junit4]   2> 1745529 INFO  (SUITE-TestTolerantUpdateProcessorCloud-seed#[971B2403FEDE5916]-worker) [    ] o.a.s.c.c.SolrZkClient makePath: /configs/solrCloudCollectionConfig/solrconfig-withgethandler.xml
   [junit4]   2> 1745533 INFO  (SUITE-TestTolerantUpdateProcessorCloud-seed#[971B2403FEDE5916]-worker) [    ] o.a.s.c.c.SolrZkClient makePath: /configs/solrCloudCollectionConfig/solrconfig-mergepolicyfactory-nocfs.xml
   [junit4]   2> 1745536 INFO  (SUITE-TestTolerantUpdateProcessorCloud-seed#[971B2403FEDE5916]-worker) [    ] o.a.s.c.c.SolrZkClient makePath: /configs/solrCloudCollectionConfig/solrconfig-repeater.xml
   [junit4]   2> 1745539 INFO  (SUITE-TestTolerantUpdateProcessorCloud-seed#[971B2403FEDE5916]-worker) [    ] o.a.s.c.c.SolrZkClient makePath: /configs/solrCloudCollectionConfig/schema-postingshighlight.xml
   [junit4]   2> 1745542 INFO  (SUITE-TestTolerantUpdateProcessorCloud-seed#[971B2403FEDE5916]-worker) [    ] o.a.s.c.c.SolrZkClient makePath: /configs/solrCloudCollectionConfig/solrconfig-tieredmergepolicy.xml
   [junit4]   2> 1745545 INFO  (SUITE-TestTolerantUpdateProcessorCloud-seed#[971B2403FEDE5916]-worker) [    ] o.a.s.c.c.SolrZkClient makePath: /configs/solrCloudCollectionConfig/schema-one-field-no-dynamic-field-unique-key.xml
   [junit4]   2> 1745550 INFO  (SUITE-TestTolerantUpdateProcessorCloud-seed#[971B2403FEDE5916]-worker) [    ] o.a.s.c.c.SolrZkClient makePath: /configs/solrCloudCollectionConfig/stop-snowball.txt
   [junit4]   2> 1745553 INFO  (SUITE-TestTolerantUpdateProcessorCloud-seed#[971B2403FEDE5916]-worker) [    ] o.a.s.c.c.SolrZkClient makePath: /configs/solrCloudCollectionConfig/schema-rest-lucene-match-version.xml
   [junit4]   2> 1745557 INFO  (SUITE-TestTolerantUpdateProcessorCloud-seed#[971B2403FEDE5916]-worker) [    ] o.a.s.c.c.SolrZkClient makePath: /configs/solrCloudCollectionConfig/keep-2.txt
   [junit4]   2> 1745560 INFO  (SUITE-TestTolerantUpdateProcessorCloud-seed#[971B2403FEDE5916]-worker) [    ] o.a.s.c.c.SolrZkClient makePath: /configs/solrCloudCollectionConfig/solrconfig-query-parser-init.xml
   [junit4]   2> 1745567 INFO  (SUITE-TestTolerantUpdateProcessorCloud-seed#[971B2403FEDE5916]-worker) [    ] o.a.s.c.c.SolrZkClient makePath: /configs/solrCloudCollectionConfig/schema-non-stored-docvalues.xml
   [junit4]   2> 1745571 INFO  (SUITE-TestTolerantUpdateProcessorCloud-seed#[971B2403FEDE5916]-worker) [    ] o.a.s.c.c.SolrZkClient makePath: /configs/solrCloudCollectionConfig/bad-schema-dynamicfield-default-val.xml
   [junit4]   2> 1745574 INFO  (SUITE-TestTolerantUpdateProcessorCloud-seed#[971B2403FEDE5916]-worker) [    ] o.a.s.c.c.SolrZkClient makePath: /configs/solrCloudCollectionConfig/solrconfig.snippet.randomindexconfig.xml
   [junit4]   2> 1745578 INFO  (SUITE-TestTolerantUpdateProcessorCloud-seed#[971B2403FEDE5916]-worker) [    ] o.a.s.c.c.SolrZkClient makePath: /configs/solrCloudCollectionConfig/schema_latest.xml
   [junit4]   2> 1745581 INFO  (SUITE-TestTolerantUpdateProcessorCloud-seed#[971B2403FEDE5916]-worker) [    ] o.a.s.c.c.SolrZkClient makePath: /configs/solrCloudCollectionConfig/solrconfig-managed-schema-test.xml
   [junit4]   2> 1745585 INFO  (SUITE-TestTolerantUpdateProcessorCloud-seed#[971B2403FEDE5916]-worker) [    ] o.a.s.c.c.SolrZkClient makePath: /configs/solrCloudCollectionConfig/schema-not-required-unique-key.xml
   [junit4]   2> 1745588 INFO  (SUITE-TestTolerantUpdateProcessorCloud-seed#[971B2403FEDE5916]-worker) [    ] o.a.s.c.c.SolrZkClient makePath: /configs/solrCloudCollectionConfig/bad-schema-sweetspot-partial-baseline.xml
   [junit4]   2> 1745613 INFO  (SUITE-TestTolerantUpdateProcessorCloud-seed#[971B2403FEDE5916]-worker) [    ] o.a.s.c.c.SolrZkClient makePath: /configs/solrCloudCollectionConfig/bad-schema-sweetspot-both-tf.xml
   [junit4]   2> 1745617 INFO  (SUITE-TestTolerantUpdateProcessorCloud-seed#[971B2403FEDE5916]-worker) [    ] o.a.s.c.c.SolrZkClient makePath: /configs/solrCloudCollectionConfig/schema-collate.xml
   [junit4]   2> 1745621 INFO  (SUITE-TestTolerantUpdateProcessorCloud-seed#[971B2403FEDE5916]-worker) [    ] o.a.s.c.c.SolrZkClient makePath: /configs/solrCloudCollectionConfig/solrconfig-indexconfig-mergepolicyfactory.xml
   [junit4]   2> 1745625 INFO  (SUITE-TestTolerantUpdateProcessorCloud-seed#[971B2403FEDE5916]-worker) [    ] o.a.s.c.c.SolrZkClient makePath: /configs/solrCloudCollectionConfig/solrconfig-highlight.xml
   [junit4]   2> 1745629 INFO  (SUITE-TestTolerantUpdateProcessorCloud-seed#[971B2403FEDE5916]-worker) [    ] o.a.s.c.c.SolrZkClient makePath: /configs/solrCloudCollectionConfig/solrconfig-components-name.xml
   [junit4]   2> 1745632 INFO  (SUITE-TestTolerantUpdateProcessorCloud-seed#[971B2403FEDE5916]-worker) [    ] o.a.s.c.c.SolrZkClient makePath: /configs/solrCloudCollectionConfig/schema-null-charfilters-analyzer.xml
   [junit4]   2> 1745637 INFO  (SUITE-TestTolerantUpdateProcessorCloud-seed#[971B2403FEDE5916]-worker) [    ] o.a.s.c.c.SolrZkClient makePath: /configs/solrCloudCollectionConfig/solrconfig-master1-keepOneBackup.xml
   [junit4]   2> 1745640 INFO  (SUITE-TestTolerantUpdateProcessorCloud-seed#[971B2403FEDE5916]-worker) [    ] o.a.s.c.c.SolrZkClient makePath: /configs/solrCloudCollectionConfig/schema_codec.xml
   [junit4]   2> 1745644 INFO  (SUITE-TestTolerantUpdateProcessorCloud-seed#[971B2403FEDE5916]-worker) [    ] o.a.s.c.c.SolrZkClient makePath: /configs/solrCloudCollectionConfig/schema-sim.xml
   [junit4]   2> 1745647 INFO  (SUITE-TestTolerantUpdateProcessorCloud-seed#[971B2403FEDE5916]-worker) [    ] o.a.s.c.c.SolrZkClient makePath: /configs/solrCloudCollectionConfig/schema-required-fields.xml
   [junit4]   2> 1745650 INFO  (SUITE-TestTolerantUpdateProcessorCloud-seed#[971B2403FEDE5916]-worker) [    ] o.a.s.c.c.SolrZkClient makePath: /configs/solrCloudCollectionConfig/schema-reversed.xml
   [junit4]   2> 1745654 INFO  (SUITE-TestTolerantUpdateProcessorCloud-seed#[971B2403FEDE5916]-worker) [    ] o.a.s.c.c.SolrZkClient makePath: /configs/solrCloudCollectionConfig/open-exchange-rates.json
   [junit4]   2> 1745659 INFO  (SUITE-TestTolerantUpdateProcessorCloud-seed#[971B2403FEDE5916]-worker) [    ] o.a.s.c.c.SolrZkClient makePath: /configs/solrCloudCollectionConfig/solrconfig-mergepolicy-legacy.xml
   [junit4]   2> 1745662 INFO  (SUITE-TestTolerantUpdateProcessorCloud-seed#[971B2403FEDE5916]-worker) [    ] o.a.s.c.c.SolrZkClient makePath: /configs/solrCloudCollectionConfig/bad-schema-bogus-field-parameters.xml
   [junit4]   2> 1745666 INFO  (SUITE-TestTolerantUpdateProcessorCloud-seed#[971B2403FEDE5916]-worker) [    ] o.a.s.c.c.SolrZkClient makePath: /configs/solrCloudCollectionConfig/solrconfig-tolerant-update-minimal.xml
   [junit4]   2> 1745669 INFO  (SUITE-TestTolerantUpdateProcessorCloud-seed#[971B2403FEDE5916]-worker) [    ] o.a.s.c.c.SolrZkClient makePath: /configs/solrCloudCollectionConfig/schema-dfi.xml
   [junit4]   2> 1745673 INFO  (SUITE-TestTolerantUpdateProcessorCloud-seed#[971B2403FEDE5916]-worker) [    ] o.a.s.c.c.SolrZkClient makePath: /configs/solrCloudCollectionConfig/schema-spatial.xml
   [junit4]   2> 1745677 INFO  (SUITE-TestTolerantUpdateProcessorCloud-seed#[971B2403FEDE5916]-worker) [    ] o.a.s.c.c.SolrZkClient makePath: /configs/solrCloudCollectionConfig/solrconfig-slave1.xml
   [junit4]   2> 1745680 INFO  (SUITE-TestTolerantUpdateProcessorCloud-seed#[971B2403FEDE5916]-worker) [    ] o.a.s.c.c.SolrZkClient makePath: /configs/solrCloudCollectionConfig/schema-collate-dv.xml
   [junit4]   2> 1745684 INFO  (SUITE-TestTolerantUpdateProcessorCloud-seed#[971B2403FEDE5916]-worker) [    ] o.a.s.c.c.SolrZkClient makePath: /configs/solrCloudCollectionConfig/schema12.xml
   [junit4]   2> 1745687 INFO  (SUITE-TestTolerantUpdateProcessorCloud-seed#[971B2403FEDE5916]-worker) [    ] o.a.s.c.c.SolrZkClient makePath: /configs/solrCloudCollectionConfig/enumsConfig.xml
   [junit4]   2> 1745691 INFO  (SUITE-TestTolerantUpdateProcessorCloud-seed#[971B2403FEDE5916]-worker) [    ] o.a.s.c.c.SolrZkClient makePath: /configs/solrCloudCollectionConfig/solrconfig-delpolicy1.xml
   [junit4]   2> 1745694 INFO  (SUITE-TestTolerantUpdateProcessorCloud-seed#[971B2403FEDE5916]-worker) [    ] o.a.s.c.c.SolrZkClient makePath: /configs/solrCloudCollectionConfig/schema-ib.xml
   [junit4]   2> 1745700 INFO  (SUITE-TestTolerantUpdateProcessorCloud-seed#[971B2403FEDE5916]-worker) [    ] o.a.s.c.c.SolrZkClient makePath: /configs/solrCloudCollectionConfig/schema-numeric.xml
   [junit4]   2> 1745706 INFO  (SUITE-TestTolerantUpdateProcessorCloud-seed#[971B2403FEDE5916]-worker) [    ] o.a.s.c.c.SolrZkClient makePath: /configs/solrCloudCollectionConfig/solrconfig-master1.xml
   [junit4]   2> 1745710 INFO  (SUITE-TestTolerantUpdateProcessorCloud-seed#[971B2403FEDE5916]-worker) [    ] o.a.s.c.c.SolrZkClient makePath: /configs/solrCloudCollectionConfig/schema15.xml
   [junit4]   2> 1745713 INFO  (SUITE-TestTolerantUpdateProcessorCloud-seed#[971B2403FEDE5916]-worker) [    ] o.a.s.c.c.SolrZkClient makePath: /configs/solrCloudCollectionConfig/schema-folding.xml
   [junit4]   2> 1745716 INFO  (SUITE-TestTolerantUpdateProcessorCloud-seed#[971B2403FEDE5916]-worker) [    ] o.a.s.c.c.SolrZkClient makePath: /configs/solrCloudCollectionConfig/trivial.updateprocessor0.js
   [junit4]   2> 1745720 INFO  (SUITE-TestTolerantUpdateProcessorCloud-seed#[971B2403FEDE5916]-worker) [    ] o.a.s.c.c.SolrZkClient makePath: /configs/solrCloudCollectionConfig/schema-field-sort-values.xml
   [junit4]   2> 1745723 INFO  (SUITE-TestTolerantUpdateProcessorCloud-seed#[971B2403FEDE5916]-worker) [    ] o.a.s.c.c.SolrZkClient makePath: /configs/solrCloudCollectionConfig/solrconfig-minimal.xml
   [junit4]   2> 1745726 INFO  (SUITE-TestTolerantUpdateProcessorCloud-seed#[971B2403FEDE5916]-worker) [    ] o.a.s.c.c.SolrZkClient makePath: /configs/solrCloudCollectionConfig/schema-phrasesuggest.xml
   [junit4]   2> 1745730 INFO  (SUITE-TestTolerantUpdateProcessorCloud-seed#[971B2403FEDE5916]-worker) [    ] o.a.s.c.c.SolrZkClient makePath: /configs/solrCloudCollectionConfig/trivial.updateprocessor1.js
   [junit4]   2> 1745733 INFO  (SUITE-TestTolerantUpdateProces

[...truncated too long message...]

[    ] o.e.j.s.h.ContextHandler Stopped o.e.j.s.ServletContextHandler@2295d352{/solr,null,UNAVAILABLE}
   [junit4]   2> 1781842 WARN  (zkCallback-1832-thread-1-processing-n:127.0.0.1:45196_solr) [n:127.0.0.1:45196_solr    ] o.a.s.c.c.ZkStateReader ZooKeeper watch triggered, but Solr cannot talk to ZK: [KeeperErrorCode = Session expired for /live_nodes]
   [junit4]   2> 1781844 INFO  (jetty-launcher-1806-thread-2) [    ] o.e.j.s.h.ContextHandler Stopped o.e.j.s.ServletContextHandler@5b33d95e{/solr,null,UNAVAILABLE}
   [junit4]   2> 1781851 WARN  (zkCallback-1822-thread-1-processing-n:127.0.0.1:54732_solr) [n:127.0.0.1:54732_solr    ] o.a.s.c.c.ZkStateReader ZooKeeper watch triggered, but Solr cannot talk to ZK: [KeeperErrorCode = Session expired for /live_nodes]
   [junit4]   2> 1781851 WARN  (zkCallback-1822-thread-2-processing-n:127.0.0.1:54732_solr) [n:127.0.0.1:54732_solr    ] o.a.s.c.LeaderElector 
   [junit4]   2> org.apache.zookeeper.KeeperException$SessionExpiredException: KeeperErrorCode = Session expired for /overseer_elect
   [junit4]   2> 	at org.apache.zookeeper.KeeperException.create(KeeperException.java:127)
   [junit4]   2> 	at org.apache.zookeeper.KeeperException.create(KeeperException.java:51)
   [junit4]   2> 	at org.apache.zookeeper.ZooKeeper.exists(ZooKeeper.java:1045)
   [junit4]   2> 	at org.apache.solr.common.cloud.SolrZkClient$4.execute(SolrZkClient.java:297)
   [junit4]   2> 	at org.apache.solr.common.cloud.SolrZkClient$4.execute(SolrZkClient.java:294)
   [junit4]   2> 	at org.apache.solr.common.cloud.ZkCmdExecutor.retryOperation(ZkCmdExecutor.java:60)
   [junit4]   2> 	at org.apache.solr.common.cloud.SolrZkClient.exists(SolrZkClient.java:294)
   [junit4]   2> 	at org.apache.solr.common.cloud.SolrZkClient.makePath(SolrZkClient.java:488)
   [junit4]   2> 	at org.apache.solr.common.cloud.SolrZkClient.makePath(SolrZkClient.java:458)
   [junit4]   2> 	at org.apache.solr.common.cloud.SolrZkClient.makePath(SolrZkClient.java:445)
   [junit4]   2> 	at org.apache.solr.cloud.OverseerElectionContext.runLeaderProcess(ElectionContext.java:729)
   [junit4]   2> 	at org.apache.solr.cloud.LeaderElector.runIamLeaderProcess(LeaderElector.java:170)
   [junit4]   2> 	at org.apache.solr.cloud.LeaderElector.checkIfIamLeader(LeaderElector.java:135)
   [junit4]   2> 	at org.apache.solr.cloud.LeaderElector.access$200(LeaderElector.java:56)
   [junit4]   2> 	at org.apache.solr.cloud.LeaderElector$ElectionWatcher.process(LeaderElector.java:348)
   [junit4]   2> 	at org.apache.solr.common.cloud.SolrZkClient$3.lambda$process$0(SolrZkClient.java:266)
   [junit4]   2> 	at java.util.concurrent.Executors$RunnableAdapter.call(Executors.java:511)
   [junit4]   2> 	at java.util.concurrent.FutureTask.run(FutureTask.java:266)
   [junit4]   2> 	at org.apache.solr.common.util.ExecutorUtil$MDCAwareThreadPoolExecutor.lambda$execute$0(ExecutorUtil.java:229)
   [junit4]   2> 	at java.util.concurrent.ThreadPoolExecutor.runWorker(ThreadPoolExecutor.java:1142)
   [junit4]   2> 	at java.util.concurrent.ThreadPoolExecutor$Worker.run(ThreadPoolExecutor.java:617)
   [junit4]   2> 	at java.lang.Thread.run(Thread.java:745)
   [junit4]   2> 1781855 INFO  (jetty-launcher-1806-thread-3) [    ] o.e.j.s.h.ContextHandler Stopped o.e.j.s.ServletContextHandler@61a204e7{/solr,null,UNAVAILABLE}
   [junit4]   2> 1781858 INFO  (SUITE-TestTolerantUpdateProcessorCloud-seed#[971B2403FEDE5916]-worker) [    ] o.a.s.c.ZkTestServer connecting to 127.0.0.1:47620 47620
   [junit4]   2> 1791872 INFO  (Thread-5363) [    ] o.a.s.c.ZkTestServer connecting to 127.0.0.1:47620 47620
   [junit4]   2> 1791873 WARN  (Thread-5363) [    ] o.a.s.c.ZkTestServer Watch limit violations: 
   [junit4]   2> Maximum concurrent create/delete watches above limit:
   [junit4]   2> 
   [junit4]   2> 	6	/solr/aliases.json
   [junit4]   2> 	6	/solr/clusterprops.json
   [junit4]   2> 	5	/solr/security.json
   [junit4]   2> 	3	/solr/configs/solrCloudCollectionConfig/managed-schema
   [junit4]   2> 	3	/solr/configs/solrCloudCollectionConfig
   [junit4]   2> 
   [junit4]   2> Maximum concurrent data watches above limit:
   [junit4]   2> 
   [junit4]   2> 	6	/solr/clusterstate.json
   [junit4]   2> 	4	/solr/collections/test_col/state.json
   [junit4]   2> 
   [junit4]   2> Maximum concurrent children watches above limit:
   [junit4]   2> 
   [junit4]   2> 	6	/solr/live_nodes
   [junit4]   2> 	6	/solr/collections
   [junit4]   2> 
   [junit4]   2> 1791875 INFO  (SUITE-TestTolerantUpdateProcessorCloud-seed#[971B2403FEDE5916]-worker) [    ] o.a.s.SolrTestCaseJ4 ###deleteCore
   [junit4]   2> NOTE: test params are: codec=Asserting(Lucene62): {}, docValues:{}, maxPointsInLeafNode=1810, maxMBSortInHeap=6.2328573148015725, sim=ClassicSimilarity, locale=th-TH-u-nu-thai-x-lvariant-TH, timezone=Indian/Maldives
   [junit4]   2> NOTE: SunOS 5.11 amd64/Oracle Corporation 1.8.0_92 (64-bit)/cpus=3,threads=1,free=214115056,total=483516416
   [junit4]   2> NOTE: All tests run in this JVM: [TestIntervalFaceting, ResourceLoaderTest, TestRangeQuery, TestBinaryField, ZkNodePropsTest, CloneFieldUpdateProcessorFactoryTest, ConvertedLegacyTest, TestZkChroot, CopyFieldTest, TestAuthenticationFramework, TestBinaryResponseWriter, TestIndexingPerformance, TestBadConfig, OpenCloseCoreStressTest, VMParamsZkACLAndCredentialsProvidersTest, TestRealTimeGet, DebugComponentTest, TestMiniSolrCloudClusterBase, CacheHeaderTest, LukeRequestHandlerTest, TestDynamicFieldCollectionResource, TestManagedStopFilterFactory, DistributedFacetPivotSmallAdvancedTest, TestCloudDeleteByQuery, TestStressRecovery, DistanceFunctionTest, CoreAdminCreateDiscoverTest, ForceLeaderTest, TestLeaderInitiatedRecoveryThread, AutoCommitTest, HdfsRecoveryZkTest, TermVectorComponentTest, TestWriterPerf, TestManagedSchemaAPI, FullSolrCloudDistribCmdsTest, TestFilteredDocIdSet, DataDrivenBlockJoinTest, DeleteReplicaTest, DirectUpdateHandlerOptimizeTest, TestDistributedGrouping, SolrCmdDistributorTest, ExitableDirectoryReaderTest, RequestHandlersTest, HdfsBasicDistributedZkTest, SortByFunctionTest, TestSolrQueryParser, TestSerializedLuceneMatchVersion, ConjunctionSolrSpellCheckerTest, TestRecoveryHdfs, TestSchemaNameResource, TestSolr4Spatial, TestReplicaProperties, ChaosMonkeySafeLeaderTest, TestSystemIdResolver, SharedFSAutoReplicaFailoverUtilsTest, IgnoreCommitOptimizeUpdateProcessorFactoryTest, HLLSerializationTest, DateRangeFieldTest, TermVectorComponentDistributedTest, TestRequestStatusCollectionAPI, SynonymTokenizerTest, UniqFieldsUpdateProcessorFactoryTest, TestSha256AuthenticationProvider, IndexSchemaRuntimeFieldTest, BigEndianAscendingWordSerializerTest, DirectSolrConnectionTest, TestBulkSchemaConcurrent, TestFuzzyAnalyzedSuggestions, SearchHandlerTest, CoreMergeIndexesAdminHandlerTest, HdfsNNFailoverTest, TestLMJelinekMercerSimilarityFactory, SecurityConfHandlerTest, TestScoreJoinQPNoScore, TestConfigSetImmutable, TestMiniSolrCloudClusterSSL, SolrIndexSplitterTest, OverriddenZkACLAndCredentialsProvidersTest, ShardSplitTest, TestCustomSort, HighlighterConfigTest, ExplicitHLLTest, MultiTermTest, BinaryUpdateRequestHandlerTest, DistributedFacetPivotLargeTest, UpdateRequestProcessorFactoryTest, SpellCheckComponentTest, SpellCheckCollatorTest, BadCopyFieldTest, BasicDistributedZk2Test, AliasIntegrationTest, HdfsChaosMonkeySafeLeaderTest, RestartWhileUpdatingTest, LeaderInitiatedRecoveryOnShardRestartTest, DistribDocExpirationUpdateProcessorTest, TolerantUpdateProcessorTest, TestPerFieldSimilarityWithDefaultOverride, TestDFISimilarityFactory, DistanceUnitsTest, TestSolrQueryParserResource, DeleteInactiveReplicaTest, CachingDirectoryFactoryTest, CreateCollectionCleanupTest, TestRTGBase, TestTolerantUpdateProcessorCloud]
   [junit4]   2> NOTE: reproduce with: ant test  -Dtestcase=TestTolerantUpdateProcessorCloud -Dtests.seed=971B2403FEDE5916 -Dtests.slow=true -Dtests.locale=th-TH-u-nu-thai-x-lvariant-TH -Dtests.timezone=Indian/Maldives -Dtests.asserts=true -Dtests.file.encoding=UTF-8
   [junit4] ERROR   0.00s J1 | TestTolerantUpdateProcessorCloud (suite) <<<
   [junit4]    > Throwable #1: java.lang.AssertionError: Could not find collection:test_col
   [junit4]    > 	at __randomizedtesting.SeedInfo.seed([971B2403FEDE5916]:0)
   [junit4]    > 	at org.apache.solr.cloud.AbstractDistribZkTestBase.waitForRecoveriesToFinish(AbstractDistribZkTestBase.java:154)
   [junit4]    > 	at org.apache.solr.cloud.TestTolerantUpdateProcessorCloud.createMiniSolrCloudCluster(TestTolerantUpdateProcessorCloud.java:129)
   [junit4]    > 	at java.lang.Thread.run(Thread.java:745)
   [junit4] Completed [231/597 (1!)] on J1 in 47.98s, 0 tests, 1 failure <<< FAILURES!

[...truncated 1179 lines...]
BUILD FAILED
/export/home/jenkins/workspace/Lucene-Solr-master-Solaris/build.xml:740: The following error occurred while executing this line:
/export/home/jenkins/workspace/Lucene-Solr-master-Solaris/build.xml:684: The following error occurred while executing this line:
/export/home/jenkins/workspace/Lucene-Solr-master-Solaris/build.xml:59: The following error occurred while executing this line:
/export/home/jenkins/workspace/Lucene-Solr-master-Solaris/solr/build.xml:233: The following error occurred while executing this line:
/export/home/jenkins/workspace/Lucene-Solr-master-Solaris/solr/common-build.xml:529: The following error occurred while executing this line:
/export/home/jenkins/workspace/Lucene-Solr-master-Solaris/lucene/common-build.xml:1457: The following error occurred while executing this line:
/export/home/jenkins/workspace/Lucene-Solr-master-Solaris/lucene/common-build.xml:1014: There were test failures: 597 suites (10 ignored), 2394 tests, 1 suite-level error, 86 ignored (71 assumptions) [seed: 971B2403FEDE5916]

Total time: 87 minutes 41 seconds
Build step 'Invoke Ant' marked build as failure
Archiving artifacts
[WARNINGS] Skipping publisher since build result is FAILURE
Recording test results
Email was triggered for: Failure - Any
Sending email for trigger: Failure - Any



Mime
View raw message