lucene-dev mailing list archives

Site index · List index
Message view « Date » · « Thread »
Top « Date » · « Thread »
From Policeman Jenkins Server <jenk...@thetaphi.de>
Subject [JENKINS] Lucene-Solr-6.x-Windows (32bit/jdk1.8.0_92) - Build # 182 - Still Failing!
Date Sun, 15 May 2016 18:12:55 GMT
Build: http://jenkins.thetaphi.de/job/Lucene-Solr-6.x-Windows/182/
Java: 32bit/jdk1.8.0_92 -server -XX:+UseParallelGC

2 tests failed.
FAILED:  junit.framework.TestSuite.org.apache.solr.schema.TestManagedSchemaAPI

Error Message:
ObjectTracker found 8 object(s) that were not released!!! [MockDirectoryWrapper, TransactionLog, MockDirectoryWrapper, MDCAwareThreadPoolExecutor, MockDirectoryWrapper, MDCAwareThreadPoolExecutor, TransactionLog, MockDirectoryWrapper]

Stack Trace:
java.lang.AssertionError: ObjectTracker found 8 object(s) that were not released!!! [MockDirectoryWrapper, TransactionLog, MockDirectoryWrapper, MDCAwareThreadPoolExecutor, MockDirectoryWrapper, MDCAwareThreadPoolExecutor, TransactionLog, MockDirectoryWrapper]
	at __randomizedtesting.SeedInfo.seed([57B1E04B64DCAEF5]:0)
	at org.junit.Assert.fail(Assert.java:93)
	at org.junit.Assert.assertTrue(Assert.java:43)
	at org.junit.Assert.assertNull(Assert.java:551)
	at org.apache.solr.SolrTestCaseJ4.afterClass(SolrTestCaseJ4.java:256)
	at sun.reflect.NativeMethodAccessorImpl.invoke0(Native Method)
	at sun.reflect.NativeMethodAccessorImpl.invoke(NativeMethodAccessorImpl.java:62)
	at sun.reflect.DelegatingMethodAccessorImpl.invoke(DelegatingMethodAccessorImpl.java:43)
	at java.lang.reflect.Method.invoke(Method.java:498)
	at com.carrotsearch.randomizedtesting.RandomizedRunner.invoke(RandomizedRunner.java:1764)
	at com.carrotsearch.randomizedtesting.RandomizedRunner$7.evaluate(RandomizedRunner.java:834)
	at com.carrotsearch.randomizedtesting.rules.StatementAdapter.evaluate(StatementAdapter.java:36)
	at com.carrotsearch.randomizedtesting.rules.SystemPropertiesRestoreRule$1.evaluate(SystemPropertiesRestoreRule.java:57)
	at org.apache.lucene.util.AbstractBeforeAfterRule$1.evaluate(AbstractBeforeAfterRule.java:45)
	at com.carrotsearch.randomizedtesting.rules.StatementAdapter.evaluate(StatementAdapter.java:36)
	at org.apache.lucene.util.TestRuleStoreClassName$1.evaluate(TestRuleStoreClassName.java:41)
	at com.carrotsearch.randomizedtesting.rules.NoShadowingOrOverridesOnMethodsRule$1.evaluate(NoShadowingOrOverridesOnMethodsRule.java:40)
	at com.carrotsearch.randomizedtesting.rules.NoShadowingOrOverridesOnMethodsRule$1.evaluate(NoShadowingOrOverridesOnMethodsRule.java:40)
	at com.carrotsearch.randomizedtesting.rules.StatementAdapter.evaluate(StatementAdapter.java:36)
	at com.carrotsearch.randomizedtesting.rules.StatementAdapter.evaluate(StatementAdapter.java:36)
	at com.carrotsearch.randomizedtesting.rules.StatementAdapter.evaluate(StatementAdapter.java:36)
	at org.apache.lucene.util.TestRuleAssertionsRequired$1.evaluate(TestRuleAssertionsRequired.java:53)
	at org.apache.lucene.util.TestRuleMarkFailure$1.evaluate(TestRuleMarkFailure.java:47)
	at org.apache.lucene.util.TestRuleIgnoreAfterMaxFailures$1.evaluate(TestRuleIgnoreAfterMaxFailures.java:64)
	at org.apache.lucene.util.TestRuleIgnoreTestSuites$1.evaluate(TestRuleIgnoreTestSuites.java:54)
	at com.carrotsearch.randomizedtesting.rules.StatementAdapter.evaluate(StatementAdapter.java:36)
	at com.carrotsearch.randomizedtesting.ThreadLeakControl$StatementRunner.run(ThreadLeakControl.java:367)
	at java.lang.Thread.run(Thread.java:745)


FAILED:  junit.framework.TestSuite.org.apache.solr.schema.TestManagedSchemaAPI

Error Message:
Could not remove the following files (in the order of attempts):    C:\Users\jenkins\workspace\Lucene-Solr-6.x-Windows\solr\build\solr-core\test\J1\temp\solr.schema.TestManagedSchemaAPI_57B1E04B64DCAEF5-001\tempDir-001\node2\testschemaapi_shard1_replica1\data\tlog\tlog.0000000000000000000: java.nio.file.FileSystemException: C:\Users\jenkins\workspace\Lucene-Solr-6.x-Windows\solr\build\solr-core\test\J1\temp\solr.schema.TestManagedSchemaAPI_57B1E04B64DCAEF5-001\tempDir-001\node2\testschemaapi_shard1_replica1\data\tlog\tlog.0000000000000000000: The process cannot access the file because it is being used by another process.     C:\Users\jenkins\workspace\Lucene-Solr-6.x-Windows\solr\build\solr-core\test\J1\temp\solr.schema.TestManagedSchemaAPI_57B1E04B64DCAEF5-001\tempDir-001\node2\testschemaapi_shard1_replica1\data\tlog: java.nio.file.DirectoryNotEmptyException: C:\Users\jenkins\workspace\Lucene-Solr-6.x-Windows\solr\build\solr-core\test\J1\temp\solr.schema.TestManagedSchemaAPI_57B1E04B64DCAEF5-001\tempDir-001\node2\testschemaapi_shard1_replica1\data\tlog    C:\Users\jenkins\workspace\Lucene-Solr-6.x-Windows\solr\build\solr-core\test\J1\temp\solr.schema.TestManagedSchemaAPI_57B1E04B64DCAEF5-001\tempDir-001\node2\testschemaapi_shard1_replica1\data: java.nio.file.DirectoryNotEmptyException: C:\Users\jenkins\workspace\Lucene-Solr-6.x-Windows\solr\build\solr-core\test\J1\temp\solr.schema.TestManagedSchemaAPI_57B1E04B64DCAEF5-001\tempDir-001\node2\testschemaapi_shard1_replica1\data    C:\Users\jenkins\workspace\Lucene-Solr-6.x-Windows\solr\build\solr-core\test\J1\temp\solr.schema.TestManagedSchemaAPI_57B1E04B64DCAEF5-001\tempDir-001\node2\testschemaapi_shard1_replica1: java.nio.file.DirectoryNotEmptyException: C:\Users\jenkins\workspace\Lucene-Solr-6.x-Windows\solr\build\solr-core\test\J1\temp\solr.schema.TestManagedSchemaAPI_57B1E04B64DCAEF5-001\tempDir-001\node2\testschemaapi_shard1_replica1    C:\Users\jenkins\workspace\Lucene-Solr-6.x-Windows\solr\build\solr-core\test\J1\temp\solr.schema.TestManagedSchemaAPI_57B1E04B64DCAEF5-001\tempDir-001\node2: java.nio.file.DirectoryNotEmptyException: C:\Users\jenkins\workspace\Lucene-Solr-6.x-Windows\solr\build\solr-core\test\J1\temp\solr.schema.TestManagedSchemaAPI_57B1E04B64DCAEF5-001\tempDir-001\node2    C:\Users\jenkins\workspace\Lucene-Solr-6.x-Windows\solr\build\solr-core\test\J1\temp\solr.schema.TestManagedSchemaAPI_57B1E04B64DCAEF5-001\tempDir-001\node1\testschemaapi_shard1_replica2\data\tlog\tlog.0000000000000000001: java.nio.file.FileSystemException: C:\Users\jenkins\workspace\Lucene-Solr-6.x-Windows\solr\build\solr-core\test\J1\temp\solr.schema.TestManagedSchemaAPI_57B1E04B64DCAEF5-001\tempDir-001\node1\testschemaapi_shard1_replica2\data\tlog\tlog.0000000000000000001: The process cannot access the file because it is being used by another process.     C:\Users\jenkins\workspace\Lucene-Solr-6.x-Windows\solr\build\solr-core\test\J1\temp\solr.schema.TestManagedSchemaAPI_57B1E04B64DCAEF5-001\tempDir-001\node1\testschemaapi_shard1_replica2\data\tlog: java.nio.file.DirectoryNotEmptyException: C:\Users\jenkins\workspace\Lucene-Solr-6.x-Windows\solr\build\solr-core\test\J1\temp\solr.schema.TestManagedSchemaAPI_57B1E04B64DCAEF5-001\tempDir-001\node1\testschemaapi_shard1_replica2\data\tlog    C:\Users\jenkins\workspace\Lucene-Solr-6.x-Windows\solr\build\solr-core\test\J1\temp\solr.schema.TestManagedSchemaAPI_57B1E04B64DCAEF5-001\tempDir-001\node1\testschemaapi_shard1_replica2\data: java.nio.file.DirectoryNotEmptyException: C:\Users\jenkins\workspace\Lucene-Solr-6.x-Windows\solr\build\solr-core\test\J1\temp\solr.schema.TestManagedSchemaAPI_57B1E04B64DCAEF5-001\tempDir-001\node1\testschemaapi_shard1_replica2\data    C:\Users\jenkins\workspace\Lucene-Solr-6.x-Windows\solr\build\solr-core\test\J1\temp\solr.schema.TestManagedSchemaAPI_57B1E04B64DCAEF5-001\tempDir-001\node1\testschemaapi_shard1_replica2: java.nio.file.DirectoryNotEmptyException: C:\Users\jenkins\workspace\Lucene-Solr-6.x-Windows\solr\build\solr-core\test\J1\temp\solr.schema.TestManagedSchemaAPI_57B1E04B64DCAEF5-001\tempDir-001\node1\testschemaapi_shard1_replica2    C:\Users\jenkins\workspace\Lucene-Solr-6.x-Windows\solr\build\solr-core\test\J1\temp\solr.schema.TestManagedSchemaAPI_57B1E04B64DCAEF5-001\tempDir-001\node1: java.nio.file.DirectoryNotEmptyException: C:\Users\jenkins\workspace\Lucene-Solr-6.x-Windows\solr\build\solr-core\test\J1\temp\solr.schema.TestManagedSchemaAPI_57B1E04B64DCAEF5-001\tempDir-001\node1    C:\Users\jenkins\workspace\Lucene-Solr-6.x-Windows\solr\build\solr-core\test\J1\temp\solr.schema.TestManagedSchemaAPI_57B1E04B64DCAEF5-001\tempDir-001: java.nio.file.DirectoryNotEmptyException: C:\Users\jenkins\workspace\Lucene-Solr-6.x-Windows\solr\build\solr-core\test\J1\temp\solr.schema.TestManagedSchemaAPI_57B1E04B64DCAEF5-001\tempDir-001    C:\Users\jenkins\workspace\Lucene-Solr-6.x-Windows\solr\build\solr-core\test\J1\temp\solr.schema.TestManagedSchemaAPI_57B1E04B64DCAEF5-001: java.nio.file.DirectoryNotEmptyException: C:\Users\jenkins\workspace\Lucene-Solr-6.x-Windows\solr\build\solr-core\test\J1\temp\solr.schema.TestManagedSchemaAPI_57B1E04B64DCAEF5-001 

Stack Trace:
java.io.IOException: Could not remove the following files (in the order of attempts):
   C:\Users\jenkins\workspace\Lucene-Solr-6.x-Windows\solr\build\solr-core\test\J1\temp\solr.schema.TestManagedSchemaAPI_57B1E04B64DCAEF5-001\tempDir-001\node2\testschemaapi_shard1_replica1\data\tlog\tlog.0000000000000000000: java.nio.file.FileSystemException: C:\Users\jenkins\workspace\Lucene-Solr-6.x-Windows\solr\build\solr-core\test\J1\temp\solr.schema.TestManagedSchemaAPI_57B1E04B64DCAEF5-001\tempDir-001\node2\testschemaapi_shard1_replica1\data\tlog\tlog.0000000000000000000: The process cannot access the file because it is being used by another process.

   C:\Users\jenkins\workspace\Lucene-Solr-6.x-Windows\solr\build\solr-core\test\J1\temp\solr.schema.TestManagedSchemaAPI_57B1E04B64DCAEF5-001\tempDir-001\node2\testschemaapi_shard1_replica1\data\tlog: java.nio.file.DirectoryNotEmptyException: C:\Users\jenkins\workspace\Lucene-Solr-6.x-Windows\solr\build\solr-core\test\J1\temp\solr.schema.TestManagedSchemaAPI_57B1E04B64DCAEF5-001\tempDir-001\node2\testschemaapi_shard1_replica1\data\tlog
   C:\Users\jenkins\workspace\Lucene-Solr-6.x-Windows\solr\build\solr-core\test\J1\temp\solr.schema.TestManagedSchemaAPI_57B1E04B64DCAEF5-001\tempDir-001\node2\testschemaapi_shard1_replica1\data: java.nio.file.DirectoryNotEmptyException: C:\Users\jenkins\workspace\Lucene-Solr-6.x-Windows\solr\build\solr-core\test\J1\temp\solr.schema.TestManagedSchemaAPI_57B1E04B64DCAEF5-001\tempDir-001\node2\testschemaapi_shard1_replica1\data
   C:\Users\jenkins\workspace\Lucene-Solr-6.x-Windows\solr\build\solr-core\test\J1\temp\solr.schema.TestManagedSchemaAPI_57B1E04B64DCAEF5-001\tempDir-001\node2\testschemaapi_shard1_replica1: java.nio.file.DirectoryNotEmptyException: C:\Users\jenkins\workspace\Lucene-Solr-6.x-Windows\solr\build\solr-core\test\J1\temp\solr.schema.TestManagedSchemaAPI_57B1E04B64DCAEF5-001\tempDir-001\node2\testschemaapi_shard1_replica1
   C:\Users\jenkins\workspace\Lucene-Solr-6.x-Windows\solr\build\solr-core\test\J1\temp\solr.schema.TestManagedSchemaAPI_57B1E04B64DCAEF5-001\tempDir-001\node2: java.nio.file.DirectoryNotEmptyException: C:\Users\jenkins\workspace\Lucene-Solr-6.x-Windows\solr\build\solr-core\test\J1\temp\solr.schema.TestManagedSchemaAPI_57B1E04B64DCAEF5-001\tempDir-001\node2
   C:\Users\jenkins\workspace\Lucene-Solr-6.x-Windows\solr\build\solr-core\test\J1\temp\solr.schema.TestManagedSchemaAPI_57B1E04B64DCAEF5-001\tempDir-001\node1\testschemaapi_shard1_replica2\data\tlog\tlog.0000000000000000001: java.nio.file.FileSystemException: C:\Users\jenkins\workspace\Lucene-Solr-6.x-Windows\solr\build\solr-core\test\J1\temp\solr.schema.TestManagedSchemaAPI_57B1E04B64DCAEF5-001\tempDir-001\node1\testschemaapi_shard1_replica2\data\tlog\tlog.0000000000000000001: The process cannot access the file because it is being used by another process.

   C:\Users\jenkins\workspace\Lucene-Solr-6.x-Windows\solr\build\solr-core\test\J1\temp\solr.schema.TestManagedSchemaAPI_57B1E04B64DCAEF5-001\tempDir-001\node1\testschemaapi_shard1_replica2\data\tlog: java.nio.file.DirectoryNotEmptyException: C:\Users\jenkins\workspace\Lucene-Solr-6.x-Windows\solr\build\solr-core\test\J1\temp\solr.schema.TestManagedSchemaAPI_57B1E04B64DCAEF5-001\tempDir-001\node1\testschemaapi_shard1_replica2\data\tlog
   C:\Users\jenkins\workspace\Lucene-Solr-6.x-Windows\solr\build\solr-core\test\J1\temp\solr.schema.TestManagedSchemaAPI_57B1E04B64DCAEF5-001\tempDir-001\node1\testschemaapi_shard1_replica2\data: java.nio.file.DirectoryNotEmptyException: C:\Users\jenkins\workspace\Lucene-Solr-6.x-Windows\solr\build\solr-core\test\J1\temp\solr.schema.TestManagedSchemaAPI_57B1E04B64DCAEF5-001\tempDir-001\node1\testschemaapi_shard1_replica2\data
   C:\Users\jenkins\workspace\Lucene-Solr-6.x-Windows\solr\build\solr-core\test\J1\temp\solr.schema.TestManagedSchemaAPI_57B1E04B64DCAEF5-001\tempDir-001\node1\testschemaapi_shard1_replica2: java.nio.file.DirectoryNotEmptyException: C:\Users\jenkins\workspace\Lucene-Solr-6.x-Windows\solr\build\solr-core\test\J1\temp\solr.schema.TestManagedSchemaAPI_57B1E04B64DCAEF5-001\tempDir-001\node1\testschemaapi_shard1_replica2
   C:\Users\jenkins\workspace\Lucene-Solr-6.x-Windows\solr\build\solr-core\test\J1\temp\solr.schema.TestManagedSchemaAPI_57B1E04B64DCAEF5-001\tempDir-001\node1: java.nio.file.DirectoryNotEmptyException: C:\Users\jenkins\workspace\Lucene-Solr-6.x-Windows\solr\build\solr-core\test\J1\temp\solr.schema.TestManagedSchemaAPI_57B1E04B64DCAEF5-001\tempDir-001\node1
   C:\Users\jenkins\workspace\Lucene-Solr-6.x-Windows\solr\build\solr-core\test\J1\temp\solr.schema.TestManagedSchemaAPI_57B1E04B64DCAEF5-001\tempDir-001: java.nio.file.DirectoryNotEmptyException: C:\Users\jenkins\workspace\Lucene-Solr-6.x-Windows\solr\build\solr-core\test\J1\temp\solr.schema.TestManagedSchemaAPI_57B1E04B64DCAEF5-001\tempDir-001
   C:\Users\jenkins\workspace\Lucene-Solr-6.x-Windows\solr\build\solr-core\test\J1\temp\solr.schema.TestManagedSchemaAPI_57B1E04B64DCAEF5-001: java.nio.file.DirectoryNotEmptyException: C:\Users\jenkins\workspace\Lucene-Solr-6.x-Windows\solr\build\solr-core\test\J1\temp\solr.schema.TestManagedSchemaAPI_57B1E04B64DCAEF5-001

	at org.apache.lucene.util.IOUtils.rm(IOUtils.java:323)
	at org.apache.lucene.util.TestRuleTemporaryFilesCleanup.afterAlways(TestRuleTemporaryFilesCleanup.java:216)
	at com.carrotsearch.randomizedtesting.rules.TestRuleAdapter$1.afterAlways(TestRuleAdapter.java:31)
	at com.carrotsearch.randomizedtesting.rules.StatementAdapter.evaluate(StatementAdapter.java:43)
	at com.carrotsearch.randomizedtesting.rules.StatementAdapter.evaluate(StatementAdapter.java:36)
	at org.apache.lucene.util.TestRuleAssertionsRequired$1.evaluate(TestRuleAssertionsRequired.java:53)
	at org.apache.lucene.util.TestRuleMarkFailure$1.evaluate(TestRuleMarkFailure.java:47)
	at org.apache.lucene.util.TestRuleIgnoreAfterMaxFailures$1.evaluate(TestRuleIgnoreAfterMaxFailures.java:64)
	at org.apache.lucene.util.TestRuleIgnoreTestSuites$1.evaluate(TestRuleIgnoreTestSuites.java:54)
	at com.carrotsearch.randomizedtesting.rules.StatementAdapter.evaluate(StatementAdapter.java:36)
	at com.carrotsearch.randomizedtesting.ThreadLeakControl$StatementRunner.run(ThreadLeakControl.java:367)
	at java.lang.Thread.run(Thread.java:745)




Build Log:
[...truncated 10601 lines...]
   [junit4] Suite: org.apache.solr.schema.TestManagedSchemaAPI
   [junit4]   2> Creating dataDir: C:\Users\jenkins\workspace\Lucene-Solr-6.x-Windows\solr\build\solr-core\test\J1\temp\solr.schema.TestManagedSchemaAPI_57B1E04B64DCAEF5-001\init-core-data-001
   [junit4]   2> 85257 INFO  (SUITE-TestManagedSchemaAPI-seed#[57B1E04B64DCAEF5]-worker) [    ] o.a.s.SolrTestCaseJ4 Randomized ssl (false) and clientAuth (true)
   [junit4]   2> 85268 INFO  (SUITE-TestManagedSchemaAPI-seed#[57B1E04B64DCAEF5]-worker) [    ] o.a.s.c.ZkTestServer STARTING ZK TEST SERVER
   [junit4]   2> 85270 INFO  (Thread-155) [    ] o.a.s.c.ZkTestServer client port:0.0.0.0/0.0.0.0:0
   [junit4]   2> 85270 INFO  (Thread-155) [    ] o.a.s.c.ZkTestServer Starting server
   [junit4]   2> 85370 INFO  (SUITE-TestManagedSchemaAPI-seed#[57B1E04B64DCAEF5]-worker) [    ] o.a.s.c.ZkTestServer start zk server on port:56075
   [junit4]   2> 85370 INFO  (SUITE-TestManagedSchemaAPI-seed#[57B1E04B64DCAEF5]-worker) [    ] o.a.s.c.c.SolrZkClient Using default ZkCredentialsProvider
   [junit4]   2> 85371 INFO  (SUITE-TestManagedSchemaAPI-seed#[57B1E04B64DCAEF5]-worker) [    ] o.a.s.c.c.ConnectionManager Waiting for client to connect to ZooKeeper
   [junit4]   2> 85380 INFO  (zkCallback-86-thread-1) [    ] o.a.s.c.c.ConnectionManager Watcher org.apache.solr.common.cloud.ConnectionManager@1cbaa9e name:ZooKeeperConnection Watcher:127.0.0.1:56075 got event WatchedEvent state:SyncConnected type:None path:null path:null type:None
   [junit4]   2> 85380 INFO  (SUITE-TestManagedSchemaAPI-seed#[57B1E04B64DCAEF5]-worker) [    ] o.a.s.c.c.ConnectionManager Client is connected to ZooKeeper
   [junit4]   2> 85380 INFO  (SUITE-TestManagedSchemaAPI-seed#[57B1E04B64DCAEF5]-worker) [    ] o.a.s.c.c.SolrZkClient Using default ZkACLProvider
   [junit4]   2> 85380 INFO  (SUITE-TestManagedSchemaAPI-seed#[57B1E04B64DCAEF5]-worker) [    ] o.a.s.c.c.SolrZkClient makePath: /solr/solr.xml
   [junit4]   2> 85395 INFO  (jetty-launcher-85-thread-2) [    ] o.e.j.s.Server jetty-9.3.8.v20160314
   [junit4]   2> 85396 INFO  (jetty-launcher-85-thread-2) [    ] o.e.j.s.h.ContextHandler Started o.e.j.s.ServletContextHandler@e0d4d{/solr,null,AVAILABLE}
   [junit4]   2> 85399 INFO  (jetty-launcher-85-thread-2) [    ] o.e.j.s.ServerConnector Started ServerConnector@dd7020{HTTP/1.1,[http/1.1]}{127.0.0.1:56082}
   [junit4]   2> 85399 INFO  (jetty-launcher-85-thread-2) [    ] o.e.j.s.Server Started @90815ms
   [junit4]   2> 85399 INFO  (jetty-launcher-85-thread-2) [    ] o.a.s.c.s.e.JettySolrRunner Jetty properties: {hostContext=/solr, hostPort=56082}
   [junit4]   2> 85400 INFO  (jetty-launcher-85-thread-2) [    ] o.a.s.s.SolrDispatchFilter SolrDispatchFilter.init(): sun.misc.Launcher$AppClassLoader@1d16e93
   [junit4]   2> 85400 INFO  (jetty-launcher-85-thread-2) [    ] o.a.s.c.SolrResourceLoader new SolrResourceLoader for directory: 'C:\Users\jenkins\workspace\Lucene-Solr-6.x-Windows\solr\build\solr-core\test\J1\temp\solr.schema.TestManagedSchemaAPI_57B1E04B64DCAEF5-001\tempDir-001\node2'
   [junit4]   2> 85400 INFO  (jetty-launcher-85-thread-2) [    ] o.a.s.c.SolrResourceLoader JNDI not configured for solr (NoInitialContextEx)
   [junit4]   2> 85400 INFO  (jetty-launcher-85-thread-2) [    ] o.a.s.c.SolrResourceLoader solr home defaulted to 'solr/' (could not find system property or JNDI)
   [junit4]   2> 85400 INFO  (jetty-launcher-85-thread-1) [    ] o.e.j.s.Server jetty-9.3.8.v20160314
   [junit4]   2> 85402 INFO  (jetty-launcher-85-thread-2) [    ] o.a.s.c.c.SolrZkClient Using default ZkCredentialsProvider
   [junit4]   2> 85402 INFO  (jetty-launcher-85-thread-1) [    ] o.e.j.s.h.ContextHandler Started o.e.j.s.ServletContextHandler@418a94{/solr,null,AVAILABLE}
   [junit4]   2> 85403 INFO  (jetty-launcher-85-thread-2) [    ] o.a.s.c.c.ConnectionManager Waiting for client to connect to ZooKeeper
   [junit4]   2> 85404 INFO  (jetty-launcher-85-thread-1) [    ] o.e.j.s.ServerConnector Started ServerConnector@14d4e16{HTTP/1.1,[http/1.1]}{127.0.0.1:56087}
   [junit4]   2> 85404 INFO  (jetty-launcher-85-thread-1) [    ] o.e.j.s.Server Started @90820ms
   [junit4]   2> 85404 INFO  (jetty-launcher-85-thread-1) [    ] o.a.s.c.s.e.JettySolrRunner Jetty properties: {hostContext=/solr, hostPort=56087}
   [junit4]   2> 85405 INFO  (jetty-launcher-85-thread-1) [    ] o.a.s.s.SolrDispatchFilter SolrDispatchFilter.init(): sun.misc.Launcher$AppClassLoader@1d16e93
   [junit4]   2> 85405 INFO  (jetty-launcher-85-thread-1) [    ] o.a.s.c.SolrResourceLoader new SolrResourceLoader for directory: 'C:\Users\jenkins\workspace\Lucene-Solr-6.x-Windows\solr\build\solr-core\test\J1\temp\solr.schema.TestManagedSchemaAPI_57B1E04B64DCAEF5-001\tempDir-001\node1'
   [junit4]   2> 85405 INFO  (jetty-launcher-85-thread-1) [    ] o.a.s.c.SolrResourceLoader JNDI not configured for solr (NoInitialContextEx)
   [junit4]   2> 85405 INFO  (jetty-launcher-85-thread-1) [    ] o.a.s.c.SolrResourceLoader solr home defaulted to 'solr/' (could not find system property or JNDI)
   [junit4]   2> 85410 INFO  (jetty-launcher-85-thread-1) [    ] o.a.s.c.c.SolrZkClient Using default ZkCredentialsProvider
   [junit4]   2> 85412 INFO  (jetty-launcher-85-thread-1) [    ] o.a.s.c.c.ConnectionManager Waiting for client to connect to ZooKeeper
   [junit4]   2> 85415 INFO  (zkCallback-87-thread-1) [    ] o.a.s.c.c.ConnectionManager Watcher org.apache.solr.common.cloud.ConnectionManager@114215a name:ZooKeeperConnection Watcher:127.0.0.1:56075/solr got event WatchedEvent state:SyncConnected type:None path:null path:null type:None
   [junit4]   2> 85415 INFO  (jetty-launcher-85-thread-2) [    ] o.a.s.c.c.ConnectionManager Client is connected to ZooKeeper
   [junit4]   2> 85415 INFO  (zkCallback-88-thread-1) [    ] o.a.s.c.c.ConnectionManager Watcher org.apache.solr.common.cloud.ConnectionManager@6faf05 name:ZooKeeperConnection Watcher:127.0.0.1:56075/solr got event WatchedEvent state:SyncConnected type:None path:null path:null type:None
   [junit4]   2> 85415 INFO  (jetty-launcher-85-thread-1) [    ] o.a.s.c.c.ConnectionManager Client is connected to ZooKeeper
   [junit4]   2> 85415 INFO  (jetty-launcher-85-thread-2) [    ] o.a.s.c.c.SolrZkClient Using default ZkACLProvider
   [junit4]   2> 85415 INFO  (jetty-launcher-85-thread-1) [    ] o.a.s.c.c.SolrZkClient Using default ZkACLProvider
   [junit4]   2> 85416 INFO  (jetty-launcher-85-thread-1) [    ] o.a.s.s.SolrDispatchFilter solr.xml found in ZooKeeper. Loading...
   [junit4]   2> 85416 INFO  (jetty-launcher-85-thread-2) [    ] o.a.s.s.SolrDispatchFilter solr.xml found in ZooKeeper. Loading...
   [junit4]   2> 85431 WARN  (NIOServerCxn.Factory:0.0.0.0/0.0.0.0:0) [    ] o.a.z.s.NIOServerCnxn caught end of stream exception
   [junit4]   2> EndOfStreamException: Unable to read additional data from client sessionid 0x154b56e6b800002, likely client has closed socket
   [junit4]   2> 	at org.apache.zookeeper.server.NIOServerCnxn.doIO(NIOServerCnxn.java:228)
   [junit4]   2> 	at org.apache.zookeeper.server.NIOServerCnxnFactory.run(NIOServerCnxnFactory.java:208)
   [junit4]   2> 	at java.lang.Thread.run(Thread.java:745)
   [junit4]   2> 85434 INFO  (jetty-launcher-85-thread-1) [    ] o.a.s.c.CorePropertiesLocator Config-defined core root directory: C:\Users\jenkins\workspace\Lucene-Solr-6.x-Windows\solr\build\solr-core\test\J1\temp\solr.schema.TestManagedSchemaAPI_57B1E04B64DCAEF5-001\tempDir-001\node1\.
   [junit4]   2> 85434 INFO  (jetty-launcher-85-thread-1) [    ] o.a.s.c.CoreContainer New CoreContainer 17413058
   [junit4]   2> 85434 INFO  (jetty-launcher-85-thread-1) [    ] o.a.s.c.CoreContainer Loading cores into CoreContainer [instanceDir=C:\Users\jenkins\workspace\Lucene-Solr-6.x-Windows\solr\build\solr-core\test\J1\temp\solr.schema.TestManagedSchemaAPI_57B1E04B64DCAEF5-001\tempDir-001\node1]
   [junit4]   2> 85434 WARN  (jetty-launcher-85-thread-1) [    ] o.a.s.c.CoreContainer Couldn't add files from C:\Users\jenkins\workspace\Lucene-Solr-6.x-Windows\solr\build\solr-core\test\J1\temp\solr.schema.TestManagedSchemaAPI_57B1E04B64DCAEF5-001\tempDir-001\node1\lib to classpath: C:\Users\jenkins\workspace\Lucene-Solr-6.x-Windows\solr\build\solr-core\test\J1\temp\solr.schema.TestManagedSchemaAPI_57B1E04B64DCAEF5-001\tempDir-001\node1\lib
   [junit4]   2> 85435 INFO  (jetty-launcher-85-thread-1) [    ] o.a.s.h.c.HttpShardHandlerFactory created with socketTimeout : 90000,urlScheme : ,connTimeout : 15000,maxConnectionsPerHost : 20,maxConnections : 10000,corePoolSize : 0,maximumPoolSize : 2147483647,maxThreadIdleTime : 5,sizeOfQueue : -1,fairnessPolicy : false,useRetries : false,
   [junit4]   2> 85438 INFO  (jetty-launcher-85-thread-1) [    ] o.a.s.u.UpdateShardHandler Creating UpdateShardHandler HTTP client with params: socketTimeout=340000&connTimeout=45000&retry=true
   [junit4]   2> 85439 INFO  (jetty-launcher-85-thread-1) [    ] o.a.s.l.LogWatcher SLF4J impl is org.slf4j.impl.Log4jLoggerFactory
   [junit4]   2> 85439 INFO  (jetty-launcher-85-thread-1) [    ] o.a.s.l.LogWatcher Registering Log Listener [Log4j (org.slf4j.impl.Log4jLoggerFactory)]
   [junit4]   2> 85439 INFO  (jetty-launcher-85-thread-1) [    ] o.a.s.c.ZkContainer Zookeeper client=127.0.0.1:56075/solr
   [junit4]   2> 85439 INFO  (jetty-launcher-85-thread-1) [    ] o.a.s.c.ZkController zkHost includes chroot
   [junit4]   2> 85439 INFO  (jetty-launcher-85-thread-1) [    ] o.a.s.c.c.SolrZkClient Using default ZkCredentialsProvider
   [junit4]   2> 85440 INFO  (jetty-launcher-85-thread-1) [    ] o.a.s.c.c.ConnectionManager Waiting for client to connect to ZooKeeper
   [junit4]   2> 85443 INFO  (jetty-launcher-85-thread-2) [    ] o.a.s.c.CorePropertiesLocator Config-defined core root directory: C:\Users\jenkins\workspace\Lucene-Solr-6.x-Windows\solr\build\solr-core\test\J1\temp\solr.schema.TestManagedSchemaAPI_57B1E04B64DCAEF5-001\tempDir-001\node2\.
   [junit4]   2> 85444 INFO  (jetty-launcher-85-thread-2) [    ] o.a.s.c.CoreContainer New CoreContainer 9134209
   [junit4]   2> 85444 INFO  (jetty-launcher-85-thread-2) [    ] o.a.s.c.CoreContainer Loading cores into CoreContainer [instanceDir=C:\Users\jenkins\workspace\Lucene-Solr-6.x-Windows\solr\build\solr-core\test\J1\temp\solr.schema.TestManagedSchemaAPI_57B1E04B64DCAEF5-001\tempDir-001\node2]
   [junit4]   2> 85445 WARN  (jetty-launcher-85-thread-2) [    ] o.a.s.c.CoreContainer Couldn't add files from C:\Users\jenkins\workspace\Lucene-Solr-6.x-Windows\solr\build\solr-core\test\J1\temp\solr.schema.TestManagedSchemaAPI_57B1E04B64DCAEF5-001\tempDir-001\node2\lib to classpath: C:\Users\jenkins\workspace\Lucene-Solr-6.x-Windows\solr\build\solr-core\test\J1\temp\solr.schema.TestManagedSchemaAPI_57B1E04B64DCAEF5-001\tempDir-001\node2\lib
   [junit4]   2> 85445 INFO  (jetty-launcher-85-thread-2) [    ] o.a.s.h.c.HttpShardHandlerFactory created with socketTimeout : 90000,urlScheme : ,connTimeout : 15000,maxConnectionsPerHost : 20,maxConnections : 10000,corePoolSize : 0,maximumPoolSize : 2147483647,maxThreadIdleTime : 5,sizeOfQueue : -1,fairnessPolicy : false,useRetries : false,
   [junit4]   2> 85446 INFO  (jetty-launcher-85-thread-2) [    ] o.a.s.u.UpdateShardHandler Creating UpdateShardHandler HTTP client with params: socketTimeout=340000&connTimeout=45000&retry=true
   [junit4]   2> 85447 INFO  (jetty-launcher-85-thread-2) [    ] o.a.s.l.LogWatcher SLF4J impl is org.slf4j.impl.Log4jLoggerFactory
   [junit4]   2> 85447 INFO  (jetty-launcher-85-thread-2) [    ] o.a.s.l.LogWatcher Registering Log Listener [Log4j (org.slf4j.impl.Log4jLoggerFactory)]
   [junit4]   2> 85447 INFO  (jetty-launcher-85-thread-2) [    ] o.a.s.c.ZkContainer Zookeeper client=127.0.0.1:56075/solr
   [junit4]   2> 85447 INFO  (jetty-launcher-85-thread-2) [    ] o.a.s.c.ZkController zkHost includes chroot
   [junit4]   2> 85447 INFO  (jetty-launcher-85-thread-2) [    ] o.a.s.c.c.SolrZkClient Using default ZkCredentialsProvider
   [junit4]   2> 85448 INFO  (zkCallback-91-thread-1) [    ] o.a.s.c.c.ConnectionManager Watcher org.apache.solr.common.cloud.ConnectionManager@fb075e name:ZooKeeperConnection Watcher:127.0.0.1:56075 got event WatchedEvent state:SyncConnected type:None path:null path:null type:None
   [junit4]   2> 85448 INFO  (jetty-launcher-85-thread-1) [    ] o.a.s.c.c.ConnectionManager Client is connected to ZooKeeper
   [junit4]   2> 85448 INFO  (jetty-launcher-85-thread-2) [    ] o.a.s.c.c.ConnectionManager Waiting for client to connect to ZooKeeper
   [junit4]   2> 85448 INFO  (jetty-launcher-85-thread-1) [    ] o.a.s.c.c.SolrZkClient Using default ZkACLProvider
   [junit4]   2> 85452 WARN  (NIOServerCxn.Factory:0.0.0.0/0.0.0.0:0) [    ] o.a.z.s.NIOServerCnxn caught end of stream exception
   [junit4]   2> EndOfStreamException: Unable to read additional data from client sessionid 0x154b56e6b800003, likely client has closed socket
   [junit4]   2> 	at org.apache.zookeeper.server.NIOServerCnxn.doIO(NIOServerCnxn.java:228)
   [junit4]   2> 	at org.apache.zookeeper.server.NIOServerCnxnFactory.run(NIOServerCnxnFactory.java:208)
   [junit4]   2> 	at java.lang.Thread.run(Thread.java:745)
   [junit4]   2> 85453 INFO  (jetty-launcher-85-thread-1) [n:127.0.0.1:56087_solr    ] o.a.s.c.ZkController Added new OnReconnect listener org.apache.solr.cloud.ZkController$$Lambda$34/18316412@6d69b2
   [junit4]   2> 85456 INFO  (jetty-launcher-85-thread-1) [n:127.0.0.1:56087_solr    ] o.a.s.c.c.ConnectionManager Waiting for client to connect to ZooKeeper
   [junit4]   2> 85456 INFO  (zkCallback-94-thread-1) [    ] o.a.s.c.c.ConnectionManager Watcher org.apache.solr.common.cloud.ConnectionManager@8a691e name:ZooKeeperConnection Watcher:127.0.0.1:56075 got event WatchedEvent state:SyncConnected type:None path:null path:null type:None
   [junit4]   2> 85456 INFO  (jetty-launcher-85-thread-2) [    ] o.a.s.c.c.ConnectionManager Client is connected to ZooKeeper
   [junit4]   2> 85458 INFO  (jetty-launcher-85-thread-2) [    ] o.a.s.c.c.SolrZkClient Using default ZkACLProvider
   [junit4]   2> 85462 INFO  (zkCallback-95-thread-1-processing-n:127.0.0.1:56087_solr) [n:127.0.0.1:56087_solr    ] o.a.s.c.c.ConnectionManager Watcher org.apache.solr.common.cloud.ConnectionManager@6675ed name:ZooKeeperConnection Watcher:127.0.0.1:56075/solr got event WatchedEvent state:SyncConnected type:None path:null path:null type:None
   [junit4]   2> 85462 INFO  (jetty-launcher-85-thread-1) [n:127.0.0.1:56087_solr    ] o.a.s.c.c.ConnectionManager Client is connected to ZooKeeper
   [junit4]   2> 85465 WARN  (NIOServerCxn.Factory:0.0.0.0/0.0.0.0:0) [    ] o.a.z.s.NIOServerCnxn caught end of stream exception
   [junit4]   2> EndOfStreamException: Unable to read additional data from client sessionid 0x154b56e6b800004, likely client has closed socket
   [junit4]   2> 	at org.apache.zookeeper.server.NIOServerCnxn.doIO(NIOServerCnxn.java:228)
   [junit4]   2> 	at org.apache.zookeeper.server.NIOServerCnxnFactory.run(NIOServerCnxnFactory.java:208)
   [junit4]   2> 	at java.lang.Thread.run(Thread.java:745)
   [junit4]   2> 85465 INFO  (jetty-launcher-85-thread-2) [n:127.0.0.1:56082_solr    ] o.a.s.c.ZkController Added new OnReconnect listener org.apache.solr.cloud.ZkController$$Lambda$34/18316412@14f5f3e
   [junit4]   2> 85465 INFO  (jetty-launcher-85-thread-1) [n:127.0.0.1:56087_solr    ] o.a.s.c.c.SolrZkClient makePath: /overseer/queue
   [junit4]   2> 85466 INFO  (jetty-launcher-85-thread-2) [n:127.0.0.1:56082_solr    ] o.a.s.c.c.ConnectionManager Waiting for client to connect to ZooKeeper
   [junit4]   2> 85469 INFO  (zkCallback-96-thread-1-processing-n:127.0.0.1:56082_solr) [n:127.0.0.1:56082_solr    ] o.a.s.c.c.ConnectionManager Watcher org.apache.solr.common.cloud.ConnectionManager@1cc36af name:ZooKeeperConnection Watcher:127.0.0.1:56075/solr got event WatchedEvent state:SyncConnected type:None path:null path:null type:None
   [junit4]   2> 85469 INFO  (jetty-launcher-85-thread-2) [n:127.0.0.1:56082_solr    ] o.a.s.c.c.ConnectionManager Client is connected to ZooKeeper
   [junit4]   2> 85470 INFO  (jetty-launcher-85-thread-1) [n:127.0.0.1:56087_solr    ] o.a.s.c.c.SolrZkClient makePath: /overseer/collection-queue-work
   [junit4]   2> 85476 INFO  (jetty-launcher-85-thread-2) [n:127.0.0.1:56082_solr    ] o.a.s.c.c.SolrZkClient makePath: /overseer/collection-map-running
   [junit4]   2> 85476 INFO  (jetty-launcher-85-thread-1) [n:127.0.0.1:56087_solr    ] o.a.s.c.c.SolrZkClient makePath: /overseer/collection-map-running
   [junit4]   2> 85477 INFO  (jetty-launcher-85-thread-1) [n:127.0.0.1:56087_solr    ] o.a.s.c.c.SolrZkClient makePath: /overseer/collection-map-completed
   [junit4]   2> 85478 INFO  (jetty-launcher-85-thread-2) [n:127.0.0.1:56082_solr    ] o.a.s.c.c.SolrZkClient makePath: /overseer/collection-map-completed
   [junit4]   2> 85479 INFO  (jetty-launcher-85-thread-1) [n:127.0.0.1:56087_solr    ] o.a.s.c.c.SolrZkClient makePath: /overseer/collection-map-failure
   [junit4]   2> 85481 INFO  (jetty-launcher-85-thread-2) [n:127.0.0.1:56082_solr    ] o.a.s.c.c.SolrZkClient makePath: /overseer/collection-map-failure
   [junit4]   2> 85483 INFO  (jetty-launcher-85-thread-1) [n:127.0.0.1:56087_solr    ] o.a.s.c.c.SolrZkClient makePath: /live_nodes
   [junit4]   2> 85483 INFO  (jetty-launcher-85-thread-2) [n:127.0.0.1:56082_solr    ] o.a.s.c.c.SolrZkClient makePath: /live_nodes
   [junit4]   2> 85484 INFO  (jetty-launcher-85-thread-2) [n:127.0.0.1:56082_solr    ] o.a.s.c.c.SolrZkClient makePath: /collections
   [junit4]   2> 85484 INFO  (jetty-launcher-85-thread-1) [n:127.0.0.1:56087_solr    ] o.a.s.c.c.SolrZkClient makePath: /collections
   [junit4]   2> 85486 INFO  (jetty-launcher-85-thread-1) [n:127.0.0.1:56087_solr    ] o.a.s.c.c.SolrZkClient makePath: /aliases.json
   [junit4]   2> 85486 INFO  (jetty-launcher-85-thread-2) [n:127.0.0.1:56082_solr    ] o.a.s.c.c.SolrZkClient makePath: /aliases.json
   [junit4]   2> 85489 INFO  (jetty-launcher-85-thread-2) [n:127.0.0.1:56082_solr    ] o.a.s.c.c.SolrZkClient makePath: /clusterstate.json
   [junit4]   2> 85489 INFO  (jetty-launcher-85-thread-1) [n:127.0.0.1:56087_solr    ] o.a.s.c.c.SolrZkClient makePath: /clusterstate.json
   [junit4]   2> 85491 INFO  (jetty-launcher-85-thread-1) [n:127.0.0.1:56087_solr    ] o.a.s.c.c.SolrZkClient makePath: /security.json
   [junit4]   2> 85491 INFO  (jetty-launcher-85-thread-2) [n:127.0.0.1:56082_solr    ] o.a.s.c.c.SolrZkClient makePath: /security.json
   [junit4]   2> 85492 INFO  (jetty-launcher-85-thread-1) [n:127.0.0.1:56087_solr    ] o.a.s.c.c.ZkStateReader Updating cluster state from ZooKeeper... 
   [junit4]   2> 85493 INFO  (jetty-launcher-85-thread-2) [n:127.0.0.1:56082_solr    ] o.a.s.c.c.ZkStateReader Updating cluster state from ZooKeeper... 
   [junit4]   2> 85494 INFO  (jetty-launcher-85-thread-1) [n:127.0.0.1:56087_solr    ] o.a.s.c.c.ZkStateReader Loaded empty cluster properties
   [junit4]   2> 85494 INFO  (jetty-launcher-85-thread-2) [n:127.0.0.1:56082_solr    ] o.a.s.c.c.ZkStateReader Loaded empty cluster properties
   [junit4]   2> 85495 INFO  (jetty-launcher-85-thread-1) [n:127.0.0.1:56087_solr    ] o.a.s.c.c.ZkStateReader Updated live nodes from ZooKeeper... (0) -> (0)
   [junit4]   2> 85495 INFO  (jetty-launcher-85-thread-2) [n:127.0.0.1:56082_solr    ] o.a.s.c.c.ZkStateReader Updated live nodes from ZooKeeper... (0) -> (0)
   [junit4]   2> 85498 INFO  (jetty-launcher-85-thread-1) [n:127.0.0.1:56087_solr    ] o.a.s.c.c.SolrZkClient makePath: /overseer_elect
   [junit4]   2> 85499 INFO  (jetty-launcher-85-thread-2) [n:127.0.0.1:56082_solr    ] o.a.s.c.c.SolrZkClient makePath: /overseer_elect
   [junit4]   2> 85500 INFO  (jetty-launcher-85-thread-2) [n:127.0.0.1:56082_solr    ] o.a.s.c.c.SolrZkClient makePath: /overseer_elect/election
   [junit4]   2> 85501 INFO  (jetty-launcher-85-thread-1) [n:127.0.0.1:56087_solr    ] o.a.s.c.c.SolrZkClient makePath: /overseer_elect/election
   [junit4]   2> 85501 INFO  (jetty-launcher-85-thread-2) [n:127.0.0.1:56082_solr    ] o.a.s.c.Overseer Overseer (id=null) closing
   [junit4]   2> 85502 INFO  (jetty-launcher-85-thread-2) [n:127.0.0.1:56082_solr    ] o.a.s.c.LeaderElector Joined leadership election with path: /overseer_elect/election/95900977936203782-127.0.0.1:56082_solr-n_0000000000
   [junit4]   2> 85502 INFO  (jetty-launcher-85-thread-1) [n:127.0.0.1:56087_solr    ] o.a.s.c.Overseer Overseer (id=null) closing
   [junit4]   2> 85502 INFO  (jetty-launcher-85-thread-2) [n:127.0.0.1:56082_solr    ] o.a.s.c.OverseerElectionContext I am going to be the leader 127.0.0.1:56082_solr
   [junit4]   2> 85502 INFO  (jetty-launcher-85-thread-2) [n:127.0.0.1:56082_solr    ] o.a.s.c.c.SolrZkClient makePath: /overseer_elect/leader
   [junit4]   2> 85503 INFO  (jetty-launcher-85-thread-1) [n:127.0.0.1:56087_solr    ] o.a.s.c.LeaderElector Joined leadership election with path: /overseer_elect/election/95900977936203781-127.0.0.1:56087_solr-n_0000000001
   [junit4]   2> 85504 INFO  (jetty-launcher-85-thread-1) [n:127.0.0.1:56087_solr    ] o.a.s.c.LeaderElector Watching path /overseer_elect/election/95900977936203782-127.0.0.1:56082_solr-n_0000000000 to know if I could be the leader
   [junit4]   2> 85504 INFO  (jetty-launcher-85-thread-2) [n:127.0.0.1:56082_solr    ] o.a.s.c.Overseer Overseer (id=95900977936203782-127.0.0.1:56082_solr-n_0000000000) starting
   [junit4]   2> 85505 INFO  (jetty-launcher-85-thread-1) [n:127.0.0.1:56087_solr    ] o.a.s.c.ZkController Register node as live in ZooKeeper:/live_nodes/127.0.0.1:56087_solr
   [junit4]   2> 85505 INFO  (jetty-launcher-85-thread-1) [n:127.0.0.1:56087_solr    ] o.a.s.c.c.SolrZkClient makePath: /live_nodes/127.0.0.1:56087_solr
   [junit4]   2> 85509 INFO  (zkCallback-96-thread-1-processing-n:127.0.0.1:56082_solr) [n:127.0.0.1:56082_solr    ] o.a.s.c.c.ZkStateReader A live node change: [WatchedEvent state:SyncConnected type:NodeChildrenChanged path:/live_nodes], has occurred - updating... (live nodes size: [0])
   [junit4]   2> 85509 INFO  (jetty-launcher-85-thread-2) [n:127.0.0.1:56082_solr    ] o.a.s.c.c.SolrZkClient makePath: /overseer/queue-work
   [junit4]   2> 85509 INFO  (zkCallback-95-thread-1-processing-n:127.0.0.1:56087_solr) [n:127.0.0.1:56087_solr    ] o.a.s.c.c.ZkStateReader A live node change: [WatchedEvent state:SyncConnected type:NodeChildrenChanged path:/live_nodes], has occurred - updating... (live nodes size: [0])
   [junit4]   2> 85513 INFO  (zkCallback-96-thread-1-processing-n:127.0.0.1:56082_solr) [n:127.0.0.1:56082_solr    ] o.a.s.c.c.ZkStateReader Updated live nodes from ZooKeeper... (0) -> (1)
   [junit4]   2> 85516 INFO  (zkCallback-95-thread-1-processing-n:127.0.0.1:56087_solr) [n:127.0.0.1:56087_solr    ] o.a.s.c.c.ZkStateReader Updated live nodes from ZooKeeper... (0) -> (1)
   [junit4]   2> 85535 INFO  (jetty-launcher-85-thread-1) [n:127.0.0.1:56087_solr    ] o.a.s.c.CoreContainer Security conf doesn't exist. Skipping setup for authorization module.
   [junit4]   2> 85535 INFO  (jetty-launcher-85-thread-1) [n:127.0.0.1:56087_solr    ] o.a.s.c.CoreContainer No authentication plugin used.
   [junit4]   2> 85537 INFO  (jetty-launcher-85-thread-1) [n:127.0.0.1:56087_solr    ] o.a.s.c.CorePropertiesLocator Looking for core definitions underneath C:\Users\jenkins\workspace\Lucene-Solr-6.x-Windows\solr\build\solr-core\test\J1\temp\solr.schema.TestManagedSchemaAPI_57B1E04B64DCAEF5-001\tempDir-001\node1\.
   [junit4]   2> 85576 INFO  (jetty-launcher-85-thread-2) [n:127.0.0.1:56082_solr    ] o.a.s.c.OverseerAutoReplicaFailoverThread Starting OverseerAutoReplicaFailoverThread autoReplicaFailoverWorkLoopDelay=10000 autoReplicaFailoverWaitAfterExpiration=30000 autoReplicaFailoverBadNodeExpiration=60000
   [junit4]   2> 85577 INFO  (jetty-launcher-85-thread-2) [n:127.0.0.1:56082_solr    ] o.a.s.c.ZkController Publish node=127.0.0.1:56082_solr as DOWN
   [junit4]   2> 85582 INFO  (jetty-launcher-85-thread-1) [n:127.0.0.1:56087_solr    ] o.a.s.c.CorePropertiesLocator Found 0 core definitions
   [junit4]   2> 85583 INFO  (jetty-launcher-85-thread-1) [n:127.0.0.1:56087_solr    ] o.a.s.s.SolrDispatchFilter user.dir=C:\Users\jenkins\workspace\Lucene-Solr-6.x-Windows\solr\build\solr-core\test\J1
   [junit4]   2> 85583 INFO  (jetty-launcher-85-thread-1) [n:127.0.0.1:56087_solr    ] o.a.s.s.SolrDispatchFilter SolrDispatchFilter.init() done
   [junit4]   2> 85584 INFO  (OverseerStateUpdate-95900977936203782-127.0.0.1:56082_solr-n_0000000000) [n:127.0.0.1:56082_solr    ] o.a.s.c.Overseer Starting to work on the main queue
   [junit4]   2> 85587 INFO  (OverseerStateUpdate-95900977936203782-127.0.0.1:56082_solr-n_0000000000) [n:127.0.0.1:56082_solr    ] o.a.s.c.c.ZkStateReader Updated live nodes from ZooKeeper... (1) -> (1)
   [junit4]   2> 85588 INFO  (OverseerStateUpdate-95900977936203782-127.0.0.1:56082_solr-n_0000000000) [n:127.0.0.1:56082_solr    ] o.a.s.c.Overseer processMessage: queueSize: 1, message = {
   [junit4]   2>   "operation":"downnode",
   [junit4]   2>   "node_name":"127.0.0.1:56082_solr"} current state version: 0
   [junit4]   2> 85589 INFO  (OverseerStateUpdate-95900977936203782-127.0.0.1:56082_solr-n_0000000000) [n:127.0.0.1:56082_solr    ] o.a.s.c.o.NodeMutator DownNode state invoked for node: 127.0.0.1:56082_solr
   [junit4]   2> 85590 INFO  (OverseerCollectionConfigSetProcessor-95900977936203782-127.0.0.1:56082_solr-n_0000000000) [n:127.0.0.1:56082_solr    ] o.a.s.c.OverseerTaskProcessor Process current queue of overseer operations
   [junit4]   2> 86581 INFO  (jetty-launcher-85-thread-2) [n:127.0.0.1:56082_solr    ] o.a.s.c.ZkController Register node as live in ZooKeeper:/live_nodes/127.0.0.1:56082_solr
   [junit4]   2> 86582 INFO  (jetty-launcher-85-thread-2) [n:127.0.0.1:56082_solr    ] o.a.s.c.c.SolrZkClient makePath: /live_nodes/127.0.0.1:56082_solr
   [junit4]   2> 86583 INFO  (zkCallback-96-thread-1-processing-n:127.0.0.1:56082_solr) [n:127.0.0.1:56082_solr    ] o.a.s.c.c.ZkStateReader A live node change: [WatchedEvent state:SyncConnected type:NodeChildrenChanged path:/live_nodes], has occurred - updating... (live nodes size: [1])
   [junit4]   2> 86584 INFO  (zkCallback-95-thread-1-processing-n:127.0.0.1:56087_solr) [n:127.0.0.1:56087_solr    ] o.a.s.c.c.ZkStateReader A live node change: [WatchedEvent state:SyncConnected type:NodeChildrenChanged path:/live_nodes], has occurred - updating... (live nodes size: [1])
   [junit4]   2> 86584 INFO  (zkCallback-96-thread-1-processing-n:127.0.0.1:56082_solr) [n:127.0.0.1:56082_solr    ] o.a.s.c.c.ZkStateReader Updated live nodes from ZooKeeper... (1) -> (2)
   [junit4]   2> 86585 INFO  (zkCallback-95-thread-1-processing-n:127.0.0.1:56087_solr) [n:127.0.0.1:56087_solr    ] o.a.s.c.c.ZkStateReader Updated live nodes from ZooKeeper... (1) -> (2)
   [junit4]   2> 86623 INFO  (jetty-launcher-85-thread-2) [n:127.0.0.1:56082_solr    ] o.a.s.c.CoreContainer Security conf doesn't exist. Skipping setup for authorization module.
   [junit4]   2> 86623 INFO  (jetty-launcher-85-thread-2) [n:127.0.0.1:56082_solr    ] o.a.s.c.CoreContainer No authentication plugin used.
   [junit4]   2> 86627 INFO  (jetty-launcher-85-thread-2) [n:127.0.0.1:56082_solr    ] o.a.s.c.CorePropertiesLocator Looking for core definitions underneath C:\Users\jenkins\workspace\Lucene-Solr-6.x-Windows\solr\build\solr-core\test\J1\temp\solr.schema.TestManagedSchemaAPI_57B1E04B64DCAEF5-001\tempDir-001\node2\.
   [junit4]   2> 86627 INFO  (jetty-launcher-85-thread-2) [n:127.0.0.1:56082_solr    ] o.a.s.c.CorePropertiesLocator Found 0 core definitions
   [junit4]   2> 86629 INFO  (jetty-launcher-85-thread-2) [n:127.0.0.1:56082_solr    ] o.a.s.s.SolrDispatchFilter user.dir=C:\Users\jenkins\workspace\Lucene-Solr-6.x-Windows\solr\build\solr-core\test\J1
   [junit4]   2> 86629 INFO  (jetty-launcher-85-thread-2) [n:127.0.0.1:56082_solr    ] o.a.s.s.SolrDispatchFilter SolrDispatchFilter.init() done
   [junit4]   2> 86630 INFO  (SUITE-TestManagedSchemaAPI-seed#[57B1E04B64DCAEF5]-worker) [    ] o.a.s.c.c.SolrZkClient Using default ZkCredentialsProvider
   [junit4]   2> 86632 INFO  (SUITE-TestManagedSchemaAPI-seed#[57B1E04B64DCAEF5]-worker) [    ] o.a.s.c.c.ConnectionManager Waiting for client to connect to ZooKeeper
   [junit4]   2> 86645 INFO  (zkCallback-99-thread-1) [    ] o.a.s.c.c.ConnectionManager Watcher org.apache.solr.common.cloud.ConnectionManager@266f56 name:ZooKeeperConnection Watcher:127.0.0.1:56075 got event WatchedEvent state:SyncConnected type:None path:null path:null type:None
   [junit4]   2> 86645 INFO  (SUITE-TestManagedSchemaAPI-seed#[57B1E04B64DCAEF5]-worker) [    ] o.a.s.c.c.ConnectionManager Client is connected to ZooKeeper
   [junit4]   2> 86646 INFO  (SUITE-TestManagedSchemaAPI-seed#[57B1E04B64DCAEF5]-worker) [    ] o.a.s.c.c.SolrZkClient Using default ZkACLProvider
   [junit4]   2> 86649 INFO  (SUITE-TestManagedSchemaAPI-seed#[57B1E04B64DCAEF5]-worker) [    ] o.a.s.c.s.i.CloudSolrClient Final constructed zkHost string: 127.0.0.1:56075/solr
   [junit4]   2> 86649 INFO  (SUITE-TestManagedSchemaAPI-seed#[57B1E04B64DCAEF5]-worker) [    ] o.a.s.c.c.SolrZkClient Using default ZkCredentialsProvider
   [junit4]   2> 86651 INFO  (SUITE-TestManagedSchemaAPI-seed#[57B1E04B64DCAEF5]-worker) [    ] o.a.s.c.c.ConnectionManager Waiting for client to connect to ZooKeeper
   [junit4]   2> 86653 INFO  (zkCallback-102-thread-1) [    ] o.a.s.c.c.ConnectionManager Watcher org.apache.solr.common.cloud.ConnectionManager@150c865 name:ZooKeeperConnection Watcher:127.0.0.1:56075/solr got event WatchedEvent state:SyncConnected type:None path:null path:null type:None
   [junit4]   2> 86653 INFO  (SUITE-TestManagedSchemaAPI-seed#[57B1E04B64DCAEF5]-worker) [    ] o.a.s.c.c.ConnectionManager Client is connected to ZooKeeper
   [junit4]   2> 86654 INFO  (SUITE-TestManagedSchemaAPI-seed#[57B1E04B64DCAEF5]-worker) [    ] o.a.s.c.c.SolrZkClient Using default ZkACLProvider
   [junit4]   2> 86654 INFO  (SUITE-TestManagedSchemaAPI-seed#[57B1E04B64DCAEF5]-worker) [    ] o.a.s.c.c.ZkStateReader Updating cluster state from ZooKeeper... 
   [junit4]   2> 86655 INFO  (SUITE-TestManagedSchemaAPI-seed#[57B1E04B64DCAEF5]-worker) [    ] o.a.s.c.c.ZkStateReader Loaded empty cluster properties
   [junit4]   2> 86656 INFO  (SUITE-TestManagedSchemaAPI-seed#[57B1E04B64DCAEF5]-worker) [    ] o.a.s.c.c.ZkStateReader Updated live nodes from ZooKeeper... (0) -> (2)
   [junit4]   2> 86659 INFO  (SUITE-TestManagedSchemaAPI-seed#[57B1E04B64DCAEF5]-worker) [    ] o.a.s.c.c.SolrZkClient makePath: /configs/conf1/managed-schema
   [junit4]   2> 86662 INFO  (SUITE-TestManagedSchemaAPI-seed#[57B1E04B64DCAEF5]-worker) [    ] o.a.s.c.c.SolrZkClient makePath: /configs/conf1/solrconfig.xml
   [junit4]   2> 86686 INFO  (TEST-TestManagedSchemaAPI.test-seed#[57B1E04B64DCAEF5]) [    ] o.a.s.SolrTestCaseJ4 ###Starting test
   [junit4]   2> 86693 INFO  (qtp18531457-477) [n:127.0.0.1:56082_solr    ] o.a.s.h.a.CollectionsHandler Invoked Collection Action :create with params replicationFactor=2&collection.configName=conf1&name=testschemaapi&action=CREATE&numShards=1&wt=javabin&version=2 and sendToOCPQueue=true
   [junit4]   2> 86699 INFO  (OverseerCollectionConfigSetProcessor-95900977936203782-127.0.0.1:56082_solr-n_0000000000) [n:127.0.0.1:56082_solr    ] o.a.s.c.OverseerTaskProcessor Overseer Collection Message Handler: Get the message id:/overseer/collection-queue-work/qn-0000000000 message:{
   [junit4]   2>   "name":"testschemaapi",
   [junit4]   2>   "fromApi":"true",
   [junit4]   2>   "replicationFactor":"2",
   [junit4]   2>   "collection.configName":"conf1",
   [junit4]   2>   "numShards":"1",
   [junit4]   2>   "stateFormat":"2",
   [junit4]   2>   "operation":"create"}
   [junit4]   2> 86706 INFO  (OverseerThreadFactory-218-thread-1-processing-n:127.0.0.1:56082_solr) [n:127.0.0.1:56082_solr    ] o.a.s.c.OverseerCollectionMessageHandler OverseerCollectionMessageHandler.processMessage : create , {
   [junit4]   2>   "name":"testschemaapi",
   [junit4]   2>   "fromApi":"true",
   [junit4]   2>   "replicationFactor":"2",
   [junit4]   2>   "collection.configName":"conf1",
   [junit4]   2>   "numShards":"1",
   [junit4]   2>   "stateFormat":"2",
   [junit4]   2>   "operation":"create"}
   [junit4]   2> 86706 INFO  (OverseerThreadFactory-218-thread-1-processing-n:127.0.0.1:56082_solr) [n:127.0.0.1:56082_solr    ] o.a.s.c.OverseerCollectionMessageHandler Create collection testschemaapi
   [junit4]   2> 86707 INFO  (OverseerThreadFactory-218-thread-1-processing-n:127.0.0.1:56082_solr) [n:127.0.0.1:56082_solr    ] o.a.s.c.OverseerCollectionMessageHandler creating collections conf node /collections/testschemaapi 
   [junit4]   2> 86707 INFO  (OverseerThreadFactory-218-thread-1-processing-n:127.0.0.1:56082_solr) [n:127.0.0.1:56082_solr    ] o.a.s.c.c.SolrZkClient makePath: /collections/testschemaapi
   [junit4]   2> 86708 INFO  (zkCallback-96-thread-1-processing-n:127.0.0.1:56082_solr) [n:127.0.0.1:56082_solr    ] o.a.s.c.c.ZkStateReader A collections change: [WatchedEvent state:SyncConnected type:NodeChildrenChanged path:/collections], has occurred - updating...
   [junit4]   2> 86709 INFO  (zkCallback-102-thread-1) [    ] o.a.s.c.c.ZkStateReader A collections change: [WatchedEvent state:SyncConnected type:NodeChildrenChanged path:/collections], has occurred - updating...
   [junit4]   2> 86709 INFO  (zkCallback-95-thread-1-processing-n:127.0.0.1:56087_solr) [n:127.0.0.1:56087_solr    ] o.a.s.c.c.ZkStateReader A collections change: [WatchedEvent state:SyncConnected type:NodeChildrenChanged path:/collections], has occurred - updating...
   [junit4]   2> 86714 INFO  (OverseerStateUpdate-95900977936203782-127.0.0.1:56082_solr-n_0000000000) [n:127.0.0.1:56082_solr    ] o.a.s.c.Overseer processMessage: queueSize: 1, message = {
   [junit4]   2>   "name":"testschemaapi",
   [junit4]   2>   "fromApi":"true",
   [junit4]   2>   "replicationFactor":"2",
   [junit4]   2>   "collection.configName":"conf1",
   [junit4]   2>   "numShards":"1",
   [junit4]   2>   "stateFormat":"2",
   [junit4]   2>   "operation":"create"} current state version: 0
   [junit4]   2> 86714 INFO  (OverseerStateUpdate-95900977936203782-127.0.0.1:56082_solr-n_0000000000) [n:127.0.0.1:56082_solr    ] o.a.s.c.o.ClusterStateMutator building a new cName: testschemaapi
   [junit4]   2> 86716 INFO  (OverseerStateUpdate-95900977936203782-127.0.0.1:56082_solr-n_0000000000) [n:127.0.0.1:56082_solr    ] o.a.s.c.o.ZkStateWriter going to create_collection /collections/testschemaapi/state.json
   [junit4]   2> 86816 INFO  (OverseerThreadFactory-218-thread-1-processing-n:127.0.0.1:56082_solr) [n:127.0.0.1:56082_solr    ] o.a.s.c.OverseerCollectionMessageHandler Creating SolrCores for new collection testschemaapi, shardNames [shard1] , replicationFactor : 2
   [junit4]   2> 86816 INFO  (OverseerThreadFactory-218-thread-1-processing-n:127.0.0.1:56082_solr) [n:127.0.0.1:56082_solr    ] o.a.s.c.OverseerCollectionMessageHandler Creating core testschemaapi_shard1_replica1 as part of shard shard1 of collection testschemaapi on 127.0.0.1:56082_solr
   [junit4]   2> 86822 INFO  (OverseerThreadFactory-218-thread-1-processing-n:127.0.0.1:56082_solr) [n:127.0.0.1:56082_solr    ] o.a.s.c.OverseerCollectionMessageHandler Creating core testschemaapi_shard1_replica2 as part of shard shard1 of collection testschemaapi on 127.0.0.1:56087_solr
   [junit4]   2> 86835 INFO  (qtp18531457-462) [n:127.0.0.1:56082_solr    ] o.a.s.h.a.CoreAdminOperation core create command qt=/admin/cores&collection.configName=conf1&name=testschemaapi_shard1_replica1&action=CREATE&numShards=1&collection=testschemaapi&shard=shard1&wt=javabin&version=2
   [junit4]   2> 86835 INFO  (qtp22504676-471) [n:127.0.0.1:56087_solr    ] o.a.s.h.a.CoreAdminOperation core create command qt=/admin/cores&collection.configName=conf1&name=testschemaapi_shard1_replica2&action=CREATE&numShards=1&collection=testschemaapi&shard=shard1&wt=javabin&version=2
   [junit4]   2> 86837 INFO  (qtp18531457-462) [n:127.0.0.1:56082_solr    ] o.a.s.c.CoreDescriptor Created CoreDescriptor: {name=testschemaapi_shard1_replica1, collection.configName=conf1, config=solrconfig.xml, transient=false, schema=schema.xml, loadOnStartup=true, configSetProperties=configsetprops.json, collection=testschemaapi, numShards=1, dataDir=data\, shard=shard1}
   [junit4]   2> 86838 INFO  (qtp22504676-471) [n:127.0.0.1:56087_solr    ] o.a.s.c.CoreDescriptor Created CoreDescriptor: {name=testschemaapi_shard1_replica2, collection.configName=conf1, config=solrconfig.xml, transient=false, schema=schema.xml, loadOnStartup=true, configSetProperties=configsetprops.json, collection=testschemaapi, numShards=1, dataDir=data\, shard=shard1}
   [junit4]   2> 86844 INFO  (qtp18531457-462) [n:127.0.0.1:56082_solr c:testschemaapi s:shard1  x:testschemaapi_shard1_replica1] o.a.s.c.ZkController publishing state=down
   [junit4]   2> 86844 INFO  (qtp22504676-471) [n:127.0.0.1:56087_solr c:testschemaapi s:shard1  x:testschemaapi_shard1_replica2] o.a.s.c.ZkController publishing state=down
   [junit4]   2> 86846 INFO  (qtp18531457-462) [n:127.0.0.1:56082_solr c:testschemaapi s:shard1  x:testschemaapi_shard1_replica1] o.a.s.c.ZkController Registering watch for collection testschemaapi
   [junit4]   2> 86846 INFO  (qtp22504676-471) [n:127.0.0.1:56087_solr c:testschemaapi s:shard1  x:testschemaapi_shard1_replica2] o.a.s.c.ZkController Registering watch for collection testschemaapi
   [junit4]   2> 86846 INFO  (qtp18531457-462) [n:127.0.0.1:56082_solr c:testschemaapi s:shard1  x:testschemaapi_shard1_replica1] o.a.s.c.c.ZkStateReader Add data for [testschemaapi] ver [0]
   [junit4]   2> 86846 INFO  (qtp18531457-462) [n:127.0.0.1:56082_solr c:testschemaapi s:shard1  x:testschemaapi_shard1_replica1] o.a.s.c.ZkController look for our core node name
   [junit4]   2> 86847 INFO  (qtp22504676-471) [n:127.0.0.1:56087_solr c:testschemaapi s:shard1  x:testschemaapi_shard1_replica2] o.a.s.c.c.ZkStateReader Add data for [testschemaapi] ver [0]
   [junit4]   2> 86847 INFO  (qtp22504676-471) [n:127.0.0.1:56087_solr c:testschemaapi s:shard1  x:testschemaapi_shard1_replica2] o.a.s.c.ZkController look for our core node name
   [junit4]   2> 86848 INFO  (OverseerStateUpdate-95900977936203782-127.0.0.1:56082_solr-n_0000000000) [n:127.0.0.1:56082_solr    ] o.a.s.c.Overseer processMessage: queueSize: 2, message = {
   [junit4]   2>   "core":"testschemaapi_shard1_replica1",
   [junit4]   2>   "roles":null,
   [junit4]   2>   "base_url":"http://127.0.0.1:56082/solr",
   [junit4]   2>   "node_name":"127.0.0.1:56082_solr",
   [junit4]   2>   "numShards":"1",
   [junit4]   2>   "state":"down",
   [junit4]   2>   "shard":"shard1",
   [junit4]   2>   "collection":"testschemaapi",
   [junit4]   2>   "operation":"state"} current state version: 0
   [junit4]   2> 86848 INFO  (OverseerStateUpdate-95900977936203782-127.0.0.1:56082_solr-n_0000000000) [n:127.0.0.1:56082_solr    ] o.a.s.c.o.ReplicaMutator Update state numShards=1 message={
   [junit4]   2>   "core":"testschemaapi_shard1_replica1",
   [junit4]   2>   "roles":null,
   [junit4]   2>   "base_url":"http://127.0.0.1:56082/solr",
   [junit4]   2>   "node_name":"127.0.0.1:56082_solr",
   [junit4]   2>   "numShards":"1",
   [junit4]   2>   "state":"down",
   [junit4]   2>   "shard":"shard1",
   [junit4]   2>   "collection":"testschemaapi",
   [junit4]   2>   "operation":"state"}
   [junit4]   2> 86850 INFO  (OverseerStateUpdate-95900977936203782-127.0.0.1:56082_solr-n_0000000000) [n:127.0.0.1:56082_solr    ] o.a.s.c.Overseer processMessage: queueSize: 2, message = {
   [junit4]   2>   "core":"testschemaapi_shard1_replica2",
   [junit4]   2>   "roles":null,
   [junit4]   2>   "base_url":"http://127.0.0.1:56087/solr",
   [junit4]   2>   "node_name":"127.0.0.1:56087_solr",
   [junit4]   2>   "numShards":"1",
   [junit4]   2>   "state":"down",
   [junit4]   2>   "shard":"shard1",
   [junit4]   2>   "collection":"testschemaapi",
   [junit4]   2>   "operation":"state"} current state version: 0
   [junit4]   2> 86850 INFO  (OverseerStateUpdate-95900977936203782-127.0.0.1:56082_solr-n_0000000000) [n:127.0.0.1:56082_solr    ] o.a.s.c.o.ReplicaMutator Update state numShards=1 message={
   [junit4]   2>   "core":"testschemaapi_shard1_replica2",
   [junit4]   2>   "roles":null,
   [junit4]   2>   "base_url":"http://127.0.0.1:56087/solr",
   [junit4]   2>   "node_name":"127.0.0.1:56087_solr",
   [junit4]   2>   "numShards":"1",
   [junit4]   2>   "state":"down",
   [junit4]   2>   "shard":"shard1",
   [junit4]   2>   "collection":"testschemaapi",
   [junit4]   2>   "operation":"state"}
   [junit4]   2> 86955 INFO  (OverseerStateUpdate-95900977936203782-127.0.0.1:56082_solr-n_0000000000) [n:127.0.0.1:56082_solr    ] o.a.s.c.o.ZkStateWriter going to update_collection /collections/testschemaapi/state.json version: 0
   [junit4]   2> 86956 INFO  (zkCallback-95-thread-1-processing-n:127.0.0.1:56087_solr) [n:127.0.0.1:56087_solr    ] o.a.s.c.c.ZkStateReader A cluster state change: [WatchedEvent state:SyncConnected type:NodeDataChanged path:/collections/testschemaapi/state.json] for collection [testschemaapi] has occurred - updating... (live nodes size: [2])
   [junit4]   2> 86956 INFO  (zkCallback-96-thread-1-processing-n:127.0.0.1:56082_solr) [n:127.0.0.1:56082_solr    ] o.a.s.c.c.ZkStateReader A cluster state change: [WatchedEvent state:SyncConnected type:NodeDataChanged path:/collections/testschemaapi/state.json] for collection [testschemaapi] has occurred - updating... (live nodes size: [2])
   [junit4]   2> 86957 INFO  (zkCallback-95-thread-1-processing-n:127.0.0.1:56087_solr) [n:127.0.0.1:56087_solr    ] o.a.s.c.c.ZkStateReader Updating data for [testschemaapi] from [0] to [1]
   [junit4]   2> 86957 INFO  (zkCallback-96-thread-1-processing-n:127.0.0.1:56082_solr) [n:127.0.0.1:56082_solr    ] o.a.s.c.c.ZkStateReader Updating data for [testschemaapi] from [0] to [1]
   [junit4]   2> 87847 INFO  (qtp18531457-462) [n:127.0.0.1:56082_solr c:testschemaapi s:shard1  x:testschemaapi_shard1_replica1] o.a.s.c.ZkController waiting to find shard id in clusterstate for testschemaapi_shard1_replica1
   [junit4]   2> 87847 INFO  (qtp18531457-462) [n:127.0.0.1:56082_solr c:testschemaapi s:shard1  x:testschemaapi_shard1_replica1] o.a.s.c.ZkController Check for collection zkNode:testschemaapi
   [junit4]   2> 87847 INFO  (qtp18531457-462) [n:127.0.0.1:56082_solr c:testschemaapi s:shard1  x:testschemaapi_shard1_replica1] o.a.s.c.ZkController Collection zkNode exists
   [junit4]   2> 87847 INFO  (qtp18531457-462) [n:127.0.0.1:56082_solr c:testschemaapi s:shard1  x:testschemaapi_shard1_replica1] o.a.s.c.c.ZkStateReader Load collection config from: [/collections/testschemaapi]
   [junit4]   2> 87848 INFO  (qtp22504676-471) [n:127.0.0.1:56087_solr c:testschemaapi s:shard1  x:testschemaapi_shard1_replica2] o.a.s.c.ZkController waiting to find shard id in clusterstate for testschemaapi_shard1_replica2
   [junit4]   2> 87848 INFO  (qtp22504676-471) [n:127.0.0.1:56087_solr c:testschemaapi s:shard1  x:testschemaapi_shard1_replica2] o.a.s.c.ZkController Check for collection zkNode:testschemaapi
   [junit4]   2> 87849 INFO  (qtp22504676-471) [n:127.0.0.1:56087_solr c:testschemaapi s:shard1  x:testschemaapi_shard1_replica2] o.a.s.c.ZkController Collection zkNode exists
   [junit4]   2> 87849 INFO  (qtp22504676-471) [n:127.0.0.1:56087_solr c:testschemaapi s:shard1  x:testschemaapi_shard1_replica2] o.a.s.c.c.ZkStateReader Load collection config from: [/collections/testschemaapi]
   [junit4]   2> 87849 INFO  (qtp18531457-462) [n:127.0.0.1:56082_solr c:testschemaapi s:shard1  x:testschemaapi_shard1_replica1] o.a.s.c.c.ZkStateReader path=[/collections/testschemaapi] [configName]=[conf1] specified config exists in ZooKeeper
   [junit4]   2> 87849 INFO  (qtp18531457-462) [n:127.0.0.1:56082_solr c:testschemaapi s:shard1  x:testschemaapi_shard1_replica1] o.a.s.c.SolrResourceLoader new SolrResourceLoader for directory: 'C:\Users\jenkins\workspace\Lucene-Solr-6.x-Windows\solr\build\solr-core\test\J1\temp\solr.schema.TestManagedSchemaAPI_57B1E04B64DCAEF5-001\tempDir-001\node2\testschemaapi_shard1_replica1'
   [junit4]   2> 87849 INFO  (qtp18531457-462) [n:127.0.0.1:56082_solr c:testschemaapi s:shard1  x:testschemaapi_shard1_replica1] o.a.s.c.SolrResourceLoader JNDI not configured for solr (NoInitialContextEx)
   [junit4]   2> 87849 INFO  (qtp18531457-462) [n:127.0.0.1:56082_solr c:testschemaapi s:shard1  x:testschemaapi_shard1_replica1] o.a.s.c.SolrResourceLoader solr home defaulted to 'solr/' (could not find system property or JNDI)
   [junit4]   2> 87852 INFO  (qtp22504676-471) [n:127.0.0.1:56087_solr c:testschemaapi s:shard1  x:testschemaapi_shard1_replica2] o.a.s.c.c.ZkStateReader path=[/collections/testschemaapi] [configName]=[conf1] specified config exists in ZooKeeper
   [junit4]   2> 87852 INFO  (qtp22504676-471) [n:127.0.0.1:56087_solr c:testschemaapi s:shard1  x:testschemaapi_shard1_replica2] o.a.s.c.SolrResourceLoader new SolrResourceLoader for directory: 'C:\Users\jenkins\workspace\Lucene-Solr-6.x-Windows\solr\build\solr-core\test\J1\temp\solr.schema.TestManagedSchemaAPI_57B1E04B64DCAEF5-001\tempDir-001\node1\testschemaapi_shard1_replica2'
   [junit4]   2> 87852 INFO  (qtp22504676-471) [n:127.0.0.1:56087_solr c:testschemaapi s:shard1  x:testschemaapi_shard1_replica2] o.a.s.c.SolrResourceLoader JNDI not configured for solr (NoInitialContextEx)
   [junit4]   2> 87852 INFO  (qtp22504676-471) [n:127.0.0.1:56087_solr c:testschemaapi s:shard1  x:testschemaapi_shard1_replica2] o.a.s.c.SolrResourceLoader solr home defaulted to 'solr/' (could not find system property or JNDI)
   [junit4]   2> 87854 INFO  (qtp18531457-462) [n:127.0.0.1:56082_solr c:testschemaapi s:shard1  x:testschemaapi_shard1_replica1] o.a.s.c.Config loaded config solrconfig.xml with version 0 
   [junit4]   2> 87857 INFO  (qtp22504676-471) [n:127.0.0.1:56087_solr c:testschemaapi s:shard1  x:testschemaapi_shard1_replica2] o.a.s.c.Config loaded config solrconfig.xml with version 0 
   [junit4]   2> 87866 INFO  (qtp18531457-462) [n:127.0.0.1:56082_solr c:testschemaapi s:shard1  x:testschemaapi_shard1_replica1] o.a.s.c.SolrConfig current version of requestparams : -1
   [junit4]   2> 87867 INFO  (qtp22504676-471) [n:127.0.0.1:56087_solr c:testschemaapi s:shard1  x:testschemaapi_shard1_replica2] o.a.s.c.SolrConfig current version of requestparams : -1
   [junit4]   2> 87868 INFO  (qtp18531457-462) [n:127.0.0.1:56082_solr c:testschemaapi s:shard1  x:testschemaapi_shard1_replica1] o.a.s.c.SolrConfig Using Lucene MatchVersion: 6.1.0
   [junit4]   2> 87869 INFO  (qtp22504676-471) [n:127.0.0.1:56087_solr c:testschemaapi s:shard1  x:testschemaapi_shard1_replica2] o.a.s.c.SolrConfig Using Lucene MatchVersion: 6.1.0
   [junit4]   2> 87888 INFO  (qtp18531457-462) [n:127.0.0.1:56082_solr c:testschemaapi s:shard1  x:testschemaapi_shard1_replica1] o.a.s.c.SolrConfig Loaded SolrConfig: solrconfig.xml
   [junit4]   2> 87889 INFO  (qtp22504676-471) [n:127.0.0.1:56087_solr c:testschemaapi s:shard1  x:testschemaapi_shard1_replica2] o.a.s.c.SolrConfig Loaded SolrConfig: solrconfig.xml
   [junit4]   2> 87914 INFO  (qtp22504676-471) [n:127.0.0.1:56087_solr c:testschemaapi s:shard1  x:testschemaapi_shard1_replica2] o.a.s.s.IndexSchema [testschemaapi_shard1_replica2] Schema name=minimal
   [junit4]   2> 87914 INFO  (qtp18531457-462) [n:127.0.0.1:56082_solr c:testschemaapi s:shard1  x:testschemaapi_shard1_replica1] o.a.s.s.IndexSchema [testschemaapi_shard1_replica1] Schema name=minimal
   [junit4]   2> 87927 INFO  (qtp22504676-471) [n:127.0.0.1:56087_solr c:testschemaapi s:shard1  x:testschemaapi_shard1_replica2] o.a.s.s.IndexSchema unique key field: id
   [junit4]   2> 87934 INFO  (qtp22504676-471) [n:127.0.0.1:56087_solr c:testschemaapi s:shard1  x:testschemaapi_shard1_replica2] o.a.s.c.ConfigSetProperties Did not find ConfigSet properties, assuming default properties: Can't find resource 'configsetprops.json' in classpath or '/configs/conf1', cwd=C:\Users\jenkins\workspace\Lucene-Solr-6.x-Windows\solr\build\solr-core\test\J1
   [junit4]   2> 87934 INFO  (qtp22504676-471) [n:127.0.0.1:56087_solr c:testschemaapi s:shard1  x:testschemaapi_shard1_replica2] o.a.s.c.CoreContainer Creating SolrCore 'testschemaapi_shard1_replica2' using configuration from collection testschemaapi
   [junit4]   2> 87934 INFO  (qtp22504676-471) [n:127.0.0.1:56087_solr c:testschemaapi s:shard1 r:core_node2 x:testschemaapi_shard1_replica2] o.a.s.c.SolrCore org.apache.solr.core.MockDirectoryFactory
   [junit4]   2> 87935 INFO  (qtp22504676-471) [n:127.0.0.1:56087_solr c:testschemaapi s:shard1 r:core_node2 x:testschemaapi_shard1_replica2] o.a.s.c.SolrCore [[testschemaapi_shard1_replica2] ] Opening new SolrCore at [C:\Users\jenkins\workspace\Lucene-Solr-6.x-Windows\solr\build\solr-core\test\J1\temp\solr.schema.TestManagedSchemaAPI_57B1E04B64DCAEF5-001\tempDir-001\node1\testschemaapi_shard1_replica2], dataDir=[C:\Users\jenkins\workspace\Lucene-Solr-6.x-Windows\solr\build\solr-core\test\J1\temp\solr.schema.TestManagedSchemaAPI_57B1E04B64DCAEF5-001\tempDir-001\node1\.\testschemaapi_shard1_replica2\data\]
   [junit4]   2> 87935 INFO  (qtp22504676-471) [n:127.0.0.1:56087_solr c:testschemaapi s:shard1 r:core_node2 x:testschemaapi_shard1_replica2] o.a.s.c.SolrCore JMX monitoring not detected for core: testschemaapi_shard1_replica2
   [junit4]   2> 87936 INFO  (qtp22504676-471) [n:127.0.0.1:56087_solr c:testschemaapi s:shard1 r:core_node2 x:testschemaapi_shard1_replica2] o.a.s.c.CachingDirectoryFactory return new directory for C:\Users\jenkins\workspace\Lucene-Solr-6.x-Windows\solr\build\solr-core\test\J1\temp\solr.schema.TestManagedSchemaAPI_57B1E04B64DCAEF5-001\tempDir-001\node1\.\testschemaapi_shard1_replica2\data\
   [junit4]   2> 87936 INFO  (qtp22504676-471) [n:127.0.0.1:56087_solr c:testschemaapi s:shard1 r:core_node2 x:testschemaapi_shard1_replica2] o.a.s.c.SolrCore New index directory detected: old=null new=C:\Users\jenkins\workspace\Lucene-Solr-6.x-Windows\solr\build\solr-core\test\J1\temp\solr.schema.TestManagedSchemaAPI_57B1E04B64DCAEF5-001\tempDir-001\node1\.\testschemaapi_shard1_replica2\data\index/
   [junit4]   2> 87936 WARN  (qtp22504676-471) [n:127.0.0.1:56087_solr c:testschemaapi s:shard1 r:core_node2 x:testschemaapi_shard1_replica2] o.a.s.c.SolrCore [testschemaapi_shard1_replica2] Solr index directory 'C:\Users\jenkins\workspace\Lucene-Solr-6.x-Windows\solr\build\solr-core\test\J1\temp\solr.schema.TestManagedSchemaAPI_57B1E04B64DCAEF5-001\tempDir-001\node1\.\testschemaapi_shard1_replica2\data\index' doesn't exist. Creating new index...
   [junit4]   2> 87937 INFO  (qtp22504676-471) [n:127.0.0.1:56087_solr c:testschemaapi s:shard1 r:core_node2 x:testschemaapi_shard1_replica2] o.a.s.c.CachingDirectoryFactory return new directory for C:\Users\jenkins\workspace\Lucene-Solr-6.x-Windows\solr\build\solr-core\test\J1\temp\solr.schema.TestManagedSchemaAPI_57B1E04B64DCAEF5-001\tempDir-001\node1\.\testschemaapi_shard1_replica2\data\index
   [junit4]   2> 87942 INFO  (qtp18531457-462) [n:127.0.0.1:56082_solr c:testschemaapi s:shard1  x:testschemaapi_shard1_replica1] o.a.s.s.IndexSchema unique key field: id
   [junit4]   2> 87943 INFO  (qtp18531457-462) [n:127.0.0.1:56082_solr c:testschemaapi s:shard1  x:testschemaapi_shard1_replica1] o.a.s.c.ConfigSetProperties Did not find ConfigSet properties, assuming default properties: Can't find resource 'configsetprops.json' in classpath or '/configs/conf1', cwd=C:\Users\jenkins\workspace\Lucene-Solr-6.x-Windows\solr\build\solr-core\test\J1
   [junit4]   2> 87943 INFO  (qtp18531457-462) [n:127.0.0.1:56082_solr c:testschemaapi s:shard1  x:testschemaapi_shard1_replica1] o.a.s.c.CoreContainer Creating SolrCore 'testschemaapi_shard1_replica1' using configuration from collection testschemaapi
   [junit4]   2> 87944 INFO  (qtp18531457-462) [n:127.0.0.1:56082_solr c:testschemaapi s:shard1 r:core_node1 x:testschemaapi_shard1_replica1] o.a.s.c.SolrCore org.apache.solr.core.MockDirectoryFactory
   [junit4]   2> 87944 INFO  (qtp18531457-462) [n:127.0.0.1:56082_solr c:testschemaapi s:shard1 r:core_node1 x:testschemaapi_shard1_replica1] o.a.s.c.SolrCore [[testschemaapi_shard1_replica1] ] Opening new SolrCore at [C:\Users\jenkins\workspace\Lucene-Solr-6.x-Windows\solr\build\solr-core\test\J1\temp\solr.schema.TestManagedSchemaAPI_57B1E04B64DCAEF5-001\tempDir-001\node2\testschemaapi_shard1_replica1], dataDir=[C:\Users\jenkins\workspace\Lucene-Solr-6.x-Windows\solr\build\solr-core\test\J1\temp\solr.schema.TestManagedSchemaAPI_57B1E04B64DCAEF5-001\tempDir-001\node2\.\testschemaapi_shard1_replica1\data\]
   [junit4]   2> 87944 INFO  (qtp18531457-462) [n:127.0.0.1:56082_solr c:testschemaapi s:shard1 r:core_node1 x:testschemaapi_shard1_replica1] o.a.s.c.SolrCore JMX monitoring not detected for core: testschemaapi_shard1_replica1
   [junit4]   2> 87945 INFO  (qtp18531457-462) [n:127.0.0.1:56082_solr c:testschemaapi s:shard1 r:core_node1 x:testschemaapi_shard1_replica1] o.a.s.c.CachingDirectoryFactory return new directory for C:\Users\jenkins\workspace\Lucene-Solr-6.x-Windows\solr\build\solr-core\test\J1\temp\solr.schema.TestManagedSchemaAPI_57B1E04B64DCAEF5-001\tempDir-001\node2\.\testschemaapi_shard1_replica1\data\
   [junit4]   2> 87945 INFO  (qtp18531457-462) [n:127.0.0.1:56082_solr c:testschemaapi s:shard1 r:core_node1 x:testschemaapi_shard1_replica1] o.a.s.c.SolrCore New index directory detected: old=null new=C:\Users\jenkins\workspace\Lucene-Solr-6.x-Windows\solr\build\solr-core\test\J1\temp\solr.schema.TestManagedSchemaAPI_57B1E04B64DCAEF5-001\tempDir-001\node2\.\testschemaapi_shard1_replica1\data\index/
   [junit4]   2> 87945 WARN  (qtp18531457-462) [n:127.0.0.1:56082_solr c:testschemaapi s:shard1 r:core_node1 x:testschemaapi_shard1_replica1] o.a.s.c.SolrCore [testschemaapi_shard1_replica1] Solr index directory 'C:\Users\jenkins\workspace\Lucene-Solr-6.x-Windows\solr\build\solr-core\test\J1\temp\solr.schema.TestManagedSchemaAPI_57B1E04B64DCAEF5-001\tempDir-001\node2\.\testschemaapi_shard1_replica1\data\index' doesn't exist. Creating new index...
   [junit4]   2> 87946 INFO  (qtp18531457-462) [n:127.0.0.1:56082_solr c:testschemaapi s:shard1 r:core_node1 x:testschemaapi_shard1_replica1] o.a.s.c.CachingDirectoryFactory return new directory for C:\Users\jenkins\workspace\Lucene-Solr-6.x-Windows\solr\build\solr-core\test\J1\temp\solr.schema.TestManagedSchemaAPI_57B1E04B64DCAEF5-001\tempDir-001\node2\.\testschemaapi_shard1_replica1\data\index
   [junit4]   2> 87955 INFO  (qtp22504676-471) [n:127.0.0.1:56087_solr c:testschemaapi s:shard1 r:core_node2 x:testschemaapi_shard1_replica2] o.a.s.c.SolrDeletionPolicy SolrDeletionPolicy.onCommit: commits: num=1
   [junit4]   2> 	commit{dir=MockDirectoryWrapper(RAMDirectory@82c1f9 lockFactory=org.apache.lucene.store.SingleInstanceLockFactory@146f530),segFN=segments_1,generation=1}
   [junit4]   2> 87956 INFO  (qtp22504676-471) [n:127.0.0.1:56087_solr c:testschemaapi s:shard1 r:core_node2 x:testschemaapi_shard1_replica2] o.a.s.c.SolrDeletionPolicy newest commit generation = 1
   [junit4]   2> 87956 INFO  (qtp18531457-462) [n:127.0.0.1:56082_solr c:testschemaapi s:shard1 r:core_node1 x:testschemaapi_shard1_replica1] o.a.s.c.SolrDeletionPolicy SolrDeletionPolicy.onCommit: commits: num=1
   [junit4]   2> 	commit{dir=MockDirectoryWrapper(RAMDirectory@11c6e01 lockFactory=org.apache.lucene.store.SingleInstanceLockFactory@140eff0),segFN=segments_1,generation=1}
   [junit4]   2> 87956 INFO  (qtp18531457-462) [n:127.0.0.1:56082_solr c:testschemaapi s:shard1 r:core_node1 x:testschemaapi_shard1_replica1] o.a.s.c.SolrDeletionPolicy newest commit generation = 1
   [junit4]   2> 87959 INFO  (qtp22504676-471) [n:127.0.0.1:56087_solr c:testschemaapi s:shard1 r:core_node2 x:testschemaapi_shard1_replica2] o.a.s.c.SolrCore no updateRequestProcessorChain defined as default, creating implicit default
   [junit4]   2> 87970 INFO  (qtp22504676-471) [n:127.0.0.1:56087_solr c:testschemaapi s:shard1 r:core_node2 x:testschemaapi_shard1_replica2] o.a.s.h.l.XMLLoader xsltCacheLifetimeSeconds=60
   [junit4]   2> 87971 INFO  (qtp22504676-471) [n:127.0.0.1:56087_solr c:testschemaapi s:shard1 r:core_node2 x:testschemaapi_shard1_replica2] o.a.s.h.l.XMLLoader xsltCacheLifetimeSeconds=60
   [junit4]   2> 87972 INFO  (qtp22504676-471) [n:127.0.0.1:56087_solr c:testschemaapi s:shard1 r:core_node2 x:testschemaapi_shard1_replica2] o.a.s.h.l.XMLLoader xsltCacheLifetimeSeconds=60
   [junit4]   2> 87974 INFO  (qtp22504676-471) [n:127.0.0.1:56087_solr c:testschemaapi s:shard1 r:core_node2 x:testschemaapi_shard1_replica2] o.a.s.h.l.XMLLoader xsltCacheLifetimeSeconds=60
   [junit4]   2> 87975 INFO  (qtp22504676-471) [n:127.0.0.1:56087_solr c:testschemaapi s:shard1 r:core_node2 x:testschemaapi_shard1_replica2] o.a.s.c.RequestHandlers Registered paths: /admin/mbeans,/update/csv,/sql,/update/json/docs,/admin/luke,/graph,/export,/select,/admin/segments,/get,/admin/system,/replication,/admin/properties,/config,/stream,/schema,/admin/plugins,/admin/logging,/update/json,/admin/ping,/admin/threads,/update,/admin/file
   [junit4]   2> 87975 INFO  (qtp22504676-471) [n:127.0.0.1:56087_solr c:testschemaapi s:shard1 r:core_node2 x:testschemaapi_shard1_replica2] o.a.s.c.SolrCore Using default statsCache cache: org.apache.solr.search.stats.LocalStatsCache
   [junit4]   2> 87979 INFO  (qtp22504676-471) [n:127.0.0.1:56087_solr c:testschemaapi s:shard1 r:core_node2 x:testschemaapi_shard1_replica2] o.a.s.u.UpdateHandler Using UpdateLog implementation: org.apache.solr.update.UpdateLog
   [junit4]   2> 87979 INFO  (qtp22504676-471) [n:127.0.0.1:56087_solr c:testschemaapi s:shard1 r:core_node2 x:testschemaapi_shard1_replica2] o.a.s.u.UpdateLog Initializing UpdateLog: dataDir=null defaultSyncLevel=FLUSH numRecordsToKeep=100 maxNumLogsToKeep=10 numVersionBuckets=65536
   [junit4]   2> 87982 INFO  (qtp22504676-471) [n:127.0.0.1:56087_solr c:testschemaapi s:shard1 r:core_node2 x:testschemaapi_shard1_replica2] o.a.s.u.CommitTracker Hard AutoCommit: disabled
   [junit4]   2> 87982 INFO  (qtp22504676-471) [n:127.0.0.1:56087_solr c:testschemaapi s:shard1 r:core_node2 x:testschemaapi_shard1_replica2] o.a.s.u.CommitTracker Soft AutoCommit: disabled
   [junit4]   2> 87983 INFO  (qtp22504676-471) [n:127.0.0.1:56087_solr c:testschemaapi s:shard1 r:core_node2 x:testschemaapi_shard1_replica2] o.a.s.c.SolrDeletionPolicy SolrDeletionPolicy.onInit: commits: num=1
   [junit4]   2> 	commit{dir=MockDirectoryWrapper(RAMDirectory@82c1f9 lockFactory=org.apache.lucene.store.SingleInstanceLockFactory@146f530),segFN=segments_1,generation=1}
   [junit4]   2> 87983 INFO  (qtp22504676-471) [n:127.0.0.1:56087_solr c:testschemaapi s:shard1 r:core_node2 x:testschemaapi_shard1_replica2] o.a.s.c.SolrDeletionPolicy newest commit generation = 1
   [junit4]   2> 87983 INFO  (OldIndexDirectoryCleanupThreadForCore-testschemaapi_shard1_replica2) [n:127.0.0.1:56087_solr c:testschemaapi s:shard1 r:core_node2 x:testschemaapi_shard1_replica2] o.a.s.c.SolrCore Looking for old index directories to cleanup for core testschemaapi_shard1_replica2 in C:\Users\jenkins\workspace\Lucene-Solr-6.x-Windows\solr\build\solr-core\test\J1\temp\solr.schema.TestManagedSchemaAPI_57B1E04B64DCAEF5-001\tempDir-001\node1\.\testschemaapi_shard1_replica2\data\
   [junit4]   2> 87984 INFO  (qtp22504676-471) [n:127.0.0.1:56087_solr c:testschemaapi s:shard1 r:core_node2 x:testschemaapi_shard1_replica2] o.a.s.s.SolrIndexSearcher Opening [Searcher@1cd97ca[testschemaapi_shard1_replica2] main]
   [junit4]   2> 87984 INFO  (qtp22504676-471) [n:127.0.0.1:56087_solr c:testschemaapi s:shard1 r:core_node2 x:testschemaapi_shard1_replica2] o.a.s.c.c.ZkStateReader Load collection config from: [/collections/testschemaapi]
   [junit4]   2> 87985 INFO  (qtp18531457-462) [n:127.0.0.1:56082_solr c:testschemaapi s:shard1 r:core_node1 x:testschemaapi_shard1_replica1] o.a.s.c.SolrCore no updateRequestProcessorChain defined as default, creating implicit default
   [junit4]   2> 87985 INFO  (qtp22504676-471) [n:127.0.0.1:56087_solr c:testschemaapi s:shard1 r:core_node2 x:testschemaapi_shard1_replica2] o.a.s.c.c.ZkStateReader path=[/collections/testschemaapi] [configName]=[conf1] specified config exists in ZooKeeper
   [junit4]   2> 87985 INFO  (qtp22504676-471) [n:127.0.0.1:56087_solr c:testschemaapi s:shard1 r:core_node2 x:testschemaapi_shard1_replica2] o.a.s.r.ManagedResourceStorage Setting up ZooKeeper-based storage for the RestManager with znodeBase: /configs/conf1
   [junit4]   2> 87986 INFO  (OldIndexDirectoryCleanupThreadForCore-testschemaapi_shard1_replica1) [n:127.0.0.1:56082_solr c:testschemaapi s:shard1 r:core_node1 x:testschemaapi_shard1_replica1] o.a.s.c.SolrCore Looking for old index directories to cleanup for core testschemaapi_shard1_replica1 in C:\Users\jenkins\workspace\Lucene-Solr-6.x-Windows\solr\build\solr-core\test\J1\temp\solr.schema.TestManagedSchemaAPI_57B1E04B64DCAEF5-001\tempDir-001\node2\.\testschemaapi_shard1_replica1\data\
   [junit4]   2> 87986 INFO  (qtp22504676-471) [n:127.0.0.1:56087_solr c:testschemaapi s:shard1 r:core_node2 x:testschemaapi_shard1_replica2] o.a.s.r.ManagedResourceStorage Configured ZooKeeperStorageIO with znodeBase: /configs/conf1
   [junit4]   2> 87986 INFO  (qtp22504676-471) [n:127.0.0.1:56087_solr c:testschemaapi s:shard1 r:core_node2 x:testschemaapi_shard1_replica2] o.a.s.r.RestManager Initializing RestManager with initArgs: {}
   [junit4]   2> 87987 INFO  (qtp22504676-471) [n:127.0.0.1:56087_solr c:testschemaapi s:shard1 r:core_node2 x:testschemaapi_shard1_replica2] o.a.s.r.ManagedResourceStorage Reading _rest_managed.json using ZooKeeperStorageIO:path=/configs/conf1
   [junit4]   2> 87987 INFO  (qtp22504676-471) [n:127.0.0.1:56087_solr c:testschemaapi s:shard1 r:core_node2 x:testschemaapi_shard1_replica2] o.a.s.r.ManagedResourceStorage No data found for znode /configs/conf1/_rest_managed.json
   [junit4]   2> 87987 INFO  (qtp22504676-471) [n:127.0.0.1:56087_solr c:testschemaapi s:shard1 r:core_node2 x:testschemaapi_shard1_replica2] o.a.s.r.ManagedResourceStorage Loaded null at path _rest_managed.json using ZooKeeperStorageIO:path=/configs/conf1
   [junit4]   2> 87987 INFO  (qtp22504676-471) [n:127.0.0.1:56087_solr c:testschemaapi s:shard1 r:core_node2 x:testschemaapi_shard1_replica2] o.a.s.r.RestManager Initializing 0 registered ManagedResources
   [junit4]   2> 87987 INFO  (qtp22504676-471) [n:127.0.0.1:56087_solr c:testschemaapi s:shard1 r:core_node2 x:testschemaapi_shard1_replica2] o.a.s.s.ZkIndexSchemaReader Creating ZooKeeper watch for the managed schema at /configs/conf1/managed-schema
   [junit4]   2> 87988 WARN  (OldIndexDirectoryCleanupThreadForCore-testschemaapi_shard1_replica1) [n:127.0.0.1:56082_solr c:testschemaapi s:shard1 r:core_node1 x:testschemaapi_shard1_replica1] o.a.s.c.DirectoryFactory C:\Users\jenkins\workspace\Lucene-Solr-6.x-Windows\solr\build\solr-core\test\J1\temp\solr.schema.TestManagedSchemaAPI_57B1E04B64DCAEF5-001\tempDir-001\node2\.\testschemaapi_shard1_replica1\data\ does not point to a valid data directory; skipping clean-up of old index directories.
   [junit4]   2> 87988 INFO  (qtp18531457-462) [n:127.0.0.1:56082_solr c:testschemaapi s:shard1 r:core_node1 x:testschemaapi_shard1_replica1] o.a.s.h.l.XMLLoader xsltCacheLifetimeSeconds=60
   [junit4]   2> 87989 INFO  (qtp22504676-471) [n:127.0.0.1:56087_solr c:testschemaapi s:shard1 r:core_node2 x:testschemaapi_shard1_replica2] o.a.s.c.ZkController Added new OnReconnect listener ZkIndexSchemaReader: /configs/conf1/managed-schema, uniqueCoreId: testschemaapi_shard1_replica2:790934015203091
   [junit4]   2> 87989 INFO  (qtp22504676-471) [n:127.0.0.1:56087_solr c:testschemaapi s:shard1 r:core_node2 x:testschemaapi_shard1_replica2] o.a.s.h.ReplicationHandler Commits will be reserved for  10000
   [junit4]   2> 87990 INFO  (qtp18531457-462) [n:127.0.0.1:56082_solr c:testschemaapi s:shard1 r:core_node1 x:testschemaapi_shard1_replica1] o.a.s.h.l.XMLLoader xsltCacheLifetimeSeconds=60
   [junit4]   2> 87990 INFO  (qtp22504676-471) [n:127.0.0.1:56087_solr c:testschemaapi s:shard1 r:core_node2 x:testschemaapi_shard1_replica2] o.a.s.u.UpdateLog Looking up max value of version field to seed version buckets
   [junit4]   2> 87991 INFO  (qtp22504676-471) [n:127.0.0.1:56087_solr c:testschemaapi s:shard1 r:core_node2 x:testschemaapi_shard1_replica2] o.a.s.u.VersionInfo Refreshing highest value of _version_ for 65536 version buckets from index
   [junit4]   2> 87991 INFO  (qtp22504676-471) [n:127.0.0.1:56087_solr c:testschemaapi s:shard1 r:core_node2 x:testschemaapi_shard1_replica2] o.a.s.u.VersionInfo No terms found for _version_, cannot seed version bucket highest value from index
   [junit4]   2> 87991 INFO  (qtp22504676-471) [n:127.0.0.1:56087_solr c:testschemaapi s:shard1 r:core_node2 x:testschemaapi_shard1_replica2] o.a.s.u.UpdateLog Could not find max version in index or recent updates, using new clock 1534415649828241408
   [junit4]   2> 87991 INFO  (searcherExecutor-221-thread-1-processing-n:127.0.0.1:56087_solr x:testschemaapi_shard1_replica2 s:shard1 c:testschemaapi r:core_node2) [n:127.0.0.1:56087_solr c:testschemaapi s:shard1 r:core_node2 x:testschemaapi_shard1_replica2] o.a.s.c.SolrCore [testschemaapi_shard1_replica2] Registered new searcher Searcher@1cd97ca[testschemaapi_shard1_replica2] main{ExitableDirectoryReader(UninvertingDirectoryReader())}
   [junit4]   2> 87992 INFO  (qtp18531457-462) [n:127.0.0.1:56082_solr c:testschemaapi s:shard1 r:core_node1 x:testschemaapi_shard1_replica1] o.a.s.h.l.XMLLoader xsltCacheLifetimeSeconds=60
   [junit4]   2> 87992 INFO  (qtp22504676-471) [n:127.0.0.1:56087_solr c:testschemaapi s:shard1 r:core_node2 x:testschemaapi_shard1_replica2] o.a.s.u.UpdateLog Took 1.0ms to seed version buckets with highest version 1534415649828241408
   [junit4]   2> 87992 INFO  (qtp22504676-471) [n:127.0.0.1:56087_solr c:testschemaapi s:shard1 r:core_node2 x:testschemaapi_shard1_replica2] o.a.s.c.ZkController watch zkdir /configs/conf1
   [junit4]   2> 87995 INFO  (qtp18531457-462) [n:127.0.0.1:56082_solr c:testschemaapi s:shard1 r:core_node1 x:testschemaapi_shard1_replica1] o.a.s.h.l.XMLLoader xsltCacheLifetimeSeconds=60
   [junit4]   2> 87995 INFO  (qtp22504676-471) [n:127.0.0.1:56087_solr c:testschemaapi s:shard1 r:core_node2 x:testschemaapi_shard1_replica2] o.a.s.c.CoreContainer registering core: testschemaapi_shard1_replica2
   [junit4]   2> 87995 INFO  (qtp22504676-471) [n:127.0.0.1:56087_solr c:testschemaapi s:shard1 r:core_node2 x:testschemaapi_shard1_replica2] o.a.s.c.ZkController Register replica - core:testschemaapi_shard1_replica2 address:http://127.0.0.1:56087/solr collection:testschemaapi shard:shard1
   [junit4]   2> 87996 INFO  (qtp18531457-462) [n:127.0.0.1:56082_solr c:testschemaapi s:shard1 r:core_node1 x:testschemaapi_shard1_replica1] o.a.s.c.RequestHandlers Registered paths: /admin/mbeans,/update/csv,/sql,/update/json/docs,/admin/luke,/graph,/export,/select,/admin/segments,/get,/admin/system,/replication,/admin/properties,/config,/stream,/schema,/admin/plugins,/admin/logging,/update/json,/admin/ping,/admin/threads,/update,/admin/file
   [junit4]   2> 87996 INFO  (qtp18531457-462) [n:127.0.0.1:56082_solr c:testschemaapi s:shard1 r:core_node1 x:testschemaapi_shard1_replica1] o.a.s.c.SolrCore Using default statsCache cache: org.apache.solr.search.stats.LocalStatsCache
   [junit4]   2> 87998 INFO  (qtp18531457-462) [n:127.0.0.1:56082_solr c:testschemaapi s:shard1 r:core_node1 x:testschemaapi_shard1_replica1] o.a.s.u.UpdateHandler Using UpdateLog implementation: org.apache.solr.update.UpdateLog
   [junit4]   2> 87998 INFO  (qtp18531457-462) [n:127.0.0.1:56082_solr c:testschemaapi s:shard1 r:core_node1 x:testschemaapi_shard1_replica1] o.a.s.u.UpdateLog Initializing UpdateLog: dataDir=null defaultSyncLevel=FLUSH numRecordsToKeep=100 maxNumLogsToKeep=10 numVersionBuckets=65536
   [junit4]   2> 87998 INFO  (qtp22504676-471) [n:127.0.0.1:56087_solr c:testschemaapi s:shard1 r:core_node2 x:testschemaapi_shard1_replica2] o.a.s.c.c.SolrZkClient makePath: /collections/testschemaapi/leader_elect/shard1/election
   [junit4]   2> 88000 INFO  (qtp18531457-462) [n:127.0.0.1:56082_solr c:testschemaapi s:shard1 r:core_node1 x:testschemaapi_shard1_replica1] o.a.s.u.CommitTracker Hard AutoCommit: disabled
   [junit4]   2> 88000 INFO  (qtp18531457-462) [n:127.0.0.1:56082_solr c:testschemaapi s:shard1 r:core_node1 x:testschemaapi_shard1_replica1] o.a.s.u.CommitTracker Soft AutoCommit: disabled
   [junit4]   2> 88005 INFO  (qtp22504676-471) [n:127.0.0.1:56087_solr c:testschemaapi s:shard1 r:core_node2 x:testschemaapi_shard1_replica2] o.a.s.c.LeaderElector Joined leadership election with path: /collections/testschemaapi/leader_elect/shard1/election/95900977936203781-core_node2-n_0000000000
   [junit4]   2> 88005 INFO  (qtp22504676-471) [n:127.0.0.1:56087_solr c:testschemaapi s:shard1 r:core_node2 x:testschemaapi_shard1_replica2] o.a.s.c.ShardLeaderElectionContext Running the leader process for shard=shard1 and weAreReplacement=false and leaderVoteWait=10000
   [junit4]   2> 88007 INFO  (qtp18531457-462) [n:127.0.0.1:56082_solr c:testschemaapi s:shard1 r:core_node1 x:testschemaapi_shard1_replica1] o.a.s.c.SolrDeletionPolicy SolrDeletionPolicy.onInit: commits: num=1
   [junit4]   2> 	commit{dir=MockDirectoryWrapper(RAMDirectory@11c6e01 lockFactory=org.apache.lucene.store.SingleInstanceLockFactory@140eff0),segFN=segments_1,generation=1}
   [junit4]   2> 88007 INFO  (qtp18531457-462) [n:127.0.0.1:56082_solr c:testschemaapi s:shard1 r:core_node1 x:testschemaapi_shard1_replica1] o.a.s.c.SolrDeletionPolicy newest commit generation = 1
   [junit4]   2> 88008 INFO  (qtp22504676-471) [n:127.0.0.1:56087_solr c:testschemaapi s:shard1 r:core_node2 x:testschemaapi_shard1_replica2] o.a.s.c.ShardLeaderElectionContext Waiting until we see more replicas up for shard shard1: total=2 found=1 timeoutin=9999ms
   [junit4]   2> 88008 INFO  (qtp18531457-462) [n:127.0.0.1:56082_solr c:testschemaapi s:shard1 r:core_node1 x:testschemaapi_shard1_replica1] o.a.s.s.SolrIndexSearcher Opening [Searcher@1af633c[testschemaapi_shard1_replica1] main]
   [junit4]   2> 88009 INFO  (qtp18531457-462) [n:127.0.0.1:56082_solr c:testschemaapi s:shard1 r:core_node1 x:testschemaapi_shard1_replica1] o.a.s.c.c.ZkStateReader Load collection config from: [/collections/testschemaapi]
   [junit4]   2> 88009 INFO  (OverseerStateUpdate-95900977936203782-127.0.0.1:56082_solr-n_0000000000) [n:127.0.0.1:56082_solr    ] o.a.s.c.Overseer processMessage: queueSize: 1, message = {
   [junit4]   2>   "operation":"leader",
   [junit4]   2>   "shard":"shard1",
   [junit4]   2>   "collection":"testschemaapi"} current state version: 0
   [junit4]   2> 88011 INFO  (qtp18531457-462) [n:127.0.0.1:56082_solr c:testschemaapi s:shard1 r:core_node1 x:testschemaapi_shard1_replica1] o.a.s.c.c.ZkStateReader path=[/collections/testschemaapi] [configName]=[conf1] specified config exists in ZooKeeper
   [junit4]   2> 88011 INFO  (qtp18531457-462) [n:127.0.0.1:56082_solr c:testschemaapi s:shard1 r:core_node1 x:testschemaapi_shard1_replica1] o.a.s.r.ManagedResourceStorage Setting up ZooKeeper-based storage for the RestManager with znodeBase: /configs/conf1
   [junit4]   2> 88012 INFO  (qtp18531457-462) [n:127.0.0.1:56082_solr c:testschemaapi s:shard1 r:core_node1 x:testschemaapi_shard1_replica1] o.a.s.r.ManagedResourceStorage Configured ZooKeeperStorageIO with znodeBase: /configs/conf1
   [junit4]   2> 88012 INFO  (qtp18531457-462) [n:127.0.0.1:56082_solr c:testschemaapi s:shard1 r:core_node1 x:testschemaapi_shard1_replica1] o.a.s.r.RestManager Initializing RestManager with initArgs: {}
   [junit4]   2> 88012 INFO  (qtp18531457-462) [n:127.0.0.1:56082_solr c:testschemaapi s:shard1 r:core_node1 x:testschemaapi_shard1_replica1] o.a.s.r.ManagedResourceStorage Reading _rest_managed.json using ZooKeeperStorageIO:path=/configs/conf1
   [junit4]   2> 88012 INFO  (qtp18531457-462) [n:127.0.0.1:56082_solr c:testschemaapi s:shard1 r:core_node1 x:testschemaapi_shard1_replica1] o.a.s.r.ManagedResourceStorage No data found for znode /configs/conf1/_rest_managed.json
   [junit4]   2> 88012 INFO  (qtp18531457-462) [n:127.0.0.1:56082_solr c:testschemaapi s:shard1 r:core_node1 x:testschemaapi_shard1_replica1] o.a.s.r.ManagedResourceStorage Loaded null at path _rest_managed.json using ZooKeeperStorageIO:path=/configs/conf1
   [junit4]   2> 88012 INFO  (qtp18531457-462) [n:127.0.0.1:56082_solr c:testschemaapi s:shard1 r:core_node1 x:testschemaapi_shard1_replica1] o.a.s.r.RestManager Initializing 0 registered ManagedResources
   [junit4]   2> 88012 INFO  (qtp18531457-462) [n:127.0.0.1:56082_solr c:testschemaapi s:shard1 r:core_node1 x:testschemaapi_shard1_replica1] o.a.s.s.ZkIndexSchemaReader Creating ZooKeeper watch for the managed schema at /configs/conf1/managed-schema
   [junit4]   2> 88013 INFO  (qtp18531457-462) [n:127.0.0.1:56082_solr c:testschemaapi s:shard1 r:core_node1 x:testschemaapi_shard1_replica1] o.a.s.c.ZkController Added new OnReconnect listener ZkIndexSchemaReader: /configs/conf1/managed-schema, uniqueCoreId: testschemaapi_shard1_replica1:790934024881708
   [junit4]   2> 88013 INFO  (qtp18531457-462) [n:127.0.0.1:56082_solr c:testschemaapi s:shard1 r:core_node1 x:testschemaapi_shard1_replica1] o.a.s.h.ReplicationHandler Commits will be reserved for  10000
   [junit4]   2> 88014 INFO  (qtp18531457-462) [n:127.0.0.1:56082_solr c:testschemaapi s:shard1 r:core_node1 x:testschemaapi_shard1_replica1] o.a.s.u.UpdateLog Looking up max value of version field to seed version buckets
   [junit4]   2> 88014 INFO  (qtp18531457-462) [n:127.0.0.1:56082_solr c:testschemaapi s:shard1 r:core_node1 x:testschemaapi_shard1_replica1] o.a.s.u.VersionInfo Refreshing highest value of _version_ for 65536 version buckets from index
   [junit4]   2> 88014 INFO  (qtp18531457-462) [n:127.0.0.1:56082_solr c:testschemaapi s:shard1 r:core_node1 x:testschemaapi_shard1_replica1] o.a.s.u.VersionInfo No terms found for _version_, cannot seed version bucket highest value from index
   [junit4]   2> 88014 INFO  (qtp18531457-462) [n:127.0.0.1:56082_solr c:testschemaapi s:shard1 r:core_node1 x:testschemaapi_shard1_replica1] o.a.s.u.UpdateLog Could not find max version in index or recent updates, using new clock 1534415649852358656
   [junit4]   2> 88014 INFO  (searcherExecutor-222-thread-1-processing-n:127.0.0.1:56082_solr x:testschemaapi_shard1_replica1 s:shard1 c:testschemaapi r:core_node1) [n:127.0.0.1:56082_solr c:testschemaapi s:shard1 r:core_node1 x:testschemaapi_shard1_replica1] o.a.s.c.SolrCore [testschemaapi_shard1_replica1] Registered new searcher Searcher@1af633c[testschemaapi_shard1_replica1

[...truncated too long message...]

c:testschemaapi s:shard1 r:core_node1 x:testschemaapi_shard1_replica1] o.a.s.c.ZkController listener throws error
   [junit4]   2> org.apache.solr.common.SolrException: Unable to reload core [testschemaapi_shard1_replica1]
   [junit4]   2> 	at org.apache.solr.core.CoreContainer.reload(CoreContainer.java:921)
   [junit4]   2> 	at org.apache.solr.core.SolrCore.lambda$getConfListener$6(SolrCore.java:2490)
   [junit4]   2> 	at org.apache.solr.cloud.ZkController$4.run(ZkController.java:2409)
   [junit4]   2> Caused by: org.apache.solr.common.SolrException: Could not find config name for collection:testschemaapi
   [junit4]   2> 	at org.apache.solr.core.SolrCore.<init>(SolrCore.java:773)
   [junit4]   2> 	at org.apache.solr.core.SolrCore.reload(SolrCore.java:462)
   [junit4]   2> 	at org.apache.solr.core.CoreContainer.reload(CoreContainer.java:915)
   [junit4]   2> 	... 2 more
   [junit4]   2> Caused by: org.apache.solr.common.SolrException: Could not find config name for collection:testschemaapi
   [junit4]   2> 	at org.apache.solr.rest.ManagedResourceStorage.newStorageIO(ManagedResourceStorage.java:101)
   [junit4]   2> 	at org.apache.solr.core.SolrCore.initRestManager(SolrCore.java:2285)
   [junit4]   2> 	at org.apache.solr.core.SolrCore.<init>(SolrCore.java:749)
   [junit4]   2> 	... 4 more
   [junit4]   2> NOTE: test params are: codec=Asserting(Lucene60): {_version_=TestBloomFilteredLucenePostings(BloomFilteringPostingsFormat(Lucene50(blocksize=128))), id=PostingsFormat(name=LuceneFixedGap), myNewField1=PostingsFormat(name=LuceneFixedGap), myNewField=TestBloomFilteredLucenePostings(BloomFilteringPostingsFormat(Lucene50(blocksize=128)))}, docValues:{}, maxPointsInLeafNode=1281, maxMBSortInHeap=7.461718011227283, sim=ClassicSimilarity, locale=fr-LU, timezone=Pacific/Fiji
   [junit4]   2> NOTE: Windows 10 10.0 x86/Oracle Corporation 1.8.0_92 (32-bit)/cpus=3,threads=1,free=185996352,total=254541824
   [junit4]   2> NOTE: All tests run in this JVM: [SimpleMLTQParserTest, SolrCloudExampleTest, DefaultValueUpdateProcessorTest, TestFileDictionaryLookup, ClassificationUpdateProcessorFactoryTest, TestRecoveryHdfs, UUIDUpdateProcessorFallbackTest, TestConfigSetImmutable, TestManagedSchemaAPI]
   [junit4]   2> NOTE: reproduce with: ant test  -Dtestcase=TestManagedSchemaAPI -Dtests.seed=57B1E04B64DCAEF5 -Dtests.slow=true -Dtests.locale=fr-LU -Dtests.timezone=Pacific/Fiji -Dtests.asserts=true -Dtests.file.encoding=UTF-8
   [junit4] ERROR   0.00s J1 | TestManagedSchemaAPI (suite) <<<
   [junit4]    > Throwable #1: java.lang.AssertionError: ObjectTracker found 8 object(s) that were not released!!! [MockDirectoryWrapper, TransactionLog, MockDirectoryWrapper, MDCAwareThreadPoolExecutor, MockDirectoryWrapper, MDCAwareThreadPoolExecutor, TransactionLog, MockDirectoryWrapper]
   [junit4]    > 	at __randomizedtesting.SeedInfo.seed([57B1E04B64DCAEF5]:0)
   [junit4]    > 	at org.apache.solr.SolrTestCaseJ4.afterClass(SolrTestCaseJ4.java:256)
   [junit4]    > 	at java.lang.Thread.run(Thread.java:745)Throwable #2: java.io.IOException: Could not remove the following files (in the order of attempts):
   [junit4]    >    C:\Users\jenkins\workspace\Lucene-Solr-6.x-Windows\solr\build\solr-core\test\J1\temp\solr.schema.TestManagedSchemaAPI_57B1E04B64DCAEF5-001\tempDir-001\node2\testschemaapi_shard1_replica1\data\tlog\tlog.0000000000000000000: java.nio.file.FileSystemException: C:\Users\jenkins\workspace\Lucene-Solr-6.x-Windows\solr\build\solr-core\test\J1\temp\solr.schema.TestManagedSchemaAPI_57B1E04B64DCAEF5-001\tempDir-001\node2\testschemaapi_shard1_replica1\data\tlog\tlog.0000000000000000000: The process cannot access the file because it is being used by another process.
   [junit4]    >    C:\Users\jenkins\workspace\Lucene-Solr-6.x-Windows\solr\build\solr-core\test\J1\temp\solr.schema.TestManagedSchemaAPI_57B1E04B64DCAEF5-001\tempDir-001\node2\testschemaapi_shard1_replica1\data\tlog: java.nio.file.DirectoryNotEmptyException: C:\Users\jenkins\workspace\Lucene-Solr-6.x-Windows\solr\build\solr-core\test\J1\temp\solr.schema.TestManagedSchemaAPI_57B1E04B64DCAEF5-001\tempDir-001\node2\testschemaapi_shard1_replica1\data\tlog
   [junit4]    >    C:\Users\jenkins\workspace\Lucene-Solr-6.x-Windows\solr\build\solr-core\test\J1\temp\solr.schema.TestManagedSchemaAPI_57B1E04B64DCAEF5-001\tempDir-001\node2\testschemaapi_shard1_replica1\data: java.nio.file.DirectoryNotEmptyException: C:\Users\jenkins\workspace\Lucene-Solr-6.x-Windows\solr\build\solr-core\test\J1\temp\solr.schema.TestManagedSchemaAPI_57B1E04B64DCAEF5-001\tempDir-001\node2\testschemaapi_shard1_replica1\data
   [junit4]    >    C:\Users\jenkins\workspace\Lucene-Solr-6.x-Windows\solr\build\solr-core\test\J1\temp\solr.schema.TestManagedSchemaAPI_57B1E04B64DCAEF5-001\tempDir-001\node2\testschemaapi_shard1_replica1: java.nio.file.DirectoryNotEmptyException: C:\Users\jenkins\workspace\Lucene-Solr-6.x-Windows\solr\build\solr-core\test\J1\temp\solr.schema.TestManagedSchemaAPI_57B1E04B64DCAEF5-001\tempDir-001\node2\testschemaapi_shard1_replica1
   [junit4]    >    C:\Users\jenkins\workspace\Lucene-Solr-6.x-Windows\solr\build\solr-core\test\J1\temp\solr.schema.TestManagedSchemaAPI_57B1E04B64DCAEF5-001\tempDir-001\node2: java.nio.file.DirectoryNotEmptyException: C:\Users\jenkins\workspace\Lucene-Solr-6.x-Windows\solr\build\solr-core\test\J1\temp\solr.schema.TestManagedSchemaAPI_57B1E04B64DCAEF5-001\tempDir-001\node2
   [junit4]    >    C:\Users\jenkins\workspace\Lucene-Solr-6.x-Windows\solr\build\solr-core\test\J1\temp\solr.schema.TestManagedSchemaAPI_57B1E04B64DCAEF5-001\tempDir-001\node1\testschemaapi_shard1_replica2\data\tlog\tlog.0000000000000000001: java.nio.file.FileSystemException: C:\Users\jenkins\workspace\Lucene-Solr-6.x-Windows\solr\build\solr-core\test\J1\temp\solr.schema.TestManagedSchemaAPI_57B1E04B64DCAEF5-001\tempDir-001\node1\testschemaapi_shard1_replica2\data\tlog\tlog.0000000000000000001: The process cannot access the file because it is being used by another process.
   [junit4]    >    C:\Users\jenkins\workspace\Lucene-Solr-6.x-Windows\solr\build\solr-core\test\J1\temp\solr.schema.TestManagedSchemaAPI_57B1E04B64DCAEF5-001\tempDir-001\node1\testschemaapi_shard1_replica2\data\tlog: java.nio.file.DirectoryNotEmptyException: C:\Users\jenkins\workspace\Lucene-Solr-6.x-Windows\solr\build\solr-core\test\J1\temp\solr.schema.TestManagedSchemaAPI_57B1E04B64DCAEF5-001\tempDir-001\node1\testschemaapi_shard1_replica2\data\tlog
   [junit4]    >    C:\Users\jenkins\workspace\Lucene-Solr-6.x-Windows\solr\build\solr-core\test\J1\temp\solr.schema.TestManagedSchemaAPI_57B1E04B64DCAEF5-001\tempDir-001\node1\testschemaapi_shard1_replica2\data: java.nio.file.DirectoryNotEmptyException: C:\Users\jenkins\workspace\Lucene-Solr-6.x-Windows\solr\build\solr-core\test\J1\temp\solr.schema.TestManagedSchemaAPI_57B1E04B64DCAEF5-001\tempDir-001\node1\testschemaapi_shard1_replica2\data
   [junit4]    >    C:\Users\jenkins\workspace\Lucene-Solr-6.x-Windows\solr\build\solr-core\test\J1\temp\solr.schema.TestManagedSchemaAPI_57B1E04B64DCAEF5-001\tempDir-001\node1\testschemaapi_shard1_replica2: java.nio.file.DirectoryNotEmptyException: C:\Users\jenkins\workspace\Lucene-Solr-6.x-Windows\solr\build\solr-core\test\J1\temp\solr.schema.TestManagedSchemaAPI_57B1E04B64DCAEF5-001\tempDir-001\node1\testschemaapi_shard1_replica2
   [junit4]    >    C:\Users\jenkins\workspace\Lucene-Solr-6.x-Windows\solr\build\solr-core\test\J1\temp\solr.schema.TestManagedSchemaAPI_57B1E04B64DCAEF5-001\tempDir-001\node1: java.nio.file.DirectoryNotEmptyException: C:\Users\jenkins\workspace\Lucene-Solr-6.x-Windows\solr\build\solr-core\test\J1\temp\solr.schema.TestManagedSchemaAPI_57B1E04B64DCAEF5-001\tempDir-001\node1
   [junit4]    >    C:\Users\jenkins\workspace\Lucene-Solr-6.x-Windows\solr\build\solr-core\test\J1\temp\solr.schema.TestManagedSchemaAPI_57B1E04B64DCAEF5-001\tempDir-001: java.nio.file.DirectoryNotEmptyException: C:\Users\jenkins\workspace\Lucene-Solr-6.x-Windows\solr\build\solr-core\test\J1\temp\solr.schema.TestManagedSchemaAPI_57B1E04B64DCAEF5-001\tempDir-001
   [junit4]    >    C:\Users\jenkins\workspace\Lucene-Solr-6.x-Windows\solr\build\solr-core\test\J1\temp\solr.schema.TestManagedSchemaAPI_57B1E04B64DCAEF5-001: java.nio.file.DirectoryNotEmptyException: C:\Users\jenkins\workspace\Lucene-Solr-6.x-Windows\solr\build\solr-core\test\J1\temp\solr.schema.TestManagedSchemaAPI_57B1E04B64DCAEF5-001
   [junit4]    > 	at org.apache.lucene.util.IOUtils.rm(IOUtils.java:323)
   [junit4]    > 	at java.lang.Thread.run(Thread.java:745)
   [junit4] Completed [28/598 (1!)] on J1 in 14.03s, 1 test, 1 failure, 1 error <<< FAILURES!

[...truncated 1872 lines...]
BUILD FAILED
C:\Users\jenkins\workspace\Lucene-Solr-6.x-Windows\build.xml:740: The following error occurred while executing this line:
C:\Users\jenkins\workspace\Lucene-Solr-6.x-Windows\build.xml:684: The following error occurred while executing this line:
C:\Users\jenkins\workspace\Lucene-Solr-6.x-Windows\build.xml:59: The following error occurred while executing this line:
C:\Users\jenkins\workspace\Lucene-Solr-6.x-Windows\solr\build.xml:233: The following error occurred while executing this line:
C:\Users\jenkins\workspace\Lucene-Solr-6.x-Windows\solr\common-build.xml:529: The following error occurred while executing this line:
C:\Users\jenkins\workspace\Lucene-Solr-6.x-Windows\lucene\common-build.xml:1457: The following error occurred while executing this line:
C:\Users\jenkins\workspace\Lucene-Solr-6.x-Windows\lucene\common-build.xml:1014: There were test failures: 598 suites (10 ignored), 2420 tests, 2 suite-level errors, 125 ignored (81 assumptions) [seed: 57B1E04B64DCAEF5]

Total time: 78 minutes 39 seconds
Build step 'Invoke Ant' marked build as failure
Archiving artifacts
[WARNINGS] Skipping publisher since build result is FAILURE
Recording test results
Email was triggered for: Failure - Any
Sending email for trigger: Failure - Any



Mime
View raw message