lucene-dev mailing list archives

Site index · List index
Message view « Date » · « Thread »
Top « Date » · « Thread »
From Policeman Jenkins Server <jenk...@thetaphi.de>
Subject [JENKINS] Lucene-Solr-6.x-Linux (32bit/jdk1.8.0_92) - Build # 657 - Failure!
Date Sun, 15 May 2016 08:46:12 GMT
Build: http://jenkins.thetaphi.de/job/Lucene-Solr-6.x-Linux/657/
Java: 32bit/jdk1.8.0_92 -server -XX:+UseConcMarkSweepGC

1 tests failed.
FAILED:  org.apache.solr.schema.TestManagedSchemaAPI.test

Error Message:
Error from server at http://127.0.0.1:39337/solr/testschemaapi_shard1_replica1: ERROR: [doc=2] unknown field 'myNewField1'

Stack Trace:
org.apache.solr.client.solrj.impl.CloudSolrClient$RouteException: Error from server at http://127.0.0.1:39337/solr/testschemaapi_shard1_replica1: ERROR: [doc=2] unknown field 'myNewField1'
	at __randomizedtesting.SeedInfo.seed([89C812C3487E6EEC:19C2D19E6820314]:0)
	at org.apache.solr.client.solrj.impl.CloudSolrClient.directUpdate(CloudSolrClient.java:697)
	at org.apache.solr.client.solrj.impl.CloudSolrClient.sendRequest(CloudSolrClient.java:1109)
	at org.apache.solr.client.solrj.impl.CloudSolrClient.requestWithRetryOnStaleState(CloudSolrClient.java:998)
	at org.apache.solr.client.solrj.impl.CloudSolrClient.request(CloudSolrClient.java:934)
	at org.apache.solr.schema.TestManagedSchemaAPI.testAddFieldAndDocument(TestManagedSchemaAPI.java:86)
	at org.apache.solr.schema.TestManagedSchemaAPI.test(TestManagedSchemaAPI.java:55)
	at sun.reflect.NativeMethodAccessorImpl.invoke0(Native Method)
	at sun.reflect.NativeMethodAccessorImpl.invoke(NativeMethodAccessorImpl.java:62)
	at sun.reflect.DelegatingMethodAccessorImpl.invoke(DelegatingMethodAccessorImpl.java:43)
	at java.lang.reflect.Method.invoke(Method.java:498)
	at com.carrotsearch.randomizedtesting.RandomizedRunner.invoke(RandomizedRunner.java:1764)
	at com.carrotsearch.randomizedtesting.RandomizedRunner$8.evaluate(RandomizedRunner.java:871)
	at com.carrotsearch.randomizedtesting.RandomizedRunner$9.evaluate(RandomizedRunner.java:907)
	at com.carrotsearch.randomizedtesting.RandomizedRunner$10.evaluate(RandomizedRunner.java:921)
	at com.carrotsearch.randomizedtesting.rules.SystemPropertiesRestoreRule$1.evaluate(SystemPropertiesRestoreRule.java:57)
	at org.apache.lucene.util.TestRuleSetupTeardownChained$1.evaluate(TestRuleSetupTeardownChained.java:49)
	at org.apache.lucene.util.AbstractBeforeAfterRule$1.evaluate(AbstractBeforeAfterRule.java:45)
	at org.apache.lucene.util.TestRuleThreadAndTestName$1.evaluate(TestRuleThreadAndTestName.java:48)
	at org.apache.lucene.util.TestRuleIgnoreAfterMaxFailures$1.evaluate(TestRuleIgnoreAfterMaxFailures.java:64)
	at org.apache.lucene.util.TestRuleMarkFailure$1.evaluate(TestRuleMarkFailure.java:47)
	at com.carrotsearch.randomizedtesting.rules.StatementAdapter.evaluate(StatementAdapter.java:36)
	at com.carrotsearch.randomizedtesting.ThreadLeakControl$StatementRunner.run(ThreadLeakControl.java:367)
	at com.carrotsearch.randomizedtesting.ThreadLeakControl.forkTimeoutingTask(ThreadLeakControl.java:809)
	at com.carrotsearch.randomizedtesting.ThreadLeakControl$3.evaluate(ThreadLeakControl.java:460)
	at com.carrotsearch.randomizedtesting.RandomizedRunner.runSingleTest(RandomizedRunner.java:880)
	at com.carrotsearch.randomizedtesting.RandomizedRunner$5.evaluate(RandomizedRunner.java:781)
	at com.carrotsearch.randomizedtesting.RandomizedRunner$6.evaluate(RandomizedRunner.java:816)
	at com.carrotsearch.randomizedtesting.RandomizedRunner$7.evaluate(RandomizedRunner.java:827)
	at com.carrotsearch.randomizedtesting.rules.StatementAdapter.evaluate(StatementAdapter.java:36)
	at com.carrotsearch.randomizedtesting.rules.SystemPropertiesRestoreRule$1.evaluate(SystemPropertiesRestoreRule.java:57)
	at org.apache.lucene.util.AbstractBeforeAfterRule$1.evaluate(AbstractBeforeAfterRule.java:45)
	at com.carrotsearch.randomizedtesting.rules.StatementAdapter.evaluate(StatementAdapter.java:36)
	at org.apache.lucene.util.TestRuleStoreClassName$1.evaluate(TestRuleStoreClassName.java:41)
	at com.carrotsearch.randomizedtesting.rules.NoShadowingOrOverridesOnMethodsRule$1.evaluate(NoShadowingOrOverridesOnMethodsRule.java:40)
	at com.carrotsearch.randomizedtesting.rules.NoShadowingOrOverridesOnMethodsRule$1.evaluate(NoShadowingOrOverridesOnMethodsRule.java:40)
	at com.carrotsearch.randomizedtesting.rules.StatementAdapter.evaluate(StatementAdapter.java:36)
	at com.carrotsearch.randomizedtesting.rules.StatementAdapter.evaluate(StatementAdapter.java:36)
	at com.carrotsearch.randomizedtesting.rules.StatementAdapter.evaluate(StatementAdapter.java:36)
	at org.apache.lucene.util.TestRuleAssertionsRequired$1.evaluate(TestRuleAssertionsRequired.java:53)
	at org.apache.lucene.util.TestRuleMarkFailure$1.evaluate(TestRuleMarkFailure.java:47)
	at org.apache.lucene.util.TestRuleIgnoreAfterMaxFailures$1.evaluate(TestRuleIgnoreAfterMaxFailures.java:64)
	at org.apache.lucene.util.TestRuleIgnoreTestSuites$1.evaluate(TestRuleIgnoreTestSuites.java:54)
	at com.carrotsearch.randomizedtesting.rules.StatementAdapter.evaluate(StatementAdapter.java:36)
	at com.carrotsearch.randomizedtesting.ThreadLeakControl$StatementRunner.run(ThreadLeakControl.java:367)
	at java.lang.Thread.run(Thread.java:745)
Caused by: org.apache.solr.client.solrj.impl.HttpSolrClient$RemoteSolrException: Error from server at http://127.0.0.1:39337/solr/testschemaapi_shard1_replica1: ERROR: [doc=2] unknown field 'myNewField1'
	at org.apache.solr.client.solrj.impl.HttpSolrClient.executeMethod(HttpSolrClient.java:590)
	at org.apache.solr.client.solrj.impl.HttpSolrClient.request(HttpSolrClient.java:259)
	at org.apache.solr.client.solrj.impl.HttpSolrClient.request(HttpSolrClient.java:248)
	at org.apache.solr.client.solrj.impl.LBHttpSolrClient.doRequest(LBHttpSolrClient.java:404)
	at org.apache.solr.client.solrj.impl.LBHttpSolrClient.request(LBHttpSolrClient.java:357)
	at org.apache.solr.client.solrj.impl.CloudSolrClient.lambda$directUpdate$0(CloudSolrClient.java:674)
	at java.util.concurrent.FutureTask.run(FutureTask.java:266)
	at org.apache.solr.common.util.ExecutorUtil$MDCAwareThreadPoolExecutor.lambda$execute$0(ExecutorUtil.java:229)
	at java.util.concurrent.ThreadPoolExecutor.runWorker(ThreadPoolExecutor.java:1142)
	at java.util.concurrent.ThreadPoolExecutor$Worker.run(ThreadPoolExecutor.java:617)
	... 1 more




Build Log:
[...truncated 12240 lines...]
   [junit4] Suite: org.apache.solr.schema.TestManagedSchemaAPI
   [junit4]   2> Creating dataDir: /home/jenkins/workspace/Lucene-Solr-6.x-Linux/solr/build/solr-core/test/J0/temp/solr.schema.TestManagedSchemaAPI_89C812C3487E6EEC-001/init-core-data-001
   [junit4]   2> 2619033 INFO  (SUITE-TestManagedSchemaAPI-seed#[89C812C3487E6EEC]-worker) [    ] o.a.s.SolrTestCaseJ4 Randomized ssl (false) and clientAuth (false)
   [junit4]   2> 2619036 INFO  (SUITE-TestManagedSchemaAPI-seed#[89C812C3487E6EEC]-worker) [    ] o.a.s.c.ZkTestServer STARTING ZK TEST SERVER
   [junit4]   2> 2619036 INFO  (Thread-5953) [    ] o.a.s.c.ZkTestServer client port:0.0.0.0/0.0.0.0:0
   [junit4]   2> 2619036 INFO  (Thread-5953) [    ] o.a.s.c.ZkTestServer Starting server
   [junit4]   2> 2619136 INFO  (SUITE-TestManagedSchemaAPI-seed#[89C812C3487E6EEC]-worker) [    ] o.a.s.c.ZkTestServer start zk server on port:44503
   [junit4]   2> 2619136 INFO  (SUITE-TestManagedSchemaAPI-seed#[89C812C3487E6EEC]-worker) [    ] o.a.s.c.c.SolrZkClient Using default ZkCredentialsProvider
   [junit4]   2> 2619137 INFO  (SUITE-TestManagedSchemaAPI-seed#[89C812C3487E6EEC]-worker) [    ] o.a.s.c.c.ConnectionManager Waiting for client to connect to ZooKeeper
   [junit4]   2> 2619143 INFO  (zkCallback-2669-thread-1) [    ] o.a.s.c.c.ConnectionManager Watcher org.apache.solr.common.cloud.ConnectionManager@1fd41bd name:ZooKeeperConnection Watcher:127.0.0.1:44503 got event WatchedEvent state:SyncConnected type:None path:null path:null type:None
   [junit4]   2> 2619143 INFO  (SUITE-TestManagedSchemaAPI-seed#[89C812C3487E6EEC]-worker) [    ] o.a.s.c.c.ConnectionManager Client is connected to ZooKeeper
   [junit4]   2> 2619143 INFO  (SUITE-TestManagedSchemaAPI-seed#[89C812C3487E6EEC]-worker) [    ] o.a.s.c.c.SolrZkClient Using default ZkACLProvider
   [junit4]   2> 2619143 INFO  (SUITE-TestManagedSchemaAPI-seed#[89C812C3487E6EEC]-worker) [    ] o.a.s.c.c.SolrZkClient makePath: /solr/solr.xml
   [junit4]   2> 2619148 INFO  (jetty-launcher-2668-thread-1) [    ] o.e.j.s.Server jetty-9.3.8.v20160314
   [junit4]   2> 2619148 INFO  (jetty-launcher-2668-thread-2) [    ] o.e.j.s.Server jetty-9.3.8.v20160314
   [junit4]   2> 2619149 INFO  (jetty-launcher-2668-thread-2) [    ] o.e.j.s.h.ContextHandler Started o.e.j.s.ServletContextHandler@f1a313{/solr,null,AVAILABLE}
   [junit4]   2> 2619150 INFO  (jetty-launcher-2668-thread-2) [    ] o.e.j.s.ServerConnector Started ServerConnector@13c25f6{HTTP/1.1,[http/1.1]}{127.0.0.1:39337}
   [junit4]   2> 2619150 INFO  (jetty-launcher-2668-thread-2) [    ] o.e.j.s.Server Started @2620757ms
   [junit4]   2> 2619150 INFO  (jetty-launcher-2668-thread-2) [    ] o.a.s.c.s.e.JettySolrRunner Jetty properties: {hostContext=/solr, hostPort=39337}
   [junit4]   2> 2619150 INFO  (jetty-launcher-2668-thread-2) [    ] o.a.s.s.SolrDispatchFilter SolrDispatchFilter.init(): sun.misc.Launcher$AppClassLoader@1d16e93
   [junit4]   2> 2619150 INFO  (jetty-launcher-2668-thread-2) [    ] o.a.s.c.SolrResourceLoader new SolrResourceLoader for directory: '/home/jenkins/workspace/Lucene-Solr-6.x-Linux/solr/build/solr-core/test/J0/temp/solr.schema.TestManagedSchemaAPI_89C812C3487E6EEC-001/tempDir-001/node2'
   [junit4]   2> 2619150 INFO  (jetty-launcher-2668-thread-2) [    ] o.a.s.c.SolrResourceLoader JNDI not configured for solr (NoInitialContextEx)
   [junit4]   2> 2619150 INFO  (jetty-launcher-2668-thread-2) [    ] o.a.s.c.SolrResourceLoader solr home defaulted to 'solr/' (could not find system property or JNDI)
   [junit4]   2> 2619150 INFO  (jetty-launcher-2668-thread-2) [    ] o.a.s.c.c.SolrZkClient Using default ZkCredentialsProvider
   [junit4]   2> 2619155 INFO  (jetty-launcher-2668-thread-2) [    ] o.a.s.c.c.ConnectionManager Waiting for client to connect to ZooKeeper
   [junit4]   2> 2619155 INFO  (zkCallback-2670-thread-1) [    ] o.a.s.c.c.ConnectionManager Watcher org.apache.solr.common.cloud.ConnectionManager@481be3 name:ZooKeeperConnection Watcher:127.0.0.1:44503/solr got event WatchedEvent state:SyncConnected type:None path:null path:null type:None
   [junit4]   2> 2619155 INFO  (jetty-launcher-2668-thread-2) [    ] o.a.s.c.c.ConnectionManager Client is connected to ZooKeeper
   [junit4]   2> 2619155 INFO  (jetty-launcher-2668-thread-1) [    ] o.e.j.s.h.ContextHandler Started o.e.j.s.ServletContextHandler@c04663{/solr,null,AVAILABLE}
   [junit4]   2> 2619155 INFO  (jetty-launcher-2668-thread-2) [    ] o.a.s.c.c.SolrZkClient Using default ZkACLProvider
   [junit4]   2> 2619155 INFO  (jetty-launcher-2668-thread-1) [    ] o.e.j.s.ServerConnector Started ServerConnector@10adc7b{HTTP/1.1,[http/1.1]}{127.0.0.1:46849}
   [junit4]   2> 2619155 INFO  (jetty-launcher-2668-thread-2) [    ] o.a.s.s.SolrDispatchFilter solr.xml found in ZooKeeper. Loading...
   [junit4]   2> 2619155 INFO  (jetty-launcher-2668-thread-1) [    ] o.e.j.s.Server Started @2620763ms
   [junit4]   2> 2619156 INFO  (jetty-launcher-2668-thread-1) [    ] o.a.s.c.s.e.JettySolrRunner Jetty properties: {hostContext=/solr, hostPort=46849}
   [junit4]   2> 2619156 INFO  (jetty-launcher-2668-thread-1) [    ] o.a.s.s.SolrDispatchFilter SolrDispatchFilter.init(): sun.misc.Launcher$AppClassLoader@1d16e93
   [junit4]   2> 2619156 INFO  (jetty-launcher-2668-thread-1) [    ] o.a.s.c.SolrResourceLoader new SolrResourceLoader for directory: '/home/jenkins/workspace/Lucene-Solr-6.x-Linux/solr/build/solr-core/test/J0/temp/solr.schema.TestManagedSchemaAPI_89C812C3487E6EEC-001/tempDir-001/node1'
   [junit4]   2> 2619156 INFO  (jetty-launcher-2668-thread-1) [    ] o.a.s.c.SolrResourceLoader JNDI not configured for solr (NoInitialContextEx)
   [junit4]   2> 2619156 INFO  (jetty-launcher-2668-thread-1) [    ] o.a.s.c.SolrResourceLoader solr home defaulted to 'solr/' (could not find system property or JNDI)
   [junit4]   2> 2619157 INFO  (jetty-launcher-2668-thread-1) [    ] o.a.s.c.c.SolrZkClient Using default ZkCredentialsProvider
   [junit4]   2> 2619157 INFO  (jetty-launcher-2668-thread-1) [    ] o.a.s.c.c.ConnectionManager Waiting for client to connect to ZooKeeper
   [junit4]   2> 2619168 INFO  (zkCallback-2671-thread-1) [    ] o.a.s.c.c.ConnectionManager Watcher org.apache.solr.common.cloud.ConnectionManager@1c69d6f name:ZooKeeperConnection Watcher:127.0.0.1:44503/solr got event WatchedEvent state:SyncConnected type:None path:null path:null type:None
   [junit4]   2> 2619168 INFO  (jetty-launcher-2668-thread-2) [    ] o.a.s.c.CorePropertiesLocator Config-defined core root directory: /home/jenkins/workspace/Lucene-Solr-6.x-Linux/solr/build/solr-core/test/J0/temp/solr.schema.TestManagedSchemaAPI_89C812C3487E6EEC-001/tempDir-001/node2/.
   [junit4]   2> 2619169 INFO  (jetty-launcher-2668-thread-2) [    ] o.a.s.c.CoreContainer New CoreContainer 18769436
   [junit4]   2> 2619169 INFO  (jetty-launcher-2668-thread-2) [    ] o.a.s.c.CoreContainer Loading cores into CoreContainer [instanceDir=/home/jenkins/workspace/Lucene-Solr-6.x-Linux/solr/build/solr-core/test/J0/temp/solr.schema.TestManagedSchemaAPI_89C812C3487E6EEC-001/tempDir-001/node2]
   [junit4]   2> 2619169 WARN  (jetty-launcher-2668-thread-2) [    ] o.a.s.c.CoreContainer Couldn't add files from /home/jenkins/workspace/Lucene-Solr-6.x-Linux/solr/build/solr-core/test/J0/temp/solr.schema.TestManagedSchemaAPI_89C812C3487E6EEC-001/tempDir-001/node2/lib to classpath: /home/jenkins/workspace/Lucene-Solr-6.x-Linux/solr/build/solr-core/test/J0/temp/solr.schema.TestManagedSchemaAPI_89C812C3487E6EEC-001/tempDir-001/node2/lib
   [junit4]   2> 2619169 INFO  (jetty-launcher-2668-thread-2) [    ] o.a.s.h.c.HttpShardHandlerFactory created with socketTimeout : 90000,urlScheme : ,connTimeout : 15000,maxConnectionsPerHost : 20,maxConnections : 10000,corePoolSize : 0,maximumPoolSize : 2147483647,maxThreadIdleTime : 5,sizeOfQueue : -1,fairnessPolicy : false,useRetries : false,
   [junit4]   2> 2619172 INFO  (jetty-launcher-2668-thread-2) [    ] o.a.s.u.UpdateShardHandler Creating UpdateShardHandler HTTP client with params: socketTimeout=340000&connTimeout=45000&retry=true
   [junit4]   2> 2619172 INFO  (jetty-launcher-2668-thread-2) [    ] o.a.s.l.LogWatcher SLF4J impl is org.slf4j.impl.Log4jLoggerFactory
   [junit4]   2> 2619172 INFO  (jetty-launcher-2668-thread-2) [    ] o.a.s.l.LogWatcher Registering Log Listener [Log4j (org.slf4j.impl.Log4jLoggerFactory)]
   [junit4]   2> 2619173 INFO  (jetty-launcher-2668-thread-2) [    ] o.a.s.c.ZkContainer Zookeeper client=127.0.0.1:44503/solr
   [junit4]   2> 2619173 INFO  (jetty-launcher-2668-thread-2) [    ] o.a.s.c.ZkController zkHost includes chroot
   [junit4]   2> 2619173 INFO  (jetty-launcher-2668-thread-2) [    ] o.a.s.c.c.SolrZkClient Using default ZkCredentialsProvider
   [junit4]   2> 2619173 INFO  (jetty-launcher-2668-thread-2) [    ] o.a.s.c.c.ConnectionManager Waiting for client to connect to ZooKeeper
   [junit4]   2> 2619175 INFO  (jetty-launcher-2668-thread-1) [    ] o.a.s.c.c.ConnectionManager Client is connected to ZooKeeper
   [junit4]   2> 2619175 INFO  (jetty-launcher-2668-thread-1) [    ] o.a.s.c.c.SolrZkClient Using default ZkACLProvider
   [junit4]   2> 2619176 INFO  (jetty-launcher-2668-thread-1) [    ] o.a.s.s.SolrDispatchFilter solr.xml found in ZooKeeper. Loading...
   [junit4]   2> 2619176 INFO  (zkCallback-2674-thread-1) [    ] o.a.s.c.c.ConnectionManager Watcher org.apache.solr.common.cloud.ConnectionManager@cadcbf name:ZooKeeperConnection Watcher:127.0.0.1:44503 got event WatchedEvent state:SyncConnected type:None path:null path:null type:None
   [junit4]   2> 2619176 INFO  (jetty-launcher-2668-thread-2) [    ] o.a.s.c.c.ConnectionManager Client is connected to ZooKeeper
   [junit4]   2> 2619176 INFO  (jetty-launcher-2668-thread-2) [    ] o.a.s.c.c.SolrZkClient Using default ZkACLProvider
   [junit4]   2> 2619178 INFO  (jetty-launcher-2668-thread-2) [n:127.0.0.1:39337_solr    ] o.a.s.c.ZkController Added new OnReconnect listener org.apache.solr.cloud.ZkController$$Lambda$28/2949003@1473b2a
   [junit4]   2> 2619178 INFO  (jetty-launcher-2668-thread-2) [n:127.0.0.1:39337_solr    ] o.a.s.c.c.ConnectionManager Waiting for client to connect to ZooKeeper
   [junit4]   2> 2619179 INFO  (jetty-launcher-2668-thread-1) [    ] o.a.s.c.CorePropertiesLocator Config-defined core root directory: /home/jenkins/workspace/Lucene-Solr-6.x-Linux/solr/build/solr-core/test/J0/temp/solr.schema.TestManagedSchemaAPI_89C812C3487E6EEC-001/tempDir-001/node1/.
   [junit4]   2> 2619179 INFO  (jetty-launcher-2668-thread-1) [    ] o.a.s.c.CoreContainer New CoreContainer 32864414
   [junit4]   2> 2619179 INFO  (jetty-launcher-2668-thread-1) [    ] o.a.s.c.CoreContainer Loading cores into CoreContainer [instanceDir=/home/jenkins/workspace/Lucene-Solr-6.x-Linux/solr/build/solr-core/test/J0/temp/solr.schema.TestManagedSchemaAPI_89C812C3487E6EEC-001/tempDir-001/node1]
   [junit4]   2> 2619179 WARN  (jetty-launcher-2668-thread-1) [    ] o.a.s.c.CoreContainer Couldn't add files from /home/jenkins/workspace/Lucene-Solr-6.x-Linux/solr/build/solr-core/test/J0/temp/solr.schema.TestManagedSchemaAPI_89C812C3487E6EEC-001/tempDir-001/node1/lib to classpath: /home/jenkins/workspace/Lucene-Solr-6.x-Linux/solr/build/solr-core/test/J0/temp/solr.schema.TestManagedSchemaAPI_89C812C3487E6EEC-001/tempDir-001/node1/lib
   [junit4]   2> 2619180 INFO  (jetty-launcher-2668-thread-1) [    ] o.a.s.h.c.HttpShardHandlerFactory created with socketTimeout : 90000,urlScheme : ,connTimeout : 15000,maxConnectionsPerHost : 20,maxConnections : 10000,corePoolSize : 0,maximumPoolSize : 2147483647,maxThreadIdleTime : 5,sizeOfQueue : -1,fairnessPolicy : false,useRetries : false,
   [junit4]   2> 2619181 INFO  (jetty-launcher-2668-thread-1) [    ] o.a.s.u.UpdateShardHandler Creating UpdateShardHandler HTTP client with params: socketTimeout=340000&connTimeout=45000&retry=true
   [junit4]   2> 2619181 INFO  (jetty-launcher-2668-thread-1) [    ] o.a.s.l.LogWatcher SLF4J impl is org.slf4j.impl.Log4jLoggerFactory
   [junit4]   2> 2619181 INFO  (jetty-launcher-2668-thread-1) [    ] o.a.s.l.LogWatcher Registering Log Listener [Log4j (org.slf4j.impl.Log4jLoggerFactory)]
   [junit4]   2> 2619181 INFO  (jetty-launcher-2668-thread-1) [    ] o.a.s.c.ZkContainer Zookeeper client=127.0.0.1:44503/solr
   [junit4]   2> 2619181 INFO  (jetty-launcher-2668-thread-1) [    ] o.a.s.c.ZkController zkHost includes chroot
   [junit4]   2> 2619181 INFO  (jetty-launcher-2668-thread-1) [    ] o.a.s.c.c.SolrZkClient Using default ZkCredentialsProvider
   [junit4]   2> 2619182 INFO  (jetty-launcher-2668-thread-1) [    ] o.a.s.c.c.ConnectionManager Waiting for client to connect to ZooKeeper
   [junit4]   2> 2619179 INFO  (zkCallback-2675-thread-1-processing-n:127.0.0.1:39337_solr) [n:127.0.0.1:39337_solr    ] o.a.s.c.c.ConnectionManager Watcher org.apache.solr.common.cloud.ConnectionManager@1c79d4a name:ZooKeeperConnection Watcher:127.0.0.1:44503/solr got event WatchedEvent state:SyncConnected type:None path:null path:null type:None
   [junit4]   2> 2619184 INFO  (zkCallback-2678-thread-1) [    ] o.a.s.c.c.ConnectionManager Watcher org.apache.solr.common.cloud.ConnectionManager@1954e1a name:ZooKeeperConnection Watcher:127.0.0.1:44503 got event WatchedEvent state:SyncConnected type:None path:null path:null type:None
   [junit4]   2> 2619186 INFO  (jetty-launcher-2668-thread-1) [    ] o.a.s.c.c.ConnectionManager Client is connected to ZooKeeper
   [junit4]   2> 2619187 INFO  (jetty-launcher-2668-thread-1) [    ] o.a.s.c.c.SolrZkClient Using default ZkACLProvider
   [junit4]   2> 2619187 INFO  (jetty-launcher-2668-thread-2) [n:127.0.0.1:39337_solr    ] o.a.s.c.c.ConnectionManager Client is connected to ZooKeeper
   [junit4]   2> 2619187 INFO  (jetty-launcher-2668-thread-1) [n:127.0.0.1:46849_solr    ] o.a.s.c.ZkController Added new OnReconnect listener org.apache.solr.cloud.ZkController$$Lambda$28/2949003@9b618e
   [junit4]   2> 2619188 INFO  (jetty-launcher-2668-thread-2) [n:127.0.0.1:39337_solr    ] o.a.s.c.c.SolrZkClient makePath: /overseer/queue
   [junit4]   2> 2619188 INFO  (jetty-launcher-2668-thread-1) [n:127.0.0.1:46849_solr    ] o.a.s.c.c.ConnectionManager Waiting for client to connect to ZooKeeper
   [junit4]   2> 2619188 INFO  (zkCallback-2679-thread-1-processing-n:127.0.0.1:46849_solr) [n:127.0.0.1:46849_solr    ] o.a.s.c.c.ConnectionManager Watcher org.apache.solr.common.cloud.ConnectionManager@1a590ee name:ZooKeeperConnection Watcher:127.0.0.1:44503/solr got event WatchedEvent state:SyncConnected type:None path:null path:null type:None
   [junit4]   2> 2619188 INFO  (jetty-launcher-2668-thread-2) [n:127.0.0.1:39337_solr    ] o.a.s.c.c.SolrZkClient makePath: /overseer/collection-queue-work
   [junit4]   2> 2619189 INFO  (jetty-launcher-2668-thread-1) [n:127.0.0.1:46849_solr    ] o.a.s.c.c.ConnectionManager Client is connected to ZooKeeper
   [junit4]   2> 2619189 INFO  (jetty-launcher-2668-thread-2) [n:127.0.0.1:39337_solr    ] o.a.s.c.c.SolrZkClient makePath: /overseer/collection-map-running
   [junit4]   2> 2619190 INFO  (jetty-launcher-2668-thread-1) [n:127.0.0.1:46849_solr    ] o.a.s.c.c.SolrZkClient makePath: /overseer/collection-map-running
   [junit4]   2> 2619190 INFO  (jetty-launcher-2668-thread-2) [n:127.0.0.1:39337_solr    ] o.a.s.c.c.SolrZkClient makePath: /overseer/collection-map-completed
   [junit4]   2> 2619190 INFO  (jetty-launcher-2668-thread-1) [n:127.0.0.1:46849_solr    ] o.a.s.c.c.SolrZkClient makePath: /overseer/collection-map-completed
   [junit4]   2> 2619192 INFO  (jetty-launcher-2668-thread-2) [n:127.0.0.1:39337_solr    ] o.a.s.c.c.SolrZkClient makePath: /overseer/collection-map-failure
   [junit4]   2> 2619193 INFO  (jetty-launcher-2668-thread-1) [n:127.0.0.1:46849_solr    ] o.a.s.c.c.SolrZkClient makePath: /overseer/collection-map-failure
   [junit4]   2> 2619193 INFO  (jetty-launcher-2668-thread-1) [n:127.0.0.1:46849_solr    ] o.a.s.c.c.SolrZkClient makePath: /live_nodes
   [junit4]   2> 2619193 INFO  (jetty-launcher-2668-thread-2) [n:127.0.0.1:39337_solr    ] o.a.s.c.c.SolrZkClient makePath: /live_nodes
   [junit4]   2> 2619193 INFO  (jetty-launcher-2668-thread-2) [n:127.0.0.1:39337_solr    ] o.a.s.c.c.SolrZkClient makePath: /collections
   [junit4]   2> 2619193 INFO  (jetty-launcher-2668-thread-1) [n:127.0.0.1:46849_solr    ] o.a.s.c.c.SolrZkClient makePath: /collections
   [junit4]   2> 2619194 INFO  (jetty-launcher-2668-thread-1) [n:127.0.0.1:46849_solr    ] o.a.s.c.c.SolrZkClient makePath: /aliases.json
   [junit4]   2> 2619194 INFO  (jetty-launcher-2668-thread-2) [n:127.0.0.1:39337_solr    ] o.a.s.c.c.SolrZkClient makePath: /aliases.json
   [junit4]   2> 2619196 INFO  (jetty-launcher-2668-thread-2) [n:127.0.0.1:39337_solr    ] o.a.s.c.c.SolrZkClient makePath: /clusterstate.json
   [junit4]   2> 2619196 INFO  (jetty-launcher-2668-thread-1) [n:127.0.0.1:46849_solr    ] o.a.s.c.c.SolrZkClient makePath: /clusterstate.json
   [junit4]   2> 2619197 INFO  (jetty-launcher-2668-thread-2) [n:127.0.0.1:39337_solr    ] o.a.s.c.c.SolrZkClient makePath: /security.json
   [junit4]   2> 2619197 INFO  (jetty-launcher-2668-thread-1) [n:127.0.0.1:46849_solr    ] o.a.s.c.c.SolrZkClient makePath: /security.json
   [junit4]   2> 2619197 INFO  (jetty-launcher-2668-thread-2) [n:127.0.0.1:39337_solr    ] o.a.s.c.c.ZkStateReader Updating cluster state from ZooKeeper... 
   [junit4]   2> 2619197 INFO  (jetty-launcher-2668-thread-1) [n:127.0.0.1:46849_solr    ] o.a.s.c.c.ZkStateReader Updating cluster state from ZooKeeper... 
   [junit4]   2> 2619197 INFO  (jetty-launcher-2668-thread-2) [n:127.0.0.1:39337_solr    ] o.a.s.c.c.ZkStateReader Loaded empty cluster properties
   [junit4]   2> 2619198 INFO  (jetty-launcher-2668-thread-1) [n:127.0.0.1:46849_solr    ] o.a.s.c.c.ZkStateReader Loaded empty cluster properties
   [junit4]   2> 2619198 INFO  (jetty-launcher-2668-thread-1) [n:127.0.0.1:46849_solr    ] o.a.s.c.c.ZkStateReader Updated live nodes from ZooKeeper... (0) -> (0)
   [junit4]   2> 2619198 INFO  (jetty-launcher-2668-thread-2) [n:127.0.0.1:39337_solr    ] o.a.s.c.c.ZkStateReader Updated live nodes from ZooKeeper... (0) -> (0)
   [junit4]   2> 2619199 INFO  (jetty-launcher-2668-thread-1) [n:127.0.0.1:46849_solr    ] o.a.s.c.c.SolrZkClient makePath: /overseer_elect
   [junit4]   2> 2619199 INFO  (jetty-launcher-2668-thread-2) [n:127.0.0.1:39337_solr    ] o.a.s.c.c.SolrZkClient makePath: /overseer_elect
   [junit4]   2> 2619199 INFO  (jetty-launcher-2668-thread-1) [n:127.0.0.1:46849_solr    ] o.a.s.c.c.SolrZkClient makePath: /overseer_elect/election
   [junit4]   2> 2619199 INFO  (jetty-launcher-2668-thread-2) [n:127.0.0.1:39337_solr    ] o.a.s.c.c.SolrZkClient makePath: /overseer_elect/election
   [junit4]   2> 2619200 INFO  (jetty-launcher-2668-thread-2) [n:127.0.0.1:39337_solr    ] o.a.s.c.Overseer Overseer (id=null) closing
   [junit4]   2> 2619200 INFO  (jetty-launcher-2668-thread-1) [n:127.0.0.1:46849_solr    ] o.a.s.c.Overseer Overseer (id=null) closing
   [junit4]   2> 2619200 INFO  (jetty-launcher-2668-thread-2) [n:127.0.0.1:39337_solr    ] o.a.s.c.LeaderElector Joined leadership election with path: /overseer_elect/election/95898918437388292-127.0.0.1:39337_solr-n_0000000000
   [junit4]   2> 2619200 INFO  (jetty-launcher-2668-thread-1) [n:127.0.0.1:46849_solr    ] o.a.s.c.LeaderElector Joined leadership election with path: /overseer_elect/election/95898918437388294-127.0.0.1:46849_solr-n_0000000001
   [junit4]   2> 2619200 INFO  (jetty-launcher-2668-thread-2) [n:127.0.0.1:39337_solr    ] o.a.s.c.OverseerElectionContext I am going to be the leader 127.0.0.1:39337_solr
   [junit4]   2> 2619200 INFO  (jetty-launcher-2668-thread-1) [n:127.0.0.1:46849_solr    ] o.a.s.c.LeaderElector Watching path /overseer_elect/election/95898918437388292-127.0.0.1:39337_solr-n_0000000000 to know if I could be the leader
   [junit4]   2> 2619200 INFO  (jetty-launcher-2668-thread-2) [n:127.0.0.1:39337_solr    ] o.a.s.c.c.SolrZkClient makePath: /overseer_elect/leader
   [junit4]   2> 2619201 INFO  (jetty-launcher-2668-thread-1) [n:127.0.0.1:46849_solr    ] o.a.s.c.ZkController Register node as live in ZooKeeper:/live_nodes/127.0.0.1:46849_solr
   [junit4]   2> 2619201 INFO  (jetty-launcher-2668-thread-1) [n:127.0.0.1:46849_solr    ] o.a.s.c.c.SolrZkClient makePath: /live_nodes/127.0.0.1:46849_solr
   [junit4]   2> 2619201 INFO  (jetty-launcher-2668-thread-2) [n:127.0.0.1:39337_solr    ] o.a.s.c.Overseer Overseer (id=95898918437388292-127.0.0.1:39337_solr-n_0000000000) starting
   [junit4]   2> 2619201 INFO  (zkCallback-2675-thread-1-processing-n:127.0.0.1:39337_solr) [n:127.0.0.1:39337_solr    ] o.a.s.c.c.ZkStateReader A live node change: [WatchedEvent state:SyncConnected type:NodeChildrenChanged path:/live_nodes], has occurred - updating... (live nodes size: [0])
   [junit4]   2> 2619202 INFO  (zkCallback-2679-thread-1-processing-n:127.0.0.1:46849_solr) [n:127.0.0.1:46849_solr    ] o.a.s.c.c.ZkStateReader A live node change: [WatchedEvent state:SyncConnected type:NodeChildrenChanged path:/live_nodes], has occurred - updating... (live nodes size: [0])
   [junit4]   2> 2619202 INFO  (zkCallback-2675-thread-1-processing-n:127.0.0.1:39337_solr) [n:127.0.0.1:39337_solr    ] o.a.s.c.c.ZkStateReader Updated live nodes from ZooKeeper... (0) -> (1)
   [junit4]   2> 2619203 INFO  (zkCallback-2679-thread-1-processing-n:127.0.0.1:46849_solr) [n:127.0.0.1:46849_solr    ] o.a.s.c.c.ZkStateReader Updated live nodes from ZooKeeper... (0) -> (1)
   [junit4]   2> 2619203 INFO  (jetty-launcher-2668-thread-2) [n:127.0.0.1:39337_solr    ] o.a.s.c.c.SolrZkClient makePath: /overseer/queue-work
   [junit4]   2> 2619209 INFO  (jetty-launcher-2668-thread-2) [n:127.0.0.1:39337_solr    ] o.a.s.c.OverseerAutoReplicaFailoverThread Starting OverseerAutoReplicaFailoverThread autoReplicaFailoverWorkLoopDelay=10000 autoReplicaFailoverWaitAfterExpiration=30000 autoReplicaFailoverBadNodeExpiration=60000
   [junit4]   2> 2619209 INFO  (OverseerCollectionConfigSetProcessor-95898918437388292-127.0.0.1:39337_solr-n_0000000000) [n:127.0.0.1:39337_solr    ] o.a.s.c.OverseerTaskProcessor Process current queue of overseer operations
   [junit4]   2> 2619209 INFO  (jetty-launcher-2668-thread-2) [n:127.0.0.1:39337_solr    ] o.a.s.c.ZkController Publish node=127.0.0.1:39337_solr as DOWN
   [junit4]   2> 2619210 INFO  (OverseerStateUpdate-95898918437388292-127.0.0.1:39337_solr-n_0000000000) [n:127.0.0.1:39337_solr    ] o.a.s.c.Overseer Starting to work on the main queue
   [junit4]   2> 2619211 INFO  (OverseerStateUpdate-95898918437388292-127.0.0.1:39337_solr-n_0000000000) [n:127.0.0.1:39337_solr    ] o.a.s.c.c.ZkStateReader Updated live nodes from ZooKeeper... (1) -> (1)
   [junit4]   2> 2619211 INFO  (OverseerStateUpdate-95898918437388292-127.0.0.1:39337_solr-n_0000000000) [n:127.0.0.1:39337_solr    ] o.a.s.c.Overseer processMessage: queueSize: 1, message = {
   [junit4]   2>   "operation":"downnode",
   [junit4]   2>   "node_name":"127.0.0.1:39337_solr"} current state version: 0
   [junit4]   2> 2619211 INFO  (OverseerStateUpdate-95898918437388292-127.0.0.1:39337_solr-n_0000000000) [n:127.0.0.1:39337_solr    ] o.a.s.c.o.NodeMutator DownNode state invoked for node: 127.0.0.1:39337_solr
   [junit4]   2> 2619220 INFO  (jetty-launcher-2668-thread-1) [n:127.0.0.1:46849_solr    ] o.a.s.c.CoreContainer Security conf doesn't exist. Skipping setup for authorization module.
   [junit4]   2> 2619220 INFO  (jetty-launcher-2668-thread-1) [n:127.0.0.1:46849_solr    ] o.a.s.c.CoreContainer No authentication plugin used.
   [junit4]   2> 2619220 INFO  (jetty-launcher-2668-thread-1) [n:127.0.0.1:46849_solr    ] o.a.s.c.CorePropertiesLocator Looking for core definitions underneath /home/jenkins/workspace/Lucene-Solr-6.x-Linux/solr/build/solr-core/test/J0/temp/solr.schema.TestManagedSchemaAPI_89C812C3487E6EEC-001/tempDir-001/node1/.
   [junit4]   2> 2619221 INFO  (jetty-launcher-2668-thread-1) [n:127.0.0.1:46849_solr    ] o.a.s.c.CorePropertiesLocator Found 0 core definitions
   [junit4]   2> 2619221 INFO  (jetty-launcher-2668-thread-1) [n:127.0.0.1:46849_solr    ] o.a.s.s.SolrDispatchFilter user.dir=/home/jenkins/workspace/Lucene-Solr-6.x-Linux/solr/build/solr-core/test/J0
   [junit4]   2> 2619221 INFO  (jetty-launcher-2668-thread-1) [n:127.0.0.1:46849_solr    ] o.a.s.s.SolrDispatchFilter SolrDispatchFilter.init() done
   [junit4]   2> 2620211 INFO  (jetty-launcher-2668-thread-2) [n:127.0.0.1:39337_solr    ] o.a.s.c.ZkController Register node as live in ZooKeeper:/live_nodes/127.0.0.1:39337_solr
   [junit4]   2> 2620211 INFO  (jetty-launcher-2668-thread-2) [n:127.0.0.1:39337_solr    ] o.a.s.c.c.SolrZkClient makePath: /live_nodes/127.0.0.1:39337_solr
   [junit4]   2> 2620212 INFO  (zkCallback-2679-thread-1-processing-n:127.0.0.1:46849_solr) [n:127.0.0.1:46849_solr    ] o.a.s.c.c.ZkStateReader A live node change: [WatchedEvent state:SyncConnected type:NodeChildrenChanged path:/live_nodes], has occurred - updating... (live nodes size: [1])
   [junit4]   2> 2620212 INFO  (zkCallback-2675-thread-1-processing-n:127.0.0.1:39337_solr) [n:127.0.0.1:39337_solr    ] o.a.s.c.c.ZkStateReader A live node change: [WatchedEvent state:SyncConnected type:NodeChildrenChanged path:/live_nodes], has occurred - updating... (live nodes size: [1])
   [junit4]   2> 2620212 INFO  (zkCallback-2679-thread-1-processing-n:127.0.0.1:46849_solr) [n:127.0.0.1:46849_solr    ] o.a.s.c.c.ZkStateReader Updated live nodes from ZooKeeper... (1) -> (2)
   [junit4]   2> 2620212 INFO  (zkCallback-2675-thread-1-processing-n:127.0.0.1:39337_solr) [n:127.0.0.1:39337_solr    ] o.a.s.c.c.ZkStateReader Updated live nodes from ZooKeeper... (1) -> (2)
   [junit4]   2> 2620231 INFO  (jetty-launcher-2668-thread-2) [n:127.0.0.1:39337_solr    ] o.a.s.c.CoreContainer Security conf doesn't exist. Skipping setup for authorization module.
   [junit4]   2> 2620231 INFO  (jetty-launcher-2668-thread-2) [n:127.0.0.1:39337_solr    ] o.a.s.c.CoreContainer No authentication plugin used.
   [junit4]   2> 2620232 INFO  (jetty-launcher-2668-thread-2) [n:127.0.0.1:39337_solr    ] o.a.s.c.CorePropertiesLocator Looking for core definitions underneath /home/jenkins/workspace/Lucene-Solr-6.x-Linux/solr/build/solr-core/test/J0/temp/solr.schema.TestManagedSchemaAPI_89C812C3487E6EEC-001/tempDir-001/node2/.
   [junit4]   2> 2620232 INFO  (jetty-launcher-2668-thread-2) [n:127.0.0.1:39337_solr    ] o.a.s.c.CorePropertiesLocator Found 0 core definitions
   [junit4]   2> 2620232 INFO  (jetty-launcher-2668-thread-2) [n:127.0.0.1:39337_solr    ] o.a.s.s.SolrDispatchFilter user.dir=/home/jenkins/workspace/Lucene-Solr-6.x-Linux/solr/build/solr-core/test/J0
   [junit4]   2> 2620232 INFO  (jetty-launcher-2668-thread-2) [n:127.0.0.1:39337_solr    ] o.a.s.s.SolrDispatchFilter SolrDispatchFilter.init() done
   [junit4]   2> 2620232 INFO  (SUITE-TestManagedSchemaAPI-seed#[89C812C3487E6EEC]-worker) [    ] o.a.s.c.c.SolrZkClient Using default ZkCredentialsProvider
   [junit4]   2> 2620233 INFO  (SUITE-TestManagedSchemaAPI-seed#[89C812C3487E6EEC]-worker) [    ] o.a.s.c.c.ConnectionManager Waiting for client to connect to ZooKeeper
   [junit4]   2> 2620233 INFO  (zkCallback-2682-thread-1) [    ] o.a.s.c.c.ConnectionManager Watcher org.apache.solr.common.cloud.ConnectionManager@4c6944 name:ZooKeeperConnection Watcher:127.0.0.1:44503 got event WatchedEvent state:SyncConnected type:None path:null path:null type:None
   [junit4]   2> 2620233 INFO  (SUITE-TestManagedSchemaAPI-seed#[89C812C3487E6EEC]-worker) [    ] o.a.s.c.c.ConnectionManager Client is connected to ZooKeeper
   [junit4]   2> 2620234 INFO  (SUITE-TestManagedSchemaAPI-seed#[89C812C3487E6EEC]-worker) [    ] o.a.s.c.c.SolrZkClient Using default ZkACLProvider
   [junit4]   2> 2620235 INFO  (SUITE-TestManagedSchemaAPI-seed#[89C812C3487E6EEC]-worker) [    ] o.a.s.c.s.i.CloudSolrClient Final constructed zkHost string: 127.0.0.1:44503/solr
   [junit4]   2> 2620235 INFO  (SUITE-TestManagedSchemaAPI-seed#[89C812C3487E6EEC]-worker) [    ] o.a.s.c.c.SolrZkClient Using default ZkCredentialsProvider
   [junit4]   2> 2620235 INFO  (SUITE-TestManagedSchemaAPI-seed#[89C812C3487E6EEC]-worker) [    ] o.a.s.c.c.ConnectionManager Waiting for client to connect to ZooKeeper
   [junit4]   2> 2620235 INFO  (zkCallback-2685-thread-1) [    ] o.a.s.c.c.ConnectionManager Watcher org.apache.solr.common.cloud.ConnectionManager@18d83d4 name:ZooKeeperConnection Watcher:127.0.0.1:44503/solr got event WatchedEvent state:SyncConnected type:None path:null path:null type:None
   [junit4]   2> 2620236 INFO  (SUITE-TestManagedSchemaAPI-seed#[89C812C3487E6EEC]-worker) [    ] o.a.s.c.c.ConnectionManager Client is connected to ZooKeeper
   [junit4]   2> 2620236 INFO  (SUITE-TestManagedSchemaAPI-seed#[89C812C3487E6EEC]-worker) [    ] o.a.s.c.c.SolrZkClient Using default ZkACLProvider
   [junit4]   2> 2620236 INFO  (SUITE-TestManagedSchemaAPI-seed#[89C812C3487E6EEC]-worker) [    ] o.a.s.c.c.ZkStateReader Updating cluster state from ZooKeeper... 
   [junit4]   2> 2620236 INFO  (SUITE-TestManagedSchemaAPI-seed#[89C812C3487E6EEC]-worker) [    ] o.a.s.c.c.ZkStateReader Loaded empty cluster properties
   [junit4]   2> 2620236 INFO  (SUITE-TestManagedSchemaAPI-seed#[89C812C3487E6EEC]-worker) [    ] o.a.s.c.c.ZkStateReader Updated live nodes from ZooKeeper... (0) -> (2)
   [junit4]   2> 2620237 INFO  (SUITE-TestManagedSchemaAPI-seed#[89C812C3487E6EEC]-worker) [    ] o.a.s.c.c.SolrZkClient makePath: /configs/conf1/solrconfig.xml
   [junit4]   2> 2620238 INFO  (SUITE-TestManagedSchemaAPI-seed#[89C812C3487E6EEC]-worker) [    ] o.a.s.c.c.SolrZkClient makePath: /configs/conf1/managed-schema
   [junit4]   2> 2620248 INFO  (TEST-TestManagedSchemaAPI.test-seed#[89C812C3487E6EEC]) [    ] o.a.s.SolrTestCaseJ4 ###Starting test
   [junit4]   2> 2620249 INFO  (qtp4612621-15839) [n:127.0.0.1:39337_solr    ] o.a.s.h.a.CollectionsHandler Invoked Collection Action :create with params replicationFactor=2&collection.configName=conf1&name=testschemaapi&action=CREATE&numShards=1&wt=javabin&version=2 and sendToOCPQueue=true
   [junit4]   2> 2620251 INFO  (OverseerCollectionConfigSetProcessor-95898918437388292-127.0.0.1:39337_solr-n_0000000000) [n:127.0.0.1:39337_solr    ] o.a.s.c.OverseerTaskProcessor Overseer Collection Message Handler: Get the message id:/overseer/collection-queue-work/qn-0000000000 message:{
   [junit4]   2>   "name":"testschemaapi",
   [junit4]   2>   "fromApi":"true",
   [junit4]   2>   "replicationFactor":"2",
   [junit4]   2>   "collection.configName":"conf1",
   [junit4]   2>   "numShards":"1",
   [junit4]   2>   "stateFormat":"2",
   [junit4]   2>   "operation":"create"}
   [junit4]   2> 2620251 INFO  (OverseerThreadFactory-8436-thread-1-processing-n:127.0.0.1:39337_solr) [n:127.0.0.1:39337_solr    ] o.a.s.c.OverseerCollectionMessageHandler OverseerCollectionMessageHandler.processMessage : create , {
   [junit4]   2>   "name":"testschemaapi",
   [junit4]   2>   "fromApi":"true",
   [junit4]   2>   "replicationFactor":"2",
   [junit4]   2>   "collection.configName":"conf1",
   [junit4]   2>   "numShards":"1",
   [junit4]   2>   "stateFormat":"2",
   [junit4]   2>   "operation":"create"}
   [junit4]   2> 2620251 INFO  (OverseerThreadFactory-8436-thread-1-processing-n:127.0.0.1:39337_solr) [n:127.0.0.1:39337_solr    ] o.a.s.c.OverseerCollectionMessageHandler Create collection testschemaapi
   [junit4]   2> 2620251 INFO  (OverseerThreadFactory-8436-thread-1-processing-n:127.0.0.1:39337_solr) [n:127.0.0.1:39337_solr    ] o.a.s.c.OverseerCollectionMessageHandler creating collections conf node /collections/testschemaapi 
   [junit4]   2> 2620252 INFO  (OverseerThreadFactory-8436-thread-1-processing-n:127.0.0.1:39337_solr) [n:127.0.0.1:39337_solr    ] o.a.s.c.c.SolrZkClient makePath: /collections/testschemaapi
   [junit4]   2> 2620252 INFO  (zkCallback-2679-thread-1-processing-n:127.0.0.1:46849_solr) [n:127.0.0.1:46849_solr    ] o.a.s.c.c.ZkStateReader A collections change: [WatchedEvent state:SyncConnected type:NodeChildrenChanged path:/collections], has occurred - updating...
   [junit4]   2> 2620252 INFO  (zkCallback-2675-thread-1-processing-n:127.0.0.1:39337_solr) [n:127.0.0.1:39337_solr    ] o.a.s.c.c.ZkStateReader A collections change: [WatchedEvent state:SyncConnected type:NodeChildrenChanged path:/collections], has occurred - updating...
   [junit4]   2> 2620252 INFO  (zkCallback-2685-thread-1) [    ] o.a.s.c.c.ZkStateReader A collections change: [WatchedEvent state:SyncConnected type:NodeChildrenChanged path:/collections], has occurred - updating...
   [junit4]   2> 2620253 INFO  (OverseerStateUpdate-95898918437388292-127.0.0.1:39337_solr-n_0000000000) [n:127.0.0.1:39337_solr    ] o.a.s.c.Overseer processMessage: queueSize: 1, message = {
   [junit4]   2>   "name":"testschemaapi",
   [junit4]   2>   "fromApi":"true",
   [junit4]   2>   "replicationFactor":"2",
   [junit4]   2>   "collection.configName":"conf1",
   [junit4]   2>   "numShards":"1",
   [junit4]   2>   "stateFormat":"2",
   [junit4]   2>   "operation":"create"} current state version: 0
   [junit4]   2> 2620253 INFO  (OverseerStateUpdate-95898918437388292-127.0.0.1:39337_solr-n_0000000000) [n:127.0.0.1:39337_solr    ] o.a.s.c.o.ClusterStateMutator building a new cName: testschemaapi
   [junit4]   2> 2620253 INFO  (OverseerStateUpdate-95898918437388292-127.0.0.1:39337_solr-n_0000000000) [n:127.0.0.1:39337_solr    ] o.a.s.c.o.ZkStateWriter going to create_collection /collections/testschemaapi/state.json
   [junit4]   2> 2620353 INFO  (OverseerThreadFactory-8436-thread-1-processing-n:127.0.0.1:39337_solr) [n:127.0.0.1:39337_solr    ] o.a.s.c.OverseerCollectionMessageHandler Creating SolrCores for new collection testschemaapi, shardNames [shard1] , replicationFactor : 2
   [junit4]   2> 2620353 INFO  (OverseerThreadFactory-8436-thread-1-processing-n:127.0.0.1:39337_solr) [n:127.0.0.1:39337_solr    ] o.a.s.c.OverseerCollectionMessageHandler Creating core testschemaapi_shard1_replica2 as part of shard shard1 of collection testschemaapi on 127.0.0.1:46849_solr
   [junit4]   2> 2620353 INFO  (OverseerThreadFactory-8436-thread-1-processing-n:127.0.0.1:39337_solr) [n:127.0.0.1:39337_solr    ] o.a.s.c.OverseerCollectionMessageHandler Creating core testschemaapi_shard1_replica1 as part of shard shard1 of collection testschemaapi on 127.0.0.1:39337_solr
   [junit4]   2> 2620356 INFO  (qtp21759280-15852) [n:127.0.0.1:46849_solr    ] o.a.s.h.a.CoreAdminOperation core create command qt=/admin/cores&collection.configName=conf1&name=testschemaapi_shard1_replica2&action=CREATE&numShards=1&collection=testschemaapi&shard=shard1&wt=javabin&version=2
   [junit4]   2> 2620357 INFO  (qtp21759280-15852) [n:127.0.0.1:46849_solr    ] o.a.s.c.CoreDescriptor Created CoreDescriptor: {name=testschemaapi_shard1_replica2, collection.configName=conf1, config=solrconfig.xml, transient=false, schema=schema.xml, loadOnStartup=true, configSetProperties=configsetprops.json, collection=testschemaapi, numShards=1, dataDir=data/, shard=shard1}
   [junit4]   2> 2620360 INFO  (qtp21759280-15852) [n:127.0.0.1:46849_solr c:testschemaapi s:shard1  x:testschemaapi_shard1_replica2] o.a.s.c.ZkController publishing state=down
   [junit4]   2> 2620360 INFO  (qtp21759280-15852) [n:127.0.0.1:46849_solr c:testschemaapi s:shard1  x:testschemaapi_shard1_replica2] o.a.s.c.ZkController Registering watch for collection testschemaapi
   [junit4]   2> 2620361 INFO  (qtp4612621-15838) [n:127.0.0.1:39337_solr    ] o.a.s.h.a.CoreAdminOperation core create command qt=/admin/cores&collection.configName=conf1&name=testschemaapi_shard1_replica1&action=CREATE&numShards=1&collection=testschemaapi&shard=shard1&wt=javabin&version=2
   [junit4]   2> 2620361 INFO  (qtp21759280-15852) [n:127.0.0.1:46849_solr c:testschemaapi s:shard1  x:testschemaapi_shard1_replica2] o.a.s.c.c.ZkStateReader Add data for [testschemaapi] ver [0]
   [junit4]   2> 2620361 INFO  (qtp21759280-15852) [n:127.0.0.1:46849_solr c:testschemaapi s:shard1  x:testschemaapi_shard1_replica2] o.a.s.c.ZkController look for our core node name
   [junit4]   2> 2620362 INFO  (qtp4612621-15838) [n:127.0.0.1:39337_solr    ] o.a.s.c.CoreDescriptor Created CoreDescriptor: {name=testschemaapi_shard1_replica1, collection.configName=conf1, config=solrconfig.xml, transient=false, schema=schema.xml, loadOnStartup=true, configSetProperties=configsetprops.json, collection=testschemaapi, numShards=1, dataDir=data/, shard=shard1}
   [junit4]   2> 2620362 INFO  (OverseerStateUpdate-95898918437388292-127.0.0.1:39337_solr-n_0000000000) [n:127.0.0.1:39337_solr    ] o.a.s.c.Overseer processMessage: queueSize: 1, message = {
   [junit4]   2>   "core":"testschemaapi_shard1_replica2",
   [junit4]   2>   "roles":null,
   [junit4]   2>   "base_url":"http://127.0.0.1:46849/solr",
   [junit4]   2>   "node_name":"127.0.0.1:46849_solr",
   [junit4]   2>   "numShards":"1",
   [junit4]   2>   "state":"down",
   [junit4]   2>   "shard":"shard1",
   [junit4]   2>   "collection":"testschemaapi",
   [junit4]   2>   "operation":"state"} current state version: 0
   [junit4]   2> 2620363 INFO  (OverseerStateUpdate-95898918437388292-127.0.0.1:39337_solr-n_0000000000) [n:127.0.0.1:39337_solr    ] o.a.s.c.o.ReplicaMutator Update state numShards=1 message={
   [junit4]   2>   "core":"testschemaapi_shard1_replica2",
   [junit4]   2>   "roles":null,
   [junit4]   2>   "base_url":"http://127.0.0.1:46849/solr",
   [junit4]   2>   "node_name":"127.0.0.1:46849_solr",
   [junit4]   2>   "numShards":"1",
   [junit4]   2>   "state":"down",
   [junit4]   2>   "shard":"shard1",
   [junit4]   2>   "collection":"testschemaapi",
   [junit4]   2>   "operation":"state"}
   [junit4]   2> 2620363 INFO  (qtp4612621-15838) [n:127.0.0.1:39337_solr c:testschemaapi s:shard1  x:testschemaapi_shard1_replica1] o.a.s.c.ZkController publishing state=down
   [junit4]   2> 2620364 INFO  (qtp4612621-15838) [n:127.0.0.1:39337_solr c:testschemaapi s:shard1  x:testschemaapi_shard1_replica1] o.a.s.c.ZkController Registering watch for collection testschemaapi
   [junit4]   2> 2620364 INFO  (OverseerStateUpdate-95898918437388292-127.0.0.1:39337_solr-n_0000000000) [n:127.0.0.1:39337_solr    ] o.a.s.c.Overseer processMessage: queueSize: 1, message = {
   [junit4]   2>   "core":"testschemaapi_shard1_replica1",
   [junit4]   2>   "roles":null,
   [junit4]   2>   "base_url":"http://127.0.0.1:39337/solr",
   [junit4]   2>   "node_name":"127.0.0.1:39337_solr",
   [junit4]   2>   "numShards":"1",
   [junit4]   2>   "state":"down",
   [junit4]   2>   "shard":"shard1",
   [junit4]   2>   "collection":"testschemaapi",
   [junit4]   2>   "operation":"state"} current state version: 0
   [junit4]   2> 2620364 INFO  (OverseerStateUpdate-95898918437388292-127.0.0.1:39337_solr-n_0000000000) [n:127.0.0.1:39337_solr    ] o.a.s.c.o.ReplicaMutator Update state numShards=1 message={
   [junit4]   2>   "core":"testschemaapi_shard1_replica1",
   [junit4]   2>   "roles":null,
   [junit4]   2>   "base_url":"http://127.0.0.1:39337/solr",
   [junit4]   2>   "node_name":"127.0.0.1:39337_solr",
   [junit4]   2>   "numShards":"1",
   [junit4]   2>   "state":"down",
   [junit4]   2>   "shard":"shard1",
   [junit4]   2>   "collection":"testschemaapi",
   [junit4]   2>   "operation":"state"}
   [junit4]   2> 2620366 INFO  (qtp4612621-15838) [n:127.0.0.1:39337_solr c:testschemaapi s:shard1  x:testschemaapi_shard1_replica1] o.a.s.c.c.ZkStateReader Add data for [testschemaapi] ver [0]
   [junit4]   2> 2620367 INFO  (qtp4612621-15838) [n:127.0.0.1:39337_solr c:testschemaapi s:shard1  x:testschemaapi_shard1_replica1] o.a.s.c.ZkController look for our core node name
   [junit4]   2> 2620466 INFO  (OverseerStateUpdate-95898918437388292-127.0.0.1:39337_solr-n_0000000000) [n:127.0.0.1:39337_solr    ] o.a.s.c.o.ZkStateWriter going to update_collection /collections/testschemaapi/state.json version: 0
   [junit4]   2> 2620467 INFO  (zkCallback-2679-thread-1-processing-n:127.0.0.1:46849_solr) [n:127.0.0.1:46849_solr    ] o.a.s.c.c.ZkStateReader A cluster state change: [WatchedEvent state:SyncConnected type:NodeDataChanged path:/collections/testschemaapi/state.json] for collection [testschemaapi] has occurred - updating... (live nodes size: [2])
   [junit4]   2> 2620467 INFO  (zkCallback-2675-thread-1-processing-n:127.0.0.1:39337_solr) [n:127.0.0.1:39337_solr    ] o.a.s.c.c.ZkStateReader A cluster state change: [WatchedEvent state:SyncConnected type:NodeDataChanged path:/collections/testschemaapi/state.json] for collection [testschemaapi] has occurred - updating... (live nodes size: [2])
   [junit4]   2> 2620467 INFO  (zkCallback-2679-thread-1-processing-n:127.0.0.1:46849_solr) [n:127.0.0.1:46849_solr    ] o.a.s.c.c.ZkStateReader Updating data for [testschemaapi] from [0] to [1]
   [junit4]   2> 2620468 INFO  (zkCallback-2675-thread-1-processing-n:127.0.0.1:39337_solr) [n:127.0.0.1:39337_solr    ] o.a.s.c.c.ZkStateReader Updating data for [testschemaapi] from [0] to [1]
   [junit4]   2> 2621362 INFO  (qtp21759280-15852) [n:127.0.0.1:46849_solr c:testschemaapi s:shard1  x:testschemaapi_shard1_replica2] o.a.s.c.ZkController waiting to find shard id in clusterstate for testschemaapi_shard1_replica2
   [junit4]   2> 2621362 INFO  (qtp21759280-15852) [n:127.0.0.1:46849_solr c:testschemaapi s:shard1  x:testschemaapi_shard1_replica2] o.a.s.c.ZkController Check for collection zkNode:testschemaapi
   [junit4]   2> 2621363 INFO  (qtp21759280-15852) [n:127.0.0.1:46849_solr c:testschemaapi s:shard1  x:testschemaapi_shard1_replica2] o.a.s.c.ZkController Collection zkNode exists
   [junit4]   2> 2621363 INFO  (qtp21759280-15852) [n:127.0.0.1:46849_solr c:testschemaapi s:shard1  x:testschemaapi_shard1_replica2] o.a.s.c.c.ZkStateReader Load collection config from: [/collections/testschemaapi]
   [junit4]   2> 2621365 INFO  (qtp21759280-15852) [n:127.0.0.1:46849_solr c:testschemaapi s:shard1  x:testschemaapi_shard1_replica2] o.a.s.c.c.ZkStateReader path=[/collections/testschemaapi] [configName]=[conf1] specified config exists in ZooKeeper
   [junit4]   2> 2621365 INFO  (qtp21759280-15852) [n:127.0.0.1:46849_solr c:testschemaapi s:shard1  x:testschemaapi_shard1_replica2] o.a.s.c.SolrResourceLoader new SolrResourceLoader for directory: '/home/jenkins/workspace/Lucene-Solr-6.x-Linux/solr/build/solr-core/test/J0/temp/solr.schema.TestManagedSchemaAPI_89C812C3487E6EEC-001/tempDir-001/node1/testschemaapi_shard1_replica2'
   [junit4]   2> 2621365 INFO  (qtp21759280-15852) [n:127.0.0.1:46849_solr c:testschemaapi s:shard1  x:testschemaapi_shard1_replica2] o.a.s.c.SolrResourceLoader JNDI not configured for solr (NoInitialContextEx)
   [junit4]   2> 2621365 INFO  (qtp21759280-15852) [n:127.0.0.1:46849_solr c:testschemaapi s:shard1  x:testschemaapi_shard1_replica2] o.a.s.c.SolrResourceLoader solr home defaulted to 'solr/' (could not find system property or JNDI)
   [junit4]   2> 2621367 INFO  (qtp4612621-15838) [n:127.0.0.1:39337_solr c:testschemaapi s:shard1  x:testschemaapi_shard1_replica1] o.a.s.c.ZkController waiting to find shard id in clusterstate for testschemaapi_shard1_replica1
   [junit4]   2> 2621367 INFO  (qtp4612621-15838) [n:127.0.0.1:39337_solr c:testschemaapi s:shard1  x:testschemaapi_shard1_replica1] o.a.s.c.ZkController Check for collection zkNode:testschemaapi
   [junit4]   2> 2621368 INFO  (qtp4612621-15838) [n:127.0.0.1:39337_solr c:testschemaapi s:shard1  x:testschemaapi_shard1_replica1] o.a.s.c.ZkController Collection zkNode exists
   [junit4]   2> 2621368 INFO  (qtp4612621-15838) [n:127.0.0.1:39337_solr c:testschemaapi s:shard1  x:testschemaapi_shard1_replica1] o.a.s.c.c.ZkStateReader Load collection config from: [/collections/testschemaapi]
   [junit4]   2> 2621368 INFO  (qtp21759280-15852) [n:127.0.0.1:46849_solr c:testschemaapi s:shard1  x:testschemaapi_shard1_replica2] o.a.s.c.Config loaded config solrconfig.xml with version 0 
   [junit4]   2> 2621368 INFO  (qtp4612621-15838) [n:127.0.0.1:39337_solr c:testschemaapi s:shard1  x:testschemaapi_shard1_replica1] o.a.s.c.c.ZkStateReader path=[/collections/testschemaapi] [configName]=[conf1] specified config exists in ZooKeeper
   [junit4]   2> 2621368 INFO  (qtp4612621-15838) [n:127.0.0.1:39337_solr c:testschemaapi s:shard1  x:testschemaapi_shard1_replica1] o.a.s.c.SolrResourceLoader new SolrResourceLoader for directory: '/home/jenkins/workspace/Lucene-Solr-6.x-Linux/solr/build/solr-core/test/J0/temp/solr.schema.TestManagedSchemaAPI_89C812C3487E6EEC-001/tempDir-001/node2/testschemaapi_shard1_replica1'
   [junit4]   2> 2621368 INFO  (qtp4612621-15838) [n:127.0.0.1:39337_solr c:testschemaapi s:shard1  x:testschemaapi_shard1_replica1] o.a.s.c.SolrResourceLoader JNDI not configured for solr (NoInitialContextEx)
   [junit4]   2> 2621368 INFO  (qtp4612621-15838) [n:127.0.0.1:39337_solr c:testschemaapi s:shard1  x:testschemaapi_shard1_replica1] o.a.s.c.SolrResourceLoader solr home defaulted to 'solr/' (could not find system property or JNDI)
   [junit4]   2> 2621369 INFO  (qtp4612621-15838) [n:127.0.0.1:39337_solr c:testschemaapi s:shard1  x:testschemaapi_shard1_replica1] o.a.s.c.Config loaded config solrconfig.xml with version 0 
   [junit4]   2> 2621370 INFO  (qtp21759280-15852) [n:127.0.0.1:46849_solr c:testschemaapi s:shard1  x:testschemaapi_shard1_replica2] o.a.s.c.SolrConfig current version of requestparams : -1
   [junit4]   2> 2621371 INFO  (qtp4612621-15838) [n:127.0.0.1:39337_solr c:testschemaapi s:shard1  x:testschemaapi_shard1_replica1] o.a.s.c.SolrConfig current version of requestparams : -1
   [junit4]   2> 2621372 INFO  (qtp21759280-15852) [n:127.0.0.1:46849_solr c:testschemaapi s:shard1  x:testschemaapi_shard1_replica2] o.a.s.c.SolrConfig Using Lucene MatchVersion: 6.1.0
   [junit4]   2> 2621372 INFO  (qtp4612621-15838) [n:127.0.0.1:39337_solr c:testschemaapi s:shard1  x:testschemaapi_shard1_replica1] o.a.s.c.SolrConfig Using Lucene MatchVersion: 6.1.0
   [junit4]   2> 2621375 INFO  (qtp21759280-15852) [n:127.0.0.1:46849_solr c:testschemaapi s:shard1  x:testschemaapi_shard1_replica2] o.a.s.c.SolrConfig Loaded SolrConfig: solrconfig.xml
   [junit4]   2> 2621376 INFO  (qtp4612621-15838) [n:127.0.0.1:39337_solr c:testschemaapi s:shard1  x:testschemaapi_shard1_replica1] o.a.s.c.SolrConfig Loaded SolrConfig: solrconfig.xml
   [junit4]   2> 2621378 INFO  (qtp21759280-15852) [n:127.0.0.1:46849_solr c:testschemaapi s:shard1  x:testschemaapi_shard1_replica2] o.a.s.s.IndexSchema [testschemaapi_shard1_replica2] Schema name=minimal
   [junit4]   2> 2621380 INFO  (qtp4612621-15838) [n:127.0.0.1:39337_solr c:testschemaapi s:shard1  x:testschemaapi_shard1_replica1] o.a.s.s.IndexSchema [testschemaapi_shard1_replica1] Schema name=minimal
   [junit4]   2> 2621382 INFO  (qtp21759280-15852) [n:127.0.0.1:46849_solr c:testschemaapi s:shard1  x:testschemaapi_shard1_replica2] o.a.s.s.IndexSchema unique key field: id
   [junit4]   2> 2621384 INFO  (qtp4612621-15838) [n:127.0.0.1:39337_solr c:testschemaapi s:shard1  x:testschemaapi_shard1_replica1] o.a.s.s.IndexSchema unique key field: id
   [junit4]   2> 2621385 INFO  (qtp21759280-15852) [n:127.0.0.1:46849_solr c:testschemaapi s:shard1  x:testschemaapi_shard1_replica2] o.a.s.c.ConfigSetProperties Did not find ConfigSet properties, assuming default properties: Can't find resource 'configsetprops.json' in classpath or '/configs/conf1', cwd=/home/jenkins/workspace/Lucene-Solr-6.x-Linux/solr/build/solr-core/test/J0
   [junit4]   2> 2621385 INFO  (qtp21759280-15852) [n:127.0.0.1:46849_solr c:testschemaapi s:shard1  x:testschemaapi_shard1_replica2] o.a.s.c.CoreContainer Creating SolrCore 'testschemaapi_shard1_replica2' using configuration from collection testschemaapi
   [junit4]   2> 2621386 INFO  (qtp21759280-15852) [n:127.0.0.1:46849_solr c:testschemaapi s:shard1 r:core_node1 x:testschemaapi_shard1_replica2] o.a.s.c.SolrCore org.apache.solr.core.MockDirectoryFactory
   [junit4]   2> 2621386 INFO  (qtp21759280-15852) [n:127.0.0.1:46849_solr c:testschemaapi s:shard1 r:core_node1 x:testschemaapi_shard1_replica2] o.a.s.c.SolrCore [[testschemaapi_shard1_replica2] ] Opening new SolrCore at [/home/jenkins/workspace/Lucene-Solr-6.x-Linux/solr/build/solr-core/test/J0/temp/solr.schema.TestManagedSchemaAPI_89C812C3487E6EEC-001/tempDir-001/node1/testschemaapi_shard1_replica2], dataDir=[/home/jenkins/workspace/Lucene-Solr-6.x-Linux/solr/build/solr-core/test/J0/temp/solr.schema.TestManagedSchemaAPI_89C812C3487E6EEC-001/tempDir-001/node1/./testschemaapi_shard1_replica2/data/]
   [junit4]   2> 2621386 INFO  (qtp21759280-15852) [n:127.0.0.1:46849_solr c:testschemaapi s:shard1 r:core_node1 x:testschemaapi_shard1_replica2] o.a.s.c.SolrCore JMX monitoring not detected for core: testschemaapi_shard1_replica2
   [junit4]   2> 2621387 INFO  (qtp4612621-15838) [n:127.0.0.1:39337_solr c:testschemaapi s:shard1  x:testschemaapi_shard1_replica1] o.a.s.c.ConfigSetProperties Did not find ConfigSet properties, assuming default properties: Can't find resource 'configsetprops.json' in classpath or '/configs/conf1', cwd=/home/jenkins/workspace/Lucene-Solr-6.x-Linux/solr/build/solr-core/test/J0
   [junit4]   2> 2621387 INFO  (qtp21759280-15852) [n:127.0.0.1:46849_solr c:testschemaapi s:shard1 r:core_node1 x:testschemaapi_shard1_replica2] o.a.s.c.CachingDirectoryFactory return new directory for /home/jenkins/workspace/Lucene-Solr-6.x-Linux/solr/build/solr-core/test/J0/temp/solr.schema.TestManagedSchemaAPI_89C812C3487E6EEC-001/tempDir-001/node1/./testschemaapi_shard1_replica2/data
   [junit4]   2> 2621387 INFO  (qtp4612621-15838) [n:127.0.0.1:39337_solr c:testschemaapi s:shard1  x:testschemaapi_shard1_replica1] o.a.s.c.CoreContainer Creating SolrCore 'testschemaapi_shard1_replica1' using configuration from collection testschemaapi
   [junit4]   2> 2621387 INFO  (qtp21759280-15852) [n:127.0.0.1:46849_solr c:testschemaapi s:shard1 r:core_node1 x:testschemaapi_shard1_replica2] o.a.s.c.SolrCore New index directory detected: old=null new=/home/jenkins/workspace/Lucene-Solr-6.x-Linux/solr/build/solr-core/test/J0/temp/solr.schema.TestManagedSchemaAPI_89C812C3487E6EEC-001/tempDir-001/node1/./testschemaapi_shard1_replica2/data/index/
   [junit4]   2> 2621387 WARN  (qtp21759280-15852) [n:127.0.0.1:46849_solr c:testschemaapi s:shard1 r:core_node1 x:testschemaapi_shard1_replica2] o.a.s.c.SolrCore [testschemaapi_shard1_replica2] Solr index directory '/home/jenkins/workspace/Lucene-Solr-6.x-Linux/solr/build/solr-core/test/J0/temp/solr.schema.TestManagedSchemaAPI_89C812C3487E6EEC-001/tempDir-001/node1/./testschemaapi_shard1_replica2/data/index' doesn't exist. Creating new index...
   [junit4]   2> 2621387 INFO  (qtp4612621-15838) [n:127.0.0.1:39337_solr c:testschemaapi s:shard1 r:core_node2 x:testschemaapi_shard1_replica1] o.a.s.c.SolrCore org.apache.solr.core.MockDirectoryFactory
   [junit4]   2> 2621387 INFO  (qtp4612621-15838) [n:127.0.0.1:39337_solr c:testschemaapi s:shard1 r:core_node2 x:testschemaapi_shard1_replica1] o.a.s.c.SolrCore [[testschemaapi_shard1_replica1] ] Opening new SolrCore at [/home/jenkins/workspace/Lucene-Solr-6.x-Linux/solr/build/solr-core/test/J0/temp/solr.schema.TestManagedSchemaAPI_89C812C3487E6EEC-001/tempDir-001/node2/testschemaapi_shard1_replica1], dataDir=[/home/jenkins/workspace/Lucene-Solr-6.x-Linux/solr/build/solr-core/test/J0/temp/solr.schema.TestManagedSchemaAPI_89C812C3487E6EEC-001/tempDir-001/node2/./testschemaapi_shard1_replica1/data/]
   [junit4]   2> 2621388 INFO  (qtp4612621-15838) [n:127.0.0.1:39337_solr c:testschemaapi s:shard1 r:core_node2 x:testschemaapi_shard1_replica1] o.a.s.c.SolrCore JMX monitoring not detected for core: testschemaapi_shard1_replica1
   [junit4]   2> 2621388 INFO  (qtp21759280-15852) [n:127.0.0.1:46849_solr c:testschemaapi s:shard1 r:core_node1 x:testschemaapi_shard1_replica2] o.a.s.c.CachingDirectoryFactory return new directory for /home/jenkins/workspace/Lucene-Solr-6.x-Linux/solr/build/solr-core/test/J0/temp/solr.schema.TestManagedSchemaAPI_89C812C3487E6EEC-001/tempDir-001/node1/./testschemaapi_shard1_replica2/data/index
   [junit4]   2> 2621388 INFO  (qtp21759280-15852) [n:127.0.0.1:46849_solr c:testschemaapi s:shard1 r:core_node1 x:testschemaapi_shard1_replica2] o.a.s.c.SolrDeletionPolicy SolrDeletionPolicy.onCommit: commits: num=1
   [junit4]   2> 	commit{dir=MockDirectoryWrapper(RAMDirectory@17f2846 lockFactory=org.apache.lucene.store.SingleInstanceLockFactory@109abf8),segFN=segments_1,generation=1}
   [junit4]   2> 2621388 INFO  (qtp4612621-15838) [n:127.0.0.1:39337_solr c:testschemaapi s:shard1 r:core_node2 x:testschemaapi_shard1_replica1] o.a.s.c.CachingDirectoryFactory return new directory for /home/jenkins/workspace/Lucene-Solr-6.x-Linux/solr/build/solr-core/test/J0/temp/solr.schema.TestManagedSchemaAPI_89C812C3487E6EEC-001/tempDir-001/node2/./testschemaapi_shard1_replica1/data
   [junit4]   2> 2621388 INFO  (qtp21759280-15852) [n:127.0.0.1:46849_solr c:testschemaapi s:shard1 r:core_node1 x:testschemaapi_shard1_replica2] o.a.s.c.SolrDeletionPolicy newest commit generation = 1
   [junit4]   2> 2621388 INFO  (qtp4612621-15838) [n:127.0.0.1:39337_solr c:testschemaapi s:shard1 r:core_node2 x:testschemaapi_shard1_replica1] o.a.s.c.SolrCore New index directory detected: old=null new=/home/jenkins/workspace/Lucene-Solr-6.x-Linux/solr/build/solr-core/test/J0/temp/solr.schema.TestManagedSchemaAPI_89C812C3487E6EEC-001/tempDir-001/node2/./testschemaapi_shard1_replica1/data/index/
   [junit4]   2> 2621388 WARN  (qtp4612621-15838) [n:127.0.0.1:39337_solr c:testschemaapi s:shard1 r:core_node2 x:testschemaapi_shard1_replica1] o.a.s.c.SolrCore [testschemaapi_shard1_replica1] Solr index directory '/home/jenkins/workspace/Lucene-Solr-6.x-Linux/solr/build/solr-core/test/J0/temp/solr.schema.TestManagedSchemaAPI_89C812C3487E6EEC-001/tempDir-001/node2/./testschemaapi_shard1_replica1/data/index' doesn't exist. Creating new index...
   [junit4]   2> 2621388 INFO  (OldIndexDirectoryCleanupThreadForCore-testschemaapi_shard1_replica2) [n:127.0.0.1:46849_solr c:testschemaapi s:shard1 r:core_node1 x:testschemaapi_shard1_replica2] o.a.s.c.SolrCore Looking for old index directories to cleanup for core testschemaapi_shard1_replica2 in /home/jenkins/workspace/Lucene-Solr-6.x-Linux/solr/build/solr-core/test/J0/temp/solr.schema.TestManagedSchemaAPI_89C812C3487E6EEC-001/tempDir-001/node1/./testschemaapi_shard1_replica2/data/
   [junit4]   2> 2621389 WARN  (OldIndexDirectoryCleanupThreadForCore-testschemaapi_shard1_replica2) [n:127.0.0.1:46849_solr c:testschemaapi s:shard1 r:core_node1 x:testschemaapi_shard1_replica2] o.a.s.c.DirectoryFactory /home/jenkins/workspace/Lucene-Solr-6.x-Linux/solr/build/solr-core/test/J0/temp/solr.schema.TestManagedSchemaAPI_89C812C3487E6EEC-001/tempDir-001/node1/./testschemaapi_shard1_replica2/data/ does not point to a valid data directory; skipping clean-up of old index directories.
   [junit4]   2> 2621389 INFO  (qtp4612621-15838) [n:127.0.0.1:39337_solr c:testschemaapi s:shard1 r:core_node2 x:testschemaapi_shard1_replica1] o.a.s.c.CachingDirectoryFactory return new directory for /home/jenkins/workspace/Lucene-Solr-6.x-Linux/solr/build/solr-core/test/J0/temp/solr.schema.TestManagedSchemaAPI_89C812C3487E6EEC-001/tempDir-001/node2/./testschemaapi_shard1_replica1/data/index
   [junit4]   2> 2621389 INFO  (qtp4612621-15838) [n:127.0.0.1:39337_solr c:testschemaapi s:shard1 r:core_node2 x:testschemaapi_shard1_replica1] o.a.s.c.SolrDeletionPolicy SolrDeletionPolicy.onCommit: commits: num=1
   [junit4]   2> 	commit{dir=MockDirectoryWrapper(RAMDirectory@1dc7d77 lockFactory=org.apache.lucene.store.SingleInstanceLockFactory@1033a56),segFN=segments_1,generation=1}
   [junit4]   2> 2621389 INFO  (qtp4612621-15838) [n:127.0.0.1:39337_solr c:testschemaapi s:shard1 r:core_node2 x:testschemaapi_shard1_replica1] o.a.s.c.SolrDeletionPolicy newest commit generation = 1
   [junit4]   2> 2621389 INFO  (OldIndexDirectoryCleanupThreadForCore-testschemaapi_shard1_replica1) [n:127.0.0.1:39337_solr c:testschemaapi s:shard1 r:core_node2 x:testschemaapi_shard1_replica1] o.a.s.c.SolrCore Looking for old index directories to cleanup for core testschemaapi_shard1_replica1 in /home/jenkins/workspace/Lucene-Solr-6.x-Linux/solr/build/solr-core/test/J0/temp/solr.schema.TestManagedSchemaAPI_89C812C3487E6EEC-001/tempDir-001/node2/./testschemaapi_shard1_replica1/data/
   [junit4]   2> 2621389 INFO  (qtp21759280-15852) [n:127.0.0.1:46849_solr c:testschemaapi s:shard1 r:core_node1 x:testschemaapi_shard1_replica2] o.a.s.c.SolrCore no updateRequestProcessorChain defined as default, creating implicit default
   [junit4]   2> 2621389 WARN  (OldIndexDirectoryCleanupThreadForCore-testschemaapi_shard1_replica1) [n:127.0.0.1:39337_solr c:testschemaapi s:shard1 r:core_node2 x:testschemaapi_shard1_replica1] o.a.s.c.DirectoryFactory /home/jenkins/workspace/Lucene-Solr-6.x-Linux/solr/build/solr-core/test/J0/temp/solr.schema.TestManagedSchemaAPI_89C812C3487E6EEC-001/tempDir-001/node2/./testschemaapi_shard1_replica1/data/ does not point to a valid data directory; skipping clean-up of old index directories.
   [junit4]   2> 2621390 INFO  (qtp4612621-15838) [n:127.0.0.1:39337_solr c:testschemaapi s:shard1 r:core_node2 x:testschemaapi_shard1_replica1] o.a.s.c.SolrCore no updateRequestProcessorChain defined as default, creating implicit default
   [junit4]   2> 2621392 INFO  (qtp4612621-15838) [n:127.0.0.1:39337_solr c:testschemaapi s:shard1 r:core_node2 x:testschemaapi_shard1_replica1] o.a.s.h.l.XMLLoader xsltCacheLifetimeSeconds=60
   [junit4]   2> 2621392 INFO  (qtp21759280-15852) [n:127.0.0.1:46849_solr c:testschemaapi s:shard1 r:core_node1 x:testschemaapi_shard1_replica2] o.a.s.h.l.XMLLoader xsltCacheLifetimeSeconds=60
   [junit4]   2> 2621393 INFO  (qtp4612621-15838) [n:127.0.0.1:39337_solr c:testschemaapi s:shard1 r:core_node2 x:testschemaapi_shard1_replica1] o.a.s.h.l.XMLLoader xsltCacheLifetimeSeconds=60
   [junit4]   2> 2621393 INFO  (qtp21759280-15852) [n:127.0.0.1:46849_solr c:testschemaapi s:shard1 r:core_node1 x:testschemaapi_shard1_replica2] o.a.s.h.l.XMLLoader xsltCacheLifetimeSeconds=60
   [junit4]   2> 2621393 INFO  (qtp4612621-15838) [n:127.0.0.1:39337_solr c:testschemaapi s:shard1 r:core_node2 x:testschemaapi_shard1_replica1] o.a.s.h.l.XMLLoader xsltCacheLifetimeSeconds=60
   [junit4]   2> 2621394 INFO  (qtp4612621-15838) [n:127.0.0.1:39337_solr c:testschemaapi s:shard1 r:core_node2 x:testschemaapi_shard1_replica1] o.a.s.h.l.XMLLoader xsltCacheLifetimeSeconds=60
   [junit4]   2> 2621394 INFO  (qtp21759280-15852) [n:127.0.0.1:46849_solr c:testschemaapi s:shard1 r:core_node1 x:testschemaapi_shard1_replica2] o.a.s.h.l.XMLLoader xsltCacheLifetimeSeconds=60
   [junit4]   2> 2621394 INFO  (qtp21759280-15852) [n:127.0.0.1:46849_solr c:testschemaapi s:shard1 r:core_node1 x:testschemaapi_shard1_replica2] o.a.s.h.l.XMLLoader xsltCacheLifetimeSeconds=60
   [junit4]   2> 2621394 INFO  (qtp4612621-15838) [n:127.0.0.1:39337_solr c:testschemaapi s:shard1 r:core_node2 x:testschemaapi_shard1_replica1] o.a.s.c.RequestHandlers Registered paths: /admin/mbeans,/update/csv,/sql,/update/json/docs,/admin/luke,/graph,/export,/select,/admin/segments,/get,/admin/system,/replication,/admin/properties,/config,/stream,/schema,/admin/plugins,/admin/logging,/update/json,/admin/ping,/admin/threads,/update,/admin/file
   [junit4]   2> 2621395 INFO  (qtp4612621-15838) [n:127.0.0.1:39337_solr c:testschemaapi s:shard1 r:core_node2 x:testschemaapi_shard1_replica1] o.a.s.c.SolrCore Using default statsCache cache: org.apache.solr.search.stats.LocalStatsCache
   [junit4]   2> 2621395 INFO  (qtp4612621-15838) [n:127.0.0.1:39337_solr c:testschemaapi s:shard1 r:core_node2 x:testschemaapi_shard1_replica1] o.a.s.u.UpdateHandler Using UpdateLog implementation: org.apache.solr.update.UpdateLog
   [junit4]   2> 2621395 INFO  (qtp4612621-15838) [n:127.0.0.1:39337_solr c:testschemaapi s:shard1 r:core_node2 x:testschemaapi_shard1_replica1] o.a.s.u.UpdateLog Initializing UpdateLog: dataDir=null defaultSyncLevel=FLUSH numRecordsToKeep=100 maxNumLogsToKeep=10 numVersionBuckets=65536
   [junit4]   2> 2621395 INFO  (qtp21759280-15852) [n:127.0.0.1:46849_solr c:testschemaapi s:shard1 r:core_node1 x:testschemaapi_shard1_replica2] o.a.s.c.RequestHandlers Registered paths: /admin/mbeans,/update/csv,/sql,/update/json/docs,/admin/luke,/graph,/export,/select,/admin/segments,/get,/admin/system,/replication,/admin/properties,/config,/stream,/schema,/admin/plugins,/admin/logging,/update/json,/admin/ping,/admin/threads,/update,/admin/file
   [junit4]   2> 2621395 INFO  (qtp21759280-15852) [n:127.0.0.1:46849_solr c:testschemaapi s:shard1 r:core_node1 x:testschemaapi_shard1_replica2] o.a.s.c.SolrCore Using default statsCache cache: org.apache.solr.search.stats.LocalStatsCache
   [junit4]   2> 2621396 INFO  (qtp21759280-15852) [n:127.0.0.1:46849_solr c:testschemaapi s:shard1 r:core_node1 x:testschemaapi_shard1_replica2] o.a.s.u.UpdateHandler Using UpdateLog implementation: org.apache.solr.update.UpdateLog
   [junit4]   2> 2621396 INFO  (qtp21759280-15852) [n:127.0.0.1:46849_solr c:testschemaapi s:shard1 r:core_node1 x:testschemaapi_shard1_replica2] o.a.s.u.UpdateLog Initializing UpdateLog: dataDir=null defaultSyncLevel=FLUSH numRecordsToKeep=100 maxNumLogsToKeep=10 numVersionBuckets=65536
   [junit4]   2> 2621396 INFO  (qtp4612621-15838) [n:127.0.0.1:39337_solr c:testschemaapi s:shard1 r:core_node2 x:testschemaapi_shard1_replica1] o.a.s.u.CommitTracker Hard AutoCommit: disabled
   [junit4]   2> 2621396 INFO  (qtp4612621-15838) [n:127.0.0.1:39337_solr c:testschemaapi s:shard1 r:core_node2 x:testschemaapi_shard1_replica1] o.a.s.u.CommitTracker Soft AutoCommit: disabled
   [junit4]   2> 2621396 INFO  (qtp4612621-15838) [n:127.0.0.1:39337_solr c:testschemaapi s:shard1 r:core_node2 x:testschemaapi_shard1_replica1] o.a.s.c.SolrDeletionPolicy SolrDeletionPolicy.onInit: commits: num=1
   [junit4]   2> 	commit{dir=MockDirectoryWrapper(RAMDirectory@1dc7d77 lockFactory=org.apache.lucene.store.SingleInstanceLockFactory@1033a56),segFN=segments_1,generation=1}
   [junit4]   2> 2621396 INFO  (qtp4612621-15838) [n:127.0.0.1:39337_solr c:testschemaapi s:shard1 r:core_node2 x:testschemaapi_shard1_replica1] o.a.s.c.SolrDeletionPolicy newest commit generation = 1
   [junit4]   2> 2621396 INFO  (qtp4612621-15838) [n:127.0.0.1:39337_solr c:testschemaapi s:shard1 r:core_node2 x:testschemaapi_shard1_replica1] o.a.s.s.SolrIndexSearcher Opening [Searcher@4b3556[testschemaapi_shard1_replica1] main]
   [junit4]   2> 2621396 INFO  (qtp4612621-15838) [n:127.0.0.1:39337_solr c:testschemaapi s:shard1 r:core_node2 x:testschemaapi_shard1_replica1] o.a.s.c.c.ZkStateReader Load collection config from: [/collections/testschemaapi]
   [junit4]   2> 2621396 INFO  (qtp4612621-15838) [n:127.0.0.1:39337_solr c:testschemaapi s:shard1 r:core_node2 x:testschemaapi_shard1_replica1] o.a.s.c.c.ZkStateReader path=[/collections/testschemaapi] [configName]=[conf1] specified config exists in ZooKeeper
   [junit4]   2> 2621396 INFO  (qtp4612621-15838) [n:127.0.0.1:39337_solr c:testschemaapi s:shard1 r:core_node2 x:testschemaapi_shard1_replica1] o.a.s.r.ManagedResourceStorage Setting up ZooKeeper-based storage for the RestManager with znodeBase: /configs/conf1
   [junit4]   2> 2621397 INFO  (qtp21759280-15852) [n:127.0.0.1:46849_solr c:testschemaapi s:shard1 r:core_node1 x:testschemaapi_shard1_replica2] o.a.s.u.CommitTracker Hard AutoCommit: disabled
   [junit4]   2> 2621397 INFO  (qtp4612621-15838) [n:127.0.0.1:39337_solr c:testschemaapi s:shard1 r:core_node2 x:testschemaapi_shard1_replica1] o.a.s.r.ManagedResourceStorage Configured ZooKeeperStorageIO with znodeBase: /configs/conf1
   [junit4]   2> 2621397 INFO  (qtp4612621-15838) [n:127.0.0.1:39337_solr c:testschemaapi s:shard1 r:core_node2 x:testschemaapi_shard1_replica1] o.a.s.r.RestManager Initializing RestManager with initArgs: {}
   [junit4]   2> 2621397 INFO  (qtp21759280-15852) [n:127.0.0.1:46849_solr c:testschemaapi s:shard1 r:core_node1 x:testschemaapi_shard1_replica2] o.a.s.u.CommitTracker Soft AutoCommit: disabled
   [junit4]   2> 2621397 INFO  (qtp4612621-15838) [n:127.0.0.1:39337_solr c:testschemaapi s:shard1 r:core_node2 x:testschemaapi_shard1_replica1] o.a.s.r.ManagedResourceStorage Reading _rest_managed.json using ZooKeeperStorageIO:path=/configs/conf1
   [junit4]   2> 2621397 INFO  (qtp21759280-15852) [n:127.0.0.1:46849_solr c:testschemaapi s:shard1 r:core_node1 x:testschemaapi_shard1_replica2] o.a.s.c.SolrDeletionPolicy SolrDeletionPolicy.onInit: commits: num=1
   [junit4]   2> 	commit{dir=MockDirectoryWrapper(RAMDirectory@17f2846 lockFactory=org.apache.lucene.store.SingleInstanceLockFactory@109abf8),segFN=segments_1,generation=1}
   [junit4]   2> 2621397 INFO  (qtp21759280-15852) [n:127.0.0.1:46849_solr c:testschemaapi s:shard1 r:core_node1 x:testschemaapi_shard1_replica2] o.a.s.c.SolrDeletionPolicy newest commit generation = 1
   [junit4]   2> 2621397 INFO  (qtp4612621-15838) [n:127.0.0.1:39337_solr c:testschemaapi s:shard1 r:core_node2 x:testschemaapi_shard1_replica1] o.a.s.r.ManagedResourceStorage No data found for znode /configs/conf1/_rest_managed.json
   [junit4]   2> 2621397 INFO  (qtp21759280-15852) [n:127.0.0.1:46849_solr c:testschemaapi s:shard1 r:core_node1 x:testschemaapi_shard1_replica2] o.a.s.s.SolrIndexSearcher Opening [Searcher@b5fe2f[testschemaapi_shard1_replica2] main]
   [junit4]   2> 2621397 INFO  (qtp4612621-15838) [n:127.0.0.1:39337_solr c:testschemaapi s:shard1 r:core_node2 x:testschemaapi_shard1_replica1] o.a.s.r.ManagedResourceStorage Loaded null at path _rest_managed.json using ZooKeeperStorageIO:path=/configs/conf1
   [junit4]   2> 2621397 INFO  (qtp21759280-15852) [n:127.0.0.1:46849_solr c:testschemaapi s:shard1 r:core_node1 x:testschemaapi_shard1_replica2] o.a.s.c.c.ZkStateReader Load collection config from: [/collections/testschemaapi]
   [junit4]   2> 2621397 INFO  (qtp4612621-15838) [n:127.0.0.1:39337_solr c:testschemaapi s:shard1 r:core_node2 x:testschemaapi_shard1_replica1] o.a.s.r.RestManager Initializing 0 registered ManagedResources
   [junit4]   2> 2621397 INFO  (qtp4612621-15838) [n:127.0.0.1:39337_solr c:testschemaapi s:shard1 r:core_node2 x:testschemaapi_shard1_replica1] o.a.s.s.ZkIndexSchemaReader Creating ZooKeeper watch for the managed schema at /configs/conf1/managed-schema
   [junit4]   2> 2621398 INFO  (qtp4612621-15838) [n:127.0.0.1:39337_solr c:testschemaapi s:shard1 r:core_node2 x:testschemaapi_shard1_replica1] o.a.s.c.ZkController Added new OnReconnect listener ZkIndexSchemaReader: /configs/conf1/managed-schema, uniqueCoreId: testschemaapi_shard1_replica1:759530076965898
   [junit4]   2> 2621398 INFO  (qtp4612621-15838) [n:127.0.0.1:39337_solr c:testschemaapi s:shard1 r:core_node2 x:testschemaapi_shard1_replica1] o.a.s.h.ReplicationHandler Commits will be reserved for  10000
   [junit4]   2> 2621398 INFO  (searcherExecutor-8442-thread-1-processing-n:127.0.0.1:39337_solr x:testschemaapi_shard1_replica1 s:shard1 c:testschemaapi r:core_node2) [n:127.0.0.1:39337_solr c:testschemaapi s:shard1 r:core_node2 x:testschemaapi_shard1_replica1] o.a.s.c.SolrCore [testschemaapi_shard1_replica1] Registered new searcher Searcher@4b3556[testschemaapi_shard1_replica1] main{ExitableDirectoryReader(UninvertingDirectoryReader())}
   [junit4]   2> 2621398 INFO  (qtp4612621-15838) [n:127.0.0.1:39337_solr c:testschemaapi s:shard1 r:core_node2 x:testschemaapi_shard1_replica1] o.a.s.u.UpdateLog Looking up max value of version field to seed version buckets
   [junit4]   2> 2621398 INFO  (qtp4612621-15838) [n:127.0.0.1:39337_solr c:testschemaapi s:shard1 r:core_node2 x:testschemaapi_shard1_replica1] o.a.s.u.VersionInfo Refreshing highest value of _version_ for 65536 version buckets from index
   [junit4]   2> 2621398 INFO  (qtp4612621-15838) [n:127.0.0.1:39337_solr c:testschemaapi s:shard1 r:core_node2 x:testschemaapi_shard1_replica1] o.a.s.u.VersionInfo No terms found for _version_, cannot seed version bucket highest value from index
   [junit4]   2> 2621398 INFO  (qtp21759280-15852) [n:127.0.0.1:46849_solr c:testschemaapi s:shard1 r:core_node1 x:testschemaapi_shard1_replica2] o.a.s.c.c.ZkStateReader path=[/collections/testschemaapi] [configName]=[conf1] specified config exists in ZooKeeper
   [junit4]   2> 2621398 INFO  (qtp21759280-15852) [n:127.0.0.1:46849_solr c:testschemaapi s:shard1 r:core_node1 x:testschemaapi_shard1_replica2] o.a.s.r.ManagedResourceStorage Setting up ZooKeeper-based storage for the RestManager with znodeBase: /configs/conf1
   [junit4]   2> 2621398 INFO  (qtp4612621-15838) [n:127.0.0.1:39337_solr c:testschemaapi s:shard1 r:core_node2 x:testschemaapi_shard1_replica1] o.a.s.u.UpdateLog Could not find max version in index or recent updates, using new clock 1534382697473900544
   [junit4]   2> 2621399 INFO  (qtp21759280-15852) [n:127.0.0.1:46849_solr c:testschemaapi s:shard1 r:core_node1 x:testschemaapi_shard1_replica2] o.a.s.r.ManagedResourceStorage Configured ZooKeeperStorageIO with znodeBase: /configs/conf1
   [junit4]   2> 2621399 INFO  (qtp21759280-15852) [n:127.0.0.1:46849_solr c:testschemaapi s:shard1 r:core_node1 x:testschemaapi_shard1_replica2] o.a.s.r.RestManager Initializing RestManager with initArgs: {}
   [junit4]   2> 2621399 INFO  (qtp21759280-15852) [n:127.0.0.1:46849_solr c:testschemaapi s:shard1 r:core_node1 x:testschemaapi_shard1_replica2] o.a.s.r.ManagedResourceStorage Reading _rest_managed.json using ZooKeeperStorageIO:path=/configs/conf1
   [junit4]   2> 2621399 INFO  (qtp21759280-15852) [n:127.0.0.1:46849_solr c:testschemaapi s:shard1 r:core_node1 x:testschemaapi_shard1_replica2] o.a.s.r.ManagedResourceStorage No data found for znode /configs/conf1/_rest_managed.json
   [junit4]   2> 2621399 INFO  (qtp21759280-15852) [n:127.0.0.1:46849_solr c:testschemaapi s:shard1 r:core_node1 x:testschemaapi_shard1_replica2] o.a.s.r.ManagedResourceStorage Loaded null at path _rest_managed.json using ZooKeeperStorageIO:path=/configs/conf1
   [junit4]   2> 2621399 INFO  (qtp21759280-15852) [n:127.0.0.1:46849_solr c:testschemaapi s:shard1 r:core_node1 x:testschemaapi_shard1_replica2] o.a.s.r.RestManager Initializing 0 registered ManagedResources
   [junit4]   2> 2621399 INFO  (qtp21759280-15852) [n:127.0.0.1:46849_solr c:testschemaapi s:shard1 r:core_node1 x:testschemaapi_shard1_replica2] o.a.s.s.ZkIndexSchemaReader Creating ZooKeeper watch for the managed schema at /configs/conf1/managed-schema
   [junit4]   2> 2621399 INFO  (qtp21759280-15852) [n:127.0.0.1:46849_solr c:testschemaapi s:shard1 r:core_node1 x:testschemaapi_shard1_replica2] o.a.s.c.ZkController Added new OnReconnect listener ZkIndexSchemaReader: /configs/conf1/managed-schema, uniqueCoreId: testschemaapi_shard1_replica2:759530075047368
   [junit4]   2> 2621399 INFO  (qtp21759280-15852) [n:127.0.0.1:46849_solr c:testschemaapi s:shard1 r:core_node1 x:testschemaapi_shard1_replica2] o.a.s.h.ReplicationHandler Commits will be reserved for  10000
   [junit4]   2> 2621399 INFO  (searcherExecutor-8441-thread-1-processing-n:127.0.0.1:46849_solr x:testschemaapi_shard1_replica2 s:shard1 c:testschemaapi r:core_node1) [n:127.0.0.1:46849_solr c:testschemaapi s:shard1 r:core_node1 x:testschemaapi_shard1_replica2] o.a.s.c.SolrCore [testschemaapi_shard1_replica2] Registered new searcher Searcher@b5fe2f[testschemaapi_shard1_replica2] main{ExitableDirectoryReader(UninvertingDirectoryReader())}
   [junit4]   2> 2621399 INFO  (qtp21759280-15852) [n:127.0.0.1:46849_solr c:testschemaapi s:shard1 r:core_node1 x:testschemaapi_shard1_replica2] o.a.s.u.UpdateLog Looking up max value of version field to seed version buckets
   [junit4]   2> 2621400 INFO  (qtp21759280-15852) [n:127.0.0.1:46849_solr c:testschemaapi s:shard1 r:core_node1 x:testschemaapi_shard1_replica2] o.a.s.u.VersionInfo Refreshing highest value of _version_ for 65536 version buckets from index
   [junit4]   2> 2621400 INFO  (qtp21759280-15852) [n:127.0.0.1:46849_solr c:testschemaapi s:shard1 r:core_node1 x:testschemaapi_shard1_replica2] o.a.s.u.VersionInfo No terms found for _version_, cannot seed version bucket highest value from index
   [junit4]   2> 2621400 INFO  (qtp21759280-15852) [n:127.0.0.1:46849_solr c:testschemaapi s:shard1 r:core_node1 x:testschemaapi_shard1_replica2] o.a.s.u.UpdateLog Could not find max version in index or recent updates, using new clock 1534382697475997696
   [junit4]   2> 2621400 INFO  (qtp4612621-15838) [n:127.0.0.1:39337_solr c:testschemaapi s:shard1 r:core_node2 x:testschemaapi_shard1_replica1] o.a.s.u.UpdateLog Took 2.0ms to seed version buckets with highest version 1534382697473900544
   [junit4]   2> 2621400 INFO  (qtp4612621-15838) [n:127.0.0.1:39337_solr c:testschemaapi s:shard1 r:core_node2 x:testschemaapi_shard1_replica1] o.a.s.c.ZkController watch zkdir /configs/conf1
   [junit4]   2> 2621401 INFO  (qtp4612621-15838) [n:127.0.0.1:39337_solr c:testschemaapi s:shard1 r:core_node2 x:testschemaapi_shard1_replica1] o.a.s.c.CoreContainer registering core: testschemaapi_shard1_replica1
   [junit4]   2> 2621401 INFO  (qtp4612621-15838) [n:127.0.0.1:39337_solr c:testschemaapi s:shard1 r:core_node2 x:testschemaapi_shard1_replica1] o.a.s.c.ZkController Register replica - core:testschemaapi_shard1_replica1 address:http://127.0.0.1:39337/solr collection:testschemaapi shard:shard1
   [junit4]   2> 2621401 INFO  (qtp4612621-15838) [n:127.0.0.1:39337_solr c:testschemaapi s:shard1 r:core_node2 x:testschemaapi_shard1_replica1] o.a.s.c.c.SolrZkClient makePath: /collections/testschemaapi/leader_elect/shard1/election
   [junit4]   2> 2621401 INFO  (qtp21759280-15852) [n:127.0.0.1:46849_solr c:testschemaapi s:shard1 r:core_node1 x:testschemaapi_shard1_replica2] o.a.s.u.UpdateLog Took 1.0ms to seed version buckets with highest version 1534382697475997696
   [junit4]   2> 2621401 INFO  (qtp21759280-15852) [n:127.0.0.1:46849_solr c:testschemaapi s:shard1 r:core_node1 x:testschemaapi_shard1_replica2] o.a.s.c.ZkController watch zkdir /configs/conf1
   [junit4]   2> 2621402 INFO  (qtp21759280-15852) [n:127.0.0.1:46849_solr c:testschemaapi s:shard1 r:core_node1 x:testschemaapi_shard1_replica2] o.a.s.c.CoreContainer registering core: testschemaapi_shard1_replica2
   [junit4]   2> 2621402 INFO  (qtp21759280-15852) [n:127.0.0.1:46849_solr c:testschemaapi s:shard1 r:core_node1 x:testschemaapi_shard1_replica2] o.a.s.c.ZkController Register replica - core:testschemaapi_shard1_replica2 address:http://127.0.0.1:46849/solr collection:testschemaapi shard:shard1
   [junit4]   2> 2621403 INFO  (qtp4612621-15838) [n:127.0.0.1:39337_solr c:testschemaapi s:shard1 r:core_node2 x:testschemaapi_shard1_replica1] o.a.s.c.LeaderElector Joined leadership election with path: /collections/testschemaapi/leader_elect/shard1/election/95898918437388292-core_node2-n_0000000000
   [junit4]   2> 2621403 INFO  (qtp21759280-15852) [n:127.0.0.1:46849_solr c:testschemaapi s:shard1 r:core_node1 x:testschemaapi_shard1_replica2] o.a.s.c.LeaderElector Joined leadership election with path: /collections/testschemaapi/leader_elect/shard1/election/95898918437388294-core_node1-n_0000000001
   [junit4]   2> 2621404 INFO  (qtp4612621-15838) [n:127.0.0.1:39337_solr c:testschemaapi s:shard1 r:core_node2 x:testschemaapi_shard1_replica1] o.a.s.c.ShardLeaderElectionContext Running the leader process for shard=shard1 and weAreReplacement=false and leaderVoteWait=10000
   [junit4]   2> 2621404 INFO  (qtp21759280-15852) [n:127.0.0.1:46849_solr c:testschemaapi s:shard1 r:core_node1 x:testschemaapi_shard1_replica2] o.a.s.c.LeaderElector Watching path /collections/testschemaapi/leader_elect/shard1/election/95898918437388292-core_node2-n_0000000000 to know if I could be the leader
   [junit4]   2> 2621410 INFO  (qtp4612621-15838) [n:127.0.0.1:39337_solr c:testschemaapi s:shard1 r:core_node2 x:testschemaapi_shard1_replica1] o.a.s.c.ShardLeaderElectionContext Enough replicas found to continue.
   [junit4]   2> 2621410 INFO  (OverseerStateUpdate-95898918437388292-127.0.0.1:39337_solr-n_0000000000) [n:127.0.0.1:39337_solr    ] o.a.s.c.Overseer processMessage: queueSize: 1, message = {
   [junit4]   2>   "operation":"leader",
   [junit4]   2>   "shard":"shard1",
   [junit4]   2>   "collection":"testschemaapi"} current state version: 0
   [junit4]   2> 2621410 INFO  (qtp4612621-15838) [n:127.0.0.1:39337_solr c:testschemaapi s:shard1 r:core_node2 x:testschemaapi_shard1_replica1] o.a.s.c.ShardLeaderElectionContext I may be the new leader - try and sync
   [junit4]   2> 2621410 INFO  (qtp4612621-15838) [n:127.0.0.1:39337_solr c:testschemaapi s:shard1 r:core_node2 x:testschemaapi_shard1_replica1] o.a.s.c.SyncStrategy Sync replicas to http://127.0.0.1:39337/solr/testschemaapi_shard1_replica1/
   [junit4]   2> 2621411 INFO  (qtp4612621-15838) [n:127.0.0.1:39337_solr c:testschemaapi s:shard1 r:core_node2 x:testschemaapi_shard1_replica1] o.a.s.u.PeerSync PeerSync: core=testschemaapi_shard1_replica1 url=http://127.0.0.1:39337/solr START replicas=[http://127.0.0.1:46849/solr/testschemaapi_shard1_replica2/] nUpdates=100
   [junit4]   2> 2621411 INFO  (qtp4612621-15838) [n:127.0.0.1:39337_solr c:testschemaapi s:shard1 r:core_node2 x:testschemaapi_shard1_replica1] o.a.s.u.PeerSync PeerSync: core=testschemaapi_shard1_replica1 url=http://127.0.0.1:39337/solr DONE.  We have no versions.  sync failed.
   [junit4]   2> 2621411 INFO  (qtp4612621-15838) [n:127.0.0.1:39337_solr c:testschemaapi s:shard1 r:core_node2 x:testschemaapi_shard1_replica1] o.a.s.c.SyncStrategy Leader's attempt to sync with shard failed, moving to the next candidate
   [junit4]   2> 2621411 INFO  (qtp4612621-15838) [n:127.0.0.1:39337_solr c:testschemaapi s:shard1 r:core_node2 x:testschemaapi_shard1_replica1] o.a.s.c.ShardLeaderElectionContext We failed sync, but we have no versions - we can't sync in that case - we were active before, so become leader anyway
   [junit4]   2> 2621413 INFO  (qtp4612621-15838) [n:127.0.0.1:39337_solr c:testschemaapi s:shard1 r:core_node2 x:testschemaapi_shard1_replica1] o.a.s.c.c.SolrZkClient makePath: /collections/testschemaapi/leaders/shard1
   [junit4]   2> 2621416 INFO  (qtp21759280-15854) [n:127.0.0.1:46849_solr c:testschemaapi s:shard1 r:core_node1 x:testschemaapi_shard1_replica2] o.a.s.c.S.Request [testschemaapi_shard1_replica2]  webapp=/solr path=/get params={distrib=false&qt=/get&fingerprint=false&getVersions=100&wt=javabin&version=2} status=0 QTime=2
   [junit4]   2> 2621416 INFO  (qtp4612621-15838) [n:127.0.0.1:39337_solr c:testschemaapi s:shard1 r:core_node2 x:testschemaapi_shard1_replica1] o.a.s.c.ShardLeaderElectionContextBase Creating leader registration node /collections/testschemaapi/leaders/shard1/leader after winning as /collections/testschemaapi/leader_elect/shard1/election/95898918437388292-core_node2-n_0000000000
   [junit4]   2> 2621417 INFO  (qtp4612621-15838) [n:127.0.0.1:39337_solr c:testschemaapi s:shard1 r:core_node2 x:testschemaapi_shard1_replica1] o.a.s.c.ShardLeaderElectionContext I am the new leader: http://127.0.0.1:39337/solr/testschemaapi_shard1_replica1/ shard1
   [junit4]   2> 2621418 INFO  (OverseerStateUpdate-95898918437388292-127.0.0.1:39337_solr-n_0000000000) [n:127.0.0.1:39337_solr    ] o.a.s.c.Overseer processMessage: queueSize: 1, message = {
   [junit4]   2>   "operation":"leader",
   [junit4]   2>   "shard":"shard1",
   [junit4]   2>   "collection":"testschemaapi",
   [junit4]   2>   "base_url":"http://127.0.0.1:39337/solr",
   [junit4]   2>   "core":"testschemaapi_shard1_replica1",
   [junit4]   2>   "state":"active"} current state version: 0
   [junit4]   2> 2621519 INFO  (OverseerStateUpdate-95898918437388292-127.0.0.1:39337_solr-n_0000000000) [n:127.0.0.1:39337_solr    ] o.a.s.c.o.ZkStateWriter going to update_collection /collections/testschemaapi/state.json version: 1
   [junit4]   2> 2621519 INFO  (zkCallback-2679-thread-1-processing-n:127.0.0.1:46849_solr) [n:127.0.0.1:46849_solr    ] o.a.s.c.c.ZkStateReader A cluster state change: [WatchedEvent state:SyncConnected type:NodeDataChanged path:/collections/testschemaapi/state.json] for collection [testschemaapi] has occurred - updating... (live nodes size: [2])
   [junit4]   2> 2621519 INFO  (zkCallback-2675-thread-1-processing-n:127.0.0.1:39337_solr) [n:127.0.0.1:39337_solr    ] o.a.s.c.c.ZkStateReader A cluster state change: [WatchedEvent state:SyncConnected type:NodeDataChanged path:/collections/testschemaapi/state.json] for collection [testschemaapi] has occurred - updating... (live nodes size: [2])
   [junit4]   2> 2621520 INFO  (zkCallback-2679-thread-1-processing-n:127.0.0.1:46849_solr) [n:127.0.0.1:46849_solr    ] o.a.s.c.c.ZkStateReader Updating data for [testschemaapi] from [1] to [2]
   [junit4]   2> 2621520 INFO  (zkCallback-2675-thread-1-processing-n:127.0.0.1:39337_solr) [n:127.0.0.1:39337_solr    ] o.a.s.c.c.ZkStateReader Updating data for [testschemaapi] from [1] to [2]
   [junit4]   2> 2621568 INFO  (qtp4612621-15838) [n:127.0.0.1:39337_solr c:testschemaapi s:shard1 r:core_node2 x:testschemaapi_shard1_replica1] o.a.s.c.ZkController We are http://127.0.0.1:39337/solr/testschemaapi_shard1_replica1/ and leader is http://127.0.0.1:39337/solr/testschemaapi_shard1_replica1/
   [junit4]   2> 2621568 INFO  (qtp4612621-15838) [n:127.0.0.1:39337_solr c:testschemaapi s:shard1 r:core_node2 x:testschemaapi_shard1_replica1] o.a.s.c.ZkController No LogReplay needed for core=testschemaapi_shard1_replica1 baseURL=http://127.0.0.1:39337/solr
   [junit4]   2> 2621568 INFO  (qtp4612621-15838) [n:127.0.0.1:39337_solr c:testschemaapi s:shard1 r:core_node2 x:testschemaapi_shard1_replica1] o.a.s.c.ZkController I am the leader, no recovery necessary
   [junit4]   2> 2621568 INFO  (qtp4612621-15838) [n:127.0.0.1:39337_solr c:testschemaapi s:shard1 r:core_node2 x:testschemaapi_shard1_replica1] o.a.s.c.ZkController publishing state=active
   [junit4]   2> 2621573 INFO  (qtp4612621-15838) [n:127.0.0.1:39337_solr c:testschemaapi s:shard1 r:core_node2 x:testschemaapi_shard1_replica1] o.a.s.s.HttpSolrCall [admin] webapp=null path=/admin/cores params={qt=/admin/cores&collection.configName=conf1&name=testschemaapi_shard1_replica1&action=CREATE&numShards=1&collection=testschemaapi&shard=shard1&wt=javabin&version=2} status=0 QTime=1211
   [junit4]   2> 2621573 INFO  (OverseerStateUpdate-95898918437388292-127.0.0.1:39337_solr-n_0000000000) [n:127.0.0.1:39337_solr    ] o.a.s.c.Overseer processMessage: queueSize: 1, message = {
   [junit4]   2>   "core":"testschemaapi_shard1_replica1",
   [junit4]   2>   "core_node_name":"core_node2",
   [junit4]   2>   "roles":null,
   [junit4]   2>   "base_url":"http://127.0.0.1:39337/solr",
   [junit4]   2>   "node_name":"127.0.0.1:39337_solr",
   [junit4]   2>   "numShards":"1",
   [junit4]   2>   "state":"active",
   [junit4]   2>   "shard":"shard1",
   [junit4]   2>   "collection":"testschemaapi",
   [junit4]   2>   "operation":"state"} current state version: 0
   [junit4]   2> 2621573 INFO  (OverseerStateUpdate-95898918437388292-127.0.0.1:39337_solr-n_0000000000) [n:127.0.0.1:39337_solr    ] o.a.s.c.o.ReplicaMutator Update state numShards=1 message={
   [junit4]   2>   "core":"testschemaapi_shard1_replica1",
   [junit4]   2>   "core_node_name":"core_node2",
   [junit4]   2>   "roles":null,
   [junit4]   2>   "base_url":"http://127.0.0.1:39337/solr",
   [junit4]   2>   "node_name":"127.0.0.1:39337_solr",
   [junit4]   2>   "numShards":"1",
   [junit4]   2>   "state":"active",
   [junit4]   2>   "shard":"shard1",
   [junit4]   2>   "collection":"testschemaapi",
   [junit4]   2>   "operation":"state"}
   [junit4]   2> 2621675 INFO  (OverseerStateUpdate-95898918437388292-127.0.0.1:39337_solr-n_0000000000) [n:127.0.0.1:39337_solr    ] o.a.s.c.o.ZkStateWriter going to update_collection /collections/testschemaapi/state.json version: 2
   [junit4]   2> 2621676 INFO  (zkCallback-2679-thread-1-processing-n:127.0.0.1:46849_solr) [n:127.0.0.1:46849_solr    ] o

[...truncated too long message...]

.LeaderElector.checkIfIamLeader(LeaderElector.java:135)
   [junit4]   2> 	at org.apache.solr.cloud.LeaderElector.access$200(LeaderElector.java:56)
   [junit4]   2> 	at org.apache.solr.cloud.LeaderElector$ElectionWatcher.process(LeaderElector.java:348)
   [junit4]   2> 	at org.apache.solr.common.cloud.SolrZkClient$3.lambda$process$0(SolrZkClient.java:266)
   [junit4]   2> 	at java.util.concurrent.Executors$RunnableAdapter.call(Executors.java:511)
   [junit4]   2> 	at java.util.concurrent.FutureTask.run(FutureTask.java:266)
   [junit4]   2> 	at org.apache.solr.common.util.ExecutorUtil$MDCAwareThreadPoolExecutor.lambda$execute$0(ExecutorUtil.java:229)
   [junit4]   2> 	at java.util.concurrent.ThreadPoolExecutor.runWorker(ThreadPoolExecutor.java:1142)
   [junit4]   2> 	at java.util.concurrent.ThreadPoolExecutor$Worker.run(ThreadPoolExecutor.java:617)
   [junit4]   2> 	at java.lang.Thread.run(Thread.java:745)
   [junit4]   2> 2633124 WARN  (zkCallback-2679-thread-3-processing-n:127.0.0.1:46849_solr) [n:127.0.0.1:46849_solr    ] o.a.s.c.c.ZkStateReader ZooKeeper watch triggered, but Solr cannot talk to ZK: [KeeperErrorCode = Session expired for /live_nodes]
   [junit4]   2> 2633125 INFO  (jetty-launcher-2668-thread-2) [    ] o.e.j.s.h.ContextHandler Stopped o.e.j.s.ServletContextHandler@c04663{/solr,null,UNAVAILABLE}
   [junit4]   2> 2633127 INFO  (SUITE-TestManagedSchemaAPI-seed#[89C812C3487E6EEC]-worker) [    ] o.a.s.c.ZkTestServer connecting to 127.0.0.1:44503 44503
   [junit4]   2> 2638264 INFO  (Thread-5953) [    ] o.a.s.c.ZkTestServer connecting to 127.0.0.1:44503 44503
   [junit4]   2> 2638265 WARN  (Thread-5953) [    ] o.a.s.c.ZkTestServer Watch limit violations: 
   [junit4]   2> Maximum concurrent create/delete watches above limit:
   [junit4]   2> 
   [junit4]   2> 	6	/solr/configs/conf1/managed-schema
   [junit4]   2> 	6	/solr/configs/conf1
   [junit4]   2> 	3	/solr/aliases.json
   [junit4]   2> 	3	/solr/clusterprops.json
   [junit4]   2> 	2	/solr/security.json
   [junit4]   2> 
   [junit4]   2> Maximum concurrent data watches above limit:
   [junit4]   2> 
   [junit4]   2> 	3	/solr/clusterstate.json
   [junit4]   2> 	2	/solr/collections/testschemaapi/state.json
   [junit4]   2> 
   [junit4]   2> Maximum concurrent children watches above limit:
   [junit4]   2> 
   [junit4]   2> 	3	/solr/live_nodes
   [junit4]   2> 	3	/solr/collections
   [junit4]   2> 
   [junit4]   2> 2638265 INFO  (SUITE-TestManagedSchemaAPI-seed#[89C812C3487E6EEC]-worker) [    ] o.a.s.SolrTestCaseJ4 ###deleteCore
   [junit4]   2> NOTE: leaving temporary files on disk at: /home/jenkins/workspace/Lucene-Solr-6.x-Linux/solr/build/solr-core/test/J0/temp/solr.schema.TestManagedSchemaAPI_89C812C3487E6EEC-001
   [junit4]   2> NOTE: test params are: codec=Asserting(Lucene60): {_version_=PostingsFormat(name=Direct), id=BlockTreeOrds(blocksize=128), myNewField=PostingsFormat(name=Direct)}, docValues:{}, maxPointsInLeafNode=359, maxMBSortInHeap=7.494341103636077, sim=ClassicSimilarity, locale=tr, timezone=Asia/Kamchatka
   [junit4]   2> NOTE: Linux 4.4.0-21-generic i386/Oracle Corporation 1.8.0_92 (32-bit)/cpus=12,threads=1,free=270229432,total=518979584
   [junit4]   2> NOTE: All tests run in this JVM: [TestMaxScoreQueryParser, TestShardHandlerFactory, DocumentAnalysisRequestHandlerTest, TestReplicaProperties, SparseHLLTest, TestOnReconnectListenerSupport, DistributedFacetPivotSmallTest, ActionThrottleTest, DefaultValueUpdateProcessorTest, CreateCollectionCleanupTest, ExternalFileFieldSortTest, DistributedFacetPivotLargeTest, TestRemoteStreaming, SegmentsInfoRequestHandlerTest, HdfsRestartWhileUpdatingTest, TestMiniSolrCloudClusterBase, AnalyticsQueryTest, MultiThreadedOCPTest, TestCloudBackupRestore, TestSolrQueryParserResource, TestOmitPositions, DisMaxRequestHandlerTest, TestOrdValues, TestFieldResource, TestSolrConfigHandlerConcurrent, CacheHeaderTest, SystemInfoHandlerTest, SpatialHeatmapFacetsTest, TestSmileRequest, TestDocBasedVersionConstraints, TestReplicationHandler, TestDistribDocBasedVersion, TestPerFieldSimilarityClassic, TestCustomDocTransformer, SolrCloudExampleTest, SpatialRPTFieldTypeTest, TestJoin, CloudExitableDirectoryReaderTest, CachingDirectoryFactoryTest, SolrCoreTest, TestUseDocValuesAsStored, BlockCacheTest, ConjunctionSolrSpellCheckerTest, AsyncCallRequestStatusResponseTest, JsonLoaderTest, TestIBSimilarityFactory, TestRTGBase, WrapperMergePolicyFactoryTest, TestRandomDVFaceting, CursorPagingTest, DeleteLastCustomShardedReplicaTest, TestSchemaNameResource, StandardRequestHandlerTest, TestFaceting, TestRealTimeGet, TestFunctionQuery, TestSubQueryTransformerCrossCore, TestTolerantUpdateProcessorRandomCloud, ForceLeaderTest, TestOverriddenPrefixQueryForCustomFieldType, TestDefaultStatsCache, DistributedSpellCheckComponentTest, DistributedQueryComponentOptimizationTest, TestConfigSetsAPIExclusivity, SharedFSAutoReplicaFailoverTest, TestRawResponseWriter, TestArbitraryIndexDir, TestRandomFaceting, CollectionTooManyReplicasTest, IndexSchemaTest, EchoParamsTest, DateFieldTest, VersionInfoTest, TestLeaderElectionZkExpiry, ZkStateWriterTest, TestHighlightDedupGrouping, ReplicationFactorTest, CopyFieldTest, TestDynamicFieldCollectionResource, SyncSliceTest, TestRangeQuery, TestFastOutputStream, TestSortingResponseWriter, PrimUtilsTest, IndexSchemaRuntimeFieldTest, PreAnalyzedFieldTest, TestManagedResourceStorage, TestExactStatsCache, JSONWriterTest, URLClassifyProcessorTest, TestSolrXml, TestDocSet, TestSolr4Spatial, TestFileDictionaryLookup, RulesTest, TestGraphTermsQParserPlugin, CoreMergeIndexesAdminHandlerTest, TestLazyCores, BasicDistributedZk2Test, OpenCloseCoreStressTest, OverseerTest, ClusterStateUpdateTest, TestStressVersions, HardAutoCommitTest, DistributedTermsComponentTest, StatsComponentTest, SpellCheckComponentTest, QueryElevationComponentTest, PeerSyncTest, ConvertedLegacyTest, DirectUpdateHandlerTest, TestBadConfig, TestIndexSearcher, ShowFileRequestHandlerTest, CurrencyFieldOpenExchangeTest, DistributedQueryElevationComponentTest, SolrIndexSplitterTest, AnalysisAfterCoreReloadTest, SignatureUpdateProcessorFactoryTest, TestExtendedDismaxParser, SpellCheckCollatorTest, CoreAdminHandlerTest, SolrRequestParserTest, TestFoldingMultitermQuery, SuggesterTest, TestStressLucene, TestTrie, TestCSVLoader, PolyFieldTest, NoCacheHeaderTest, TestPseudoReturnFields, TestUpdate, FieldMutatingUpdateProcessorTest, QueryEqualityTest, DocValuesMultiTest, SolrInfoMBeanTest, DebugComponentTest, TestSurroundQueryParser, DirectSolrSpellCheckerTest, FileBasedSpellCheckerTest, PathHierarchyTokenizerFactoryTest, RequiredFieldsTest, TestSolrQueryParser, RegexBoostProcessorTest, UpdateRequestProcessorFactoryTest, MBeansHandlerTest, TestAnalyzedSuggestions, TestPartialUpdateDeduplication, TestPHPSerializedResponseWriter, TestComponentsName, SearchHandlerTest, HighlighterConfigTest, SOLR749Test, TestQuerySenderListener, AlternateDirectoryTest, TestQuerySenderNoQuery, ResponseLogComponentTest, SolrIndexConfigTest, BadComponentTest, TestMergePolicyConfig, TestSolrDeletionPolicy2, TestBinaryField, TestSearchPerf, TestElisionMultitermQuery, TestConfig, OutputWriterTest, TestSolrCoreProperties, DirectSolrConnectionTest, NotRequiredUniqueKeyTest, TestLuceneMatchVersion, TestPhraseSuggestions, TestCharFilters, SynonymTokenizerTest, TestXIncludeConfig, TestSweetSpotSimilarityFactory, TestPerFieldSimilarity, TestLMDirichletSimilarityFactory, TestLMJelinekMercerSimilarityFactory, TestBM25SimilarityFactory, TestFastWriter, TimeZoneUtilsTest, ResourceLoaderTest, ScriptEngineTest, PluginInfoTest, TestFastLRUCache, DOMUtilTest, RAMDirectoryFactoryTest, TestSolrJ, TestLRUCache, TestUtils, ZkNodePropsTest, UUIDFieldTest, DistributedMLTComponentTest, SolrTestCaseJ4Test, TestCrossCoreJoin, TestCursorMarkWithoutUniqueKey, TestSimpleTrackingShardHandler, AssignTest, BaseCdcrDistributedZkTest, CdcrReplicationDistributedZkTest, CdcrVersionReplicationTest, ConcurrentDeleteAndCreateCollectionTest, DeleteShardTest, DistribJoinFromCollectionTest, LeaderInitiatedRecoveryOnCommitTest, RollingRestartTest, TestConfigSetsAPI, TestLeaderInitiatedRecoveryThread, TestTolerantUpdateProcessorCloud, TlogReplayBufferedWhileIndexingTest, VMParamsZkACLAndCredentialsProvidersTest, TestImplicitCoreProperties, TestInfoStreamLogging, TestInitParams, TestSolrConfigHandler, TestSolrDynamicMBean, TestBlobHandler, TestRestoreCore, CoreAdminRequestStatusTest, DistributedDebugComponentTest, DistributedExpandComponentTest, DistributedFacetPivotLongTailTest, FacetPivotSmallTest, TestDistributedStatsComponentCardinality, TestCollationFieldDocValues, TestManagedSchema, TestManagedSchemaAPI]
   [junit4] Completed [536/598 (1!)] on J0 in 19.24s, 1 test, 1 error <<< FAILURES!

[...truncated 243 lines...]
BUILD FAILED
/home/jenkins/workspace/Lucene-Solr-6.x-Linux/build.xml:740: The following error occurred while executing this line:
/home/jenkins/workspace/Lucene-Solr-6.x-Linux/build.xml:684: The following error occurred while executing this line:
/home/jenkins/workspace/Lucene-Solr-6.x-Linux/build.xml:59: The following error occurred while executing this line:
/home/jenkins/workspace/Lucene-Solr-6.x-Linux/solr/build.xml:233: The following error occurred while executing this line:
/home/jenkins/workspace/Lucene-Solr-6.x-Linux/solr/common-build.xml:529: The following error occurred while executing this line:
/home/jenkins/workspace/Lucene-Solr-6.x-Linux/lucene/common-build.xml:1457: The following error occurred while executing this line:
/home/jenkins/workspace/Lucene-Solr-6.x-Linux/lucene/common-build.xml:1014: There were test failures: 598 suites (10 ignored), 2420 tests, 1 error, 115 ignored (71 assumptions) [seed: 89C812C3487E6EEC]

Total time: 79 minutes 29 seconds
Build step 'Invoke Ant' marked build as failure
Archiving artifacts
[WARNINGS] Skipping publisher since build result is FAILURE
Recording test results
Email was triggered for: Failure - Any
Sending email for trigger: Failure - Any



Mime
View raw message