lucene-dev mailing list archives

Site index · List index
Message view « Date » · « Thread »
Top « Date » · « Thread »
From Policeman Jenkins Server <jenk...@thetaphi.de>
Subject [JENKINS] Lucene-Solr-6.x-MacOSX (64bit/jdk1.8.0) - Build # 141 - Still Failing!
Date Sun, 15 May 2016 21:25:36 GMT
Build: http://jenkins.thetaphi.de/job/Lucene-Solr-6.x-MacOSX/141/
Java: 64bit/jdk1.8.0 -XX:+UseCompressedOops -XX:+UseConcMarkSweepGC

1 tests failed.
FAILED:  org.apache.solr.cloud.CleanupOldIndexTest.test

Error Message:
Captured an uncaught exception in thread: Thread[id=12296, name=updateExecutor-2561-thread-1, state=RUNNABLE, group=TGRP-CleanupOldIndexTest]

Stack Trace:
com.carrotsearch.randomizedtesting.UncaughtExceptionError: Captured an uncaught exception in thread: Thread[id=12296, name=updateExecutor-2561-thread-1, state=RUNNABLE, group=TGRP-CleanupOldIndexTest]
	at __randomizedtesting.SeedInfo.seed([9035182FBDA8921D:186127F51354FFE5]:0)
Caused by: org.apache.solr.common.SolrException: Replica: http://127.0.0.1:61026/collection1/ should have been marked under leader initiated recovery in ZkController but wasn't.
	at __randomizedtesting.SeedInfo.seed([9035182FBDA8921D]:0)
	at org.apache.solr.cloud.LeaderInitiatedRecoveryThread.run(LeaderInitiatedRecoveryThread.java:88)
	at org.apache.solr.common.util.ExecutorUtil$MDCAwareThreadPoolExecutor.lambda$execute$0(ExecutorUtil.java:229)
	at java.util.concurrent.ThreadPoolExecutor.runWorker(ThreadPoolExecutor.java:1142)
	at java.util.concurrent.ThreadPoolExecutor$Worker.run(ThreadPoolExecutor.java:617)
	at java.lang.Thread.run(Thread.java:745)




Build Log:
[...truncated 11297 lines...]
   [junit4] Suite: org.apache.solr.cloud.CleanupOldIndexTest
   [junit4]   2> Creating dataDir: /Users/jenkins/workspace/Lucene-Solr-6.x-MacOSX/solr/build/solr-core/test/J1/temp/solr.cloud.CleanupOldIndexTest_9035182FBDA8921D-001/init-core-data-001
   [junit4]   2> 1791382 INFO  (SUITE-CleanupOldIndexTest-seed#[9035182FBDA8921D]-worker) [    ] o.a.s.SolrTestCaseJ4 Randomized ssl (false) and clientAuth (false)
   [junit4]   2> 1791386 INFO  (SUITE-CleanupOldIndexTest-seed#[9035182FBDA8921D]-worker) [    ] o.a.s.BaseDistributedSearchTestCase Setting hostContext system property: /
   [junit4]   2> 1791387 INFO  (TEST-CleanupOldIndexTest.test-seed#[9035182FBDA8921D]) [    ] o.a.s.c.ZkTestServer STARTING ZK TEST SERVER
   [junit4]   2> 1791388 INFO  (Thread-3826) [    ] o.a.s.c.ZkTestServer client port:0.0.0.0/0.0.0.0:0
   [junit4]   2> 1791388 INFO  (Thread-3826) [    ] o.a.s.c.ZkTestServer Starting server
   [junit4]   2> 1791488 INFO  (TEST-CleanupOldIndexTest.test-seed#[9035182FBDA8921D]) [    ] o.a.s.c.ZkTestServer start zk server on port:61005
   [junit4]   2> 1791488 INFO  (TEST-CleanupOldIndexTest.test-seed#[9035182FBDA8921D]) [    ] o.a.s.c.c.SolrZkClient Using default ZkCredentialsProvider
   [junit4]   2> 1791489 INFO  (TEST-CleanupOldIndexTest.test-seed#[9035182FBDA8921D]) [    ] o.a.s.c.c.ConnectionManager Waiting for client to connect to ZooKeeper
   [junit4]   2> 1791500 INFO  (zkCallback-2549-thread-1) [    ] o.a.s.c.c.ConnectionManager Watcher org.apache.solr.common.cloud.ConnectionManager@51b8b40f name:ZooKeeperConnection Watcher:127.0.0.1:61005 got event WatchedEvent state:SyncConnected type:None path:null path:null type:None
   [junit4]   2> 1791501 INFO  (TEST-CleanupOldIndexTest.test-seed#[9035182FBDA8921D]) [    ] o.a.s.c.c.ConnectionManager Client is connected to ZooKeeper
   [junit4]   2> 1791501 INFO  (TEST-CleanupOldIndexTest.test-seed#[9035182FBDA8921D]) [    ] o.a.s.c.c.SolrZkClient Using default ZkACLProvider
   [junit4]   2> 1791501 INFO  (TEST-CleanupOldIndexTest.test-seed#[9035182FBDA8921D]) [    ] o.a.s.c.c.SolrZkClient makePath: /solr
   [junit4]   2> 1791505 INFO  (TEST-CleanupOldIndexTest.test-seed#[9035182FBDA8921D]) [    ] o.a.s.c.c.SolrZkClient Using default ZkCredentialsProvider
   [junit4]   2> 1791507 INFO  (TEST-CleanupOldIndexTest.test-seed#[9035182FBDA8921D]) [    ] o.a.s.c.c.ConnectionManager Waiting for client to connect to ZooKeeper
   [junit4]   2> 1791510 INFO  (zkCallback-2550-thread-1) [    ] o.a.s.c.c.ConnectionManager Watcher org.apache.solr.common.cloud.ConnectionManager@511f842b name:ZooKeeperConnection Watcher:127.0.0.1:61005/solr got event WatchedEvent state:SyncConnected type:None path:null path:null type:None
   [junit4]   2> 1791510 INFO  (TEST-CleanupOldIndexTest.test-seed#[9035182FBDA8921D]) [    ] o.a.s.c.c.ConnectionManager Client is connected to ZooKeeper
   [junit4]   2> 1791511 INFO  (TEST-CleanupOldIndexTest.test-seed#[9035182FBDA8921D]) [    ] o.a.s.c.c.SolrZkClient Using default ZkACLProvider
   [junit4]   2> 1791511 INFO  (TEST-CleanupOldIndexTest.test-seed#[9035182FBDA8921D]) [    ] o.a.s.c.c.SolrZkClient makePath: /collections/collection1
   [junit4]   2> 1791514 INFO  (TEST-CleanupOldIndexTest.test-seed#[9035182FBDA8921D]) [    ] o.a.s.c.c.SolrZkClient makePath: /collections/collection1/shards
   [junit4]   2> 1791517 INFO  (TEST-CleanupOldIndexTest.test-seed#[9035182FBDA8921D]) [    ] o.a.s.c.c.SolrZkClient makePath: /collections/control_collection
   [junit4]   2> 1791519 INFO  (TEST-CleanupOldIndexTest.test-seed#[9035182FBDA8921D]) [    ] o.a.s.c.c.SolrZkClient makePath: /collections/control_collection/shards
   [junit4]   2> 1791522 INFO  (TEST-CleanupOldIndexTest.test-seed#[9035182FBDA8921D]) [    ] o.a.s.c.AbstractZkTestCase put /Users/jenkins/workspace/Lucene-Solr-6.x-MacOSX/solr/core/src/test-files/solr/collection1/conf/solrconfig-tlog.xml to /configs/conf1/solrconfig.xml
   [junit4]   2> 1791523 INFO  (TEST-CleanupOldIndexTest.test-seed#[9035182FBDA8921D]) [    ] o.a.s.c.c.SolrZkClient makePath: /configs/conf1/solrconfig.xml
   [junit4]   2> 1791527 INFO  (TEST-CleanupOldIndexTest.test-seed#[9035182FBDA8921D]) [    ] o.a.s.c.AbstractZkTestCase put /Users/jenkins/workspace/Lucene-Solr-6.x-MacOSX/solr/core/src/test-files/solr/collection1/conf/schema15.xml to /configs/conf1/schema.xml
   [junit4]   2> 1791527 INFO  (TEST-CleanupOldIndexTest.test-seed#[9035182FBDA8921D]) [    ] o.a.s.c.c.SolrZkClient makePath: /configs/conf1/schema.xml
   [junit4]   2> 1791529 INFO  (TEST-CleanupOldIndexTest.test-seed#[9035182FBDA8921D]) [    ] o.a.s.c.AbstractZkTestCase put /Users/jenkins/workspace/Lucene-Solr-6.x-MacOSX/solr/core/src/test-files/solr/collection1/conf/solrconfig.snippet.randomindexconfig.xml to /configs/conf1/solrconfig.snippet.randomindexconfig.xml
   [junit4]   2> 1791530 INFO  (TEST-CleanupOldIndexTest.test-seed#[9035182FBDA8921D]) [    ] o.a.s.c.c.SolrZkClient makePath: /configs/conf1/solrconfig.snippet.randomindexconfig.xml
   [junit4]   2> 1791533 INFO  (TEST-CleanupOldIndexTest.test-seed#[9035182FBDA8921D]) [    ] o.a.s.c.AbstractZkTestCase put /Users/jenkins/workspace/Lucene-Solr-6.x-MacOSX/solr/core/src/test-files/solr/collection1/conf/stopwords.txt to /configs/conf1/stopwords.txt
   [junit4]   2> 1791533 INFO  (TEST-CleanupOldIndexTest.test-seed#[9035182FBDA8921D]) [    ] o.a.s.c.c.SolrZkClient makePath: /configs/conf1/stopwords.txt
   [junit4]   2> 1791536 INFO  (TEST-CleanupOldIndexTest.test-seed#[9035182FBDA8921D]) [    ] o.a.s.c.AbstractZkTestCase put /Users/jenkins/workspace/Lucene-Solr-6.x-MacOSX/solr/core/src/test-files/solr/collection1/conf/protwords.txt to /configs/conf1/protwords.txt
   [junit4]   2> 1791537 INFO  (TEST-CleanupOldIndexTest.test-seed#[9035182FBDA8921D]) [    ] o.a.s.c.c.SolrZkClient makePath: /configs/conf1/protwords.txt
   [junit4]   2> 1791540 INFO  (TEST-CleanupOldIndexTest.test-seed#[9035182FBDA8921D]) [    ] o.a.s.c.AbstractZkTestCase put /Users/jenkins/workspace/Lucene-Solr-6.x-MacOSX/solr/core/src/test-files/solr/collection1/conf/currency.xml to /configs/conf1/currency.xml
   [junit4]   2> 1791540 INFO  (TEST-CleanupOldIndexTest.test-seed#[9035182FBDA8921D]) [    ] o.a.s.c.c.SolrZkClient makePath: /configs/conf1/currency.xml
   [junit4]   2> 1791548 INFO  (TEST-CleanupOldIndexTest.test-seed#[9035182FBDA8921D]) [    ] o.a.s.c.AbstractZkTestCase put /Users/jenkins/workspace/Lucene-Solr-6.x-MacOSX/solr/core/src/test-files/solr/collection1/conf/enumsConfig.xml to /configs/conf1/enumsConfig.xml
   [junit4]   2> 1791548 INFO  (TEST-CleanupOldIndexTest.test-seed#[9035182FBDA8921D]) [    ] o.a.s.c.c.SolrZkClient makePath: /configs/conf1/enumsConfig.xml
   [junit4]   2> 1791551 INFO  (TEST-CleanupOldIndexTest.test-seed#[9035182FBDA8921D]) [    ] o.a.s.c.AbstractZkTestCase put /Users/jenkins/workspace/Lucene-Solr-6.x-MacOSX/solr/core/src/test-files/solr/collection1/conf/open-exchange-rates.json to /configs/conf1/open-exchange-rates.json
   [junit4]   2> 1791551 INFO  (TEST-CleanupOldIndexTest.test-seed#[9035182FBDA8921D]) [    ] o.a.s.c.c.SolrZkClient makePath: /configs/conf1/open-exchange-rates.json
   [junit4]   2> 1791557 INFO  (TEST-CleanupOldIndexTest.test-seed#[9035182FBDA8921D]) [    ] o.a.s.c.AbstractZkTestCase put /Users/jenkins/workspace/Lucene-Solr-6.x-MacOSX/solr/core/src/test-files/solr/collection1/conf/mapping-ISOLatin1Accent.txt to /configs/conf1/mapping-ISOLatin1Accent.txt
   [junit4]   2> 1791558 INFO  (TEST-CleanupOldIndexTest.test-seed#[9035182FBDA8921D]) [    ] o.a.s.c.c.SolrZkClient makePath: /configs/conf1/mapping-ISOLatin1Accent.txt
   [junit4]   2> 1791560 INFO  (TEST-CleanupOldIndexTest.test-seed#[9035182FBDA8921D]) [    ] o.a.s.c.AbstractZkTestCase put /Users/jenkins/workspace/Lucene-Solr-6.x-MacOSX/solr/core/src/test-files/solr/collection1/conf/old_synonyms.txt to /configs/conf1/old_synonyms.txt
   [junit4]   2> 1791561 INFO  (TEST-CleanupOldIndexTest.test-seed#[9035182FBDA8921D]) [    ] o.a.s.c.c.SolrZkClient makePath: /configs/conf1/old_synonyms.txt
   [junit4]   2> 1791563 INFO  (TEST-CleanupOldIndexTest.test-seed#[9035182FBDA8921D]) [    ] o.a.s.c.AbstractZkTestCase put /Users/jenkins/workspace/Lucene-Solr-6.x-MacOSX/solr/core/src/test-files/solr/collection1/conf/synonyms.txt to /configs/conf1/synonyms.txt
   [junit4]   2> 1791564 INFO  (TEST-CleanupOldIndexTest.test-seed#[9035182FBDA8921D]) [    ] o.a.s.c.c.SolrZkClient makePath: /configs/conf1/synonyms.txt
   [junit4]   2> 1791919 INFO  (TEST-CleanupOldIndexTest.test-seed#[9035182FBDA8921D]) [    ] o.a.s.SolrTestCaseJ4 Writing core.properties file to /Users/jenkins/workspace/Lucene-Solr-6.x-MacOSX/solr/build/solr-core/test/J1/temp/solr.cloud.CleanupOldIndexTest_9035182FBDA8921D-001/control-001/cores/collection1
   [junit4]   2> 1791921 INFO  (TEST-CleanupOldIndexTest.test-seed#[9035182FBDA8921D]) [    ] o.e.j.s.Server jetty-9.3.8.v20160314
   [junit4]   2> 1791924 INFO  (TEST-CleanupOldIndexTest.test-seed#[9035182FBDA8921D]) [    ] o.e.j.s.h.ContextHandler Started o.e.j.s.ServletContextHandler@69abc788{/,null,AVAILABLE}
   [junit4]   2> 1791924 INFO  (TEST-CleanupOldIndexTest.test-seed#[9035182FBDA8921D]) [    ] o.e.j.s.ServerConnector Started ServerConnector@338e913e{HTTP/1.1,[http/1.1]}{127.0.0.1:61008}
   [junit4]   2> 1791925 INFO  (TEST-CleanupOldIndexTest.test-seed#[9035182FBDA8921D]) [    ] o.e.j.s.Server Started @1797381ms
   [junit4]   2> 1791925 INFO  (TEST-CleanupOldIndexTest.test-seed#[9035182FBDA8921D]) [    ] o.a.s.c.s.e.JettySolrRunner Jetty properties: {solr.data.dir=/Users/jenkins/workspace/Lucene-Solr-6.x-MacOSX/solr/build/solr-core/test/J1/temp/solr.cloud.CleanupOldIndexTest_9035182FBDA8921D-001/tempDir-001/control/data, hostContext=/, hostPort=61008, coreRootDirectory=/Users/jenkins/workspace/Lucene-Solr-6.x-MacOSX/solr/build/solr-core/test/J1/temp/solr.cloud.CleanupOldIndexTest_9035182FBDA8921D-001/control-001/cores}
   [junit4]   2> 1791926 INFO  (TEST-CleanupOldIndexTest.test-seed#[9035182FBDA8921D]) [    ] o.a.s.s.SolrDispatchFilter SolrDispatchFilter.init(): sun.misc.Launcher$AppClassLoader@4554617c
   [junit4]   2> 1791926 INFO  (TEST-CleanupOldIndexTest.test-seed#[9035182FBDA8921D]) [    ] o.a.s.c.SolrResourceLoader new SolrResourceLoader for directory: '/Users/jenkins/workspace/Lucene-Solr-6.x-MacOSX/solr/build/solr-core/test/J1/temp/solr.cloud.CleanupOldIndexTest_9035182FBDA8921D-001/control-001'
   [junit4]   2> 1791926 INFO  (TEST-CleanupOldIndexTest.test-seed#[9035182FBDA8921D]) [    ] o.a.s.c.SolrResourceLoader JNDI not configured for solr (NoInitialContextEx)
   [junit4]   2> 1791926 INFO  (TEST-CleanupOldIndexTest.test-seed#[9035182FBDA8921D]) [    ] o.a.s.c.SolrResourceLoader solr home defaulted to 'solr/' (could not find system property or JNDI)
   [junit4]   2> 1791926 INFO  (TEST-CleanupOldIndexTest.test-seed#[9035182FBDA8921D]) [    ] o.a.s.c.c.SolrZkClient Using default ZkCredentialsProvider
   [junit4]   2> 1791927 INFO  (TEST-CleanupOldIndexTest.test-seed#[9035182FBDA8921D]) [    ] o.a.s.c.c.ConnectionManager Waiting for client to connect to ZooKeeper
   [junit4]   2> 1791937 INFO  (zkCallback-2551-thread-1) [    ] o.a.s.c.c.ConnectionManager Watcher org.apache.solr.common.cloud.ConnectionManager@31efeaf8 name:ZooKeeperConnection Watcher:127.0.0.1:61005/solr got event WatchedEvent state:SyncConnected type:None path:null path:null type:None
   [junit4]   2> 1791937 INFO  (TEST-CleanupOldIndexTest.test-seed#[9035182FBDA8921D]) [    ] o.a.s.c.c.ConnectionManager Client is connected to ZooKeeper
   [junit4]   2> 1791938 INFO  (TEST-CleanupOldIndexTest.test-seed#[9035182FBDA8921D]) [    ] o.a.s.c.c.SolrZkClient Using default ZkACLProvider
   [junit4]   2> 1791939 INFO  (TEST-CleanupOldIndexTest.test-seed#[9035182FBDA8921D]) [    ] o.a.s.s.SolrDispatchFilter Loading solr.xml from SolrHome (not found in ZooKeeper)
   [junit4]   2> 1791940 INFO  (TEST-CleanupOldIndexTest.test-seed#[9035182FBDA8921D]) [    ] o.a.s.c.SolrXmlConfig Loading container configuration from /Users/jenkins/workspace/Lucene-Solr-6.x-MacOSX/solr/build/solr-core/test/J1/temp/solr.cloud.CleanupOldIndexTest_9035182FBDA8921D-001/control-001/solr.xml
   [junit4]   2> 1791946 INFO  (TEST-CleanupOldIndexTest.test-seed#[9035182FBDA8921D]) [    ] o.a.s.c.CorePropertiesLocator Config-defined core root directory: /Users/jenkins/workspace/Lucene-Solr-6.x-MacOSX/solr/build/solr-core/test/J1/temp/solr.cloud.CleanupOldIndexTest_9035182FBDA8921D-001/control-001/cores
   [junit4]   2> 1791946 INFO  (TEST-CleanupOldIndexTest.test-seed#[9035182FBDA8921D]) [    ] o.a.s.c.CoreContainer New CoreContainer 336170562
   [junit4]   2> 1791946 INFO  (TEST-CleanupOldIndexTest.test-seed#[9035182FBDA8921D]) [    ] o.a.s.c.CoreContainer Loading cores into CoreContainer [instanceDir=/Users/jenkins/workspace/Lucene-Solr-6.x-MacOSX/solr/build/solr-core/test/J1/temp/solr.cloud.CleanupOldIndexTest_9035182FBDA8921D-001/control-001]
   [junit4]   2> 1791946 WARN  (TEST-CleanupOldIndexTest.test-seed#[9035182FBDA8921D]) [    ] o.a.s.c.CoreContainer Couldn't add files from /Users/jenkins/workspace/Lucene-Solr-6.x-MacOSX/solr/build/solr-core/test/J1/temp/solr.cloud.CleanupOldIndexTest_9035182FBDA8921D-001/control-001/lib to classpath: /Users/jenkins/workspace/Lucene-Solr-6.x-MacOSX/solr/build/solr-core/test/J1/temp/solr.cloud.CleanupOldIndexTest_9035182FBDA8921D-001/control-001/lib
   [junit4]   2> 1791947 INFO  (TEST-CleanupOldIndexTest.test-seed#[9035182FBDA8921D]) [    ] o.a.s.h.c.HttpShardHandlerFactory created with socketTimeout : 90000,urlScheme : ,connTimeout : 15000,maxConnectionsPerHost : 20,maxConnections : 10000,corePoolSize : 0,maximumPoolSize : 2147483647,maxThreadIdleTime : 5,sizeOfQueue : -1,fairnessPolicy : false,useRetries : false,
   [junit4]   2> 1791949 INFO  (TEST-CleanupOldIndexTest.test-seed#[9035182FBDA8921D]) [    ] o.a.s.u.UpdateShardHandler Creating UpdateShardHandler HTTP client with params: socketTimeout=340000&connTimeout=45000&retry=true
   [junit4]   2> 1791950 INFO  (TEST-CleanupOldIndexTest.test-seed#[9035182FBDA8921D]) [    ] o.a.s.l.LogWatcher SLF4J impl is org.slf4j.impl.Log4jLoggerFactory
   [junit4]   2> 1791950 INFO  (TEST-CleanupOldIndexTest.test-seed#[9035182FBDA8921D]) [    ] o.a.s.l.LogWatcher Registering Log Listener [Log4j (org.slf4j.impl.Log4jLoggerFactory)]
   [junit4]   2> 1791950 INFO  (TEST-CleanupOldIndexTest.test-seed#[9035182FBDA8921D]) [    ] o.a.s.c.ZkContainer Zookeeper client=127.0.0.1:61005/solr
   [junit4]   2> 1791950 INFO  (TEST-CleanupOldIndexTest.test-seed#[9035182FBDA8921D]) [    ] o.a.s.c.ZkController zkHost includes chroot
   [junit4]   2> 1791950 INFO  (TEST-CleanupOldIndexTest.test-seed#[9035182FBDA8921D]) [    ] o.a.s.c.c.SolrZkClient Using default ZkCredentialsProvider
   [junit4]   2> 1791951 INFO  (TEST-CleanupOldIndexTest.test-seed#[9035182FBDA8921D]) [    ] o.a.s.c.c.ConnectionManager Waiting for client to connect to ZooKeeper
   [junit4]   2> 1791952 INFO  (zkCallback-2554-thread-1) [    ] o.a.s.c.c.ConnectionManager Watcher org.apache.solr.common.cloud.ConnectionManager@27b054a4 name:ZooKeeperConnection Watcher:127.0.0.1:61005 got event WatchedEvent state:SyncConnected type:None path:null path:null type:None
   [junit4]   2> 1791953 INFO  (TEST-CleanupOldIndexTest.test-seed#[9035182FBDA8921D]) [    ] o.a.s.c.c.ConnectionManager Client is connected to ZooKeeper
   [junit4]   2> 1791954 INFO  (TEST-CleanupOldIndexTest.test-seed#[9035182FBDA8921D]) [    ] o.a.s.c.c.SolrZkClient Using default ZkACLProvider
   [junit4]   2> 1791956 INFO  (TEST-CleanupOldIndexTest.test-seed#[9035182FBDA8921D]) [n:127.0.0.1:61008_    ] o.a.s.c.ZkController Added new OnReconnect listener org.apache.solr.cloud.ZkController$$Lambda$31/1678958214@76bcb9b2
   [junit4]   2> 1791957 INFO  (TEST-CleanupOldIndexTest.test-seed#[9035182FBDA8921D]) [n:127.0.0.1:61008_    ] o.a.s.c.c.ConnectionManager Waiting for client to connect to ZooKeeper
   [junit4]   2> 1791958 INFO  (zkCallback-2555-thread-1-processing-n:127.0.0.1:61008_) [n:127.0.0.1:61008_    ] o.a.s.c.c.ConnectionManager Watcher org.apache.solr.common.cloud.ConnectionManager@73e99b33 name:ZooKeeperConnection Watcher:127.0.0.1:61005/solr got event WatchedEvent state:SyncConnected type:None path:null path:null type:None
   [junit4]   2> 1791958 INFO  (TEST-CleanupOldIndexTest.test-seed#[9035182FBDA8921D]) [n:127.0.0.1:61008_    ] o.a.s.c.c.ConnectionManager Client is connected to ZooKeeper
   [junit4]   2> 1791960 INFO  (TEST-CleanupOldIndexTest.test-seed#[9035182FBDA8921D]) [n:127.0.0.1:61008_    ] o.a.s.c.c.SolrZkClient makePath: /overseer/queue
   [junit4]   2> 1791964 INFO  (TEST-CleanupOldIndexTest.test-seed#[9035182FBDA8921D]) [n:127.0.0.1:61008_    ] o.a.s.c.c.SolrZkClient makePath: /overseer/collection-queue-work
   [junit4]   2> 1791970 INFO  (TEST-CleanupOldIndexTest.test-seed#[9035182FBDA8921D]) [n:127.0.0.1:61008_    ] o.a.s.c.c.SolrZkClient makePath: /overseer/collection-map-running
   [junit4]   2> 1791974 INFO  (TEST-CleanupOldIndexTest.test-seed#[9035182FBDA8921D]) [n:127.0.0.1:61008_    ] o.a.s.c.c.SolrZkClient makePath: /overseer/collection-map-completed
   [junit4]   2> 1791978 INFO  (TEST-CleanupOldIndexTest.test-seed#[9035182FBDA8921D]) [n:127.0.0.1:61008_    ] o.a.s.c.c.SolrZkClient makePath: /overseer/collection-map-failure
   [junit4]   2> 1791982 INFO  (TEST-CleanupOldIndexTest.test-seed#[9035182FBDA8921D]) [n:127.0.0.1:61008_    ] o.a.s.c.c.SolrZkClient makePath: /live_nodes
   [junit4]   2> 1791985 INFO  (TEST-CleanupOldIndexTest.test-seed#[9035182FBDA8921D]) [n:127.0.0.1:61008_    ] o.a.s.c.c.SolrZkClient makePath: /aliases.json
   [junit4]   2> 1791988 INFO  (TEST-CleanupOldIndexTest.test-seed#[9035182FBDA8921D]) [n:127.0.0.1:61008_    ] o.a.s.c.c.SolrZkClient makePath: /clusterstate.json
   [junit4]   2> 1791992 INFO  (TEST-CleanupOldIndexTest.test-seed#[9035182FBDA8921D]) [n:127.0.0.1:61008_    ] o.a.s.c.c.SolrZkClient makePath: /security.json
   [junit4]   2> 1791995 INFO  (TEST-CleanupOldIndexTest.test-seed#[9035182FBDA8921D]) [n:127.0.0.1:61008_    ] o.a.s.c.c.ZkStateReader Updating cluster state from ZooKeeper... 
   [junit4]   2> 1791996 INFO  (TEST-CleanupOldIndexTest.test-seed#[9035182FBDA8921D]) [n:127.0.0.1:61008_    ] o.a.s.c.c.ZkStateReader Loaded empty cluster properties
   [junit4]   2> 1791998 INFO  (TEST-CleanupOldIndexTest.test-seed#[9035182FBDA8921D]) [n:127.0.0.1:61008_    ] o.a.s.c.c.ZkStateReader Updated live nodes from ZooKeeper... (0) -> (0)
   [junit4]   2> 1792007 INFO  (TEST-CleanupOldIndexTest.test-seed#[9035182FBDA8921D]) [n:127.0.0.1:61008_    ] o.a.s.c.c.SolrZkClient makePath: /overseer_elect
   [junit4]   2> 1792012 INFO  (TEST-CleanupOldIndexTest.test-seed#[9035182FBDA8921D]) [n:127.0.0.1:61008_    ] o.a.s.c.c.SolrZkClient makePath: /overseer_elect/election
   [junit4]   2> 1792016 INFO  (TEST-CleanupOldIndexTest.test-seed#[9035182FBDA8921D]) [n:127.0.0.1:61008_    ] o.a.s.c.Overseer Overseer (id=null) closing
   [junit4]   2> 1792017 INFO  (TEST-CleanupOldIndexTest.test-seed#[9035182FBDA8921D]) [n:127.0.0.1:61008_    ] o.a.s.c.LeaderElector Joined leadership election with path: /overseer_elect/election/95901818354401284-127.0.0.1:61008_-n_0000000000
   [junit4]   2> 1792018 INFO  (TEST-CleanupOldIndexTest.test-seed#[9035182FBDA8921D]) [n:127.0.0.1:61008_    ] o.a.s.c.OverseerElectionContext I am going to be the leader 127.0.0.1:61008_
   [junit4]   2> 1792018 INFO  (TEST-CleanupOldIndexTest.test-seed#[9035182FBDA8921D]) [n:127.0.0.1:61008_    ] o.a.s.c.c.SolrZkClient makePath: /overseer_elect/leader
   [junit4]   2> 1792021 INFO  (TEST-CleanupOldIndexTest.test-seed#[9035182FBDA8921D]) [n:127.0.0.1:61008_    ] o.a.s.c.Overseer Overseer (id=95901818354401284-127.0.0.1:61008_-n_0000000000) starting
   [junit4]   2> 1792026 INFO  (TEST-CleanupOldIndexTest.test-seed#[9035182FBDA8921D]) [n:127.0.0.1:61008_    ] o.a.s.c.c.SolrZkClient makePath: /overseer/queue-work
   [junit4]   2> 1792040 INFO  (TEST-CleanupOldIndexTest.test-seed#[9035182FBDA8921D]) [n:127.0.0.1:61008_    ] o.a.s.c.OverseerAutoReplicaFailoverThread Starting OverseerAutoReplicaFailoverThread autoReplicaFailoverWorkLoopDelay=10000 autoReplicaFailoverWaitAfterExpiration=30000 autoReplicaFailoverBadNodeExpiration=60000
   [junit4]   2> 1792041 INFO  (OverseerCollectionConfigSetProcessor-95901818354401284-127.0.0.1:61008_-n_0000000000) [n:127.0.0.1:61008_    ] o.a.s.c.OverseerTaskProcessor Process current queue of overseer operations
   [junit4]   2> 1792042 INFO  (OverseerStateUpdate-95901818354401284-127.0.0.1:61008_-n_0000000000) [n:127.0.0.1:61008_    ] o.a.s.c.Overseer Starting to work on the main queue
   [junit4]   2> 1792047 INFO  (OverseerStateUpdate-95901818354401284-127.0.0.1:61008_-n_0000000000) [n:127.0.0.1:61008_    ] o.a.s.c.c.ZkStateReader Updated live nodes from ZooKeeper... (0) -> (0)
   [junit4]   2> 1792047 INFO  (TEST-CleanupOldIndexTest.test-seed#[9035182FBDA8921D]) [n:127.0.0.1:61008_    ] o.a.s.c.ZkController Register node as live in ZooKeeper:/live_nodes/127.0.0.1:61008_
   [junit4]   2> 1792050 INFO  (TEST-CleanupOldIndexTest.test-seed#[9035182FBDA8921D]) [n:127.0.0.1:61008_    ] o.a.s.c.c.SolrZkClient makePath: /live_nodes/127.0.0.1:61008_
   [junit4]   2> 1792053 INFO  (zkCallback-2555-thread-1-processing-n:127.0.0.1:61008_) [n:127.0.0.1:61008_    ] o.a.s.c.c.ZkStateReader A live node change: [WatchedEvent state:SyncConnected type:NodeChildrenChanged path:/live_nodes], has occurred - updating... (live nodes size: [0])
   [junit4]   2> 1792054 INFO  (zkCallback-2555-thread-1-processing-n:127.0.0.1:61008_) [n:127.0.0.1:61008_    ] o.a.s.c.c.ZkStateReader Updated live nodes from ZooKeeper... (0) -> (1)
   [junit4]   2> 1792071 INFO  (TEST-CleanupOldIndexTest.test-seed#[9035182FBDA8921D]) [n:127.0.0.1:61008_    ] o.a.s.c.CoreContainer Security conf doesn't exist. Skipping setup for authorization module.
   [junit4]   2> 1792072 INFO  (TEST-CleanupOldIndexTest.test-seed#[9035182FBDA8921D]) [n:127.0.0.1:61008_    ] o.a.s.c.CoreContainer No authentication plugin used.
   [junit4]   2> 1792074 INFO  (TEST-CleanupOldIndexTest.test-seed#[9035182FBDA8921D]) [n:127.0.0.1:61008_    ] o.a.s.c.CorePropertiesLocator Looking for core definitions underneath /Users/jenkins/workspace/Lucene-Solr-6.x-MacOSX/solr/build/solr-core/test/J1/temp/solr.cloud.CleanupOldIndexTest_9035182FBDA8921D-001/control-001/cores
   [junit4]   2> 1792076 INFO  (TEST-CleanupOldIndexTest.test-seed#[9035182FBDA8921D]) [n:127.0.0.1:61008_    ] o.a.s.c.CoreDescriptor Created CoreDescriptor: {name=collection1, config=solrconfig.xml, transient=false, schema=schema.xml, loadOnStartup=true, configSetProperties=configsetprops.json, collection=control_collection, coreNodeName=, dataDir=data/, shard=}
   [junit4]   2> 1792076 INFO  (TEST-CleanupOldIndexTest.test-seed#[9035182FBDA8921D]) [n:127.0.0.1:61008_    ] o.a.s.c.CorePropertiesLocator Found core collection1 in /Users/jenkins/workspace/Lucene-Solr-6.x-MacOSX/solr/build/solr-core/test/J1/temp/solr.cloud.CleanupOldIndexTest_9035182FBDA8921D-001/control-001/cores/collection1
   [junit4]   2> 1792076 INFO  (TEST-CleanupOldIndexTest.test-seed#[9035182FBDA8921D]) [n:127.0.0.1:61008_    ] o.a.s.c.CorePropertiesLocator Found 1 core definitions
   [junit4]   2> 1792078 INFO  (coreLoadExecutor-5127-thread-1-processing-n:127.0.0.1:61008_) [n:127.0.0.1:61008_ c:control_collection   x:collection1] o.a.s.c.ZkController publishing state=down
   [junit4]   2> 1792078 INFO  (coreLoadExecutor-5127-thread-1-processing-n:127.0.0.1:61008_) [n:127.0.0.1:61008_ c:control_collection   x:collection1] o.a.s.c.ZkController numShards not found on descriptor - reading it from system property
   [junit4]   2> 1792081 INFO  (coreLoadExecutor-5127-thread-1-processing-n:127.0.0.1:61008_) [n:127.0.0.1:61008_ c:control_collection   x:collection1] o.a.s.c.ZkController Collection control_collection not visible yet, but flagging it so a watch is registered when it becomes visible
   [junit4]   2> 1792082 INFO  (TEST-CleanupOldIndexTest.test-seed#[9035182FBDA8921D]) [n:127.0.0.1:61008_    ] o.a.s.s.SolrDispatchFilter user.dir=/Users/jenkins/workspace/Lucene-Solr-6.x-MacOSX/solr/build/solr-core/test/J1
   [junit4]   2> 1792083 INFO  (coreLoadExecutor-5127-thread-1-processing-n:127.0.0.1:61008_) [n:127.0.0.1:61008_ c:control_collection   x:collection1] o.a.s.c.c.ZkStateReader Deleting data for [control_collection]
   [junit4]   2> 1792083 INFO  (TEST-CleanupOldIndexTest.test-seed#[9035182FBDA8921D]) [n:127.0.0.1:61008_    ] o.a.s.s.SolrDispatchFilter SolrDispatchFilter.init() done
   [junit4]   2> 1792082 INFO  (OverseerStateUpdate-95901818354401284-127.0.0.1:61008_-n_0000000000) [n:127.0.0.1:61008_    ] o.a.s.c.Overseer processMessage: queueSize: 1, message = {
   [junit4]   2>   "core":"collection1",
   [junit4]   2>   "roles":null,
   [junit4]   2>   "base_url":"http://127.0.0.1:61008",
   [junit4]   2>   "node_name":"127.0.0.1:61008_",
   [junit4]   2>   "numShards":"1",
   [junit4]   2>   "state":"down",
   [junit4]   2>   "shard":null,
   [junit4]   2>   "collection":"control_collection",
   [junit4]   2>   "operation":"state"} current state version: 0
   [junit4]   2> 1792083 INFO  (OverseerStateUpdate-95901818354401284-127.0.0.1:61008_-n_0000000000) [n:127.0.0.1:61008_    ] o.a.s.c.o.ReplicaMutator Update state numShards=1 message={
   [junit4]   2>   "core":"collection1",
   [junit4]   2>   "roles":null,
   [junit4]   2>   "base_url":"http://127.0.0.1:61008",
   [junit4]   2>   "node_name":"127.0.0.1:61008_",
   [junit4]   2>   "numShards":"1",
   [junit4]   2>   "state":"down",
   [junit4]   2>   "shard":null,
   [junit4]   2>   "collection":"control_collection",
   [junit4]   2>   "operation":"state"}
   [junit4]   2> 1792084 INFO  (OverseerStateUpdate-95901818354401284-127.0.0.1:61008_-n_0000000000) [n:127.0.0.1:61008_    ] o.a.s.c.o.ClusterStateMutator building a new cName: control_collection
   [junit4]   2> 1792086 INFO  (OverseerStateUpdate-95901818354401284-127.0.0.1:61008_-n_0000000000) [n:127.0.0.1:61008_    ] o.a.s.c.o.ReplicaMutator Assigning new node to shard shard=shard1
   [junit4]   2> 1792086 INFO  (coreLoadExecutor-5127-thread-1-processing-n:127.0.0.1:61008_) [n:127.0.0.1:61008_ c:control_collection   x:collection1] o.a.s.c.ZkController look for our core node name
   [junit4]   2> 1792089 INFO  (zkCallback-2555-thread-1-processing-n:127.0.0.1:61008_) [n:127.0.0.1:61008_    ] o.a.s.c.c.ZkStateReader A cluster state change: [WatchedEvent state:SyncConnected type:NodeDataChanged path:/clusterstate.json], has occurred - updating... (live nodes size: [1])
   [junit4]   2> 1793097 INFO  (coreLoadExecutor-5127-thread-1-processing-n:127.0.0.1:61008_) [n:127.0.0.1:61008_ c:control_collection   x:collection1] o.a.s.c.ZkController waiting to find shard id in clusterstate for collection1
   [junit4]   2> 1793097 INFO  (coreLoadExecutor-5127-thread-1-processing-n:127.0.0.1:61008_) [n:127.0.0.1:61008_ c:control_collection   x:collection1] o.a.s.c.ZkController Check for collection zkNode:control_collection
   [junit4]   2> 1793098 INFO  (coreLoadExecutor-5127-thread-1-processing-n:127.0.0.1:61008_) [n:127.0.0.1:61008_ c:control_collection   x:collection1] o.a.s.c.ZkController Collection zkNode exists
   [junit4]   2> 1793098 INFO  (coreLoadExecutor-5127-thread-1-processing-n:127.0.0.1:61008_) [n:127.0.0.1:61008_ c:control_collection   x:collection1] o.a.s.c.c.ZkStateReader Load collection config from: [/collections/control_collection]
   [junit4]   2> 1793099 INFO  (coreLoadExecutor-5127-thread-1-processing-n:127.0.0.1:61008_) [n:127.0.0.1:61008_ c:control_collection   x:collection1] o.a.s.c.c.ZkStateReader path=[/collections/control_collection] [configName]=[conf1] specified config exists in ZooKeeper
   [junit4]   2> 1793099 INFO  (coreLoadExecutor-5127-thread-1-processing-n:127.0.0.1:61008_) [n:127.0.0.1:61008_ c:control_collection   x:collection1] o.a.s.c.SolrResourceLoader new SolrResourceLoader for directory: '/Users/jenkins/workspace/Lucene-Solr-6.x-MacOSX/solr/build/solr-core/test/J1/temp/solr.cloud.CleanupOldIndexTest_9035182FBDA8921D-001/control-001/cores/collection1'
   [junit4]   2> 1793099 INFO  (coreLoadExecutor-5127-thread-1-processing-n:127.0.0.1:61008_) [n:127.0.0.1:61008_ c:control_collection   x:collection1] o.a.s.c.SolrResourceLoader JNDI not configured for solr (NoInitialContextEx)
   [junit4]   2> 1793099 INFO  (coreLoadExecutor-5127-thread-1-processing-n:127.0.0.1:61008_) [n:127.0.0.1:61008_ c:control_collection   x:collection1] o.a.s.c.SolrResourceLoader solr home defaulted to 'solr/' (could not find system property or JNDI)
   [junit4]   2> 1793102 INFO  (coreLoadExecutor-5127-thread-1-processing-n:127.0.0.1:61008_) [n:127.0.0.1:61008_ c:control_collection   x:collection1] o.a.s.c.Config loaded config solrconfig.xml with version 0 
   [junit4]   2> 1793108 INFO  (coreLoadExecutor-5127-thread-1-processing-n:127.0.0.1:61008_) [n:127.0.0.1:61008_ c:control_collection   x:collection1] o.a.s.c.SolrConfig current version of requestparams : -1
   [junit4]   2> 1793110 WARN  (coreLoadExecutor-5127-thread-1-processing-n:127.0.0.1:61008_) [n:127.0.0.1:61008_ c:control_collection   x:collection1] o.a.s.c.Config Beginning with Solr 5.5, <mergePolicy> is deprecated, use <mergePolicyFactory> instead.
   [junit4]   2> 1793111 INFO  (coreLoadExecutor-5127-thread-1-processing-n:127.0.0.1:61008_) [n:127.0.0.1:61008_ c:control_collection   x:collection1] o.a.s.c.SolrConfig Using Lucene MatchVersion: 6.1.0
   [junit4]   2> 1793117 INFO  (coreLoadExecutor-5127-thread-1-processing-n:127.0.0.1:61008_) [n:127.0.0.1:61008_ c:control_collection   x:collection1] o.a.s.c.SolrConfig Loaded SolrConfig: solrconfig.xml
   [junit4]   2> 1793122 INFO  (coreLoadExecutor-5127-thread-1-processing-n:127.0.0.1:61008_) [n:127.0.0.1:61008_ c:control_collection   x:collection1] o.a.s.s.IndexSchema [collection1] Schema name=test
   [junit4]   2> 1793177 INFO  (coreLoadExecutor-5127-thread-1-processing-n:127.0.0.1:61008_) [n:127.0.0.1:61008_ c:control_collection   x:collection1] o.a.s.s.IndexSchema default search field in schema is text
   [junit4]   2> 1793178 INFO  (coreLoadExecutor-5127-thread-1-processing-n:127.0.0.1:61008_) [n:127.0.0.1:61008_ c:control_collection   x:collection1] o.a.s.s.IndexSchema unique key field: id
   [junit4]   2> 1793178 INFO  (coreLoadExecutor-5127-thread-1-processing-n:127.0.0.1:61008_) [n:127.0.0.1:61008_ c:control_collection   x:collection1] o.a.s.s.FileExchangeRateProvider Reloading exchange rates from file currency.xml
   [junit4]   2> 1793181 INFO  (coreLoadExecutor-5127-thread-1-processing-n:127.0.0.1:61008_) [n:127.0.0.1:61008_ c:control_collection   x:collection1] o.a.s.s.FileExchangeRateProvider Reloading exchange rates from file currency.xml
   [junit4]   2> 1793209 INFO  (coreLoadExecutor-5127-thread-1-processing-n:127.0.0.1:61008_) [n:127.0.0.1:61008_ c:control_collection   x:collection1] o.a.s.c.ConfigSetProperties Did not find ConfigSet properties, assuming default properties: Can't find resource 'configsetprops.json' in classpath or '/configs/conf1', cwd=/Users/jenkins/workspace/Lucene-Solr-6.x-MacOSX/solr/build/solr-core/test/J1
   [junit4]   2> 1793209 INFO  (coreLoadExecutor-5127-thread-1-processing-n:127.0.0.1:61008_) [n:127.0.0.1:61008_ c:control_collection   x:collection1] o.a.s.c.CoreContainer Creating SolrCore 'collection1' using configuration from collection control_collection
   [junit4]   2> 1793209 INFO  (coreLoadExecutor-5127-thread-1-processing-n:127.0.0.1:61008_) [n:127.0.0.1:61008_ c:control_collection s:shard1 r:core_node1 x:collection1] o.a.s.c.SolrCore org.apache.solr.core.MockDirectoryFactory
   [junit4]   2> 1793209 INFO  (coreLoadExecutor-5127-thread-1-processing-n:127.0.0.1:61008_) [n:127.0.0.1:61008_ c:control_collection s:shard1 r:core_node1 x:collection1] o.a.s.c.SolrCore [[collection1] ] Opening new SolrCore at [/Users/jenkins/workspace/Lucene-Solr-6.x-MacOSX/solr/build/solr-core/test/J1/temp/solr.cloud.CleanupOldIndexTest_9035182FBDA8921D-001/control-001/cores/collection1], dataDir=[/Users/jenkins/workspace/Lucene-Solr-6.x-MacOSX/solr/build/solr-core/test/J1/temp/solr.cloud.CleanupOldIndexTest_9035182FBDA8921D-001/control-001/cores/collection1/data/]
   [junit4]   2> 1793209 INFO  (coreLoadExecutor-5127-thread-1-processing-n:127.0.0.1:61008_) [n:127.0.0.1:61008_ c:control_collection s:shard1 r:core_node1 x:collection1] o.a.s.c.JmxMonitoredMap JMX monitoring is enabled. Adding Solr mbeans to JMX Server: com.sun.jmx.mbeanserver.JmxMBeanServer@13caa476
   [junit4]   2> 1793210 INFO  (coreLoadExecutor-5127-thread-1-processing-n:127.0.0.1:61008_) [n:127.0.0.1:61008_ c:control_collection s:shard1 r:core_node1 x:collection1] o.a.s.c.CachingDirectoryFactory return new directory for /Users/jenkins/workspace/Lucene-Solr-6.x-MacOSX/solr/build/solr-core/test/J1/temp/solr.cloud.CleanupOldIndexTest_9035182FBDA8921D-001/control-001/cores/collection1/data
   [junit4]   2> 1793210 INFO  (coreLoadExecutor-5127-thread-1-processing-n:127.0.0.1:61008_) [n:127.0.0.1:61008_ c:control_collection s:shard1 r:core_node1 x:collection1] o.a.s.c.SolrCore New index directory detected: old=null new=/Users/jenkins/workspace/Lucene-Solr-6.x-MacOSX/solr/build/solr-core/test/J1/temp/solr.cloud.CleanupOldIndexTest_9035182FBDA8921D-001/control-001/cores/collection1/data/index/
   [junit4]   2> 1793210 WARN  (coreLoadExecutor-5127-thread-1-processing-n:127.0.0.1:61008_) [n:127.0.0.1:61008_ c:control_collection s:shard1 r:core_node1 x:collection1] o.a.s.c.SolrCore [collection1] Solr index directory '/Users/jenkins/workspace/Lucene-Solr-6.x-MacOSX/solr/build/solr-core/test/J1/temp/solr.cloud.CleanupOldIndexTest_9035182FBDA8921D-001/control-001/cores/collection1/data/index' doesn't exist. Creating new index...
   [junit4]   2> 1793210 INFO  (coreLoadExecutor-5127-thread-1-processing-n:127.0.0.1:61008_) [n:127.0.0.1:61008_ c:control_collection s:shard1 r:core_node1 x:collection1] o.a.s.c.CachingDirectoryFactory return new directory for /Users/jenkins/workspace/Lucene-Solr-6.x-MacOSX/solr/build/solr-core/test/J1/temp/solr.cloud.CleanupOldIndexTest_9035182FBDA8921D-001/control-001/cores/collection1/data/index
   [junit4]   2> 1793210 INFO  (coreLoadExecutor-5127-thread-1-processing-n:127.0.0.1:61008_) [n:127.0.0.1:61008_ c:control_collection s:shard1 r:core_node1 x:collection1] o.a.s.u.RandomMergePolicy RandomMergePolicy wrapping class org.apache.lucene.index.LogByteSizeMergePolicy: [LogByteSizeMergePolicy: minMergeSize=1677721, mergeFactor=4, maxMergeSize=2147483648, maxMergeSizeForForcedMerge=9223372036854775807, calibrateSizeByDeletes=false, maxMergeDocs=2147483647, maxCFSSegmentSizeMB=8.796093022207999E12, noCFSRatio=0.2773734684955385]
   [junit4]   2> 1793211 INFO  (coreLoadExecutor-5127-thread-1-processing-n:127.0.0.1:61008_) [n:127.0.0.1:61008_ c:control_collection s:shard1 r:core_node1 x:collection1] o.a.s.c.SolrDeletionPolicy SolrDeletionPolicy.onCommit: commits: num=1
   [junit4]   2> 	commit{dir=MockDirectoryWrapper(RAMDirectory@60855c41 lockFactory=org.apache.lucene.store.SingleInstanceLockFactory@243fd169),segFN=segments_1,generation=1}
   [junit4]   2> 1793211 INFO  (coreLoadExecutor-5127-thread-1-processing-n:127.0.0.1:61008_) [n:127.0.0.1:61008_ c:control_collection s:shard1 r:core_node1 x:collection1] o.a.s.c.SolrDeletionPolicy newest commit generation = 1
   [junit4]   2> 1793211 INFO  (OldIndexDirectoryCleanupThreadForCore-collection1) [n:127.0.0.1:61008_ c:control_collection s:shard1 r:core_node1 x:collection1] o.a.s.c.SolrCore Looking for old index directories to cleanup for core collection1 in /Users/jenkins/workspace/Lucene-Solr-6.x-MacOSX/solr/build/solr-core/test/J1/temp/solr.cloud.CleanupOldIndexTest_9035182FBDA8921D-001/control-001/cores/collection1/data/
   [junit4]   2> 1793212 WARN  (OldIndexDirectoryCleanupThreadForCore-collection1) [n:127.0.0.1:61008_ c:control_collection s:shard1 r:core_node1 x:collection1] o.a.s.c.DirectoryFactory /Users/jenkins/workspace/Lucene-Solr-6.x-MacOSX/solr/build/solr-core/test/J1/temp/solr.cloud.CleanupOldIndexTest_9035182FBDA8921D-001/control-001/cores/collection1/data/ does not point to a valid data directory; skipping clean-up of old index directories.
   [junit4]   2> 1793215 INFO  (coreLoadExecutor-5127-thread-1-processing-n:127.0.0.1:61008_) [n:127.0.0.1:61008_ c:control_collection s:shard1 r:core_node1 x:collection1] o.a.s.u.p.UpdateRequestProcessorChain creating updateRequestProcessorChain "nodistrib"
   [junit4]   2> 1793215 INFO  (coreLoadExecutor-5127-thread-1-processing-n:127.0.0.1:61008_) [n:127.0.0.1:61008_ c:control_collection s:shard1 r:core_node1 x:collection1] o.a.s.u.p.UpdateRequestProcessorChain creating updateRequestProcessorChain "dedupe"
   [junit4]   2> 1793216 INFO  (coreLoadExecutor-5127-thread-1-processing-n:127.0.0.1:61008_) [n:127.0.0.1:61008_ c:control_collection s:shard1 r:core_node1 x:collection1] o.a.s.u.p.UpdateRequestProcessorChain inserting DistributedUpdateProcessorFactory into updateRequestProcessorChain "dedupe"
   [junit4]   2> 1793216 INFO  (coreLoadExecutor-5127-thread-1-processing-n:127.0.0.1:61008_) [n:127.0.0.1:61008_ c:control_collection s:shard1 r:core_node1 x:collection1] o.a.s.u.p.UpdateRequestProcessorChain creating updateRequestProcessorChain "stored_sig"
   [junit4]   2> 1793216 INFO  (coreLoadExecutor-5127-thread-1-processing-n:127.0.0.1:61008_) [n:127.0.0.1:61008_ c:control_collection s:shard1 r:core_node1 x:collection1] o.a.s.u.p.UpdateRequestProcessorChain inserting DistributedUpdateProcessorFactory into updateRequestProcessorChain "stored_sig"
   [junit4]   2> 1793216 INFO  (coreLoadExecutor-5127-thread-1-processing-n:127.0.0.1:61008_) [n:127.0.0.1:61008_ c:control_collection s:shard1 r:core_node1 x:collection1] o.a.s.u.p.UpdateRequestProcessorChain creating updateRequestProcessorChain "distrib-dup-test-chain-explicit"
   [junit4]   2> 1793216 INFO  (coreLoadExecutor-5127-thread-1-processing-n:127.0.0.1:61008_) [n:127.0.0.1:61008_ c:control_collection s:shard1 r:core_node1 x:collection1] o.a.s.u.p.UpdateRequestProcessorChain creating updateRequestProcessorChain "distrib-dup-test-chain-implicit"
   [junit4]   2> 1793216 INFO  (coreLoadExecutor-5127-thread-1-processing-n:127.0.0.1:61008_) [n:127.0.0.1:61008_ c:control_collection s:shard1 r:core_node1 x:collection1] o.a.s.u.p.UpdateRequestProcessorChain inserting DistributedUpdateProcessorFactory into updateRequestProcessorChain "distrib-dup-test-chain-implicit"
   [junit4]   2> 1793216 INFO  (coreLoadExecutor-5127-thread-1-processing-n:127.0.0.1:61008_) [n:127.0.0.1:61008_ c:control_collection s:shard1 r:core_node1 x:collection1] o.a.s.c.SolrCore no updateRequestProcessorChain defined as default, creating implicit default
   [junit4]   2> 1793216 WARN  (coreLoadExecutor-5127-thread-1-processing-n:127.0.0.1:61008_) [n:127.0.0.1:61008_ c:control_collection s:shard1 r:core_node1 x:collection1] o.a.s.c.RequestHandlers INVALID paramSet a in requestHandler {type = requestHandler,name = /dump,class = DumpRequestHandler,args = {defaults={a=A,b=B}}}
   [junit4]   2> 1793222 INFO  (coreLoadExecutor-5127-thread-1-processing-n:127.0.0.1:61008_) [n:127.0.0.1:61008_ c:control_collection s:shard1 r:core_node1 x:collection1] o.a.s.h.l.XMLLoader xsltCacheLifetimeSeconds=60
   [junit4]   2> 1793224 INFO  (coreLoadExecutor-5127-thread-1-processing-n:127.0.0.1:61008_) [n:127.0.0.1:61008_ c:control_collection s:shard1 r:core_node1 x:collection1] o.a.s.h.l.XMLLoader xsltCacheLifetimeSeconds=60
   [junit4]   2> 1793225 INFO  (coreLoadExecutor-5127-thread-1-processing-n:127.0.0.1:61008_) [n:127.0.0.1:61008_ c:control_collection s:shard1 r:core_node1 x:collection1] o.a.s.h.l.XMLLoader xsltCacheLifetimeSeconds=60
   [junit4]   2> 1793226 INFO  (coreLoadExecutor-5127-thread-1-processing-n:127.0.0.1:61008_) [n:127.0.0.1:61008_ c:control_collection s:shard1 r:core_node1 x:collection1] o.a.s.h.l.XMLLoader xsltCacheLifetimeSeconds=60
   [junit4]   2> 1793231 INFO  (coreLoadExecutor-5127-thread-1-processing-n:127.0.0.1:61008_) [n:127.0.0.1:61008_ c:control_collection s:shard1 r:core_node1 x:collection1] o.a.s.c.RequestHandlers Registered paths: /admin/mbeans,standard,/update/json/docs,/admin/luke,/export,/get,/admin/properties,/update/json,/admin/threads,/dump,/update/csv,/sql,/graph,/admin/segments,/admin/system,/replication,/config,/stream,/schema,/admin/plugins,/admin/logging,/admin/ping,/update,/admin/file
   [junit4]   2> 1793232 INFO  (coreLoadExecutor-5127-thread-1-processing-n:127.0.0.1:61008_) [n:127.0.0.1:61008_ c:control_collection s:shard1 r:core_node1 x:collection1] o.a.s.c.SolrCore Using default statsCache cache: org.apache.solr.search.stats.LocalStatsCache
   [junit4]   2> 1793233 INFO  (coreLoadExecutor-5127-thread-1-processing-n:127.0.0.1:61008_) [n:127.0.0.1:61008_ c:control_collection s:shard1 r:core_node1 x:collection1] o.a.s.u.UpdateHandler Using UpdateLog implementation: org.apache.solr.update.UpdateLog
   [junit4]   2> 1793233 INFO  (coreLoadExecutor-5127-thread-1-processing-n:127.0.0.1:61008_) [n:127.0.0.1:61008_ c:control_collection s:shard1 r:core_node1 x:collection1] o.a.s.u.UpdateLog Initializing UpdateLog: dataDir= defaultSyncLevel=FLUSH numRecordsToKeep=100 maxNumLogsToKeep=10 numVersionBuckets=65536
   [junit4]   2> 1793234 INFO  (coreLoadExecutor-5127-thread-1-processing-n:127.0.0.1:61008_) [n:127.0.0.1:61008_ c:control_collection s:shard1 r:core_node1 x:collection1] o.a.s.u.CommitTracker Hard AutoCommit: disabled
   [junit4]   2> 1793234 INFO  (coreLoadExecutor-5127-thread-1-processing-n:127.0.0.1:61008_) [n:127.0.0.1:61008_ c:control_collection s:shard1 r:core_node1 x:collection1] o.a.s.u.CommitTracker Soft AutoCommit: disabled
   [junit4]   2> 1793234 INFO  (coreLoadExecutor-5127-thread-1-processing-n:127.0.0.1:61008_) [n:127.0.0.1:61008_ c:control_collection s:shard1 r:core_node1 x:collection1] o.a.s.u.RandomMergePolicy RandomMergePolicy wrapping class org.apache.lucene.index.TieredMergePolicy: [TieredMergePolicy: maxMergeAtOnce=12, maxMergeAtOnceExplicit=33, maxMergedSegmentMB=34.23046875, floorSegmentMB=1.103515625, forceMergeDeletesPctAllowed=27.291992423856186, segmentsPerTier=27.0, maxCFSSegmentSizeMB=8.796093022207999E12, noCFSRatio=0.6865890270577031
   [junit4]   2> 1793235 INFO  (coreLoadExecutor-5127-thread-1-processing-n:127.0.0.1:61008_) [n:127.0.0.1:61008_ c:control_collection s:shard1 r:core_node1 x:collection1] o.a.s.c.SolrDeletionPolicy SolrDeletionPolicy.onInit: commits: num=1
   [junit4]   2> 	commit{dir=MockDirectoryWrapper(RAMDirectory@60855c41 lockFactory=org.apache.lucene.store.SingleInstanceLockFactory@243fd169),segFN=segments_1,generation=1}
   [junit4]   2> 1793235 INFO  (coreLoadExecutor-5127-thread-1-processing-n:127.0.0.1:61008_) [n:127.0.0.1:61008_ c:control_collection s:shard1 r:core_node1 x:collection1] o.a.s.c.SolrDeletionPolicy newest commit generation = 1
   [junit4]   2> 1793235 INFO  (coreLoadExecutor-5127-thread-1-processing-n:127.0.0.1:61008_) [n:127.0.0.1:61008_ c:control_collection s:shard1 r:core_node1 x:collection1] o.a.s.s.SolrIndexSearcher Opening [Searcher@22dd537f[collection1] main]
   [junit4]   2> 1793235 INFO  (coreLoadExecutor-5127-thread-1-processing-n:127.0.0.1:61008_) [n:127.0.0.1:61008_ c:control_collection s:shard1 r:core_node1 x:collection1] o.a.s.c.c.ZkStateReader Load collection config from: [/collections/control_collection]
   [junit4]   2> 1793236 INFO  (coreLoadExecutor-5127-thread-1-processing-n:127.0.0.1:61008_) [n:127.0.0.1:61008_ c:control_collection s:shard1 r:core_node1 x:collection1] o.a.s.c.c.ZkStateReader path=[/collections/control_collection] [configName]=[conf1] specified config exists in ZooKeeper
   [junit4]   2> 1793236 INFO  (coreLoadExecutor-5127-thread-1-processing-n:127.0.0.1:61008_) [n:127.0.0.1:61008_ c:control_collection s:shard1 r:core_node1 x:collection1] o.a.s.r.ManagedResourceStorage Setting up ZooKeeper-based storage for the RestManager with znodeBase: /configs/conf1
   [junit4]   2> 1793237 INFO  (coreLoadExecutor-5127-thread-1-processing-n:127.0.0.1:61008_) [n:127.0.0.1:61008_ c:control_collection s:shard1 r:core_node1 x:collection1] o.a.s.r.ManagedResourceStorage Configured ZooKeeperStorageIO with znodeBase: /configs/conf1
   [junit4]   2> 1793237 INFO  (coreLoadExecutor-5127-thread-1-processing-n:127.0.0.1:61008_) [n:127.0.0.1:61008_ c:control_collection s:shard1 r:core_node1 x:collection1] o.a.s.r.RestManager Initializing RestManager with initArgs: {}
   [junit4]   2> 1793237 INFO  (coreLoadExecutor-5127-thread-1-processing-n:127.0.0.1:61008_) [n:127.0.0.1:61008_ c:control_collection s:shard1 r:core_node1 x:collection1] o.a.s.r.ManagedResourceStorage Reading _rest_managed.json using ZooKeeperStorageIO:path=/configs/conf1
   [junit4]   2> 1793238 INFO  (coreLoadExecutor-5127-thread-1-processing-n:127.0.0.1:61008_) [n:127.0.0.1:61008_ c:control_collection s:shard1 r:core_node1 x:collection1] o.a.s.r.ManagedResourceStorage No data found for znode /configs/conf1/_rest_managed.json
   [junit4]   2> 1793238 INFO  (coreLoadExecutor-5127-thread-1-processing-n:127.0.0.1:61008_) [n:127.0.0.1:61008_ c:control_collection s:shard1 r:core_node1 x:collection1] o.a.s.r.ManagedResourceStorage Loaded null at path _rest_managed.json using ZooKeeperStorageIO:path=/configs/conf1
   [junit4]   2> 1793238 INFO  (coreLoadExecutor-5127-thread-1-processing-n:127.0.0.1:61008_) [n:127.0.0.1:61008_ c:control_collection s:shard1 r:core_node1 x:collection1] o.a.s.r.RestManager Initializing 0 registered ManagedResources
   [junit4]   2> 1793239 INFO  (coreLoadExecutor-5127-thread-1-processing-n:127.0.0.1:61008_) [n:127.0.0.1:61008_ c:control_collection s:shard1 r:core_node1 x:collection1] o.a.s.h.ReplicationHandler Commits will be reserved for  10000
   [junit4]   2> 1793239 INFO  (searcherExecutor-5128-thread-1-processing-n:127.0.0.1:61008_ x:collection1 s:shard1 c:control_collection r:core_node1) [n:127.0.0.1:61008_ c:control_collection s:shard1 r:core_node1 x:collection1] o.a.s.c.SolrCore [collection1] Registered new searcher Searcher@22dd537f[collection1] main{ExitableDirectoryReader(UninvertingDirectoryReader())}
   [junit4]   2> 1793239 INFO  (coreLoadExecutor-5127-thread-1-processing-n:127.0.0.1:61008_) [n:127.0.0.1:61008_ c:control_collection s:shard1 r:core_node1 x:collection1] o.a.s.u.UpdateLog Looking up max value of version field to seed version buckets
   [junit4]   2> 1793239 INFO  (coreLoadExecutor-5127-thread-1-processing-n:127.0.0.1:61008_) [n:127.0.0.1:61008_ c:control_collection s:shard1 r:core_node1 x:collection1] o.a.s.u.VersionInfo Refreshing highest value of _version_ for 65536 version buckets from index
   [junit4]   2> 1793239 INFO  (coreLoadExecutor-5127-thread-1-processing-n:127.0.0.1:61008_) [n:127.0.0.1:61008_ c:control_collection s:shard1 r:core_node1 x:collection1] o.a.s.u.VersionInfo No terms found for _version_, cannot seed version bucket highest value from index
   [junit4]   2> 1793239 INFO  (coreLoadExecutor-5127-thread-1-processing-n:127.0.0.1:61008_) [n:127.0.0.1:61008_ c:control_collection s:shard1 r:core_node1 x:collection1] o.a.s.u.UpdateLog Could not find max version in index or recent updates, using new clock 1534429095608188928
   [junit4]   2> 1793241 INFO  (coreLoadExecutor-5127-thread-1-processing-n:127.0.0.1:61008_) [n:127.0.0.1:61008_ c:control_collection s:shard1 r:core_node1 x:collection1] o.a.s.u.UpdateLog Took 1.0ms to seed version buckets with highest version 1534429095608188928
   [junit4]   2> 1793241 INFO  (coreLoadExecutor-5127-thread-1-processing-n:127.0.0.1:61008_) [n:127.0.0.1:61008_ c:control_collection s:shard1 r:core_node1 x:collection1] o.a.s.c.ZkController watch zkdir /configs/conf1
   [junit4]   2> 1793242 INFO  (coreLoadExecutor-5127-thread-1-processing-n:127.0.0.1:61008_) [n:127.0.0.1:61008_ c:control_collection s:shard1 r:core_node1 x:collection1] o.a.s.c.CoreContainer registering core: collection1
   [junit4]   2> 1793243 INFO  (coreZkRegister-5121-thread-1-processing-n:127.0.0.1:61008_ x:collection1 s:shard1 c:control_collection r:core_node1) [n:127.0.0.1:61008_ c:control_collection s:shard1 r:core_node1 x:collection1] o.a.s.c.ZkController Register replica - core:collection1 address:http://127.0.0.1:61008 collection:control_collection shard:shard1
   [junit4]   2> 1793244 INFO  (coreZkRegister-5121-thread-1-processing-n:127.0.0.1:61008_ x:collection1 s:shard1 c:control_collection r:core_node1) [n:127.0.0.1:61008_ c:control_collection s:shard1 r:core_node1 x:collection1] o.a.s.c.c.SolrZkClient makePath: /collections/control_collection/leader_elect/shard1/election
   [junit4]   2> 1793251 INFO  (coreZkRegister-5121-thread-1-processing-n:127.0.0.1:61008_ x:collection1 s:shard1 c:control_collection r:core_node1) [n:127.0.0.1:61008_ c:control_collection s:shard1 r:core_node1 x:collection1] o.a.s.c.LeaderElector Joined leadership election with path: /collections/control_collection/leader_elect/shard1/election/95901818354401284-core_node1-n_0000000000
   [junit4]   2> 1793252 INFO  (coreZkRegister-5121-thread-1-processing-n:127.0.0.1:61008_ x:collection1 s:shard1 c:control_collection r:core_node1) [n:127.0.0.1:61008_ c:control_collection s:shard1 r:core_node1 x:collection1] o.a.s.c.ShardLeaderElectionContext Running the leader process for shard=shard1 and weAreReplacement=false and leaderVoteWait=10000
   [junit4]   2> 1793255 INFO  (coreZkRegister-5121-thread-1-processing-n:127.0.0.1:61008_ x:collection1 s:shard1 c:control_collection r:core_node1) [n:127.0.0.1:61008_ c:control_collection s:shard1 r:core_node1 x:collection1] o.a.s.c.ShardLeaderElectionContext Enough replicas found to continue.
   [junit4]   2> 1793255 INFO  (coreZkRegister-5121-thread-1-processing-n:127.0.0.1:61008_ x:collection1 s:shard1 c:control_collection r:core_node1) [n:127.0.0.1:61008_ c:control_collection s:shard1 r:core_node1 x:collection1] o.a.s.c.ShardLeaderElectionContext I may be the new leader - try and sync
   [junit4]   2> 1793255 INFO  (coreZkRegister-5121-thread-1-processing-n:127.0.0.1:61008_ x:collection1 s:shard1 c:control_collection r:core_node1) [n:127.0.0.1:61008_ c:control_collection s:shard1 r:core_node1 x:collection1] o.a.s.c.SyncStrategy Sync replicas to http://127.0.0.1:61008/collection1/
   [junit4]   2> 1793255 INFO  (coreZkRegister-5121-thread-1-processing-n:127.0.0.1:61008_ x:collection1 s:shard1 c:control_collection r:core_node1) [n:127.0.0.1:61008_ c:control_collection s:shard1 r:core_node1 x:collection1] o.a.s.c.SyncStrategy Sync Success - now sync replicas to me
   [junit4]   2> 1793255 INFO  (coreZkRegister-5121-thread-1-processing-n:127.0.0.1:61008_ x:collection1 s:shard1 c:control_collection r:core_node1) [n:127.0.0.1:61008_ c:control_collection s:shard1 r:core_node1 x:collection1] o.a.s.c.SyncStrategy http://127.0.0.1:61008/collection1/ has no replicas
   [junit4]   2> 1793256 INFO  (OverseerStateUpdate-95901818354401284-127.0.0.1:61008_-n_0000000000) [n:127.0.0.1:61008_    ] o.a.s.c.Overseer processMessage: queueSize: 1, message = {
   [junit4]   2>   "operation":"leader",
   [junit4]   2>   "shard":"shard1",
   [junit4]   2>   "collection":"control_collection"} current state version: 1
   [junit4]   2> 1793257 INFO  (coreZkRegister-5121-thread-1-processing-n:127.0.0.1:61008_ x:collection1 s:shard1 c:control_collection r:core_node1) [n:127.0.0.1:61008_ c:control_collection s:shard1 r:core_node1 x:collection1] o.a.s.c.c.SolrZkClient makePath: /collections/control_collection/leaders/shard1
   [junit4]   2> 1793264 INFO  (coreZkRegister-5121-thread-1-processing-n:127.0.0.1:61008_ x:collection1 s:shard1 c:control_collection r:core_node1) [n:127.0.0.1:61008_ c:control_collection s:shard1 r:core_node1 x:collection1] o.a.s.c.ShardLeaderElectionContextBase Creating leader registration node /collections/control_collection/leaders/shard1/leader after winning as /collections/control_collection/leader_elect/shard1/election/95901818354401284-core_node1-n_0000000000
   [junit4]   2> 1793269 INFO  (coreZkRegister-5121-thread-1-processing-n:127.0.0.1:61008_ x:collection1 s:shard1 c:control_collection r:core_node1) [n:127.0.0.1:61008_ c:control_collection s:shard1 r:core_node1 x:collection1] o.a.s.c.ShardLeaderElectionContext I am the new leader: http://127.0.0.1:61008/collection1/ shard1
   [junit4]   2> 1793270 INFO  (OverseerStateUpdate-95901818354401284-127.0.0.1:61008_-n_0000000000) [n:127.0.0.1:61008_    ] o.a.s.c.Overseer processMessage: queueSize: 1, message = {
   [junit4]   2>   "operation":"leader",
   [junit4]   2>   "shard":"shard1",
   [junit4]   2>   "collection":"control_collection",
   [junit4]   2>   "base_url":"http://127.0.0.1:61008",
   [junit4]   2>   "core":"collection1",
   [junit4]   2>   "state":"active"} current state version: 1
   [junit4]   2> 1793377 INFO  (zkCallback-2555-thread-1-processing-n:127.0.0.1:61008_) [n:127.0.0.1:61008_    ] o.a.s.c.c.ZkStateReader A cluster state change: [WatchedEvent state:SyncConnected type:NodeDataChanged path:/clusterstate.json], has occurred - updating... (live nodes size: [1])
   [junit4]   2> 1793380 INFO  (coreZkRegister-5121-thread-1-processing-n:127.0.0.1:61008_ x:collection1 s:shard1 c:control_collection r:core_node1) [n:127.0.0.1:61008_ c:control_collection s:shard1 r:core_node1 x:collection1] o.a.s.c.ZkController We are http://127.0.0.1:61008/collection1/ and leader is http://127.0.0.1:61008/collection1/
   [junit4]   2> 1793380 INFO  (coreZkRegister-5121-thread-1-processing-n:127.0.0.1:61008_ x:collection1 s:shard1 c:control_collection r:core_node1) [n:127.0.0.1:61008_ c:control_collection s:shard1 r:core_node1 x:collection1] o.a.s.c.ZkController No LogReplay needed for core=collection1 baseURL=http://127.0.0.1:61008
   [junit4]   2> 1793380 INFO  (coreZkRegister-5121-thread-1-processing-n:127.0.0.1:61008_ x:collection1 s:shard1 c:control_collection r:core_node1) [n:127.0.0.1:61008_ c:control_collection s:shard1 r:core_node1 x:collection1] o.a.s.c.ZkController I am the leader, no recovery necessary
   [junit4]   2> 1793380 INFO  (coreZkRegister-5121-thread-1-processing-n:127.0.0.1:61008_ x:collection1 s:shard1 c:control_collection r:core_node1) [n:127.0.0.1:61008_ c:control_collection s:shard1 r:core_node1 x:collection1] o.a.s.c.ZkController publishing state=active
   [junit4]   2> 1793380 INFO  (coreZkRegister-5121-thread-1-processing-n:127.0.0.1:61008_ x:collection1 s:shard1 c:control_collection r:core_node1) [n:127.0.0.1:61008_ c:control_collection s:shard1 r:core_node1 x:collection1] o.a.s.c.ZkController numShards not found on descriptor - reading it from system property
   [junit4]   2> 1793384 INFO  (OverseerStateUpdate-95901818354401284-127.0.0.1:61008_-n_0000000000) [n:127.0.0.1:61008_    ] o.a.s.c.Overseer processMessage: queueSize: 1, message = {
   [junit4]   2>   "core":"collection1",
   [junit4]   2>   "core_node_name":"core_node1",
   [junit4]   2>   "roles":null,
   [junit4]   2>   "base_url":"http://127.0.0.1:61008",
   [junit4]   2>   "node_name":"127.0.0.1:61008_",
   [junit4]   2>   "numShards":"1",
   [junit4]   2>   "state":"active",
   [junit4]   2>   "shard":"shard1",
   [junit4]   2>   "collection":"control_collection",
   [junit4]   2>   "operation":"state"} current state version: 2
   [junit4]   2> 1793384 INFO  (OverseerStateUpdate-95901818354401284-127.0.0.1:61008_-n_0000000000) [n:127.0.0.1:61008_    ] o.a.s.c.o.ReplicaMutator Update state numShards=1 message={
   [junit4]   2>   "core":"collection1",
   [junit4]   2>   "core_node_name":"core_node1",
   [junit4]   2>   "roles":null,
   [junit4]   2>   "base_url":"http://127.0.0.1:61008",
   [junit4]   2>   "node_name":"127.0.0.1:61008_",
   [junit4]   2>   "numShards":"1",
   [junit4]   2>   "state":"active",
   [junit4]   2>   "shard":"shard1",
   [junit4]   2>   "collection":"control_collection",
   [junit4]   2>   "operation":"state"}
   [junit4]   2> 1793498 INFO  (zkCallback-2555-thread-1-processing-n:127.0.0.1:61008_) [n:127.0.0.1:61008_    ] o.a.s.c.c.ZkStateReader A cluster state change: [WatchedEvent state:SyncConnected type:NodeDataChanged path:/clusterstate.json], has occurred - updating... (live nodes size: [1])
   [junit4]   2> 1793608 INFO  (TEST-CleanupOldIndexTest.test-seed#[9035182FBDA8921D]) [    ] o.a.s.c.s.i.CloudSolrClient Final constructed zkHost string: 127.0.0.1:61005/solr
   [junit4]   2> 1793608 INFO  (TEST-CleanupOldIndexTest.test-seed#[9035182FBDA8921D]) [    ] o.a.s.c.c.SolrZkClient Using default ZkCredentialsProvider
   [junit4]   2> 1793609 INFO  (TEST-CleanupOldIndexTest.test-seed#[9035182FBDA8921D]) [    ] o.a.s.c.c.ConnectionManager Waiting for client to connect to ZooKeeper
   [junit4]   2> 1793611 INFO  (zkCallback-2559-thread-1) [    ] o.a.s.c.c.ConnectionManager Watcher org.apache.solr.common.cloud.ConnectionManager@3c467b0f name:ZooKeeperConnection Watcher:127.0.0.1:61005/solr got event WatchedEvent state:SyncConnected type:None path:null path:null type:None
   [junit4]   2> 1793611 INFO  (TEST-CleanupOldIndexTest.test-seed#[9035182FBDA8921D]) [    ] o.a.s.c.c.ConnectionManager Client is connected to ZooKeeper
   [junit4]   2> 1793612 INFO  (TEST-CleanupOldIndexTest.test-seed#[9035182FBDA8921D]) [    ] o.a.s.c.c.SolrZkClient Using default ZkACLProvider
   [junit4]   2> 1793612 INFO  (TEST-CleanupOldIndexTest.test-seed#[9035182FBDA8921D]) [    ] o.a.s.c.c.ZkStateReader Updating cluster state from ZooKeeper... 
   [junit4]   2> 1793613 INFO  (TEST-CleanupOldIndexTest.test-seed#[9035182FBDA8921D]) [    ] o.a.s.c.c.ZkStateReader Loaded empty cluster properties
   [junit4]   2> 1793614 INFO  (TEST-CleanupOldIndexTest.test-seed#[9035182FBDA8921D]) [    ] o.a.s.c.c.ZkStateReader Updated live nodes from ZooKeeper... (0) -> (1)
   [junit4]   2> 1793616 INFO  (TEST-CleanupOldIndexTest.test-seed#[9035182FBDA8921D]) [    ] o.a.s.c.ChaosMonkey monkey: init - expire sessions:false cause connection loss:false
   [junit4]   2> 1794384 INFO  (TEST-CleanupOldIndexTest.test-seed#[9035182FBDA8921D]) [    ] o.a.s.SolrTestCaseJ4 Writing core.properties file to /Users/jenkins/workspace/Lucene-Solr-6.x-MacOSX/solr/build/solr-core/test/J1/temp/solr.cloud.CleanupOldIndexTest_9035182FBDA8921D-001/shard-1-001/cores/collection1
   [junit4]   2> 1794387 INFO  (TEST-CleanupOldIndexTest.test-seed#[9035182FBDA8921D]) [    ] o.a.s.c.AbstractFullDistribZkTestBase create jetty 1 in directory /Users/jenkins/workspace/Lucene-Solr-6.x-MacOSX/solr/build/solr-core/test/J1/temp/solr.cloud.CleanupOldIndexTest_9035182FBDA8921D-001/shard-1-001
   [junit4]   2> 1794388 INFO  (TEST-CleanupOldIndexTest.test-seed#[9035182FBDA8921D]) [    ] o.e.j.s.Server jetty-9.3.8.v20160314
   [junit4]   2> 1794391 INFO  (TEST-CleanupOldIndexTest.test-seed#[9035182FBDA8921D]) [    ] o.e.j.s.h.ContextHandler Started o.e.j.s.ServletContextHandler@2271a0b{/,null,AVAILABLE}
   [junit4]   2> 1794392 INFO  (TEST-CleanupOldIndexTest.test-seed#[9035182FBDA8921D]) [    ] o.e.j.s.ServerConnector Started ServerConnector@729ab593{HTTP/1.1,[http/1.1]}{127.0.0.1:61018}
   [junit4]   2> 1794392 INFO  (TEST-CleanupOldIndexTest.test-seed#[9035182FBDA8921D]) [    ] o.e.j.s.Server Started @1799848ms
   [junit4]   2> 1794392 INFO  (TEST-CleanupOldIndexTest.test-seed#[9035182FBDA8921D]) [    ] o.a.s.c.s.e.JettySolrRunner Jetty properties: {solr.data.dir=/Users/jenkins/workspace/Lucene-Solr-6.x-MacOSX/solr/build/solr-core/test/J1/temp/solr.cloud.CleanupOldIndexTest_9035182FBDA8921D-001/tempDir-001/jetty1, solrconfig=solrconfig.xml, hostContext=/, hostPort=61018, coreRootDirectory=/Users/jenkins/workspace/Lucene-Solr-6.x-MacOSX/solr/build/solr-core/test/J1/temp/solr.cloud.CleanupOldIndexTest_9035182FBDA8921D-001/shard-1-001/cores}
   [junit4]   2> 1794393 INFO  (TEST-CleanupOldIndexTest.test-seed#[9035182FBDA8921D]) [    ] o.a.s.s.SolrDispatchFilter SolrDispatchFilter.init(): sun.misc.Launcher$AppClassLoader@4554617c
   [junit4]   2> 1794393 INFO  (TEST-CleanupOldIndexTest.test-seed#[9035182FBDA8921D]) [    ] o.a.s.c.SolrResourceLoader new SolrResourceLoader for directory: '/Users/jenkins/workspace/Lucene-Solr-6.x-MacOSX/solr/build/solr-core/test/J1/temp/solr.cloud.CleanupOldIndexTest_9035182FBDA8921D-001/shard-1-001'
   [junit4]   2> 1794393 INFO  (TEST-CleanupOldIndexTest.test-seed#[9035182FBDA8921D]) [    ] o.a.s.c.SolrResourceLoader JNDI not configured for solr (NoInitialContextEx)
   [junit4]   2> 1794393 INFO  (TEST-CleanupOldIndexTest.test-seed#[9035182FBDA8921D]) [    ] o.a.s.c.SolrResourceLoader solr home defaulted to 'solr/' (could not find system property or JNDI)
   [junit4]   2> 1794394 INFO  (TEST-CleanupOldIndexTest.test-seed#[9035182FBDA8921D]) [    ] o.a.s.c.c.SolrZkClient Using default ZkCredentialsProvider
   [junit4]   2> 1794395 INFO  (TEST-CleanupOldIndexTest.test-seed#[9035182FBDA8921D]) [    ] o.a.s.c.c.ConnectionManager Waiting for client to connect to ZooKeeper
   [junit4]   2> 1794397 INFO  (zkCallback-2560-thread-1) [    ] o.a.s.c.c.ConnectionManager Watcher org.apache.solr.common.cloud.ConnectionManager@134e1a24 name:ZooKeeperConnection Watcher:127.0.0.1:61005/solr got event WatchedEvent state:SyncConnected type:None path:null path:null type:None
   [junit4]   2> 1794397 INFO  (TEST-CleanupOldIndexTest.test-seed#[9035182FBDA8921D]) [    ] o.a.s.c.c.ConnectionManager Client is connected to ZooKeeper
   [junit4]   2> 1794398 INFO  (TEST-CleanupOldIndexTest.test-seed#[9035182FBDA8921D]) [    ] o.a.s.c.c.SolrZkClient Using default ZkACLProvider
   [junit4]   2> 1794400 INFO  (TEST-CleanupOldIndexTest.test-seed#[9035182FBDA8921D]) [    ] o.a.s.s.SolrDispatchFilter Loading solr.xml from SolrHome (not found in ZooKeeper)
   [junit4]   2> 1794400 INFO  (TEST-CleanupOldIndexTest.test-seed#[9035182FBDA8921D]) [    ] o.a.s.c.SolrXmlConfig Loading container configuration from /Users/jenkins/workspace/Lucene-Solr-6.x-MacOSX/solr/build/solr-core/test/J1/temp/solr.cloud.CleanupOldIndexTest_9035182FBDA8921D-001/shard-1-001/solr.xml
   [junit4]   2> 1794466 INFO  (TEST-CleanupOldIndexTest.test-seed#[9035182FBDA8921D]) [    ] o.a.s.c.CorePropertiesLocator Config-defined core root directory: /Users/jenkins/workspace/Lucene-Solr-6.x-MacOSX/solr/build/solr-core/test/J1/temp/solr.cloud.CleanupOldIndexTest_9035182FBDA8921D-001/shard-1-001/cores
   [junit4]   2> 1794466 INFO  (TEST-CleanupOldIndexTest.test-seed#[9035182FBDA8921D]) [    ] o.a.s.c.CoreContainer New CoreContainer 51515688
   [junit4]   2> 1794466 INFO  (TEST-CleanupOldIndexTest.test-seed#[9035182FBDA8921D]) [    ] o.a.s.c.CoreContainer Loading cores into CoreContainer [instanceDir=/Users/jenkins/workspace/Lucene-Solr-6.x-MacOSX/solr/build/solr-core/test/J1/temp/solr.cloud.CleanupOldIndexTest_9035182FBDA8921D-001/shard-1-001]
   [junit4]   2> 1794466 WARN  (TEST-CleanupOldIndexTest.test-seed#[9035182FBDA8921D]) [    ] o.a.s.c.CoreContainer Couldn't add files from /Users/jenkins/workspace/Lucene-Solr-6.x-MacOSX/solr/build/solr-core/test/J1/temp/solr.cloud.CleanupOldIndexTest_9035182FBDA8921D-001/shard-1-001/lib to classpath: /Users/jenkins/workspace/Lucene-Solr-6.x-MacOSX/solr/build/solr-core/test/J1/temp/solr.cloud.CleanupOldIndexTest_9035182FBDA8921D-001/shard-1-001/lib
   [junit4]   2> 1794467 INFO  (TEST-CleanupOldIndexTest.test-seed#[9035182FBDA8921D]) [    ] o.a.s.h.c.HttpShardHandlerFactory created with socketTimeout : 90000,urlScheme : ,connTimeout : 15000,maxConnectionsPerHost : 20,maxConnections : 10000,corePoolSize : 0,maximumPoolSize : 2147483647,maxThreadIdleTime : 5,sizeOfQueue : -1,fairnessPolicy : false,useRetries : false,
   [junit4]   2> 1794471 INFO  (TEST-CleanupOldIndexTest.test-seed#[9035182FBDA8921D]) [    ] o.a.s.u.UpdateShardHandler Creating UpdateShardHandler HTTP client with params: socketTimeout=340000&connTimeout=45000&retry=true
   [junit4]   2> 1794477 INFO  (TEST-CleanupOldIndexTest.test-seed#[9035182FBDA8921D]) [    ] o.a.s.l.LogWatcher SLF4J impl is org.slf4j.impl.Log4jLoggerFactory
   [junit4]   2> 1794477 INFO  (TEST-CleanupOldIndexTest.test-seed#[9035182FBDA8921D]) [    ] o.a.s.l.LogWatcher Registering Log Listener [Log4j (org.slf4j.impl.Log4jLoggerFactory)]
   [junit4]   2> 1794477 INFO  (TEST-CleanupOldIndexTest.test-seed#[9035182FBDA8921D]) [    ] o.a.s.c.ZkContainer Zookeeper client=127.0.0.1:61005/solr
   [junit4]   2> 1794477 INFO  (TEST-CleanupOldIndexTest.test-seed#[9035182FBDA8921D]) [    ] o.a.s.c.ZkController zkHost includes chroot
   [junit4]   2> 1794478 INFO  (TEST-CleanupOldIndexTest.test-seed#[9035182FBDA8921D]) [    ] o.a.s.c.c.SolrZkClient Using default ZkCredentialsProvider
   [junit4]   2> 1794481 INFO  (zkCallback-2563-thread-1) [    ] o.a.s.c.c.ConnectionManager Watcher org.apache.solr.common.cloud.ConnectionManager@4c311cdf name:ZooKeeperConnection Watcher:127.0.0.1:61005 got event WatchedEvent state:SyncConnected type:None path:null path:null type:None
   [junit4]   2> 1794482 INFO  (TEST-CleanupOldIndexTest.test-seed#[9035182FBDA8921D]) [    ] o.a.s.c.c.ConnectionManager Waiting for client to connect to ZooKeeper
   [junit4]   2> 1794482 INFO  (TEST-CleanupOldIndexTest.test-seed#[9035182FBDA8921D]) [    ] o.a.s.c.c.ConnectionManager Client is connected to ZooKeeper
   [junit4]   2> 1794482 INFO  (TEST-CleanupOldIndexTest.test-seed#[9035182FBDA8921D]) [    ] o.a.s.c.c.SolrZkClient Using default ZkACLProvider
   [junit4]   2> 1794486 INFO  (TEST-CleanupOldIndexTest.test-seed#[9035182FBDA8921D]) [n:127.0.0.1:61018_    ] o.a.s.c.ZkController Added new OnReconnect listener org.apache.solr.cloud.ZkController$$Lambda$31/1678958214@43a73481
   [junit4]   2> 1794488 INFO  (zkCallback-2564-thread-1-processing-n:127.0.0.1:61018_) [n:127.0.0.1:61018_    ] o.a.s.c.c.ConnectionManager Watcher org.apache.solr.common.cloud.ConnectionManager@732c57ae name:ZooKeeperConnection Watcher:127.0.0.1:61005/solr got event WatchedEvent state:SyncConnected type:None path:null path:null type:None
   [junit4]   2> 1794488 INFO  (TEST-CleanupOldIndexTest.test-seed#[9035182FBDA8921D]) [n:127.0.0.1:61018_    ] o.a.s.c.c.ConnectionManager Waiting for client to connect to ZooKeeper
   [junit4]   2> 1794488 INFO  (TEST-CleanupOldIndexTest.test-seed#[9035182FBDA8921D]) [n:127.0.0.1:61018_    ] o.a.s.c.c.ConnectionManager Client is connected to ZooKeeper
   [junit4]   2> 1794511 INFO  (TEST-CleanupOldIndexTest.test-seed#[9035182FBDA8921D]) [n:127.0.0.1:61018_    ] o.a.s.c.c.ZkStateReader Updating cluster state from ZooKeeper... 
   [junit4]   2> 1794513 INFO  (TEST-CleanupOldIndexTest.test-seed#[9035182FBDA8921D]) [n:127.0.0.1:61018_    ] o.a.s.c.c.ZkStateReader Loaded empty cluster properties
   [junit4]   2> 1794518 INFO  (TEST-CleanupOldIndexTest.test-seed#[9035182FBDA8921D]) [n:127.0.0.1:61018_    ] o.a.s.c.c.ZkStateReader Updated live nodes from ZooKeeper... (0) -> (1)
   [junit4]   2> 1794523 INFO  (TEST-CleanupOldIndexTest.test-seed#[9035182FBDA8921D]) [n:127.0.0.1:61018_    ] o.a.s.c.Overseer Overseer (id=null) closing
   [junit4]   2> 1794524 INFO  (TEST-CleanupOldIndexTest.test-seed#[9035182FBDA8921D]) [n:127.0.0.1:61018_    ] o.a.s.c.LeaderElector Joined leadership election with path: /overseer_elect/election/95901818354401288-127.0.0.1:61018_-n_0000000001
   [junit4]   2> 1794528 INFO  (TEST-CleanupOldIndexTest.test-seed#[9035182FBDA8921D]) [n:127.0.0.1:61018_    ] o.a.s.c.LeaderElector Watching path /overseer_elect/election/95901818354401284-127.0.0.1:61008_-n_0000000000 to know if I could be the leader
   [junit4]   2> 1794530 INFO  (TEST-CleanupOldIndexTest.test-seed#[9035182FBDA8921D]) [n:127.0.0.1:61018_    ] o.a.s.c.ZkController Publish node=127.0.0.1:61018_ as DOWN
   [junit4]   2> 1794533 INFO  (OverseerStateUpdate-95901818354401284-127.0.0.1:61008_-n_0000000000) [n:127.0.0.1:61008_    ] o.a.s.c.Overseer processMessage: queueSize: 1, message = {
   [junit4]   2>   "operation":"downnode",
   [junit4]   2>   "node_name":"127.0.0.1:61018_"} current state version: 3
   [junit4]   2> 1794533 INFO  (OverseerStateUpdate-95901818354401284-127.0.0.1:61008_-n_0000000000) [n:127.0.0.1:61008_    ] o.a.s.c.o.NodeMutator DownNode state invoked for node: 127.0.0.1:61018_
   [junit4]   2> 1794645 INFO  (zkCallback-2559-thread-1) [    ] o.a.s.c.c.ZkStateReader A cluster state change: [WatchedEvent state:SyncConnected type:NodeDataChanged path:/clusterstate.json], has occurred - updating... (live nodes size: [1])
   [junit4]   2> 1794645 INFO  (zkCallback-2564-thread-1-processing-n:127.0.0.1:61018_) [n:127.0.0.1:61018_    ] o.a.s.c.c.ZkStateReader A cluster state change: [WatchedEvent state:SyncConnected type:NodeDataChanged path:/clusterstate.json], has occurred - updating... (live nodes size: [1])
   [junit4]   2> 1794645 INFO  (zkCallback-2555-thread-1-processing-n:127.0.0.1:61008_) [n:127.0.0.1:61008_    ] o.a.s.c.c.ZkStateReader A cluster state change: [WatchedEvent state:SyncConnected type:NodeDataChanged path:/clusterstate.json], has occurred - updating... (live nodes size: [1])
   [junit4]   2> 1795541 INFO  (TEST-CleanupOldIndexTest.test-seed#[9035182FBDA8921D]) [n:127.0.0.1:61018_    ] o.a.s.c.ZkController Register node as live in ZooKeeper:/live_nodes/127.0.0.1:61018_
   [junit4]   2> 1795543 INFO  (TEST-CleanupOldIndexTest.test-seed#[9035182FBDA8921D]) [n:127.0.0.1:61018_    ] o.a.s.c.c.SolrZkClient makePath: /live_nodes/127.0.0.1:61018_
   [junit4]   2> 1795545 INFO  (zkCallback-2559-thread-1) [    ] o.a.s.c.c.ZkStateReader A live node change: [WatchedEvent state:SyncConnected type:NodeChildrenChanged path:/live_nodes], has occurred - updating... (live nodes size: [1])
   [junit4]   2> 1795545 INFO  (zkCallback-2564-thread-1-processing-n:127.0.0.1:61018_) [n:127.0.0.1:61018_    ] o.a.s.c.c.ZkStateReader A live node change: [WatchedEvent state:SyncConnected type:NodeChildrenChanged path:/live_nodes], has occurred - updating... (live nodes size: [1])
   [junit4]   2> 1795545 INFO  (zkCallback-2555-thread-1-processing-n:127.0.0.1:61008_) [n:127.0.0.1:61008_    ] o.a.s.c.c.ZkStateReader A live node change: [WatchedEvent state:SyncConnected type:NodeChildrenChanged path:/live_nodes], has occurred - updating... (live nodes size: [1])
   [junit4]   2> 1795546 INFO  (zkCallback-2559-thread-1) [    ] o.a.s.c.c.ZkStateReader Updated live nodes from ZooKeeper... (1) -> (2)
   [junit4]   2> 1795546 INFO  (zkCallback-2555-thread-1-processing-n:127.0.0.1:61008_) [n:127.0.0.1:61008_    ] o.a.s.c.c.ZkStateReader Updated live nodes from ZooKeeper... (1) -> (2)
   [junit4]   2> 1795546 INFO  (zkCallback-2564-thread-1-processing-n:127.0.0.1:61018_) [n:127.0.0.1:61018_    ] o.a.s.c.c.ZkStateReader Updated live nodes from ZooKeeper... (1) -> (2)
   [junit4]   2> 1795568 INFO  (TEST-CleanupOldIndexTest.test-seed#[9035182FBDA8921D]) [n:127.0.0.1:61018_    ] o.a.s.c.CoreContainer Security conf doesn't exist. Skipping setup for authorization module.
   [junit4]   2> 1795569 INFO  (TEST-CleanupOldIndexTest.test-seed#[9035182FBDA8921D]) [n:127.0.0.1:61018_    ] o.a.s.c.CoreContainer No authentication plugin used.
   [junit4]   2> 1795573 INFO  (TEST-CleanupOldIndexTest.test-seed#[9035182FBDA8921D]) [n:127.0.0.1:61018_    ] o.a.s.c.CorePropertiesLocator Looking for core definitions underneath /Users/jenkins/workspace/Lucene-Solr-6.x-MacOSX/solr/build/solr-core/test/J1/temp/solr.cloud.CleanupOldIndexTest_9035182FBDA8921D-001/shard-1-001/cores
   [junit4]   2> 1795574 INFO  (TEST-CleanupOldIndexTest.test-seed#[9035182FBDA8921D]) [n:127.0.0.1:61018_    ] o.a.s.c.CoreDescriptor Created CoreDescriptor: {name=collection1, config=solrconfig.xml, transient=false, schema=schema.xml, loadOnStartup=true, configSetProperties=configsetprops.json, collection=collection1, coreNodeName=, dataDir=data/, shard=}
   [junit4]   2> 1795574 INFO  (TEST-CleanupOldIndexTest.test-seed#[9035182FBDA8921D]) [n:127.0.0.1:61018_    ] o.a.s.c.CorePropertiesLocator Found core collection1 in /Users/jenkins/workspace/Lucene-Solr-6.x-MacOSX/solr/build/solr-core/test/J1/temp/solr.cloud.CleanupOldIndexTest_9035182FBDA8921D-001/shard-1-001/cores/collection1
   [junit4]   2> 1795575 INFO  (TEST-CleanupOldIndexTest.test-seed#[9035182FBDA8921D]) [n:127.0.0.1:61018_    ] o.a.s.c.CorePropertiesLocator Found 1 core definitions
   [junit4]   2> 1795580 INFO  (coreLoadExecutor-5138-thread-1-processing-n:127.0.0.1:61018_) [n:127.0.0.1:61018_ c:collection1   x:collection1] o.a.s.c.ZkController publishing state=down
   [junit4]   2> 1795580 INFO  (coreLoadExecutor-5138-thread-1-processing-n:127.0.0.1:61018_) [n:127.0.0.1:61018_ c:collection1   x:collection1] o.a.s.c.ZkController numShards not found on descriptor - reading it from system property
   [junit4]   2> 1795580 INFO  (TEST-CleanupOldIndexTest.test-seed#[9035182FBDA8921D]) [n:127.0.0.1:61018_    ] o.a.s.s.SolrDispatchFilter user.dir=/Users/jenkins/workspace/Lucene-Solr-6.x-MacOSX/solr/build/solr-core/test/J1
   [junit4]   2> 1795580 INFO  (TEST-CleanupOldIndexTest.test-seed#[9035182FBDA8921D]) [n:127.0.0.1:61018_    ] o.a.s.s.SolrDispatchFilter SolrDispatchFilter.init() done
   [junit4]   2> 1795584 INFO  (coreLoadExecutor-5138-thread-1-processing-n:127.0.0.1:61018_) [n:127.0.0.1:61018_ c:collection1   x:collection1] o.a.s.c.ZkController Collection collection1 not visible yet, but flagging it so a watch is registered when it becomes visible
   [junit4]   2> 1795586 INFO  (OverseerStateUpdate-95901818354401284-127.0.0.1:61008_-n_0000000000) [n:127.0.0.1:61008_    ] o.a.s.c.Overseer processMessage: queueSize: 1, message = {
   [junit4]   2>   "core":"collection1",
   [junit4]   2>   "roles":null,
   [junit4]   2>   "base_url":"http://127.0.0.1:61018",
   [junit4]   2>   "node_name":"127.0.0.1:61018_",
   [junit4]   2>   "numShards":"1",
   [junit4]   2>   "state":"down",
   [junit4]   2>   "shard":null,
   [junit4]   2>   "collection":"collection1",
   [junit4]   2>   "operation":"state"} current state version: 4
   [junit4]   2> 1795586 INFO  (OverseerStateUpdate-95901818354401284-127.0.0.1:61008_-n_0000000000) [n:127.0.0.1:61008_    ] o.a.s.c.o.ReplicaMutator Update state numShards=1 message={
   [junit4]   2>   "core":"collection1",
   [junit4]   2>   "roles":null,
   [junit4]   2>   "base_url":"http://127.0.0.1:61018",
   [junit4]   2>   "node_name":"127.0.0.1:61018_",
   [junit4]   2>   "numShards":"1",
   [junit4]   2>   "state":"down",
   [junit4]   2>   "shard":null,
   [junit4]   2>   "collection":"collection1",
   [junit4]   2>   "operation":"state"}
   [junit4]   2> 1795586 INFO  (OverseerStateUpdate-95901818354401284-127.0.0.1:61008_-n_0000000000) [n:127.0.0.1:61008_    ] o.a.s.c.o.ClusterStateMutator building a new cName: collection1
   [junit4]   2> 1795586 INFO  (OverseerStateUpdate-95901818354401284-127.0.0.1:61008_-n_0000000000) [n:127.0.0.1:61008_    ] o.a.s.c.o.ReplicaMutator Assigning new node to shard shard=shard1
   [junit4]   2> 1795587 INFO  (coreLoadExecutor-5138-thread-1-processing-n:127.0.0.1:61018_) [n:127.0.0.1:61018_ c:collection1   x:collection1] o.a.s.c.c.ZkStateReader Deleting data for [collection1]
   [junit4]   2> 1795589 INFO  (coreLoadExecutor-5138-thread-1-processing-n:127.0.0.1:61018_) [n:127.0.0.1:61018_ c:collection1   x:collection1] o.a.s.c.ZkController look for our core node name
   [junit4]   2> 1795701 INFO  (zkCallback-2559-thread-1) [    ] o.a.s.c.c.ZkStateReader A cluster state change: [WatchedEvent state:SyncConnected type:NodeDataChanged path:/clusterstate.json], has occurred - updating... (live nodes size: [2])
   [junit4]   2> 1795701 INFO  (zkCallback-2564-thread-1-processing-n:127.0.0.1:61018_) [n:127.0.0.1:61018_    ] o.a.s.c.c.ZkStateReader A cluster state change: [WatchedEvent state:SyncConnected type:NodeDataChanged path:/clusterstate.json], has occurred - updating... (live nodes size: [2])
   [junit4]   2> 1795701 INFO  (zkCallback-2555-thread-1-processing-n:127.0.0.1:61008_) [n:127.0.0.1:61008_    ] o.a.s.c.c.ZkStateReader A cluster state change: [WatchedEvent state:SyncConnected type:NodeDataChanged path:/clusterstate.json], has occurred - updating... (live nodes size: [2])
   [junit4]   2> 1796591 INFO  (coreLoadExecutor-5138-thread-1-processing-n:127.0.0.1:61018_) [n:127.0.0.1:61018_ c:collection1   x:collection1] o.a.s.c.ZkController waiting to find shard id in clusterstate for collection1
   [junit4]   2> 1796591 INFO  (coreLoadExecutor-5138-thread-1-processing-n:127.0.0.1:61018_) [n:127.0.0.1:61018_ c:collection1   x:collection1] o.a.s.c.ZkController Check for collection zkNode:collection1
   [junit4]   2> 1796592 INFO  (coreLoadExecutor-5138-thread-1-processing-n:127.0.0.1:61018_) [n:127.0.0.1:61018_ c:collection1   x:collection1] o.a.s.c.ZkController Collection zkNode exists
   [junit4]   2> 1796592 INFO  (coreLoadExecutor-5138-thread-1-processing-n:127.0.0.1:61018_) [n:127.0.0.1:61018_ c:collection1   x:collection1] o.a.s.c.c.ZkStateReader Load collection config from: [/collections/collection1]
   [junit4]   2> 1796593 INFO  (coreLoadExecutor-5138-thread-1-processing-n:127.0.0.1:61018_) [n:127.0.0.1:61018_ c:collection1   x:collection1] o.a.s.c.c.ZkStateReader path=[/collections/collection1] [configName]=[conf1] specified config exists in ZooKeeper
   [junit4]   2> 1796593 INFO  (coreLoadExecutor-5138-thread-1-processing-n:127.0.0.1:61018_) [n:127.0.0.1:61018_ c:collection1   x:collection1] o.a.s.c.SolrResourceLoader new SolrResourceLoader for directory: '/Users/jenkins/workspace/Lucene-Solr-6.x-MacOSX/solr/build/solr-core/test/J1/temp/solr.cloud.CleanupOldIndexTest_9035182FBDA8921D-001/shard-1-001/cores/collection1'
   [junit4]   2> 1796593 INFO  (coreLoadExecutor-5138-thread-1-processing-n:127.0.0.1:61018_) [n:127.0.0.1:61018_ c:collection1   x:collection1] o.a.s.c.SolrResourceLoader JNDI not configured for solr (NoInitialContextEx)
   [junit4]   2> 1796593 INFO  (coreLoadExecutor-5138-thread-1-processing-n:127.0.0.1:61018_) [n:127.0.0.1:61018_ c:collection1   x:collection1] o.a.s.c.SolrResourceLoader solr home defaulted to 'solr/' (could not find system property or JNDI)
   [junit4]   2> 1796595 INFO  (coreLoadExecutor-5138-thread-1-processing-n:127.0.0.1:61018_) [n:127.0.0.1:61018_ c:collection1   x:collection1] o.a.s.c.Config loaded config solrconfig.xml with version 0 
   [junit4]   2> 1796602 INFO  (coreLoadExecutor-5138-thread-1-processing-n:127.0.0.1:61018_) [n:127.0.0.1:61018_ c:collection1   x:collection1] o.a.s.c.SolrConfig current version of requestparams : -1
   [junit4]   2> 1796604 WARN  (coreLoadExecutor-5138-thread-1-processing-n:127.0.0.1:61018_) [n:127.0.0.1:61018_ c:collection1   x:collection1] o.a.s.c.Config Beginning with Solr 5.5, <mergePolicy> is deprecated, use <mergePolicyFactory> instead.
   [junit4]   2> 1796605 INFO  (coreLoadExecutor-5138-thread-1-processing-n:127.0.0.1:61018_) [n:127.0.0.1:61018_ c:collection1   x:collection1] o.a.s.c.SolrConfig Using Lucene MatchVersion: 6.1.0
   [junit4]   2> 1796610 INFO  (coreLoadExecutor-5138-thread-1-processing-n:127.0.0.1:61018_) [n:127.0.0.1:61018_ c:collection1   x:collection1] o.a.s.c.SolrConfig Loaded SolrConfig: solrconfig.xml
   [junit4]   2> 1796615 INFO  (coreLoadExecutor-5138-thread-1-processing-n:127.0.0.1:61018_) [n:127.0.0.1:61018_ c:collection1   x:collection1] o.a.s.s.IndexSchema [collection1] Schema name=test
   [junit4]   2> 1796670 INFO  (coreLoadExecutor-5138-thread-1-processing-n:127.0.0.1:61018_) [n:127.0.0.1:61018_ c:collection1   x:collection1] o.a.s.s.IndexSchema default search field in schema is text
   [junit4]   2> 1796671 INFO  (coreLoadExecutor-5138-thread-1-processing-n:127.0.0.1:61018_) [n:127.0.0.1:61018_ c:collection1   x:collection1] o.a.s.s.IndexSchema unique key field: id
   [junit4]   2> 1796671 INFO  (coreLoadExecutor-5138-thread-1-processing-n:127.0.0.1:61018_) [n:127.0.0.1:61018_ c:collection1   x:collection1] o.a.s.s.FileExchangeRateProvider Reloading exchange rates from file currency.xml
   [junit4]   2> 1796673 INFO  (coreLoadExecutor-5138-thread-1-processing-n:127.0.0.1:61018_) [n:127.0.0.1:61018_ c:collection1   x:collection1] o.a.s.s.FileExchangeRateProvider Reloading exchange rates from file currency.xml
   [junit4]   2> 1796699 INFO  (coreLoadExecutor-5138-thread-1-processing-n:127.0.0.1:61018_) [n:127.0.0.1:61018_ c:collection1   x:collection1] o.a.s.c.ConfigSetProperties Did not find ConfigSet properties, assuming default properties: Can't find resource 'configsetprops.json' in classpath or '/configs/conf1', cwd=/Users/jenkins/workspace/Lucene-Solr-6.x-MacOSX/solr/build/solr-core/test/J1
   [junit4]   2> 1796699 INFO  (coreLoadExecutor-5138-thread-1-processing-n:127.0.0.1:61018_) [n:127.0.0.1:61018_ c:collection1   x:collection1] o.a.s.c.CoreContainer Creating SolrCore 'collection1' using configuration from collection collection1
   [junit4]   2> 1796699 INFO  (coreLoadExecutor-5138-thread-1-processing-n:127.0.0.1:61018_) [n:127.0.0.1:61018_ c:collection1 s:shard1 r:core_node1 x:collection1] o.a.s.c.SolrCore org.apache.solr.core.MockDirectoryFactory
   [junit4]   2> 1796699 INFO  (coreLoadExecutor-5138-thread-1-processing-n:127.0.0.1:61018_) [n:127.0.0.1:61018_ c:collection1 s:shard1 r:core_node1 x:collection1] o.a.s.c.SolrCore [[collection1] ] Opening new SolrCore at [/Users/jenkins/workspace/Lucene-Solr-6.x-MacOSX/solr/build/solr-core/test/J1/temp/solr.cloud.CleanupOldIndexTest_9035182FBDA8921D-001/shard-1-001/cores/collection1], dataDir=[/Users/jenkins/workspace/Lucene-Solr-6.x-MacOSX/solr/build/solr-core/test/J1/temp/solr.cloud.CleanupOldIndexTest_9035182FBDA8921D-001/shard-1-001/cores/collection1/data/]
   [junit4]   2> 1796699 INFO  (coreLoadExecutor-5138-thread-1-processing-n:127.0.0.1:61018_) [n:127.0.0.1:61018_ c:collection1 s:shard1 r:core_node1 x:collection1] o.a.s.c.JmxMonitoredMap JMX monitoring is enabled. Adding Solr mbeans to JMX Server: com.sun.jmx.mbeanserver.JmxMBeanServer@13caa476
   [junit4]   2> 1796699 INFO  (coreLoadExecutor-5138-thread-1-processing-n:127.0.0.1:61018_) [n:127.0.0.1:61018_ c:collection1 s:shard1 r:core_node1 x:collection1] o.a.s.c.CachingDirectoryFactory return new directory for /Users/jenkins/workspace/Lucene-Solr-6.x-MacOSX/solr/build/solr-core/test/J1/temp/solr.cloud.CleanupOldIndexTest_9035182FBDA8921D-001/shard-1-001/cores/collection1/data
   [junit4]   2> 1796700 INFO  (coreLoadExecutor-5138-thread-1-processing-n:127.0.0.1:61018_) [n:127.0.0.1:61018_ c:collection1 s:shard1 r:core_node1 x:collection1] o.a.s.c.SolrCore New index directory detected: old=null new=/Users/jenkins/workspace/Lucene-Solr-6.x-MacOSX/solr/build/solr-core/test/J1/temp/solr.cloud.CleanupOldIndexTest_9035182FBDA8921D-001/shard-1-001/cores/collection1/data/index/
   [junit4]   2> 1796700 WARN  (coreLoadExecutor-5138-thread-1-processing-n:127.0.0.1:61018_) [n:127.0.0.1:61018_ c:collection1 s:shard1 r:core_node1 x:collection1] o.a.s.c.SolrCore [collection1] Solr index directory '/Users/jenkins/workspace/Lucene-Solr-6.x-MacOSX/solr/build/solr-core/test/J1/temp/solr.cloud.CleanupOldIndexTest_9035182FBDA8921D-001/shard-1-001/cores/collection1/data/index' doesn't exist. Creating new index...
   [junit4]   2> 1796700 INFO  (coreLoadExecutor-5138-thread-1-processing-n:127.0.0.1:61018_) [n:127.0.0.1:61018_ c:collection1 s:shard1 r:core_node1 x:collection1] o.a.s.c.CachingDirectoryFactory return new directory for /Users/jenkins/workspace/Lucene-Solr-6.x-MacOSX/solr/build/solr-core/test/J1/temp/solr.cloud.CleanupOldIndexTest_9035182FBDA8921D-001/shard-1-001/cores/collection1/data/index
   [junit4]   2> 1796700 INFO  (coreLoadExecutor-5138-thread-1-processing-n:127.0.0.1:61018_) [n:127.0.0.1:61018_ c:collection1 s:shard1 r:core_node1 x:collection1] o.a.s.u.RandomMergePolicy RandomMergePolicy wrapping class org.apache.lucene.index.LogByteSizeMergePolicy: [LogByteSizeMergePolicy: minMergeSize=1677721, mergeFactor=4, maxMergeSize=2147483648, maxMergeSizeForForcedMerge=9223372036854775807, calibrateSizeByDeletes=false, maxMergeDocs=2147483647, maxCFSSegmentSizeMB=8.796093022207999E12, noCFSRatio=0.2773734684955385]
   [junit4]   2> 1796700 INFO  (coreLoadExecutor-5138-thread-1-processing-n:127.0.0.1:61018_) [n:127.0.0.1:61018_ c:collection1 s:shard1 r:core_node1 x:collection1] o.a.s.c.SolrDeletionPolicy SolrDeletionPolicy.onCommit: commits: num=1
   [junit4]   2> 	commit{dir=MockDirectoryWrapper(RAMDirectory@558063ce lockFactory=org.apache.lucene.store.SingleInstanceLockFactory@3d53131c),segFN=segments_1,generation=1}
   [junit4]   2> 1796700 INFO  (coreLoadExecutor-5138-thread-1-processing-n:127.0.0.1:61018_) [n:127.0.0.1:61018_ c:collection1 s:shard1 r:core_node1 x:collection1] o.a.s.c.SolrDeletionPolicy newest commit generation = 1
   [junit4]   2> 1796701 INFO  (OldIndexDirectoryCleanupThreadForCore-collection1) [n:127.0.0.1:61018_ c:collection1 s:shard1 r:core_node1 x:collection1] o.a.s.c.SolrCore Looking for old index directories to cleanup for core collection1 in /Users/jenkins/workspace/Lucene-Solr-6.x-MacOSX/solr/build/solr-core/test/J1/temp/solr.cloud.CleanupOldIndexTest_9035182FBDA8921D-001/shard-1-001/cores/collection1/data/
   [junit4]   2> 1796701 WARN  (OldIndexDirectoryCleanupThreadForCore-collection1) [n:127.0.0.1:61018_ c:collection1 s:shard1 r:core_node1 x:collection1] o.a.s.c.DirectoryFactory /Users/jenkins/workspace/Lucene-Solr-6.x-MacOSX/solr/build/solr-core/test/J1/temp/solr.cloud.CleanupOldIndexTest_9035182FBDA8921D-001/shard-1-001/cores/collection1/data/ does not point to a valid data directory; skipping clean-up of old index directories.
   [junit4]   2> 1796704 INFO  (coreLoadExecutor-5138-thread-1-processing-n:127.0.0.1:61018_) [n:127.0.0.1:61018_ c:collection1 s:shard1 r:core_node1 x:collection1] o.a.s.u.p.UpdateRequestProcessorChain creating updateRequestProcessorChain "nodistrib"
   [junit4]   2> 1796704 INFO  (coreLoadExecutor-5138-thread-1-processing-n:127.0.0.1:61018_) [n:127.0.0.1:61018_ c:collection1 s:shard1 r:core_node1 x:collection1] o.a.s.u.p.UpdateRequestProcessorChain creating updateRequestProcessorChain "dedupe"
   [junit4]   2> 1796704 INFO  (coreLoadExecutor-5138-thread-1-processing-n:127.0.0.1:61018_) [n:127.0.0.1:61018_ c:collection1 s:shard1 r:core_node1 x:collection1] o.a.s.u.p.UpdateRequestProcessorChain inserting DistributedUpdateProcessorFactory into updateRequestProcessorChain "dedupe"
   [junit4]   2> 1796704 INFO  (coreLoadExecutor-5138-thread-1-processing-n:127.0.0.1:61018_) [n:127.0.0.1:61018_ c:collection1 s:shard1 r:core_node1 x:collection1] o.a.s.u.p.UpdateRequestProcessorChain creating updateRequestProcessorChain "stored_sig"
   [junit4]   2> 1796704 INFO  (coreLoadExecutor-5138-thread-1-processing-n:127.0.0.1:61018_) [n:127.0.0.1:61018_ c:collection1 s:shard1 r:core_node1 x:collection1] o.a.s.u.p.UpdateRequestProcessorChain inserting DistributedUpdateProcessorFactory into updateRequestProcessorChain "stored_sig"
   [junit4]   2> 1796704 INFO  (coreLoadExecutor-5138-thread-1-processing-n:127.0.0.1:61018_) [n:127.0.0.1:61018_ c:collection1 s:shard1 r:core_node1 x:collection1] o.a.s.u.p.UpdateRequestProcessorChain creating updateRequestProcessorChain "distrib-dup-test-chain-explicit"
   [junit4]   2> 1796704 INFO  (coreLoadExecutor-5138-thread-1-processing-n:127.0.0.1:61018_) [n:127.0.0.1:61018_ c:collection1 s:shard1 r:core_node1 x:collection1] o.a.s.u.p.UpdateRequestProcessorChain creating updateRequestProcessorChain "distrib-dup-test-chain-implicit"
   [junit4]   2> 1796704 INFO  (coreLoadExecutor-5138-thread-1-processing-n:127.0.0.1:61018_) [n:127.0.0.1:61018_ c:collection1 s:shard1 r:core_node1 x:collection1] o.a.s.u.p.UpdateRequestProcessorChain inserting DistributedUpdateProcessorFactory into updateRequestProcessorChain "distrib-dup-test-chain-implicit"
   [junit4]   2> 1796704 INFO  (coreLoadExecutor-5138-thread-1-processing-n:127.0.0.1:61018_) [n:127.0.0.1:61018_ c:collection1 s:shard1 r:core_node1 x:collection1] o.a.s.c.SolrCore no updateRequestProcessorChain defined as default, creating implicit default
   [junit4]   2> 1796704 WARN  (coreLoadExecutor-5138-thread-1-processing-n:127.0.0.1:61018_) [n:127.0.0.1:61018_ c:collection1 s:shard1 r:core_node1 x:collection1] o.a.s.c.RequestHandlers INVALID paramSet a in requestHandler {type = requestHandler,name = /dump,class = DumpRequestHandler,args = {defaults={a=A,b=B}}}
   [junit4]   2> 1796708 INFO  (coreLoadExecutor-5138-thread-1-processing-n:127.0.0.1:61018_) [n:127.0.0.1:61018_ c:collection1 s:shard1 r:core_node1 x:collection1] o.a.s.h.l.XMLLoader xsltCacheLifetimeSeconds=60
   [junit4]   2> 1796708 INFO  (coreLoadExecutor-5138-thread-1-processing-n:127.0.0.1:61018_) [n:127.0.0.1:61018_ c:collection1 s:shard1 r:core_node1 x:collection1] o.a.s.h

[...truncated too long message...]

on.cloud.SolrZkClient$2.execute(SolrZkClient.java:241)
   [junit4]   2> 	at org.apache.solr.common.cloud.ZkCmdExecutor.retryOperation(ZkCmdExecutor.java:60)
   [junit4]   2> 	at org.apache.solr.common.cloud.SolrZkClient.delete(SolrZkClient.java:241)
   [junit4]   2> 	at org.apache.solr.cloud.ElectionContext.cancelElection(ElectionContext.java:86)
   [junit4]   2> 	at org.apache.solr.cloud.ShardLeaderElectionContextBase.cancelElection(ElectionContext.java:143)
   [junit4]   2> 	at org.apache.solr.cloud.ShardLeaderElectionContext.cancelElection(ElectionContext.java:279)
   [junit4]   2> 	at org.apache.solr.cloud.ShardLeaderElectionContext.runLeaderProcess(ElectionContext.java:455)
   [junit4]   2> 	at org.apache.solr.cloud.LeaderElector.runIamLeaderProcess(LeaderElector.java:170)
   [junit4]   2> 	at org.apache.solr.cloud.LeaderElector.checkIfIamLeader(LeaderElector.java:135)
   [junit4]   2> 	at org.apache.solr.cloud.LeaderElector.access$200(LeaderElector.java:56)
   [junit4]   2> 	at org.apache.solr.cloud.LeaderElector$ElectionWatcher.process(LeaderElector.java:348)
   [junit4]   2> 	at org.apache.solr.common.cloud.SolrZkClient$3.lambda$process$0(SolrZkClient.java:266)
   [junit4]   2> 	at java.util.concurrent.Executors$RunnableAdapter.call(Executors.java:511)
   [junit4]   2> 	at java.util.concurrent.FutureTask.run(FutureTask.java:266)
   [junit4]   2> 	at org.apache.solr.common.util.ExecutorUtil$MDCAwareThreadPoolExecutor.lambda$execute$0(ExecutorUtil.java:229)
   [junit4]   2> 	at java.util.concurrent.ThreadPoolExecutor.runWorker(ThreadPoolExecutor.java:1142)
   [junit4]   2> 	at java.util.concurrent.ThreadPoolExecutor$Worker.run(ThreadPoolExecutor.java:617)
   [junit4]   2> 	at java.lang.Thread.run(Thread.java:745)
   [junit4]   2> 1823874 INFO  (TEST-CleanupOldIndexTest.test-seed#[9035182FBDA8921D]) [    ] o.e.j.s.ServerConnector Stopped ServerConnector@22237219{HTTP/1.1,[http/1.1]}{127.0.0.1:61026}
   [junit4]   2> 1823875 INFO  (TEST-CleanupOldIndexTest.test-seed#[9035182FBDA8921D]) [    ] o.e.j.s.h.ContextHandler Stopped o.e.j.s.ServletContextHandler@64421b04{/,null,UNAVAILABLE}
   [junit4]   2> 1823878 INFO  (TEST-CleanupOldIndexTest.test-seed#[9035182FBDA8921D]) [    ] o.a.s.c.ChaosMonkey monkey: stop shard! 61008
   [junit4]   2> 1823879 INFO  (TEST-CleanupOldIndexTest.test-seed#[9035182FBDA8921D]) [    ] o.a.s.c.ZkTestServer connecting to 127.0.0.1:61005 61005
   [junit4]   2> 1823932 INFO  (Thread-3826) [    ] o.a.s.c.ZkTestServer connecting to 127.0.0.1:61005 61005
   [junit4]   2> 1825129 WARN  (Thread-3826) [    ] o.a.s.c.ZkTestServer Watch limit violations: 
   [junit4]   2> Maximum concurrent create/delete watches above limit:
   [junit4]   2> 
   [junit4]   2> 	5	/solr/aliases.json
   [junit4]   2> 	5	/solr/clusterprops.json
   [junit4]   2> 	4	/solr/security.json
   [junit4]   2> 	4	/solr/configs/conf1
   [junit4]   2> 	3	/solr/collections/collection1/state.json
   [junit4]   2> 
   [junit4]   2> Maximum concurrent data watches above limit:
   [junit4]   2> 
   [junit4]   2> 	5	/solr/clusterstate.json
   [junit4]   2> 	2	/solr/overseer_elect/election/95901818354401288-127.0.0.1:61018_-n_0000000001
   [junit4]   2> 	2	/solr/collections/collection1/leader_elect/shard1/election/95901818354401288-core_node1-n_0000000000
   [junit4]   2> 
   [junit4]   2> Maximum concurrent children watches above limit:
   [junit4]   2> 
   [junit4]   2> 	5	/solr/collections
   [junit4]   2> 	4	/solr/live_nodes
   [junit4]   2> 
   [junit4]   2> NOTE: reproduce with: ant test  -Dtestcase=CleanupOldIndexTest -Dtests.method=test -Dtests.seed=9035182FBDA8921D -Dtests.slow=true -Dtests.locale=es-PY -Dtests.timezone=Brazil/West -Dtests.asserts=true -Dtests.file.encoding=US-ASCII
   [junit4] ERROR   33.7s J1 | CleanupOldIndexTest.test <<<
   [junit4]    > Throwable #1: com.carrotsearch.randomizedtesting.UncaughtExceptionError: Captured an uncaught exception in thread: Thread[id=12296, name=updateExecutor-2561-thread-1, state=RUNNABLE, group=TGRP-CleanupOldIndexTest]
   [junit4]    > 	at __randomizedtesting.SeedInfo.seed([9035182FBDA8921D:186127F51354FFE5]:0)
   [junit4]    > Caused by: org.apache.solr.common.SolrException: Replica: http://127.0.0.1:61026/collection1/ should have been marked under leader initiated recovery in ZkController but wasn't.
   [junit4]    > 	at __randomizedtesting.SeedInfo.seed([9035182FBDA8921D]:0)
   [junit4]    > 	at org.apache.solr.cloud.LeaderInitiatedRecoveryThread.run(LeaderInitiatedRecoveryThread.java:88)
   [junit4]    > 	at org.apache.solr.common.util.ExecutorUtil$MDCAwareThreadPoolExecutor.lambda$execute$0(ExecutorUtil.java:229)
   [junit4]    > 	at java.util.concurrent.ThreadPoolExecutor.runWorker(ThreadPoolExecutor.java:1142)
   [junit4]    > 	at java.util.concurrent.ThreadPoolExecutor$Worker.run(ThreadPoolExecutor.java:617)
   [junit4]    > 	at java.lang.Thread.run(Thread.java:745)
   [junit4]   2> 1825136 INFO  (SUITE-CleanupOldIndexTest-seed#[9035182FBDA8921D]-worker) [    ] o.a.s.SolrTestCaseJ4 ###deleteCore
   [junit4]   2> NOTE: test params are: codec=Asserting(Lucene60): {rnd_b=FST50, _version_=PostingsFormat(name=Asserting), a_t=Lucene50(blocksize=128), a_i=FST50, id=FST50}, docValues:{}, maxPointsInLeafNode=1408, maxMBSortInHeap=5.585331603322652, sim=RandomSimilarity(queryNorm=true,coord=crazy): {}, locale=es-PY, timezone=Brazil/West
   [junit4]   2> NOTE: Mac OS X 10.11.4 x86_64/Oracle Corporation 1.8.0_72 (64-bit)/cpus=3,threads=1,free=283952368,total=458874880
   [junit4]   2> NOTE: All tests run in this JVM: [HdfsChaosMonkeySafeLeaderTest, TestIndexingPerformance, DistribDocExpirationUpdateProcessorTest, ZkStateWriterTest, BasicDistributedZk2Test, TestObjectReleaseTracker, BlockJoinFacetSimpleTest, TestSolrXml, TestJettySolrRunner, TestBulkSchemaConcurrent, DistanceFunctionTest, RestartWhileUpdatingTest, FullSolrCloudDistribCmdsTest, TestPHPSerializedResponseWriter, TestRandomRequestDistribution, TestCloudDeleteByQuery, TestConfigSets, SharedFSAutoReplicaFailoverUtilsTest, TestFieldCollectionResource, TestSolrConfigHandlerCloud, TermVectorComponentTest, TestFileDictionaryLookup, TestTolerantUpdateProcessorCloud, TestFiltering, DeleteInactiveReplicaTest, FileBasedSpellCheckerTest, TestCollapseQParserPlugin, TestClusterStateMutator, TestQueryWrapperFilter, CollectionReloadTest, CdcrVersionReplicationTest, TestAtomicUpdateErrorCases, OutputWriterTest, TestDocBasedVersionConstraints, TestDistribDocBasedVersion, SuggesterTSTTest, TestSubQueryTransformer, MinimalSchemaTest, TestRequestStatusCollectionAPI, TestSolrDeletionPolicy2, IndexSchemaRuntimeFieldTest, TestUtils, TestBadConfig, ClassificationUpdateProcessorFactoryTest, TestDistributedGrouping, TestAuthenticationFramework, LeaderFailoverAfterPartitionTest, TestSimpleTrackingShardHandler, TestBlobHandler, TestLeaderInitiatedRecoveryThread, ZkSolrClientTest, BasicAuthIntegrationTest, AliasIntegrationTest, HdfsTlogReplayBufferedWhileIndexingTest, TestReloadAndDeleteDocs, ResponseLogComponentTest, CursorMarkTest, OpenExchangeRatesOrgProviderTest, ExitableDirectoryReaderTest, TestSerializedLuceneMatchVersion, TestRestoreCore, DirectSolrConnectionTest, TestPerFieldSimilarity, SpellCheckComponentTest, BlockJoinFacetDistribTest, TestBulkSchemaAPI, TestSortingResponseWriter, SolrCloudExampleTest, ConnectionReuseTest, SignatureUpdateProcessorFactoryTest, WrapperMergePolicyFactoryTest, RequestHandlersTest, RAMDirectoryFactoryTest, DateFieldTest, EnumFieldTest, TestCloudPivotFacet, TestOmitPositions, CurrencyFieldOpenExchangeTest, BitVectorTest, StatsComponentTest, TestMiniSolrCloudClusterBase, TestFastWriter, TestHdfsUpdateLog, CoreAdminHandlerTest, TestCustomDocTransformer, TestStressRecovery, TestSolrFieldCacheMBean, CollectionTooManyReplicasTest, TestAddFieldRealTimeGet, TestQueryTypes, ShowFileRequestHandlerTest, TestSchemaNameResource, TestFilteredDocIdSet, TestPivotHelperCode, ShardRoutingCustomTest, DistributedDebugComponentTest, BadCopyFieldTest, SpellCheckCollatorTest, SuggesterWFSTTest, HdfsWriteToMultipleCollectionsTest, BinaryUpdateRequestHandlerTest, TestInitParams, MultiThreadedOCPTest, TestValueSourceCache, TestExclusionRuleCollectionAccess, DistributedFacetPivotLargeTest, AutoCommitTest, TestNoOpRegenerator, ZkNodePropsTest, TestFoldingMultitermQuery, FieldAnalysisRequestHandlerTest, FileUtilsTest, SSLMigrationTest, TestIndexSearcher, SolrCoreCheckLockOnStartupTest, FullHLLTest, DefaultValueUpdateProcessorTest, TestJsonRequest, TestReplicaProperties, TestSystemIdResolver, TlogReplayBufferedWhileIndexingTest, TestGraphMLResponseWriter, QueryResultKeyTest, NoCacheHeaderTest, CleanupOldIndexTest]
   [junit4] Completed [272/598 (1!)] on J1 in 34.18s, 1 test, 1 error <<< FAILURES!

[...truncated 1095 lines...]
BUILD FAILED
/Users/jenkins/workspace/Lucene-Solr-6.x-MacOSX/build.xml:740: The following error occurred while executing this line:
/Users/jenkins/workspace/Lucene-Solr-6.x-MacOSX/build.xml:684: The following error occurred while executing this line:
/Users/jenkins/workspace/Lucene-Solr-6.x-MacOSX/build.xml:59: The following error occurred while executing this line:
/Users/jenkins/workspace/Lucene-Solr-6.x-MacOSX/solr/build.xml:233: The following error occurred while executing this line:
/Users/jenkins/workspace/Lucene-Solr-6.x-MacOSX/solr/common-build.xml:529: The following error occurred while executing this line:
/Users/jenkins/workspace/Lucene-Solr-6.x-MacOSX/lucene/common-build.xml:1457: The following error occurred while executing this line:
/Users/jenkins/workspace/Lucene-Solr-6.x-MacOSX/lucene/common-build.xml:1014: There were test failures: 598 suites (10 ignored), 2420 tests, 1 error, 121 ignored (71 assumptions) [seed: 9035182FBDA8921D]

Total time: 85 minutes 32 seconds
Build step 'Invoke Ant' marked build as failure
Archiving artifacts
[WARNINGS] Skipping publisher since build result is FAILURE
Recording test results
Email was triggered for: Failure - Any
Sending email for trigger: Failure - Any



Mime
View raw message