lucene-dev mailing list archives

Site index · List index
Message view « Date » · « Thread »
Top « Date » · « Thread »
From Policeman Jenkins Server <jenk...@thetaphi.de>
Subject [JENKINS] Lucene-Solr-master-Windows (64bit/jdk1.8.0_92) - Build # 5861 - Failure!
Date Mon, 23 May 2016 10:24:09 GMT
Build: http://jenkins.thetaphi.de/job/Lucene-Solr-master-Windows/5861/
Java: 64bit/jdk1.8.0_92 -XX:+UseCompressedOops -XX:+UseSerialGC

1 tests failed.
FAILED:  junit.framework.TestSuite.org.apache.solr.cloud.CdcrVersionReplicationTest

Error Message:
ObjectTracker found 1 object(s) that were not released!!! [InternalHttpClient]

Stack Trace:
java.lang.AssertionError: ObjectTracker found 1 object(s) that were not released!!! [InternalHttpClient]
	at __randomizedtesting.SeedInfo.seed([84DD82B2D66BA97A]:0)
	at org.junit.Assert.fail(Assert.java:93)
	at org.junit.Assert.assertTrue(Assert.java:43)
	at org.junit.Assert.assertNull(Assert.java:551)
	at org.apache.solr.SolrTestCaseJ4.afterClass(SolrTestCaseJ4.java:255)
	at sun.reflect.NativeMethodAccessorImpl.invoke0(Native Method)
	at sun.reflect.NativeMethodAccessorImpl.invoke(NativeMethodAccessorImpl.java:62)
	at sun.reflect.DelegatingMethodAccessorImpl.invoke(DelegatingMethodAccessorImpl.java:43)
	at java.lang.reflect.Method.invoke(Method.java:498)
	at com.carrotsearch.randomizedtesting.RandomizedRunner.invoke(RandomizedRunner.java:1764)
	at com.carrotsearch.randomizedtesting.RandomizedRunner$7.evaluate(RandomizedRunner.java:834)
	at com.carrotsearch.randomizedtesting.rules.StatementAdapter.evaluate(StatementAdapter.java:36)
	at com.carrotsearch.randomizedtesting.rules.SystemPropertiesRestoreRule$1.evaluate(SystemPropertiesRestoreRule.java:57)
	at org.apache.lucene.util.AbstractBeforeAfterRule$1.evaluate(AbstractBeforeAfterRule.java:45)
	at com.carrotsearch.randomizedtesting.rules.StatementAdapter.evaluate(StatementAdapter.java:36)
	at org.apache.lucene.util.TestRuleStoreClassName$1.evaluate(TestRuleStoreClassName.java:41)
	at com.carrotsearch.randomizedtesting.rules.NoShadowingOrOverridesOnMethodsRule$1.evaluate(NoShadowingOrOverridesOnMethodsRule.java:40)
	at com.carrotsearch.randomizedtesting.rules.NoShadowingOrOverridesOnMethodsRule$1.evaluate(NoShadowingOrOverridesOnMethodsRule.java:40)
	at com.carrotsearch.randomizedtesting.rules.StatementAdapter.evaluate(StatementAdapter.java:36)
	at com.carrotsearch.randomizedtesting.rules.StatementAdapter.evaluate(StatementAdapter.java:36)
	at com.carrotsearch.randomizedtesting.rules.StatementAdapter.evaluate(StatementAdapter.java:36)
	at org.apache.lucene.util.TestRuleAssertionsRequired$1.evaluate(TestRuleAssertionsRequired.java:53)
	at org.apache.lucene.util.TestRuleMarkFailure$1.evaluate(TestRuleMarkFailure.java:47)
	at org.apache.lucene.util.TestRuleIgnoreAfterMaxFailures$1.evaluate(TestRuleIgnoreAfterMaxFailures.java:64)
	at org.apache.lucene.util.TestRuleIgnoreTestSuites$1.evaluate(TestRuleIgnoreTestSuites.java:54)
	at com.carrotsearch.randomizedtesting.rules.StatementAdapter.evaluate(StatementAdapter.java:36)
	at com.carrotsearch.randomizedtesting.ThreadLeakControl$StatementRunner.run(ThreadLeakControl.java:367)
	at java.lang.Thread.run(Thread.java:745)




Build Log:
[...truncated 10542 lines...]
   [junit4] Suite: org.apache.solr.cloud.CdcrVersionReplicationTest
   [junit4]   2> Creating dataDir: C:\Users\jenkins\workspace\Lucene-Solr-master-Windows\solr\build\solr-core\test\J1\temp\solr.cloud.CdcrVersionReplicationTest_84DD82B2D66BA97A-001\init-core-data-001
   [junit4]   2> 89271 INFO  (SUITE-CdcrVersionReplicationTest-seed#[84DD82B2D66BA97A]-worker) [    ] o.a.s.SolrTestCaseJ4 Randomized ssl (false) and clientAuth (false)
   [junit4]   2> 89276 INFO  (SUITE-CdcrVersionReplicationTest-seed#[84DD82B2D66BA97A]-worker) [    ] o.a.s.BaseDistributedSearchTestCase Setting hostContext system property: /
   [junit4]   2> 89294 INFO  (TEST-CdcrVersionReplicationTest.testCdcrDocVersions-seed#[84DD82B2D66BA97A]) [    ] o.a.s.c.ZkTestServer STARTING ZK TEST SERVER
   [junit4]   2> 89300 INFO  (Thread-330) [    ] o.a.s.c.ZkTestServer client port:0.0.0.0/0.0.0.0:0
   [junit4]   2> 89301 INFO  (Thread-330) [    ] o.a.s.c.ZkTestServer Starting server
   [junit4]   2> 89395 INFO  (TEST-CdcrVersionReplicationTest.testCdcrDocVersions-seed#[84DD82B2D66BA97A]) [    ] o.a.s.c.ZkTestServer start zk server on port:61132
   [junit4]   2> 89404 INFO  (TEST-CdcrVersionReplicationTest.testCdcrDocVersions-seed#[84DD82B2D66BA97A]) [    ] o.a.s.c.c.SolrZkClient Using default ZkCredentialsProvider
   [junit4]   2> 89405 INFO  (TEST-CdcrVersionReplicationTest.testCdcrDocVersions-seed#[84DD82B2D66BA97A]) [    ] o.a.s.c.c.ConnectionManager Waiting for client to connect to ZooKeeper
   [junit4]   2> 89412 INFO  (zkCallback-137-thread-1) [    ] o.a.s.c.c.ConnectionManager Watcher org.apache.solr.common.cloud.ConnectionManager@b0c1aed name:ZooKeeperConnection Watcher:127.0.0.1:61132 got event WatchedEvent state:SyncConnected type:None path:null path:null type:None
   [junit4]   2> 89413 INFO  (TEST-CdcrVersionReplicationTest.testCdcrDocVersions-seed#[84DD82B2D66BA97A]) [    ] o.a.s.c.c.ConnectionManager Client is connected to ZooKeeper
   [junit4]   2> 89413 INFO  (TEST-CdcrVersionReplicationTest.testCdcrDocVersions-seed#[84DD82B2D66BA97A]) [    ] o.a.s.c.c.SolrZkClient Using default ZkACLProvider
   [junit4]   2> 89413 INFO  (TEST-CdcrVersionReplicationTest.testCdcrDocVersions-seed#[84DD82B2D66BA97A]) [    ] o.a.s.c.c.SolrZkClient makePath: /solr
   [junit4]   2> 89419 INFO  (TEST-CdcrVersionReplicationTest.testCdcrDocVersions-seed#[84DD82B2D66BA97A]) [    ] o.a.s.c.c.SolrZkClient Using default ZkCredentialsProvider
   [junit4]   2> 89420 INFO  (TEST-CdcrVersionReplicationTest.testCdcrDocVersions-seed#[84DD82B2D66BA97A]) [    ] o.a.s.c.c.ConnectionManager Waiting for client to connect to ZooKeeper
   [junit4]   2> 89422 INFO  (zkCallback-138-thread-1) [    ] o.a.s.c.c.ConnectionManager Watcher org.apache.solr.common.cloud.ConnectionManager@6197971c name:ZooKeeperConnection Watcher:127.0.0.1:61132/solr got event WatchedEvent state:SyncConnected type:None path:null path:null type:None
   [junit4]   2> 89422 INFO  (TEST-CdcrVersionReplicationTest.testCdcrDocVersions-seed#[84DD82B2D66BA97A]) [    ] o.a.s.c.c.ConnectionManager Client is connected to ZooKeeper
   [junit4]   2> 89422 INFO  (TEST-CdcrVersionReplicationTest.testCdcrDocVersions-seed#[84DD82B2D66BA97A]) [    ] o.a.s.c.c.SolrZkClient Using default ZkACLProvider
   [junit4]   2> 89422 INFO  (TEST-CdcrVersionReplicationTest.testCdcrDocVersions-seed#[84DD82B2D66BA97A]) [    ] o.a.s.c.c.SolrZkClient makePath: /collections/collection1
   [junit4]   2> 89423 INFO  (TEST-CdcrVersionReplicationTest.testCdcrDocVersions-seed#[84DD82B2D66BA97A]) [    ] o.a.s.c.c.SolrZkClient makePath: /collections/collection1/shards
   [junit4]   2> 89426 INFO  (TEST-CdcrVersionReplicationTest.testCdcrDocVersions-seed#[84DD82B2D66BA97A]) [    ] o.a.s.c.c.SolrZkClient makePath: /collections/control_collection
   [junit4]   2> 89427 INFO  (TEST-CdcrVersionReplicationTest.testCdcrDocVersions-seed#[84DD82B2D66BA97A]) [    ] o.a.s.c.c.SolrZkClient makePath: /collections/control_collection/shards
   [junit4]   2> 89430 INFO  (TEST-CdcrVersionReplicationTest.testCdcrDocVersions-seed#[84DD82B2D66BA97A]) [    ] o.a.s.c.AbstractZkTestCase put C:\Users\jenkins\workspace\Lucene-Solr-master-Windows\solr\core\src\test-files\solr\collection1\conf\solrconfig-cdcr.xml to /configs/conf1/solrconfig.xml
   [junit4]   2> 89431 INFO  (TEST-CdcrVersionReplicationTest.testCdcrDocVersions-seed#[84DD82B2D66BA97A]) [    ] o.a.s.c.c.SolrZkClient makePath: /configs/conf1/solrconfig.xml
   [junit4]   2> 89435 INFO  (TEST-CdcrVersionReplicationTest.testCdcrDocVersions-seed#[84DD82B2D66BA97A]) [    ] o.a.s.c.AbstractZkTestCase put C:\Users\jenkins\workspace\Lucene-Solr-master-Windows\solr\core\src\test-files\solr\collection1\conf\schema15.xml to /configs/conf1/schema.xml
   [junit4]   2> 89435 INFO  (TEST-CdcrVersionReplicationTest.testCdcrDocVersions-seed#[84DD82B2D66BA97A]) [    ] o.a.s.c.c.SolrZkClient makePath: /configs/conf1/schema.xml
   [junit4]   2> 89438 INFO  (TEST-CdcrVersionReplicationTest.testCdcrDocVersions-seed#[84DD82B2D66BA97A]) [    ] o.a.s.c.AbstractZkTestCase put C:\Users\jenkins\workspace\Lucene-Solr-master-Windows\solr\core\src\test-files\solr\collection1\conf\solrconfig.snippet.randomindexconfig.xml to /configs/conf1/solrconfig.snippet.randomindexconfig.xml
   [junit4]   2> 89438 INFO  (TEST-CdcrVersionReplicationTest.testCdcrDocVersions-seed#[84DD82B2D66BA97A]) [    ] o.a.s.c.c.SolrZkClient makePath: /configs/conf1/solrconfig.snippet.randomindexconfig.xml
   [junit4]   2> 89441 INFO  (TEST-CdcrVersionReplicationTest.testCdcrDocVersions-seed#[84DD82B2D66BA97A]) [    ] o.a.s.c.AbstractZkTestCase put C:\Users\jenkins\workspace\Lucene-Solr-master-Windows\solr\core\src\test-files\solr\collection1\conf\stopwords.txt to /configs/conf1/stopwords.txt
   [junit4]   2> 89441 INFO  (TEST-CdcrVersionReplicationTest.testCdcrDocVersions-seed#[84DD82B2D66BA97A]) [    ] o.a.s.c.c.SolrZkClient makePath: /configs/conf1/stopwords.txt
   [junit4]   2> 89446 INFO  (TEST-CdcrVersionReplicationTest.testCdcrDocVersions-seed#[84DD82B2D66BA97A]) [    ] o.a.s.c.AbstractZkTestCase put C:\Users\jenkins\workspace\Lucene-Solr-master-Windows\solr\core\src\test-files\solr\collection1\conf\protwords.txt to /configs/conf1/protwords.txt
   [junit4]   2> 89446 INFO  (TEST-CdcrVersionReplicationTest.testCdcrDocVersions-seed#[84DD82B2D66BA97A]) [    ] o.a.s.c.c.SolrZkClient makePath: /configs/conf1/protwords.txt
   [junit4]   2> 89448 INFO  (TEST-CdcrVersionReplicationTest.testCdcrDocVersions-seed#[84DD82B2D66BA97A]) [    ] o.a.s.c.AbstractZkTestCase put C:\Users\jenkins\workspace\Lucene-Solr-master-Windows\solr\core\src\test-files\solr\collection1\conf\currency.xml to /configs/conf1/currency.xml
   [junit4]   2> 89448 INFO  (TEST-CdcrVersionReplicationTest.testCdcrDocVersions-seed#[84DD82B2D66BA97A]) [    ] o.a.s.c.c.SolrZkClient makePath: /configs/conf1/currency.xml
   [junit4]   2> 89451 INFO  (TEST-CdcrVersionReplicationTest.testCdcrDocVersions-seed#[84DD82B2D66BA97A]) [    ] o.a.s.c.AbstractZkTestCase put C:\Users\jenkins\workspace\Lucene-Solr-master-Windows\solr\core\src\test-files\solr\collection1\conf\enumsConfig.xml to /configs/conf1/enumsConfig.xml
   [junit4]   2> 89451 INFO  (TEST-CdcrVersionReplicationTest.testCdcrDocVersions-seed#[84DD82B2D66BA97A]) [    ] o.a.s.c.c.SolrZkClient makePath: /configs/conf1/enumsConfig.xml
   [junit4]   2> 89454 INFO  (TEST-CdcrVersionReplicationTest.testCdcrDocVersions-seed#[84DD82B2D66BA97A]) [    ] o.a.s.c.AbstractZkTestCase put C:\Users\jenkins\workspace\Lucene-Solr-master-Windows\solr\core\src\test-files\solr\collection1\conf\open-exchange-rates.json to /configs/conf1/open-exchange-rates.json
   [junit4]   2> 89454 INFO  (TEST-CdcrVersionReplicationTest.testCdcrDocVersions-seed#[84DD82B2D66BA97A]) [    ] o.a.s.c.c.SolrZkClient makePath: /configs/conf1/open-exchange-rates.json
   [junit4]   2> 89456 INFO  (TEST-CdcrVersionReplicationTest.testCdcrDocVersions-seed#[84DD82B2D66BA97A]) [    ] o.a.s.c.AbstractZkTestCase put C:\Users\jenkins\workspace\Lucene-Solr-master-Windows\solr\core\src\test-files\solr\collection1\conf\mapping-ISOLatin1Accent.txt to /configs/conf1/mapping-ISOLatin1Accent.txt
   [junit4]   2> 89456 INFO  (TEST-CdcrVersionReplicationTest.testCdcrDocVersions-seed#[84DD82B2D66BA97A]) [    ] o.a.s.c.c.SolrZkClient makePath: /configs/conf1/mapping-ISOLatin1Accent.txt
   [junit4]   2> 89459 INFO  (TEST-CdcrVersionReplicationTest.testCdcrDocVersions-seed#[84DD82B2D66BA97A]) [    ] o.a.s.c.AbstractZkTestCase put C:\Users\jenkins\workspace\Lucene-Solr-master-Windows\solr\core\src\test-files\solr\collection1\conf\old_synonyms.txt to /configs/conf1/old_synonyms.txt
   [junit4]   2> 89459 INFO  (TEST-CdcrVersionReplicationTest.testCdcrDocVersions-seed#[84DD82B2D66BA97A]) [    ] o.a.s.c.c.SolrZkClient makePath: /configs/conf1/old_synonyms.txt
   [junit4]   2> 89461 INFO  (TEST-CdcrVersionReplicationTest.testCdcrDocVersions-seed#[84DD82B2D66BA97A]) [    ] o.a.s.c.AbstractZkTestCase put C:\Users\jenkins\workspace\Lucene-Solr-master-Windows\solr\core\src\test-files\solr\collection1\conf\synonyms.txt to /configs/conf1/synonyms.txt
   [junit4]   2> 89461 INFO  (TEST-CdcrVersionReplicationTest.testCdcrDocVersions-seed#[84DD82B2D66BA97A]) [    ] o.a.s.c.c.SolrZkClient makePath: /configs/conf1/synonyms.txt
   [junit4]   2> 89463 WARN  (NIOServerCxn.Factory:0.0.0.0/0.0.0.0:0) [    ] o.a.z.s.NIOServerCnxn caught end of stream exception
   [junit4]   2> EndOfStreamException: Unable to read additional data from client sessionid 0x154dcf675f40001, likely client has closed socket
   [junit4]   2> 	at org.apache.zookeeper.server.NIOServerCnxn.doIO(NIOServerCnxn.java:228)
   [junit4]   2> 	at org.apache.zookeeper.server.NIOServerCnxnFactory.run(NIOServerCnxnFactory.java:208)
   [junit4]   2> 	at java.lang.Thread.run(Thread.java:745)
   [junit4]   2> 89464 INFO  (TEST-CdcrVersionReplicationTest.testCdcrDocVersions-seed#[84DD82B2D66BA97A]) [    ] o.a.s.SolrTestCaseJ4 ###Starting testCdcrDocVersions
   [junit4]   2> 89975 INFO  (TEST-CdcrVersionReplicationTest.testCdcrDocVersions-seed#[84DD82B2D66BA97A]) [    ] o.a.s.SolrTestCaseJ4 Writing core.properties file to C:\Users\jenkins\workspace\Lucene-Solr-master-Windows\solr\build\solr-core\test\J1\temp\solr.cloud.CdcrVersionReplicationTest_84DD82B2D66BA97A-001\jetty-001\cores\collection1
   [junit4]   2> 89978 INFO  (TEST-CdcrVersionReplicationTest.testCdcrDocVersions-seed#[84DD82B2D66BA97A]) [    ] o.e.j.s.Server jetty-9.3.8.v20160314
   [junit4]   2> 89979 INFO  (TEST-CdcrVersionReplicationTest.testCdcrDocVersions-seed#[84DD82B2D66BA97A]) [    ] o.e.j.s.h.ContextHandler Started o.e.j.s.ServletContextHandler@6b7214bc{/,null,AVAILABLE}
   [junit4]   2> 89982 INFO  (TEST-CdcrVersionReplicationTest.testCdcrDocVersions-seed#[84DD82B2D66BA97A]) [    ] o.e.j.s.ServerConnector Started ServerConnector@7adc42a9{HTTP/1.1,[http/1.1]}{127.0.0.1:61139}
   [junit4]   2> 89982 INFO  (TEST-CdcrVersionReplicationTest.testCdcrDocVersions-seed#[84DD82B2D66BA97A]) [    ] o.e.j.s.Server Started @97060ms
   [junit4]   2> 89982 INFO  (TEST-CdcrVersionReplicationTest.testCdcrDocVersions-seed#[84DD82B2D66BA97A]) [    ] o.a.s.c.s.e.JettySolrRunner Jetty properties: {shards=shard1, hostContext=/, hostPort=61139, coreRootDirectory=C:\Users\jenkins\workspace\Lucene-Solr-master-Windows\solr\build\solr-core\test\J1\temp\solr.cloud.CdcrVersionReplicationTest_84DD82B2D66BA97A-001\jetty-001\cores}
   [junit4]   2> 89983 INFO  (TEST-CdcrVersionReplicationTest.testCdcrDocVersions-seed#[84DD82B2D66BA97A]) [    ] o.a.s.s.SolrDispatchFilter SolrDispatchFilter.init(): sun.misc.Launcher$AppClassLoader@73d16e93
   [junit4]   2> 89983 INFO  (TEST-CdcrVersionReplicationTest.testCdcrDocVersions-seed#[84DD82B2D66BA97A]) [    ] o.a.s.c.SolrResourceLoader new SolrResourceLoader for directory: 'C:\Users\jenkins\workspace\Lucene-Solr-master-Windows\solr\build\solr-core\test\J1\temp\solr.cloud.CdcrVersionReplicationTest_84DD82B2D66BA97A-001\jetty-001'
   [junit4]   2> 89983 INFO  (TEST-CdcrVersionReplicationTest.testCdcrDocVersions-seed#[84DD82B2D66BA97A]) [    ] o.a.s.c.SolrResourceLoader JNDI not configured for solr (NoInitialContextEx)
   [junit4]   2> 89983 INFO  (TEST-CdcrVersionReplicationTest.testCdcrDocVersions-seed#[84DD82B2D66BA97A]) [    ] o.a.s.c.SolrResourceLoader solr home defaulted to 'solr/' (could not find system property or JNDI)
   [junit4]   2> 89984 INFO  (TEST-CdcrVersionReplicationTest.testCdcrDocVersions-seed#[84DD82B2D66BA97A]) [    ] o.a.s.c.c.SolrZkClient Using default ZkCredentialsProvider
   [junit4]   2> 89985 INFO  (TEST-CdcrVersionReplicationTest.testCdcrDocVersions-seed#[84DD82B2D66BA97A]) [    ] o.a.s.c.c.ConnectionManager Waiting for client to connect to ZooKeeper
   [junit4]   2> 89986 INFO  (zkCallback-139-thread-1) [    ] o.a.s.c.c.ConnectionManager Watcher org.apache.solr.common.cloud.ConnectionManager@49fee69e name:ZooKeeperConnection Watcher:127.0.0.1:61132/solr got event WatchedEvent state:SyncConnected type:None path:null path:null type:None
   [junit4]   2> 89986 INFO  (TEST-CdcrVersionReplicationTest.testCdcrDocVersions-seed#[84DD82B2D66BA97A]) [    ] o.a.s.c.c.ConnectionManager Client is connected to ZooKeeper
   [junit4]   2> 89987 INFO  (TEST-CdcrVersionReplicationTest.testCdcrDocVersions-seed#[84DD82B2D66BA97A]) [    ] o.a.s.c.c.SolrZkClient Using default ZkACLProvider
   [junit4]   2> 89987 WARN  (NIOServerCxn.Factory:0.0.0.0/0.0.0.0:0) [    ] o.a.z.s.NIOServerCnxn caught end of stream exception
   [junit4]   2> EndOfStreamException: Unable to read additional data from client sessionid 0x154dcf675f40002, likely client has closed socket
   [junit4]   2> 	at org.apache.zookeeper.server.NIOServerCnxn.doIO(NIOServerCnxn.java:228)
   [junit4]   2> 	at org.apache.zookeeper.server.NIOServerCnxnFactory.run(NIOServerCnxnFactory.java:208)
   [junit4]   2> 	at java.lang.Thread.run(Thread.java:745)
   [junit4]   2> 89988 INFO  (TEST-CdcrVersionReplicationTest.testCdcrDocVersions-seed#[84DD82B2D66BA97A]) [    ] o.a.s.s.SolrDispatchFilter Loading solr.xml from SolrHome (not found in ZooKeeper)
   [junit4]   2> 89988 INFO  (TEST-CdcrVersionReplicationTest.testCdcrDocVersions-seed#[84DD82B2D66BA97A]) [    ] o.a.s.c.SolrXmlConfig Loading container configuration from C:\Users\jenkins\workspace\Lucene-Solr-master-Windows\solr\build\solr-core\test\J1\temp\solr.cloud.CdcrVersionReplicationTest_84DD82B2D66BA97A-001\jetty-001\solr.xml
   [junit4]   2> 90001 INFO  (TEST-CdcrVersionReplicationTest.testCdcrDocVersions-seed#[84DD82B2D66BA97A]) [    ] o.a.s.c.CorePropertiesLocator Config-defined core root directory: C:\Users\jenkins\workspace\Lucene-Solr-master-Windows\solr\build\solr-core\test\J1\temp\solr.cloud.CdcrVersionReplicationTest_84DD82B2D66BA97A-001\jetty-001\cores
   [junit4]   2> 90001 INFO  (TEST-CdcrVersionReplicationTest.testCdcrDocVersions-seed#[84DD82B2D66BA97A]) [    ] o.a.s.c.CoreContainer New CoreContainer 426651418
   [junit4]   2> 90001 INFO  (TEST-CdcrVersionReplicationTest.testCdcrDocVersions-seed#[84DD82B2D66BA97A]) [    ] o.a.s.c.CoreContainer Loading cores into CoreContainer [instanceDir=C:\Users\jenkins\workspace\Lucene-Solr-master-Windows\solr\build\solr-core\test\J1\temp\solr.cloud.CdcrVersionReplicationTest_84DD82B2D66BA97A-001\jetty-001]
   [junit4]   2> 90002 WARN  (TEST-CdcrVersionReplicationTest.testCdcrDocVersions-seed#[84DD82B2D66BA97A]) [    ] o.a.s.c.CoreContainer Couldn't add files from C:\Users\jenkins\workspace\Lucene-Solr-master-Windows\solr\build\solr-core\test\J1\temp\solr.cloud.CdcrVersionReplicationTest_84DD82B2D66BA97A-001\jetty-001\lib to classpath: C:\Users\jenkins\workspace\Lucene-Solr-master-Windows\solr\build\solr-core\test\J1\temp\solr.cloud.CdcrVersionReplicationTest_84DD82B2D66BA97A-001\jetty-001\lib
   [junit4]   2> 90002 INFO  (TEST-CdcrVersionReplicationTest.testCdcrDocVersions-seed#[84DD82B2D66BA97A]) [    ] o.a.s.h.c.HttpShardHandlerFactory created with socketTimeout : 90000,urlScheme : ,connTimeout : 15000,maxConnectionsPerHost : 20,maxConnections : 10000,corePoolSize : 0,maximumPoolSize : 2147483647,maxThreadIdleTime : 5,sizeOfQueue : -1,fairnessPolicy : false,
   [junit4]   2> 90006 INFO  (TEST-CdcrVersionReplicationTest.testCdcrDocVersions-seed#[84DD82B2D66BA97A]) [    ] o.a.s.u.UpdateShardHandler Creating UpdateShardHandler HTTP client with params: 
   [junit4]   2> 90007 INFO  (TEST-CdcrVersionReplicationTest.testCdcrDocVersions-seed#[84DD82B2D66BA97A]) [    ] o.a.s.l.LogWatcher SLF4J impl is org.slf4j.impl.Log4jLoggerFactory
   [junit4]   2> 90007 INFO  (TEST-CdcrVersionReplicationTest.testCdcrDocVersions-seed#[84DD82B2D66BA97A]) [    ] o.a.s.l.LogWatcher Registering Log Listener [Log4j (org.slf4j.impl.Log4jLoggerFactory)]
   [junit4]   2> 90007 INFO  (TEST-CdcrVersionReplicationTest.testCdcrDocVersions-seed#[84DD82B2D66BA97A]) [    ] o.a.s.c.ZkContainer Zookeeper client=127.0.0.1:61132/solr
   [junit4]   2> 90007 INFO  (TEST-CdcrVersionReplicationTest.testCdcrDocVersions-seed#[84DD82B2D66BA97A]) [    ] o.a.s.c.ZkController zkHost includes chroot
   [junit4]   2> 90007 INFO  (TEST-CdcrVersionReplicationTest.testCdcrDocVersions-seed#[84DD82B2D66BA97A]) [    ] o.a.s.c.c.SolrZkClient Using default ZkCredentialsProvider
   [junit4]   2> 90008 INFO  (TEST-CdcrVersionReplicationTest.testCdcrDocVersions-seed#[84DD82B2D66BA97A]) [    ] o.a.s.c.c.ConnectionManager Waiting for client to connect to ZooKeeper
   [junit4]   2> 90010 INFO  (zkCallback-142-thread-1) [    ] o.a.s.c.c.ConnectionManager Watcher org.apache.solr.common.cloud.ConnectionManager@2ab402e5 name:ZooKeeperConnection Watcher:127.0.0.1:61132 got event WatchedEvent state:SyncConnected type:None path:null path:null type:None
   [junit4]   2> 90010 INFO  (TEST-CdcrVersionReplicationTest.testCdcrDocVersions-seed#[84DD82B2D66BA97A]) [    ] o.a.s.c.c.ConnectionManager Client is connected to ZooKeeper
   [junit4]   2> 90011 INFO  (TEST-CdcrVersionReplicationTest.testCdcrDocVersions-seed#[84DD82B2D66BA97A]) [    ] o.a.s.c.c.SolrZkClient Using default ZkACLProvider
   [junit4]   2> 90013 INFO  (TEST-CdcrVersionReplicationTest.testCdcrDocVersions-seed#[84DD82B2D66BA97A]) [n:127.0.0.1:61139_    ] o.a.s.c.ZkController Added new OnReconnect listener org.apache.solr.cloud.ZkController$$Lambda$12/1466921985@6569403a
   [junit4]   2> 90014 INFO  (TEST-CdcrVersionReplicationTest.testCdcrDocVersions-seed#[84DD82B2D66BA97A]) [n:127.0.0.1:61139_    ] o.a.s.c.c.ConnectionManager Waiting for client to connect to ZooKeeper
   [junit4]   2> 90017 INFO  (zkCallback-143-thread-1-processing-n:127.0.0.1:61139_) [n:127.0.0.1:61139_    ] o.a.s.c.c.ConnectionManager Watcher org.apache.solr.common.cloud.ConnectionManager@6d19875f name:ZooKeeperConnection Watcher:127.0.0.1:61132/solr got event WatchedEvent state:SyncConnected type:None path:null path:null type:None
   [junit4]   2> 90017 INFO  (TEST-CdcrVersionReplicationTest.testCdcrDocVersions-seed#[84DD82B2D66BA97A]) [n:127.0.0.1:61139_    ] o.a.s.c.c.ConnectionManager Client is connected to ZooKeeper
   [junit4]   2> 90020 INFO  (TEST-CdcrVersionReplicationTest.testCdcrDocVersions-seed#[84DD82B2D66BA97A]) [n:127.0.0.1:61139_    ] o.a.s.c.c.SolrZkClient makePath: /overseer/queue
   [junit4]   2> 90025 INFO  (TEST-CdcrVersionReplicationTest.testCdcrDocVersions-seed#[84DD82B2D66BA97A]) [n:127.0.0.1:61139_    ] o.a.s.c.c.SolrZkClient makePath: /overseer/collection-queue-work
   [junit4]   2> 90032 INFO  (TEST-CdcrVersionReplicationTest.testCdcrDocVersions-seed#[84DD82B2D66BA97A]) [n:127.0.0.1:61139_    ] o.a.s.c.c.SolrZkClient makePath: /overseer/collection-map-running
   [junit4]   2> 90039 INFO  (TEST-CdcrVersionReplicationTest.testCdcrDocVersions-seed#[84DD82B2D66BA97A]) [n:127.0.0.1:61139_    ] o.a.s.c.c.SolrZkClient makePath: /overseer/collection-map-completed
   [junit4]   2> 90045 INFO  (TEST-CdcrVersionReplicationTest.testCdcrDocVersions-seed#[84DD82B2D66BA97A]) [n:127.0.0.1:61139_    ] o.a.s.c.c.SolrZkClient makePath: /overseer/collection-map-failure
   [junit4]   2> 90048 INFO  (TEST-CdcrVersionReplicationTest.testCdcrDocVersions-seed#[84DD82B2D66BA97A]) [n:127.0.0.1:61139_    ] o.a.s.c.c.SolrZkClient makePath: /live_nodes
   [junit4]   2> 90054 INFO  (TEST-CdcrVersionReplicationTest.testCdcrDocVersions-seed#[84DD82B2D66BA97A]) [n:127.0.0.1:61139_    ] o.a.s.c.c.SolrZkClient makePath: /aliases.json
   [junit4]   2> 90060 INFO  (TEST-CdcrVersionReplicationTest.testCdcrDocVersions-seed#[84DD82B2D66BA97A]) [n:127.0.0.1:61139_    ] o.a.s.c.c.SolrZkClient makePath: /clusterstate.json
   [junit4]   2> 90064 INFO  (TEST-CdcrVersionReplicationTest.testCdcrDocVersions-seed#[84DD82B2D66BA97A]) [n:127.0.0.1:61139_    ] o.a.s.c.c.SolrZkClient makePath: /security.json
   [junit4]   2> 90067 INFO  (TEST-CdcrVersionReplicationTest.testCdcrDocVersions-seed#[84DD82B2D66BA97A]) [n:127.0.0.1:61139_    ] o.a.s.c.c.ZkStateReader Updating cluster state from ZooKeeper... 
   [junit4]   2> 90068 INFO  (TEST-CdcrVersionReplicationTest.testCdcrDocVersions-seed#[84DD82B2D66BA97A]) [n:127.0.0.1:61139_    ] o.a.s.c.c.ZkStateReader Loaded empty cluster properties
   [junit4]   2> 90070 INFO  (TEST-CdcrVersionReplicationTest.testCdcrDocVersions-seed#[84DD82B2D66BA97A]) [n:127.0.0.1:61139_    ] o.a.s.c.c.ZkStateReader Updated live nodes from ZooKeeper... (0) -> (0)
   [junit4]   2> 90078 INFO  (TEST-CdcrVersionReplicationTest.testCdcrDocVersions-seed#[84DD82B2D66BA97A]) [n:127.0.0.1:61139_    ] o.a.s.c.c.SolrZkClient makePath: /overseer_elect
   [junit4]   2> 90081 INFO  (TEST-CdcrVersionReplicationTest.testCdcrDocVersions-seed#[84DD82B2D66BA97A]) [n:127.0.0.1:61139_    ] o.a.s.c.c.SolrZkClient makePath: /overseer_elect/election
   [junit4]   2> 90083 INFO  (TEST-CdcrVersionReplicationTest.testCdcrDocVersions-seed#[84DD82B2D66BA97A]) [n:127.0.0.1:61139_    ] o.a.s.c.Overseer Overseer (id=null) closing
   [junit4]   2> 90084 INFO  (TEST-CdcrVersionReplicationTest.testCdcrDocVersions-seed#[84DD82B2D66BA97A]) [n:127.0.0.1:61139_    ] o.a.s.c.LeaderElector Joined leadership election with path: /overseer_elect/election/95944443180613636-127.0.0.1:61139_-n_0000000000
   [junit4]   2> 90085 INFO  (TEST-CdcrVersionReplicationTest.testCdcrDocVersions-seed#[84DD82B2D66BA97A]) [n:127.0.0.1:61139_    ] o.a.s.c.OverseerElectionContext I am going to be the leader 127.0.0.1:61139_
   [junit4]   2> 90085 INFO  (TEST-CdcrVersionReplicationTest.testCdcrDocVersions-seed#[84DD82B2D66BA97A]) [n:127.0.0.1:61139_    ] o.a.s.c.c.SolrZkClient makePath: /overseer_elect/leader
   [junit4]   2> 90087 INFO  (TEST-CdcrVersionReplicationTest.testCdcrDocVersions-seed#[84DD82B2D66BA97A]) [n:127.0.0.1:61139_    ] o.a.s.c.Overseer Overseer (id=95944443180613636-127.0.0.1:61139_-n_0000000000) starting
   [junit4]   2> 90093 INFO  (TEST-CdcrVersionReplicationTest.testCdcrDocVersions-seed#[84DD82B2D66BA97A]) [n:127.0.0.1:61139_    ] o.a.s.c.c.SolrZkClient makePath: /overseer/queue-work
   [junit4]   2> 90111 INFO  (TEST-CdcrVersionReplicationTest.testCdcrDocVersions-seed#[84DD82B2D66BA97A]) [n:127.0.0.1:61139_    ] o.a.s.c.OverseerAutoReplicaFailoverThread Starting OverseerAutoReplicaFailoverThread autoReplicaFailoverWorkLoopDelay=10000 autoReplicaFailoverWaitAfterExpiration=30000 autoReplicaFailoverBadNodeExpiration=60000
   [junit4]   2> 90112 INFO  (OverseerCollectionConfigSetProcessor-95944443180613636-127.0.0.1:61139_-n_0000000000) [n:127.0.0.1:61139_    ] o.a.s.c.OverseerTaskProcessor Process current queue of overseer operations
   [junit4]   2> 90113 INFO  (TEST-CdcrVersionReplicationTest.testCdcrDocVersions-seed#[84DD82B2D66BA97A]) [n:127.0.0.1:61139_    ] o.a.s.c.ZkController Register node as live in ZooKeeper:/live_nodes/127.0.0.1:61139_
   [junit4]   2> 90114 INFO  (OverseerStateUpdate-95944443180613636-127.0.0.1:61139_-n_0000000000) [n:127.0.0.1:61139_    ] o.a.s.c.Overseer Starting to work on the main queue
   [junit4]   2> 90114 INFO  (TEST-CdcrVersionReplicationTest.testCdcrDocVersions-seed#[84DD82B2D66BA97A]) [n:127.0.0.1:61139_    ] o.a.s.c.c.SolrZkClient makePath: /live_nodes/127.0.0.1:61139_
   [junit4]   2> 90118 INFO  (zkCallback-143-thread-1-processing-n:127.0.0.1:61139_) [n:127.0.0.1:61139_    ] o.a.s.c.c.ZkStateReader A live node change: [WatchedEvent state:SyncConnected type:NodeChildrenChanged path:/live_nodes], has occurred - updating... (live nodes size: [0])
   [junit4]   2> 90119 INFO  (OverseerStateUpdate-95944443180613636-127.0.0.1:61139_-n_0000000000) [n:127.0.0.1:61139_    ] o.a.s.c.c.ZkStateReader Updated live nodes from ZooKeeper... (0) -> (1)
   [junit4]   2> 90120 INFO  (zkCallback-143-thread-1-processing-n:127.0.0.1:61139_) [n:127.0.0.1:61139_    ] o.a.s.c.c.ZkStateReader Updated live nodes from ZooKeeper... (1) -> (1)
   [junit4]   2> 90131 INFO  (TEST-CdcrVersionReplicationTest.testCdcrDocVersions-seed#[84DD82B2D66BA97A]) [n:127.0.0.1:61139_    ] o.a.s.c.CoreContainer Security conf doesn't exist. Skipping setup for authorization module.
   [junit4]   2> 90131 INFO  (TEST-CdcrVersionReplicationTest.testCdcrDocVersions-seed#[84DD82B2D66BA97A]) [n:127.0.0.1:61139_    ] o.a.s.c.CoreContainer No authentication plugin used.
   [junit4]   2> 90133 INFO  (TEST-CdcrVersionReplicationTest.testCdcrDocVersions-seed#[84DD82B2D66BA97A]) [n:127.0.0.1:61139_    ] o.a.s.c.CorePropertiesLocator Looking for core definitions underneath C:\Users\jenkins\workspace\Lucene-Solr-master-Windows\solr\build\solr-core\test\J1\temp\solr.cloud.CdcrVersionReplicationTest_84DD82B2D66BA97A-001\jetty-001\cores
   [junit4]   2> 90135 INFO  (TEST-CdcrVersionReplicationTest.testCdcrDocVersions-seed#[84DD82B2D66BA97A]) [n:127.0.0.1:61139_    ] o.a.s.c.CoreDescriptor Created CoreDescriptor: {name=collection1, config=solrconfig.xml, transient=false, schema=schema.xml, loadOnStartup=true, configSetProperties=configsetprops.json, collection=tmp_collection, coreNodeName=, dataDir=data\, shard=}
   [junit4]   2> 90135 INFO  (TEST-CdcrVersionReplicationTest.testCdcrDocVersions-seed#[84DD82B2D66BA97A]) [n:127.0.0.1:61139_    ] o.a.s.c.CorePropertiesLocator Found core collection1 in C:\Users\jenkins\workspace\Lucene-Solr-master-Windows\solr\build\solr-core\test\J1\temp\solr.cloud.CdcrVersionReplicationTest_84DD82B2D66BA97A-001\jetty-001\cores\collection1
   [junit4]   2> 90135 INFO  (TEST-CdcrVersionReplicationTest.testCdcrDocVersions-seed#[84DD82B2D66BA97A]) [n:127.0.0.1:61139_    ] o.a.s.c.CorePropertiesLocator Found 1 core definitions
   [junit4]   2> 90138 INFO  (coreLoadExecutor-359-thread-1-processing-n:127.0.0.1:61139_) [n:127.0.0.1:61139_ c:tmp_collection   x:collection1] o.a.s.c.ZkController publishing state=down
   [junit4]   2> 90138 INFO  (coreLoadExecutor-359-thread-1-processing-n:127.0.0.1:61139_) [n:127.0.0.1:61139_ c:tmp_collection   x:collection1] o.a.s.c.ZkController numShards not found on descriptor - reading it from system property
   [junit4]   2> 90139 INFO  (TEST-CdcrVersionReplicationTest.testCdcrDocVersions-seed#[84DD82B2D66BA97A]) [n:127.0.0.1:61139_    ] o.a.s.s.SolrDispatchFilter user.dir=C:\Users\jenkins\workspace\Lucene-Solr-master-Windows\solr\build\solr-core\test\J1
   [junit4]   2> 90139 INFO  (TEST-CdcrVersionReplicationTest.testCdcrDocVersions-seed#[84DD82B2D66BA97A]) [n:127.0.0.1:61139_    ] o.a.s.s.SolrDispatchFilter SolrDispatchFilter.init() done
   [junit4]   2> 90140 INFO  (coreLoadExecutor-359-thread-1-processing-n:127.0.0.1:61139_) [n:127.0.0.1:61139_ c:tmp_collection   x:collection1] o.a.s.c.ZkController Collection tmp_collection not visible yet, but flagging it so a watch is registered when it becomes visible
   [junit4]   2> 90142 INFO  (coreLoadExecutor-359-thread-1-processing-n:127.0.0.1:61139_) [n:127.0.0.1:61139_ c:tmp_collection   x:collection1] o.a.s.c.c.ZkStateReader Deleting data for [tmp_collection]
   [junit4]   2> 90143 INFO  (OverseerStateUpdate-95944443180613636-127.0.0.1:61139_-n_0000000000) [n:127.0.0.1:61139_    ] o.a.s.c.Overseer processMessage: queueSize: 1, message = {
   [junit4]   2>   "core":"collection1",
   [junit4]   2>   "roles":null,
   [junit4]   2>   "base_url":"http://127.0.0.1:61139",
   [junit4]   2>   "node_name":"127.0.0.1:61139_",
   [junit4]   2>   "numShards":"2",
   [junit4]   2>   "state":"down",
   [junit4]   2>   "shard":null,
   [junit4]   2>   "collection":"tmp_collection",
   [junit4]   2>   "operation":"state"} current state version: 0
   [junit4]   2> 90144 INFO  (OverseerStateUpdate-95944443180613636-127.0.0.1:61139_-n_0000000000) [n:127.0.0.1:61139_    ] o.a.s.c.o.ReplicaMutator Update state numShards=2 message={
   [junit4]   2>   "core":"collection1",
   [junit4]   2>   "roles":null,
   [junit4]   2>   "base_url":"http://127.0.0.1:61139",
   [junit4]   2>   "node_name":"127.0.0.1:61139_",
   [junit4]   2>   "numShards":"2",
   [junit4]   2>   "state":"down",
   [junit4]   2>   "shard":null,
   [junit4]   2>   "collection":"tmp_collection",
   [junit4]   2>   "operation":"state"}
   [junit4]   2> 90144 INFO  (OverseerStateUpdate-95944443180613636-127.0.0.1:61139_-n_0000000000) [n:127.0.0.1:61139_    ] o.a.s.c.o.ClusterStateMutator building a new cName: tmp_collection
   [junit4]   2> 90149 INFO  (OverseerStateUpdate-95944443180613636-127.0.0.1:61139_-n_0000000000) [n:127.0.0.1:61139_    ] o.a.s.c.o.ReplicaMutator Assigning new node to shard shard=shard2
   [junit4]   2> 90151 INFO  (coreLoadExecutor-359-thread-1-processing-n:127.0.0.1:61139_) [n:127.0.0.1:61139_ c:tmp_collection   x:collection1] o.a.s.c.ZkController look for our core node name
   [junit4]   2> 90152 INFO  (zkCallback-143-thread-1-processing-n:127.0.0.1:61139_) [n:127.0.0.1:61139_    ] o.a.s.c.c.ZkStateReader A cluster state change: [WatchedEvent state:SyncConnected type:NodeDataChanged path:/clusterstate.json], has occurred - updating... (live nodes size: [1])
   [junit4]   2> 91153 INFO  (coreLoadExecutor-359-thread-1-processing-n:127.0.0.1:61139_) [n:127.0.0.1:61139_ c:tmp_collection   x:collection1] o.a.s.c.ZkController waiting to find shard id in clusterstate for collection1
   [junit4]   2> 91154 INFO  (coreLoadExecutor-359-thread-1-processing-n:127.0.0.1:61139_) [n:127.0.0.1:61139_ c:tmp_collection   x:collection1] o.a.s.c.ZkController Check for collection zkNode:tmp_collection
   [junit4]   2> 91155 INFO  (coreLoadExecutor-359-thread-1-processing-n:127.0.0.1:61139_) [n:127.0.0.1:61139_ c:tmp_collection   x:collection1] o.a.s.c.ZkController Creating collection in ZooKeeper:tmp_collection
   [junit4]   2> 91155 INFO  (coreLoadExecutor-359-thread-1-processing-n:127.0.0.1:61139_) [n:127.0.0.1:61139_ c:tmp_collection   x:collection1] o.a.s.c.ZkController Looking for collection configName
   [junit4]   2> 91156 INFO  (coreLoadExecutor-359-thread-1-processing-n:127.0.0.1:61139_) [n:127.0.0.1:61139_ c:tmp_collection   x:collection1] o.a.s.c.ZkController Only one config set found in zk - using it:conf1
   [junit4]   2> 91156 INFO  (coreLoadExecutor-359-thread-1-processing-n:127.0.0.1:61139_) [n:127.0.0.1:61139_ c:tmp_collection   x:collection1] o.a.s.c.c.SolrZkClient makePath: /collections/tmp_collection
   [junit4]   2> 91158 INFO  (zkCallback-143-thread-1-processing-n:127.0.0.1:61139_) [n:127.0.0.1:61139_    ] o.a.s.c.c.ZkStateReader A collections change: [WatchedEvent state:SyncConnected type:NodeChildrenChanged path:/collections], has occurred - updating...
   [junit4]   2> 91158 INFO  (coreLoadExecutor-359-thread-1-processing-n:127.0.0.1:61139_) [n:127.0.0.1:61139_ c:tmp_collection   x:collection1] o.a.s.c.c.ZkStateReader Load collection config from: [/collections/tmp_collection]
   [junit4]   2> 91159 INFO  (coreLoadExecutor-359-thread-1-processing-n:127.0.0.1:61139_) [n:127.0.0.1:61139_ c:tmp_collection   x:collection1] o.a.s.c.c.ZkStateReader path=[/collections/tmp_collection] [configName]=[conf1] specified config exists in ZooKeeper
   [junit4]   2> 91159 INFO  (coreLoadExecutor-359-thread-1-processing-n:127.0.0.1:61139_) [n:127.0.0.1:61139_ c:tmp_collection   x:collection1] o.a.s.c.SolrResourceLoader new SolrResourceLoader for directory: 'C:\Users\jenkins\workspace\Lucene-Solr-master-Windows\solr\build\solr-core\test\J1\temp\solr.cloud.CdcrVersionReplicationTest_84DD82B2D66BA97A-001\jetty-001\cores\collection1'
   [junit4]   2> 91159 INFO  (coreLoadExecutor-359-thread-1-processing-n:127.0.0.1:61139_) [n:127.0.0.1:61139_ c:tmp_collection   x:collection1] o.a.s.c.SolrResourceLoader JNDI not configured for solr (NoInitialContextEx)
   [junit4]   2> 91159 INFO  (coreLoadExecutor-359-thread-1-processing-n:127.0.0.1:61139_) [n:127.0.0.1:61139_ c:tmp_collection   x:collection1] o.a.s.c.SolrResourceLoader solr home defaulted to 'solr/' (could not find system property or JNDI)
   [junit4]   2> 91163 INFO  (coreLoadExecutor-359-thread-1-processing-n:127.0.0.1:61139_) [n:127.0.0.1:61139_ c:tmp_collection   x:collection1] o.a.s.c.Config loaded config solrconfig.xml with version 0 
   [junit4]   2> 91173 INFO  (coreLoadExecutor-359-thread-1-processing-n:127.0.0.1:61139_) [n:127.0.0.1:61139_ c:tmp_collection   x:collection1] o.a.s.c.SolrConfig current version of requestparams : -1
   [junit4]   2> 91186 INFO  (coreLoadExecutor-359-thread-1-processing-n:127.0.0.1:61139_) [n:127.0.0.1:61139_ c:tmp_collection   x:collection1] o.a.s.c.SolrConfig Using Lucene MatchVersion: 7.0.0
   [junit4]   2> 91191 INFO  (coreLoadExecutor-359-thread-1-processing-n:127.0.0.1:61139_) [n:127.0.0.1:61139_ c:tmp_collection   x:collection1] o.a.s.c.SolrConfig Loaded SolrConfig: solrconfig.xml
   [junit4]   2> 91203 INFO  (coreLoadExecutor-359-thread-1-processing-n:127.0.0.1:61139_) [n:127.0.0.1:61139_ c:tmp_collection   x:collection1] o.a.s.s.IndexSchema [collection1] Schema name=test
   [junit4]   2> 91325 INFO  (coreLoadExecutor-359-thread-1-processing-n:127.0.0.1:61139_) [n:127.0.0.1:61139_ c:tmp_collection   x:collection1] o.a.s.s.IndexSchema default search field in schema is text
   [junit4]   2> 91326 INFO  (coreLoadExecutor-359-thread-1-processing-n:127.0.0.1:61139_) [n:127.0.0.1:61139_ c:tmp_collection   x:collection1] o.a.s.s.IndexSchema unique key field: id
   [junit4]   2> 91327 INFO  (coreLoadExecutor-359-thread-1-processing-n:127.0.0.1:61139_) [n:127.0.0.1:61139_ c:tmp_collection   x:collection1] o.a.s.s.FileExchangeRateProvider Reloading exchange rates from file currency.xml
   [junit4]   2> 91331 INFO  (coreLoadExecutor-359-thread-1-processing-n:127.0.0.1:61139_) [n:127.0.0.1:61139_ c:tmp_collection   x:collection1] o.a.s.s.FileExchangeRateProvider Reloading exchange rates from file currency.xml
   [junit4]   2> 91363 INFO  (coreLoadExecutor-359-thread-1-processing-n:127.0.0.1:61139_) [n:127.0.0.1:61139_ c:tmp_collection   x:collection1] o.a.s.c.ConfigSetProperties Did not find ConfigSet properties, assuming default properties: Can't find resource 'configsetprops.json' in classpath or '/configs/conf1', cwd=C:\Users\jenkins\workspace\Lucene-Solr-master-Windows\solr\build\solr-core\test\J1
   [junit4]   2> 91363 INFO  (coreLoadExecutor-359-thread-1-processing-n:127.0.0.1:61139_) [n:127.0.0.1:61139_ c:tmp_collection   x:collection1] o.a.s.c.CoreContainer Creating SolrCore 'collection1' using configuration from collection tmp_collection
   [junit4]   2> 91364 INFO  (coreLoadExecutor-359-thread-1-processing-n:127.0.0.1:61139_) [n:127.0.0.1:61139_ c:tmp_collection s:shard2 r:core_node1 x:collection1] o.a.s.c.SolrCore org.apache.solr.core.MockDirectoryFactory
   [junit4]   2> 91364 INFO  (coreLoadExecutor-359-thread-1-processing-n:127.0.0.1:61139_) [n:127.0.0.1:61139_ c:tmp_collection s:shard2 r:core_node1 x:collection1] o.a.s.c.SolrCore [[collection1] ] Opening new SolrCore at [C:\Users\jenkins\workspace\Lucene-Solr-master-Windows\solr\build\solr-core\test\J1\temp\solr.cloud.CdcrVersionReplicationTest_84DD82B2D66BA97A-001\jetty-001\cores\collection1], dataDir=[C:\Users\jenkins\workspace\Lucene-Solr-master-Windows\solr\build\solr-core\test\J1\temp\solr.cloud.CdcrVersionReplicationTest_84DD82B2D66BA97A-001\jetty-001\cores\collection1\data\]
   [junit4]   2> 91364 INFO  (coreLoadExecutor-359-thread-1-processing-n:127.0.0.1:61139_) [n:127.0.0.1:61139_ c:tmp_collection s:shard2 r:core_node1 x:collection1] o.a.s.c.JmxMonitoredMap JMX monitoring is enabled. Adding Solr mbeans to JMX Server: com.sun.jmx.mbeanserver.JmxMBeanServer@452ccb4a
   [junit4]   2> 91366 INFO  (coreLoadExecutor-359-thread-1-processing-n:127.0.0.1:61139_) [n:127.0.0.1:61139_ c:tmp_collection s:shard2 r:core_node1 x:collection1] o.a.s.c.CachingDirectoryFactory return new directory for C:\Users\jenkins\workspace\Lucene-Solr-master-Windows\solr\build\solr-core\test\J1\temp\solr.cloud.CdcrVersionReplicationTest_84DD82B2D66BA97A-001\jetty-001\cores\collection1\data\
   [junit4]   2> 91366 INFO  (coreLoadExecutor-359-thread-1-processing-n:127.0.0.1:61139_) [n:127.0.0.1:61139_ c:tmp_collection s:shard2 r:core_node1 x:collection1] o.a.s.c.SolrCore New index directory detected: old=null new=C:\Users\jenkins\workspace\Lucene-Solr-master-Windows\solr\build\solr-core\test\J1\temp\solr.cloud.CdcrVersionReplicationTest_84DD82B2D66BA97A-001\jetty-001\cores\collection1\data\index/
   [junit4]   2> 91366 WARN  (coreLoadExecutor-359-thread-1-processing-n:127.0.0.1:61139_) [n:127.0.0.1:61139_ c:tmp_collection s:shard2 r:core_node1 x:collection1] o.a.s.c.SolrCore [collection1] Solr index directory 'C:\Users\jenkins\workspace\Lucene-Solr-master-Windows\solr\build\solr-core\test\J1\temp\solr.cloud.CdcrVersionReplicationTest_84DD82B2D66BA97A-001\jetty-001\cores\collection1\data\index' doesn't exist. Creating new index...
   [junit4]   2> 91366 INFO  (coreLoadExecutor-359-thread-1-processing-n:127.0.0.1:61139_) [n:127.0.0.1:61139_ c:tmp_collection s:shard2 r:core_node1 x:collection1] o.a.s.c.CachingDirectoryFactory return new directory for C:\Users\jenkins\workspace\Lucene-Solr-master-Windows\solr\build\solr-core\test\J1\temp\solr.cloud.CdcrVersionReplicationTest_84DD82B2D66BA97A-001\jetty-001\cores\collection1\data\index
   [junit4]   2> 91366 INFO  (coreLoadExecutor-359-thread-1-processing-n:127.0.0.1:61139_) [n:127.0.0.1:61139_ c:tmp_collection s:shard2 r:core_node1 x:collection1] o.a.s.u.RandomMergePolicy RandomMergePolicy wrapping class org.apache.lucene.index.LogByteSizeMergePolicy: [LogByteSizeMergePolicy: minMergeSize=1677721, mergeFactor=43, maxMergeSize=2147483648, maxMergeSizeForForcedMerge=9223372036854775807, calibrateSizeByDeletes=false, maxMergeDocs=2147483647, maxCFSSegmentSizeMB=8.796093022207999E12, noCFSRatio=0.24750232848033393]
   [junit4]   2> 91402 INFO  (coreLoadExecutor-359-thread-1-processing-n:127.0.0.1:61139_) [n:127.0.0.1:61139_ c:tmp_collection s:shard2 r:core_node1 x:collection1] o.a.s.c.SolrDeletionPolicy SolrDeletionPolicy.onCommit: commits: num=1
   [junit4]   2> 	commit{dir=MockDirectoryWrapper(RAMDirectory@13cbf798 lockFactory=org.apache.lucene.store.SingleInstanceLockFactory@436dd74c),segFN=segments_1,generation=1}
   [junit4]   2> 91402 INFO  (coreLoadExecutor-359-thread-1-processing-n:127.0.0.1:61139_) [n:127.0.0.1:61139_ c:tmp_collection s:shard2 r:core_node1 x:collection1] o.a.s.c.SolrDeletionPolicy newest commit generation = 1
   [junit4]   2> 91561 INFO  (coreLoadExecutor-359-thread-1-processing-n:127.0.0.1:61139_) [n:127.0.0.1:61139_ c:tmp_collection s:shard2 r:core_node1 x:collection1] o.a.s.u.p.UpdateRequestProcessorChain creating updateRequestProcessorChain "cdcr-processor-chain"
   [junit4]   2> 91562 INFO  (OldIndexDirectoryCleanupThreadForCore-collection1) [n:127.0.0.1:61139_ c:tmp_collection s:shard2 r:core_node1 x:collection1] o.a.s.c.SolrCore Looking for old index directories to cleanup for core collection1 in C:\Users\jenkins\workspace\Lucene-Solr-master-Windows\solr\build\solr-core\test\J1\temp\solr.cloud.CdcrVersionReplicationTest_84DD82B2D66BA97A-001\jetty-001\cores\collection1\data\
   [junit4]   2> 91572 WARN  (OldIndexDirectoryCleanupThreadForCore-collection1) [n:127.0.0.1:61139_ c:tmp_collection s:shard2 r:core_node1 x:collection1] o.a.s.c.DirectoryFactory C:\Users\jenkins\workspace\Lucene-Solr-master-Windows\solr\build\solr-core\test\J1\temp\solr.cloud.CdcrVersionReplicationTest_84DD82B2D66BA97A-001\jetty-001\cores\collection1\data\ does not point to a valid data directory; skipping clean-up of old index directories.
   [junit4]   2> 91624 INFO  (coreLoadExecutor-359-thread-1-processing-n:127.0.0.1:61139_) [n:127.0.0.1:61139_ c:tmp_collection s:shard2 r:core_node1 x:collection1] o.a.s.c.SolrCore no updateRequestProcessorChain defined as default, creating implicit default
   [junit4]   2> 91632 INFO  (coreLoadExecutor-359-thread-1-processing-n:127.0.0.1:61139_) [n:127.0.0.1:61139_ c:tmp_collection s:shard2 r:core_node1 x:collection1] o.a.s.h.l.XMLLoader xsltCacheLifetimeSeconds=60
   [junit4]   2> 91633 INFO  (coreLoadExecutor-359-thread-1-processing-n:127.0.0.1:61139_) [n:127.0.0.1:61139_ c:tmp_collection s:shard2 r:core_node1 x:collection1] o.a.s.h.l.XMLLoader xsltCacheLifetimeSeconds=60
   [junit4]   2> 91634 INFO  (coreLoadExecutor-359-thread-1-processing-n:127.0.0.1:61139_) [n:127.0.0.1:61139_ c:tmp_collection s:shard2 r:core_node1 x:collection1] o.a.s.h.l.XMLLoader xsltCacheLifetimeSeconds=60
   [junit4]   2> 91635 INFO  (coreLoadExecutor-359-thread-1-processing-n:127.0.0.1:61139_) [n:127.0.0.1:61139_ c:tmp_collection s:shard2 r:core_node1 x:collection1] o.a.s.h.l.XMLLoader xsltCacheLifetimeSeconds=60
   [junit4]   2> 91684 INFO  (coreLoadExecutor-359-thread-1-processing-n:127.0.0.1:61139_) [n:127.0.0.1:61139_ c:tmp_collection s:shard2 r:core_node1 x:collection1] o.a.s.c.RequestHandlers Registered paths: /admin/mbeans,standard,/update/json/docs,/admin/luke,/export,/get,/admin/properties,/update/json,/admin/threads,/update/csv,/sql,/graph,/admin/segments,/admin/system,/replication,/config,/stream,/schema,/admin/plugins,/admin/logging,/admin/ping,/cdcr,/update,/admin/file
   [junit4]   2> 91684 INFO  (coreLoadExecutor-359-thread-1-processing-n:127.0.0.1:61139_) [n:127.0.0.1:61139_ c:tmp_collection s:shard2 r:core_node1 x:collection1] o.a.s.c.SolrCore Using default statsCache cache: org.apache.solr.search.stats.LocalStatsCache
   [junit4]   2> 91717 INFO  (coreLoadExecutor-359-thread-1-processing-n:127.0.0.1:61139_) [n:127.0.0.1:61139_ c:tmp_collection s:shard2 r:core_node1 x:collection1] o.a.s.u.UpdateHandler Using UpdateLog implementation: org.apache.solr.update.CdcrUpdateLog
   [junit4]   2> 91717 INFO  (coreLoadExecutor-359-thread-1-processing-n:127.0.0.1:61139_) [n:127.0.0.1:61139_ c:tmp_collection s:shard2 r:core_node1 x:collection1] o.a.s.u.UpdateLog Initializing UpdateLog: dataDir= defaultSyncLevel=FLUSH numRecordsToKeep=100 maxNumLogsToKeep=10 numVersionBuckets=65536
   [junit4]   2> 91719 INFO  (coreLoadExecutor-359-thread-1-processing-n:127.0.0.1:61139_) [n:127.0.0.1:61139_ c:tmp_collection s:shard2 r:core_node1 x:collection1] o.a.s.u.CommitTracker Hard AutoCommit: disabled
   [junit4]   2> 91719 INFO  (coreLoadExecutor-359-thread-1-processing-n:127.0.0.1:61139_) [n:127.0.0.1:61139_ c:tmp_collection s:shard2 r:core_node1 x:collection1] o.a.s.u.CommitTracker Soft AutoCommit: disabled
   [junit4]   2> 91733 INFO  (coreLoadExecutor-359-thread-1-processing-n:127.0.0.1:61139_) [n:127.0.0.1:61139_ c:tmp_collection s:shard2 r:core_node1 x:collection1] o.a.s.u.RandomMergePolicy RandomMergePolicy wrapping class org.apache.lucene.index.TieredMergePolicy: [TieredMergePolicy: maxMergeAtOnce=10, maxMergeAtOnceExplicit=17, maxMergedSegmentMB=70.28125, floorSegmentMB=1.603515625, forceMergeDeletesPctAllowed=23.171562107149477, segmentsPerTier=50.0, maxCFSSegmentSizeMB=8.796093022207999E12, noCFSRatio=0.0
   [junit4]   2> 91734 INFO  (coreLoadExecutor-359-thread-1-processing-n:127.0.0.1:61139_) [n:127.0.0.1:61139_ c:tmp_collection s:shard2 r:core_node1 x:collection1] o.a.s.c.SolrDeletionPolicy SolrDeletionPolicy.onInit: commits: num=1
   [junit4]   2> 	commit{dir=MockDirectoryWrapper(RAMDirectory@13cbf798 lockFactory=org.apache.lucene.store.SingleInstanceLockFactory@436dd74c),segFN=segments_1,generation=1}
   [junit4]   2> 91734 INFO  (coreLoadExecutor-359-thread-1-processing-n:127.0.0.1:61139_) [n:127.0.0.1:61139_ c:tmp_collection s:shard2 r:core_node1 x:collection1] o.a.s.c.SolrDeletionPolicy newest commit generation = 1
   [junit4]   2> 91734 INFO  (coreLoadExecutor-359-thread-1-processing-n:127.0.0.1:61139_) [n:127.0.0.1:61139_ c:tmp_collection s:shard2 r:core_node1 x:collection1] o.a.s.s.SolrIndexSearcher Opening [Searcher@4a22a4ce[collection1] main]
   [junit4]   2> 91734 INFO  (coreLoadExecutor-359-thread-1-processing-n:127.0.0.1:61139_) [n:127.0.0.1:61139_ c:tmp_collection s:shard2 r:core_node1 x:collection1] o.a.s.c.c.ZkStateReader Load collection config from: [/collections/tmp_collection]
   [junit4]   2> 91737 INFO  (coreLoadExecutor-359-thread-1-processing-n:127.0.0.1:61139_) [n:127.0.0.1:61139_ c:tmp_collection s:shard2 r:core_node1 x:collection1] o.a.s.c.c.ZkStateReader path=[/collections/tmp_collection] [configName]=[conf1] specified config exists in ZooKeeper
   [junit4]   2> 91737 INFO  (coreLoadExecutor-359-thread-1-processing-n:127.0.0.1:61139_) [n:127.0.0.1:61139_ c:tmp_collection s:shard2 r:core_node1 x:collection1] o.a.s.r.ManagedResourceStorage Setting up ZooKeeper-based storage for the RestManager with znodeBase: /configs/conf1
   [junit4]   2> 91786 INFO  (coreLoadExecutor-359-thread-1-processing-n:127.0.0.1:61139_) [n:127.0.0.1:61139_ c:tmp_collection s:shard2 r:core_node1 x:collection1] o.a.s.r.ManagedResourceStorage Configured ZooKeeperStorageIO with znodeBase: /configs/conf1
   [junit4]   2> 91786 INFO  (coreLoadExecutor-359-thread-1-processing-n:127.0.0.1:61139_) [n:127.0.0.1:61139_ c:tmp_collection s:shard2 r:core_node1 x:collection1] o.a.s.r.RestManager Initializing RestManager with initArgs: {}
   [junit4]   2> 91786 INFO  (coreLoadExecutor-359-thread-1-processing-n:127.0.0.1:61139_) [n:127.0.0.1:61139_ c:tmp_collection s:shard2 r:core_node1 x:collection1] o.a.s.r.ManagedResourceStorage Reading _rest_managed.json using ZooKeeperStorageIO:path=/configs/conf1
   [junit4]   2> 91787 INFO  (coreLoadExecutor-359-thread-1-processing-n:127.0.0.1:61139_) [n:127.0.0.1:61139_ c:tmp_collection s:shard2 r:core_node1 x:collection1] o.a.s.r.ManagedResourceStorage No data found for znode /configs/conf1/_rest_managed.json
   [junit4]   2> 91787 INFO  (coreLoadExecutor-359-thread-1-processing-n:127.0.0.1:61139_) [n:127.0.0.1:61139_ c:tmp_collection s:shard2 r:core_node1 x:collection1] o.a.s.r.ManagedResourceStorage Loaded null at path _rest_managed.json using ZooKeeperStorageIO:path=/configs/conf1
   [junit4]   2> 91787 INFO  (coreLoadExecutor-359-thread-1-processing-n:127.0.0.1:61139_) [n:127.0.0.1:61139_ c:tmp_collection s:shard2 r:core_node1 x:collection1] o.a.s.r.RestManager Initializing 0 registered ManagedResources
   [junit4]   2> 91787 INFO  (coreLoadExecutor-359-thread-1-processing-n:127.0.0.1:61139_) [n:127.0.0.1:61139_ c:tmp_collection s:shard2 r:core_node1 x:collection1] o.a.s.h.ReplicationHandler Commits will be reserved for  10000
   [junit4]   2> 91797 INFO  (coreLoadExecutor-359-thread-1-processing-n:127.0.0.1:61139_) [n:127.0.0.1:61139_ c:tmp_collection s:shard2 r:core_node1 x:collection1] o.a.s.c.c.SolrZkClient makePath: /collections/tmp_collection/cdcr/state
   [junit4]   2> 91800 INFO  (coreLoadExecutor-359-thread-1-processing-n:127.0.0.1:61139_) [n:127.0.0.1:61139_ c:tmp_collection s:shard2 r:core_node1 x:collection1] o.a.s.h.CdcrBufferStateManager Created znode /collections/tmp_collection/cdcr/state/buffer
   [junit4]   2> 91812 INFO  (coreLoadExecutor-359-thread-1-processing-n:127.0.0.1:61139_) [n:127.0.0.1:61139_ c:tmp_collection s:shard2 r:core_node1 x:collection1] o.a.s.h.CdcrProcessStateManager Created znode /collections/tmp_collection/cdcr/state/process
   [junit4]   2> 91872 INFO  (searcherExecutor-360-thread-1-processing-n:127.0.0.1:61139_ x:collection1 s:shard2 c:tmp_collection r:core_node1) [n:127.0.0.1:61139_ c:tmp_collection s:shard2 r:core_node1 x:collection1] o.a.s.c.SolrCore [collection1] Registered new searcher Searcher@4a22a4ce[collection1] main{ExitableDirectoryReader(UninvertingDirectoryReader())}
   [junit4]   2> 91872 INFO  (coreLoadExecutor-359-thread-1-processing-n:127.0.0.1:61139_) [n:127.0.0.1:61139_ c:tmp_collection s:shard2 r:core_node1 x:collection1] o.a.s.u.UpdateLog Looking up max value of version field to seed version buckets
   [junit4]   2> 91872 INFO  (coreLoadExecutor-359-thread-1-processing-n:127.0.0.1:61139_) [n:127.0.0.1:61139_ c:tmp_collection s:shard2 r:core_node1 x:collection1] o.a.s.u.VersionInfo Refreshing highest value of _version_ for 65536 version buckets from index
   [junit4]   2> 91872 INFO  (coreLoadExecutor-359-thread-1-processing-n:127.0.0.1:61139_) [n:127.0.0.1:61139_ c:tmp_collection s:shard2 r:core_node1 x:collection1] o.a.s.u.VersionInfo No terms found for _version_, cannot seed version bucket highest value from index
   [junit4]   2> 91872 INFO  (coreLoadExecutor-359-thread-1-processing-n:127.0.0.1:61139_) [n:127.0.0.1:61139_ c:tmp_collection s:shard2 r:core_node1 x:collection1] o.a.s.u.UpdateLog Could not find max version in index or recent updates, using new clock 1535111093580464128
   [junit4]   2> 91874 INFO  (coreLoadExecutor-359-thread-1-processing-n:127.0.0.1:61139_) [n:127.0.0.1:61139_ c:tmp_collection s:shard2 r:core_node1 x:collection1] o.a.s.u.UpdateLog Took 1.0ms to seed version buckets with highest version 1535111093580464128
   [junit4]   2> 91874 INFO  (coreLoadExecutor-359-thread-1-processing-n:127.0.0.1:61139_) [n:127.0.0.1:61139_ c:tmp_collection s:shard2 r:core_node1 x:collection1] o.a.s.c.ZkController watch zkdir /configs/conf1
   [junit4]   2> 91875 INFO  (coreLoadExecutor-359-thread-1-processing-n:127.0.0.1:61139_) [n:127.0.0.1:61139_ c:tmp_collection s:shard2 r:core_node1 x:collection1] o.a.s.c.CoreContainer registering core: collection1
   [junit4]   2> 91884 INFO  (coreZkRegister-353-thread-1-processing-n:127.0.0.1:61139_ x:collection1 s:shard2 c:tmp_collection r:core_node1) [n:127.0.0.1:61139_ c:tmp_collection s:shard2 r:core_node1 x:collection1] o.a.s.c.ZkController Register replica - core:collection1 address:http://127.0.0.1:61139 collection:tmp_collection shard:shard2
   [junit4]   2> 91887 INFO  (coreZkRegister-353-thread-1-processing-n:127.0.0.1:61139_ x:collection1 s:shard2 c:tmp_collection r:core_node1) [n:127.0.0.1:61139_ c:tmp_collection s:shard2 r:core_node1 x:collection1] o.a.s.c.c.SolrZkClient makePath: /collections/tmp_collection/leader_elect/shard2/election
   [junit4]   2> 91896 INFO  (coreZkRegister-353-thread-1-processing-n:127.0.0.1:61139_ x:collection1 s:shard2 c:tmp_collection r:core_node1) [n:127.0.0.1:61139_ c:tmp_collection s:shard2 r:core_node1 x:collection1] o.a.s.c.LeaderElector Joined leadership election with path: /collections/tmp_collection/leader_elect/shard2/election/95944443180613636-core_node1-n_0000000000
   [junit4]   2> 91897 INFO  (coreZkRegister-353-thread-1-processing-n:127.0.0.1:61139_ x:collection1 s:shard2 c:tmp_collection r:core_node1) [n:127.0.0.1:61139_ c:tmp_collection s:shard2 r:core_node1 x:collection1] o.a.s.c.ShardLeaderElectionContext Running the leader process for shard=shard2 and weAreReplacement=false and leaderVoteWait=10000
   [junit4]   2> 91901 INFO  (coreZkRegister-353-thread-1-processing-n:127.0.0.1:61139_ x:collection1 s:shard2 c:tmp_collection r:core_node1) [n:127.0.0.1:61139_ c:tmp_collection s:shard2 r:core_node1 x:collection1] o.a.s.c.ShardLeaderElectionContext Enough replicas found to continue.
   [junit4]   2> 91901 INFO  (coreZkRegister-353-thread-1-processing-n:127.0.0.1:61139_ x:collection1 s:shard2 c:tmp_collection r:core_node1) [n:127.0.0.1:61139_ c:tmp_collection s:shard2 r:core_node1 x:collection1] o.a.s.c.ShardLeaderElectionContext I may be the new leader - try and sync
   [junit4]   2> 91902 INFO  (coreZkRegister-353-thread-1-processing-n:127.0.0.1:61139_ x:collection1 s:shard2 c:tmp_collection r:core_node1) [n:127.0.0.1:61139_ c:tmp_collection s:shard2 r:core_node1 x:collection1] o.a.s.c.SyncStrategy Sync replicas to http://127.0.0.1:61139/collection1/
   [junit4]   2> 91902 INFO  (coreZkRegister-353-thread-1-processing-n:127.0.0.1:61139_ x:collection1 s:shard2 c:tmp_collection r:core_node1) [n:127.0.0.1:61139_ c:tmp_collection s:shard2 r:core_node1 x:collection1] o.a.s.c.SyncStrategy Sync Success - now sync replicas to me
   [junit4]   2> 91902 INFO  (coreZkRegister-353-thread-1-processing-n:127.0.0.1:61139_ x:collection1 s:shard2 c:tmp_collection r:core_node1) [n:127.0.0.1:61139_ c:tmp_collection s:shard2 r:core_node1 x:collection1] o.a.s.c.SyncStrategy http://127.0.0.1:61139/collection1/ has no replicas
   [junit4]   2> 91903 INFO  (OverseerStateUpdate-95944443180613636-127.0.0.1:61139_-n_0000000000) [n:127.0.0.1:61139_    ] o.a.s.c.Overseer processMessage: queueSize: 1, message = {
   [junit4]   2>   "operation":"leader",
   [junit4]   2>   "shard":"shard2",
   [junit4]   2>   "collection":"tmp_collection"} current state version: 1
   [junit4]   2> 91903 INFO  (coreZkRegister-353-thread-1-processing-n:127.0.0.1:61139_ x:collection1 s:shard2 c:tmp_collection r:core_node1) [n:127.0.0.1:61139_ c:tmp_collection s:shard2 r:core_node1 x:collection1] o.a.s.c.c.SolrZkClient makePath: /collections/tmp_collection/leaders/shard2
   [junit4]   2> 91905 INFO  (zkCallback-143-thread-1-processing-n:127.0.0.1:61139_) [n:127.0.0.1:61139_    ] o.a.s.c.c.ZkStateReader A cluster state change: [WatchedEvent state:SyncConnected type:NodeDataChanged path:/clusterstate.json], has occurred - updating... (live nodes size: [1])
   [junit4]   2> 91911 INFO  (coreZkRegister-353-thread-1-processing-n:127.0.0.1:61139_ x:collection1 s:shard2 c:tmp_collection r:core_node1) [n:127.0.0.1:61139_ c:tmp_collection s:shard2 r:core_node1 x:collection1] o.a.s.c.ShardLeaderElectionContextBase Creating leader registration node /collections/tmp_collection/leaders/shard2/leader after winning as /collections/tmp_collection/leader_elect/shard2/election/95944443180613636-core_node1-n_0000000000
   [junit4]   2> 91936 INFO  (zkCallback-143-thread-1-processing-n:127.0.0.1:61139_) [n:127.0.0.1:61139_    ] o.a.s.h.CdcrLeaderStateManager Received new leader state @ tmp_collection:shard2
   [junit4]   2> 91941 INFO  (coreZkRegister-353-thread-1-processing-n:127.0.0.1:61139_ x:collection1 s:shard2 c:tmp_collection r:core_node1) [n:127.0.0.1:61139_ c:tmp_collection s:shard2 r:core_node1 x:collection1] o.a.s.c.ShardLeaderElectionContext I am the new leader: http://127.0.0.1:61139/collection1/ shard2
   [junit4]   2> 91944 INFO  (OverseerStateUpdate-95944443180613636-127.0.0.1:61139_-n_0000000000) [n:127.0.0.1:61139_    ] o.a.s.c.Overseer processMessage: queueSize: 1, message = {
   [junit4]   2>   "operation":"leader",
   [junit4]   2>   "shard":"shard2",
   [junit4]   2>   "collection":"tmp_collection",
   [junit4]   2>   "base_url":"http://127.0.0.1:61139",
   [junit4]   2>   "core":"collection1",
   [junit4]   2>   "state":"active"} current state version: 2
   [junit4]   2> 92052 INFO  (zkCallback-143-thread-1-processing-n:127.0.0.1:61139_) [n:127.0.0.1:61139_    ] o.a.s.c.c.ZkStateReader A cluster state change: [WatchedEvent state:SyncConnected type:NodeDataChanged path:/clusterstate.json], has occurred - updating... (live nodes size: [1])
   [junit4]   2> 92095 INFO  (coreZkRegister-353-thread-1-processing-n:127.0.0.1:61139_ x:collection1 s:shard2 c:tmp_collection r:core_node1) [n:127.0.0.1:61139_ c:tmp_collection s:shard2 r:core_node1 x:collection1] o.a.s.c.ZkController We are http://127.0.0.1:61139/collection1/ and leader is http://127.0.0.1:61139/collection1/
   [junit4]   2> 92095 INFO  (coreZkRegister-353-thread-1-processing-n:127.0.0.1:61139_ x:collection1 s:shard2 c:tmp_collection r:core_node1) [n:127.0.0.1:61139_ c:tmp_collection s:shard2 r:core_node1 x:collection1] o.a.s.c.ZkController No LogReplay needed for core=collection1 baseURL=http://127.0.0.1:61139
   [junit4]   2> 92095 INFO  (coreZkRegister-353-thread-1-processing-n:127.0.0.1:61139_ x:collection1 s:shard2 c:tmp_collection r:core_node1) [n:127.0.0.1:61139_ c:tmp_collection s:shard2 r:core_node1 x:collection1] o.a.s.c.ZkController I am the leader, no recovery necessary
   [junit4]   2> 92095 INFO  (coreZkRegister-353-thread-1-processing-n:127.0.0.1:61139_ x:collection1 s:shard2 c:tmp_collection r:core_node1) [n:127.0.0.1:61139_ c:tmp_collection s:shard2 r:core_node1 x:collection1] o.a.s.c.ZkController publishing state=active
   [junit4]   2> 92095 INFO  (coreZkRegister-353-thread-1-processing-n:127.0.0.1:61139_ x:collection1 s:shard2 c:tmp_collection r:core_node1) [n:127.0.0.1:61139_ c:tmp_collection s:shard2 r:core_node1 x:collection1] o.a.s.c.ZkController numShards not found on descriptor - reading it from system property
   [junit4]   2> 92097 INFO  (OverseerStateUpdate-95944443180613636-127.0.0.1:61139_-n_0000000000) [n:127.0.0.1:61139_    ] o.a.s.c.Overseer processMessage: queueSize: 1, message = {
   [junit4]   2>   "core":"collection1",
   [junit4]   2>   "core_node_name":"core_node1",
   [junit4]   2>   "roles":null,
   [junit4]   2>   "base_url":"http://127.0.0.1:61139",
   [junit4]   2>   "node_name":"127.0.0.1:61139_",
   [junit4]   2>   "numShards":"2",
   [junit4]   2>   "state":"active",
   [junit4]   2>   "shard":"shard2",
   [junit4]   2>   "collection":"tmp_collection",
   [junit4]   2>   "operation":"state"} current state version: 3
   [junit4]   2> 92097 INFO  (OverseerStateUpdate-95944443180613636-127.0.0.1:61139_-n_0000000000) [n:127.0.0.1:61139_    ] o.a.s.c.o.ReplicaMutator Update state numShards=2 message={
   [junit4]   2>   "core":"collection1",
   [junit4]   2>   "core_node_name":"core_node1",
   [junit4]   2>   "roles":null,
   [junit4]   2>   "base_url":"http://127.0.0.1:61139",
   [junit4]   2>   "node_name":"127.0.0.1:61139_",
   [junit4]   2>   "numShards":"2",
   [junit4]   2>   "state":"active",
   [junit4]   2>   "shard":"shard2",
   [junit4]   2>   "collection":"tmp_collection",
   [junit4]   2>   "operation":"state"}
   [junit4]   2> 92203 INFO  (zkCallback-143-thread-1-processing-n:127.0.0.1:61139_) [n:127.0.0.1:61139_    ] o.a.s.c.c.ZkStateReader A cluster state change: [WatchedEvent state:SyncConnected type:NodeDataChanged path:/clusterstate.json], has occurred - updating... (live nodes size: [1])
   [junit4]   2> 92915 INFO  (TEST-CdcrVersionReplicationTest.testCdcrDocVersions-seed#[84DD82B2D66BA97A]) [    ] o.a.s.SolrTestCaseJ4 Writing core.properties file to C:\Users\jenkins\workspace\Lucene-Solr-master-Windows\solr\build\solr-core\test\J1\temp\solr.cloud.CdcrVersionReplicationTest_84DD82B2D66BA97A-001\jetty-002\cores\collection1
   [junit4]   2> 92920 INFO  (TEST-CdcrVersionReplicationTest.testCdcrDocVersions-seed#[84DD82B2D66BA97A]) [    ] o.e.j.s.Server jetty-9.3.8.v20160314
   [junit4]   2> 92921 INFO  (TEST-CdcrVersionReplicationTest.testCdcrDocVersions-seed#[84DD82B2D66BA97A]) [    ] o.e.j.s.h.ContextHandler Started o.e.j.s.ServletContextHandler@6f55d7e3{/,null,AVAILABLE}
   [junit4]   2> 92923 INFO  (TEST-CdcrVersionReplicationTest.testCdcrDocVersions-seed#[84DD82B2D66BA97A]) [    ] o.e.j.s.ServerConnector Started ServerConnector@4947e2db{HTTP/1.1,[http/1.1]}{127.0.0.1:61151}
   [junit4]   2> 92923 INFO  (TEST-CdcrVersionReplicationTest.testCdcrDocVersions-seed#[84DD82B2D66BA97A]) [    ] o.e.j.s.Server Started @100000ms
   [junit4]   2> 92923 INFO  (TEST-CdcrVersionReplicationTest.testCdcrDocVersions-seed#[84DD82B2D66BA97A]) [    ] o.a.s.c.s.e.JettySolrRunner Jetty properties: {shards=shard2, hostContext=/, hostPort=61151, coreRootDirectory=C:\Users\jenkins\workspace\Lucene-Solr-master-Windows\solr\build\solr-core\test\J1\temp\solr.cloud.CdcrVersionReplicationTest_84DD82B2D66BA97A-001\jetty-002\cores}
   [junit4]   2> 92923 INFO  (TEST-CdcrVersionReplicationTest.testCdcrDocVersions-seed#[84DD82B2D66BA97A]) [    ] o.a.s.s.SolrDispatchFilter SolrDispatchFilter.init(): sun.misc.Launcher$AppClassLoader@73d16e93
   [junit4]   2> 92923 INFO  (TEST-CdcrVersionReplicationTest.testCdcrDocVersions-seed#[84DD82B2D66BA97A]) [    ] o.a.s.c.SolrResourceLoader new SolrResourceLoader for directory: 'C:\Users\jenkins\workspace\Lucene-Solr-master-Windows\solr\build\solr-core\test\J1\temp\solr.cloud.CdcrVersionReplicationTest_84DD82B2D66BA97A-001\jetty-002'
   [junit4]   2> 92923 INFO  (TEST-CdcrVersionReplicationTest.testCdcrDocVersions-seed#[84DD82B2D66BA97A]) [    ] o.a.s.c.SolrResourceLoader JNDI not configured for solr (NoInitialContextEx)
   [junit4]   2> 92923 INFO  (TEST-CdcrVersionReplicationTest.testCdcrDocVersions-seed#[84DD82B2D66BA97A]) [    ] o.a.s.c.SolrResourceLoader solr home defaulted to 'solr/' (could not find system property or JNDI)
   [junit4]   2> 92924 INFO  (TEST-CdcrVersionReplicationTest.testCdcrDocVersions-seed#[84DD82B2D66BA97A]) [    ] o.a.s.c.c.SolrZkClient Using default ZkCredentialsProvider
   [junit4]   2> 92926 INFO  (TEST-CdcrVersionReplicationTest.testCdcrDocVersions-seed#[84DD82B2D66BA97A]) [    ] o.a.s.c.c.ConnectionManager Waiting for client to connect to ZooKeeper
   [junit4]   2> 92975 INFO  (zkCallback-145-thread-1) [    ] o.a.s.c.c.ConnectionManager Watcher org.apache.solr.common.cloud.ConnectionManager@5c90bed3 name:ZooKeeperConnection Watcher:127.0.0.1:61132/solr got event WatchedEvent state:SyncConnected type:None path:null path:null type:None
   [junit4]   2> 92975 INFO  (TEST-CdcrVersionReplicationTest.testCdcrDocVersions-seed#[84DD82B2D66BA97A]) [    ] o.a.s.c.c.ConnectionManager Client is connected to ZooKeeper
   [junit4]   2> 92985 INFO  (TEST-CdcrVersionReplicationTest.testCdcrDocVersions-seed#[84DD82B2D66BA97A]) [    ] o.a.s.c.c.SolrZkClient Using default ZkACLProvider
   [junit4]   2> 92986 WARN  (NIOServerCxn.Factory:0.0.0.0/0.0.0.0:0) [    ] o.a.z.s.NIOServerCnxn caught end of stream exception
   [junit4]   2> EndOfStreamException: Unable to read additional data from client sessionid 0x154dcf675f40005, likely client has closed socket
   [junit4]   2> 	at org.apache.zookeeper.server.NIOServerCnxn.doIO(NIOServerCnxn.java:228)
   [junit4]   2> 	at org.apache.zookeeper.server.NIOServerCnxnFactory.run(NIOServerCnxnFactory.java:208)
   [junit4]   2> 	at java.lang.Thread.run(Thread.java:745)
   [junit4]   2> 92986 INFO  (TEST-CdcrVersionReplicationTest.testCdcrDocVersions-seed#[84DD82B2D66BA97A]) [    ] o.a.s.s.SolrDispatchFilter Loading solr.xml from SolrHome (not found in ZooKeeper)
   [junit4]   2> 92986 INFO  (TEST-CdcrVersionReplicationTest.testCdcrDocVersions-seed#[84DD82B2D66BA97A]) [    ] o.a.s.c.SolrXmlConfig Loading container configuration from C:\Users\jenkins\workspace\Lucene-Solr-master-Windows\solr\build\solr-core\test\J1\temp\solr.cloud.CdcrVersionReplicationTest_84DD82B2D66BA97A-001\jetty-002\solr.xml
   [junit4]   2> 92999 INFO  (TEST-CdcrVersionReplicationTest.testCdcrDocVersions-seed#[84DD82B2D66BA97A]) [    ] o.a.s.c.CorePropertiesLocator Config-defined core root directory: C:\Users\jenkins\workspace\Lucene-Solr-master-Windows\solr\build\solr-core\test\J1\temp\solr.cloud.CdcrVersionReplicationTest_84DD82B2D66BA97A-001\jetty-002\cores
   [junit4]   2> 92999 INFO  (TEST-CdcrVersionReplicationTest.testCdcrDocVersions-seed#[84DD82B2D66BA97A]) [    ] o.a.s.c.CoreContainer New CoreContainer 1684381782
   [junit4]   2> 92999 INFO  (TEST-CdcrVersionReplicationTest.testCdcrDocVersions-seed#[84DD82B2D66BA97A]) [    ] o.a.s.c.CoreContainer Loading cores into CoreContainer [instanceDir=C:\Users\jenkins\workspace\Lucene-Solr-master-Windows\solr\build\solr-core\test\J1\temp\solr.cloud.CdcrVersionReplicationTest_84DD82B2D66BA97A-001\jetty-002]
   [junit4]   2> 92999 WARN  (TEST-CdcrVersionReplicationTest.testCdcrDocVersions-seed#[84DD82B2D66BA97A]) [    ] o.a.s.c.CoreContainer Couldn't add files from C:\Users\jenkins\workspace\Lucene-Solr-master-Windows\solr\build\solr-core\test\J1\temp\solr.cloud.CdcrVersionReplicationTest_84DD82B2D66BA97A-001\jetty-002\lib to classpath: C:\Users\jenkins\workspace\Lucene-Solr-master-Windows\solr\build\solr-core\test\J1\temp\solr.cloud.CdcrVersionReplicationTest_84DD82B2D66BA97A-001\jetty-002\lib
   [junit4]   2> 92999 INFO  (TEST-CdcrVersionReplicationTest.testCdcrDocVersions-seed#[84DD82B2D66BA97A]) [    ] o.a.s.h.c.HttpShardHandlerFactory created with socketTimeout : 90000,urlScheme : ,connTimeout : 15000,maxConnectionsPerHost : 20,maxConnections : 10000,corePoolSize : 0,maximumPoolSize : 2147483647,maxThreadIdleTime : 5,sizeOfQueue : -1,fairnessPolicy : false,
   [junit4]   2> 93004 INFO  (TEST-CdcrVersionReplicationTest.testCdcrDocVersions-seed#[84DD82B2D66BA97A]) [    ] o.a.s.u.UpdateShardHandler Creating UpdateShardHandler HTTP client with params: 
   [junit4]   2> 93005 INFO  (TEST-CdcrVersionReplicationTest.testCdcrDocVersions-seed#[84DD82B2D66BA97A]) [    ] o.a.s.l.LogWatcher SLF4J impl is org.slf4j.impl.Log4jLoggerFactory
   [junit4]   2> 93005 INFO  (TEST-CdcrVersionReplicationTest.testCdcrDocVersions-seed#[84DD82B2D66BA97A]) [    ] o.a.s.l.LogWatcher Registering Log Listener [Log4j (org.slf4j.impl.Log4jLoggerFactory)]
   [junit4]   2> 93005 INFO  (TEST-CdcrVersionReplicationTest.testCdcrDocVersions-seed#[84DD82B2D66BA97A]) [    ] o.a.s.c.ZkContainer Zookeeper client=127.0.0.1:61132/solr
   [junit4]   2> 93005 INFO  (TEST-CdcrVersionReplicationTest.testCdcrDocVersions-seed#[84DD82B2D66BA97A]) [    ] o.a.s.c.ZkController zkHost includes chroot
   [junit4]   2> 93005 INFO  (TEST-CdcrVersionReplicationTest.testCdcrDocVersions-seed#[84DD82B2D66BA97A]) [    ] o.a.s.c.c.SolrZkClient Using default ZkCredentialsProvider
   [junit4]   2> 93006 INFO  (TEST-CdcrVersionReplicationTest.testCdcrDocVersions-seed#[84DD82B2D66BA97A]) [    ] o.a.s.c.c.ConnectionManager Waiting for client to connect to ZooKeeper
   [junit4]   2> 93009 INFO  (zkCallback-148-thread-1) [    ] o.a.s.c.c.ConnectionManager Watcher org.apache.solr.common.cloud.ConnectionManager@4f81a00c name:ZooKeeperConnection Watcher:127.0.0.1:61132 got event WatchedEvent state:SyncConnected type:None path:null path:null type:None
   [junit4]   2> 93011 INFO  (TEST-CdcrVersionReplicationTest.testCdcrDocVersions-seed#[84DD82B2D66BA97A]) [    ] o.a.s.c.c.ConnectionManager Client is connected to ZooKeeper
   [junit4]   2> 93011 INFO  (TEST-CdcrVersionReplicationTest.testCdcrDocVersions-seed#[84DD82B2D66BA97A]) [    ] o.a.s.c.c.SolrZkClient Using default ZkACLProvider
   [junit4]   2> 93015 WARN  (NIOServerCxn.Factory:0.0.0.0/0.0.0.0:0) [    ] o.a.z.s.NIOServerCnxn caught end of stream exception
   [junit4]   2> EndOfStreamException: Unable to read additional data from client sessionid 0x154dcf675f40006, likely client has closed socket
   [junit4]   2> 	at org.apache.zookeeper.server.NIOServerCnxn.doIO(NIOServerCnxn.java:228)
   [junit4]   2> 	at org.apache.zookeeper.server.NIOServerCnxnFactory.run(NIOServerCnxnFactory.java:208)
   [junit4]   2> 	at java.lang.Thread.run(Thread.java:745)
   [junit4]   2> 93017 INFO  (TEST-CdcrVersionReplicationTest.testCdcrDocVersions-seed#[84DD82B2D66BA97A]) [n:127.0.0.1:61151_    ] o.a.s.c.ZkController Added new OnReconnect listener org.apache.solr.cloud.ZkController$$Lambda$12/1466921985@378a432
   [junit4]   2> 93025 INFO  (TEST-CdcrVersionReplicationTest.testCdcrDocVersions-seed#[84DD82B2D66BA97A]) [n:127.0.0.1:61151_    ] o.a.s.c.c.ConnectionManager Waiting for client to connect to ZooKeeper
   [junit4]   2> 93033 INFO  (zkCallback-149-thread-1-processing-n:127.0.0.1:61151_) [n:127.0.0.1:61151_    ] o.a.s.c.c.ConnectionManager Watcher org.apache.solr.common.cloud.ConnectionManager@203aecae name:ZooKeeperConnection Watcher:127.0.0.1:61132/solr got event WatchedEvent state:SyncConnected type:None path:null path:null type:None
   [junit4]   2> 93033 INFO  (TEST-CdcrVersionReplicationTest.testCdcrDocVersions-seed#[84DD82B2D66BA97A]) [n:127.0.0.1:61151_    ] o.a.s.c.c.ConnectionManager Client is connected to ZooKeeper
   [junit4]   2> 93040 INFO  (TEST-CdcrVersionReplicationTest.testCdcrDocVersions-seed#[84DD82B2D66BA97A]) [n:127.0.0.1:61151_    ] o.a.s.c.c.ZkStateReader Updating cluster state from ZooKeeper... 
   [junit4]   2> 93042 INFO  (TEST-CdcrVersionReplicationTest.testCdcrDocVersions-seed#[84DD82B2D66BA97A]) [n:127.0.0.1:61151_    ] o.a.s.c.c.ZkStateReader Loaded empty cluster properties
   [junit4]   2> 93043 INFO  (TEST-CdcrVersionReplicationTest.testCdcrDocVersions-seed#[84DD82B2D66BA97A]) [n:127.0.0.1:61151_    ] o.a.s.c.c.ZkStateReader Updated live nodes from ZooKeeper... (0) -> (1)
   [junit4]   2> 93048 INFO  (TEST-CdcrVersionReplicationTest.testCdcrDocVersions-seed#[84DD82B2D66BA97A]) [n:127.0.0.1:61151_    ] o.a.s.c.Overseer Overseer (id=null) closing
   [junit4]   2> 93048 INFO  (TEST-CdcrVersionReplicationTest.testCdcrDocVersions-seed#[84DD82B2D66BA97A]) [n:127.0.0.1:61151_    ] o.a.s.c.LeaderElector Joined leadership election with path: /overseer_elect/election/95944443180613639-127.0.0.1:61151_-n_0000000001
   [junit4]   2> 93049 INFO  (TEST-CdcrVersionReplicationTest.testCdcrDocVersions-seed#[84DD82B2D66BA97A]) [n:127.0.0.1:61151_    ] o.a.s.c.LeaderElector Watching path /overseer_elect/election/95944443180613636-127.0.0.1:61139_-n_0000000000 to know if I could be the leader
   [junit4]   2> 93049 INFO  (TEST-CdcrVersionReplicationTest.testCdcrDocVersions-seed#[84DD82B2D66BA97A]) [n:127.0.0.1:61151_    ] o.a.s.c.ZkController Publish node=127.0.0.1:61151_ as DOWN
   [junit4]   2> 93052 INFO  (OverseerStateUpdate-95944443180613636-127.0.0.1:61139_-n_0000000000) [n:127.0.0.1:61139_    ] o.a.s.c.Overseer processMessage: queueSize: 1, message = {
   [junit4]   2>   "operation":"downnode",
   [junit4]   2>   "node_name":"127.0.0.1:61151_"} current state version: 4
   [junit4]   2> 93052 INFO  (OverseerStateUpdate-95944443180613636-127.0.0.1:61139_-n_0000000000) [n:127.0.0.1:61139_    ] o.a.s.c.o.NodeMutator DownNode state invoked for node: 127.0.0.1:61151_
   [junit4]   2> 93162 INFO  (zkCallback-149-thread-1-processing-n:127.0.0.1:61151_) [n:127.0.0.1:61151_    ] o.a.s.c.c.ZkStateReader A cluster state change: [WatchedEvent state:SyncConnected type:NodeDataChanged path:/clusterstate.json], has occurred - updating... (live nodes size: [1])
   [junit4]   2> 93162 INFO  (zkCallback-143-thread-1-processing-n:127.0.0.1:61139_) [n:127.0.0.1:61139_    ] o.a.s.c.c.ZkStateReader A cluster state change: [WatchedEvent state:SyncConnected type:NodeDataChanged path:/clusterstate.json], has occurred - updating... (live nodes size: [1])
   [junit4]   2> 94052 INFO  (TEST-CdcrVersionReplicationTest.testCdcrDocVersions-seed#[84DD82B2D66BA97A]) [n:127.0.0.1:61151_    ] o.a.s.c.ZkController Register node as live in ZooKeeper:/live_nodes/127.0.0.1:61151_
   [junit4]   2> 94053 INFO  (TEST-CdcrVersionReplicationTest.testCdcrDocVersions-seed#[84DD82B2D66BA97A]) [n:127.0.0.1:61151_    ] o.a.s.c.c.SolrZkClient makePath: /live_nodes/127.0.0.1:61151_
   [junit4]   2> 94057 INFO  (zkCallback-143-thread-1-processing-n:127.0.0.1:61139_) [n:127.0.0.1:61139_    ] o.a.s.c.c.ZkStateReader A live node change: [WatchedEvent state:SyncConnected type:NodeChildrenChanged path:/live_nodes], has occurred - updating... (live nodes size: [1])
   [junit4]   2> 94057 INFO  (zkCallback-149-thread-1-processing-n:127.0.0.1:61151_) [n:127.0.0.1:61151_    ] o.a.s.c.c.ZkStateReader A live node change: [WatchedEvent state:SyncConnected type:NodeChildrenChanged path:/live_nodes], has occurred - updating... (live nodes size: [1])
   [junit4]   2> 94058 INFO  (zkCallback-143-thread-1-processing-n:127.0.0.1:61139_) [n:127.0.0.1:61139_    ] o.a.s.c.c.ZkStateReader Updated live nodes from ZooKeeper... (1) -> (2)
   [junit4]   2> 94058 INFO  (zkCallback-149-thread-1-processing-n:127.0.0.1:61151_) [n:127.0.0.1:61151_    ] o.a.s.c.c.ZkStateReader Updated live nodes from ZooKeeper... (1) -> (2)
   [junit4]   2> 94068 INFO  (TEST-CdcrVersionReplicationTest.testCdcrDocVersions-seed#[84DD82B2D66BA97A]) [n:127.0.0.1:61151_    ] o.a.s.c.CoreContainer Security conf doesn't exist. Skipping setup for authorization module.
   [junit4]   2> 94068 INFO  (TEST-CdcrVersionReplicationTest.testCdcrDocVersions-seed#[84DD82B2D66BA97A]) [n:127.0.0.1:61151_    ] o.a.s.c.CoreContainer No authentication plugin used.
   [junit4]   2> 94069 INFO  (TEST-CdcrVersionReplicationTest.testCdcrDocVersions-seed#[84DD82B2D66BA97A]) [n:127.0.0.1:61151_    ] o.a.s.c.CorePropertiesLocator Looking for core definitions underneath C:\Users\jenkins\workspace\Lucene-Solr-master-Windows\solr\build\solr-core\test\J1\temp\solr.cloud.CdcrVersionReplicationTest_84DD82B2D66BA97A-001\jetty-002\cores
   [junit4]   2> 94071 INFO  (TEST-CdcrVersionReplicationTest.testCdcrDocVersions-seed#[84DD82B2D66BA97A]) [n:127.0.0.1:61151_    ] o.a.s.c.CoreDescriptor Created CoreDescriptor: {name=collection1, config=solrconfig.xml, transient=false, schema=schema.xml, loadOnStartup=true, configSetProperties=configsetprops.json, collection=tmp_collection, coreNodeName=, dataDir=data\, shard=}
   [junit4]   2> 94071 INFO  (TEST-CdcrVersionReplicationTest.testCdcrDocVersions-seed#[84DD82B2D66BA97A]) [n:127.0.0.1:61151_    ] o.a.s.c.CorePropertiesLocator Found core collection1 in C:\Users\jenkins\workspace\Lucene-Solr-master-Windows\solr\build\solr-core\test\J1\temp\solr.cloud.CdcrVersionReplicationTest_84DD82B2D66BA97A-001\jetty-002\cores\collection1
   [junit4]   2> 94071 INFO  (TEST-CdcrVersionReplicationTest.testCdcrDocVersions-seed#[84DD82B2D66BA97A]) [n:127.0.0.1:61151_    ] o.a.s.c.CorePropertiesLocator Found 1 core definitions
   [junit4]   2> 94072 INFO  (TEST-CdcrVersionReplicationTest.testCdcrDocVersions-seed#[84DD82B2D66BA97A]) [n:127.0.0.1:61151_    ] o.a.s.s.SolrDispatchFilter user.dir=C:\Users\jenkins\workspace\Lucene-Solr-master-Windows\solr\build\solr-core\test\J1
   [junit4]   2> 94072 INFO  (TEST-CdcrVersionReplicationTest.testCdcrDocVersions-seed#[84DD82B2D66BA97A]) [n:127.0.0.1:61151_    ] o.a.s.s.SolrDispatchFilter SolrDispatchFilter.init() done
   [junit4]   2> 94077 INFO  (coreLoadExecutor-371-thread-1-processing-n:127.0.0.1:61151_) [n:127.0.0.1:61151_ c:tmp_collection   x:collection1] o.a.s.c.ZkController publishing state=down
   [junit4]   2> 94077 INFO  (coreLoadExecutor-371-thread-1-processing-n:127.0.0.1:61151_) [n:127.0.0.1:61151_ c:tmp_collection   x:collection1] o.a.s.c.ZkController numShards not found on descriptor - reading it from system property
   [junit4]   2> 94079 INFO  (coreLoadExecutor-371-thread-1-processing-n:127.0.0.1:61151_) [n:127.0.0.1:61151_ c:tmp_collection   x:collection1] o.a.s.c.ZkController Registering watch for collection tmp_collection
   [junit4]   2> 94080 INFO  (OverseerStateUpdate-95944443180613636-127.0.0.1:61139_-n_0000000000) [n:127.0.0.1:61139_    ] o.a.s.c.Overseer processMessage: queueSize: 1, message = {
   [junit4]   2>   "core":"collection1",
   [junit4]   2>   "roles":null,
   [junit4]   2>   "base_url":"http://127.0.0.1:61151",
   [junit4]   2>   "node_name":"127.0.0.1:61151_",
   [junit4]   2>   "numShards":"2",
   [junit4]   2>   "state":"down",
   [junit4]   2>   "shard":null,
   [junit4]   2>   "collection":"tmp_collection",
   [junit4]   2>   "operation":"state"} current state version: 5
   [junit4]   2> 94080 INFO  (OverseerStateUpdate-95944443180613636-127.0.0.1:61139_-n_0000000000) [n:127.0.0.1:61139_    ] o.a.s.c.o.ReplicaMutator Update state numShards=2 message={
   [junit4]   2>   "core":"collection1",
   [junit4]   2>   "roles":null,
   [junit4]   2>   "base_url":"http://127.0.0.1:61151",
   [junit4]   2>   "node_name":"127.0.0.1:61151_",
   [junit4]   2>   "numShards":"2",
   [junit4]   2>   "state":"down",
   [junit4]   2>   "shard":null,
   [junit4]   2>   "collection":"tmp_collection",
   [junit4]   2>   "operation":"state"}
   [junit4]   2> 94080 INFO  (OverseerStateUpdate-95944443180613636-127.0.0.1:61139_-n_0000000000) [n:127.0.0.1:61139_    ] o.a.s.c.o.ReplicaMutator Collection already exists with numShards=2
   [junit4]   2> 94080 INFO  (OverseerStateUpdate-95944443180613636-127.0.0.1:61139_-n_0000000000) [n:127.0.0.1:61139_    ] o.a.s.c.o.ReplicaMutator Assigning new node to shard shard=shard1
   [junit4]   2> 94081 INFO  (coreLoadExecutor-371-thread-1-processing-n:127.0.0.1:61151_) [n:127.0.0.1:61151_ c:tmp_collection   x:collection1] o.a.s.c.c.ZkStateReader Deleting data for [tmp_collection]
   [junit4]   2> 94082 INFO  (coreLoadExecutor-371-thread-1-processing-n:127.0.0.1:61151_) [n:127.0.0.1:61151_ c:tmp_collection   x:collection1] o.a.s.c.ZkController look for our core node name
   [junit4]   2> 94190 INFO  (zkCallback-143-thread-1-processing-n:127.0.0.1:61139_) [n:127.0.0.1:61139_    ] o.a.s.c.c.ZkStateReader A cluster state change: [WatchedEvent state:SyncConnected type:NodeDataChanged path:/clusterstate.json], has occurred - updating... (live nodes size: [2])
   [junit4]   2> 94190 INFO  (zkCallback-149-thread-1-processing-n:127.0.0.1:61151_) [n:127.0.0.1:61151_    ] o.a.s.c.c.ZkStateReader A cluster state change: [WatchedEvent state:SyncConnected type:NodeDataChanged path:/clusterstate.json], has occurred - updating... (live nodes size: [2])
   [junit4]   2> 95083 INFO  (coreLoadExecutor-371-thread-1-processing-n:127.0.0.1:61151_) [n:127.0.0.1:61151_ c:tmp_collection   x:collection1] o.a.s.c.ZkController waiting to find shard id in clusterstate for collection1
   [junit4]   2> 95083 INFO  (coreLoadExecutor-371-thread-1-processing-n:127.0.0.1:61151_) [n:127.0.0.1:61151_ c:tmp_collection   x:collection1] o.a.s.c.ZkController Check for collection zkNode:tmp_collection
   [junit4]   2> 95084 INFO  (coreLoadExecutor-371-thread-1-processing-n:127.0.0.1:61151_) [n:127.0.0.1:61151_ c:tmp_collection   x:collection1] o.a.s.c.ZkController Collection zkNode exists
   [junit4]   2> 95084 INFO  (coreLoadExecutor-371-thread-1-processing-n:127.0.0.1:61151_) [n:127.0.0.1:61151_ c:tmp_collection   x:collection1] o.a.s.c.c.ZkStateReader Load collection config from: [/collections/tmp_collection]
   [junit4]   2> 95086 INFO  (coreLoadExecutor-371-thread-1-processing-n:127.0.0.1:61151_) [n:127.0.0.1:61151_ c:tmp_collection   x:collection1] o.a.s.c.c.ZkStateReader path=[/collections/tmp_collection] [configName]=[conf1] specified config exists in ZooKeeper
   [junit4]   2> 95086 INFO  (coreLoadExecutor-371-thread-1-processing-n:127.0.0.1:61151_) [n:127.0.0.1:61151_ c:tmp_collection   x:collection1] o.a.s.c.SolrResourceLoader new SolrResourceLoader for directory: 'C:\Users\jenkins\workspace\Lucene-Solr-master-Windows\solr\build\solr-core\test\J1\temp\solr.cloud.CdcrVersionReplicationTest_84DD82B2D66BA97A-001\jetty-002\cores\collection1'
   [junit4]   2> 95086 INFO  (coreLoadExecutor-371-thread-1-processing-n:127.0.0.1:61151_) [n:127.0.0.1:61151_ c:tmp_collection   x:collection1] o.a.s.c.SolrResourceLoader JNDI not configured for solr (NoInitialContextEx)
   [junit4]   2> 95086 INFO  (coreLoadExecutor-371-thread-1-processing-n:127.0.0.1:61151_) [n:127.0.0.1:61151_ c:tmp_collection   x:collection1] o.a.s.c.SolrResourceLoader solr home defaulted to 'solr/' (could not find system property or JNDI)
   [junit4]   2> 95090 INFO  (coreLoadExecutor-371-thread-1-processing-n:127.0.0.1:61151_) [n:127.0.0.1:61151_ c:tmp_collection   x:collection1] o.a.s.c.Config loaded config solrconfig.xml with version 0 
   [junit4]   2> 95103 INFO  (coreLoadExecutor-371-thread-1-processing-n:127.0.0.1:61151_) [n:127.0.0.1:61151_ c:tmp_collection   x:collection1] o.a.s.c.SolrConfig current version of requestparams : -1
   [junit4]   2> 95104 INFO  (coreLoadExecutor-371-thread-1-processing-n:127.0.0.1:61151_) [n:127.0.0.1:61151_ c:tmp_collection   x:collection1] o.a.s.c.SolrConfig Using Lucene MatchVersion: 7.0.0
   [junit4]   2> 95119 INFO  (coreLoadExecutor-371-thread-1-processing-n:127.0.0.1:61151_) [n:127.0.0.1:61151_ c:tmp_collection   x:collection1] o.a.s.c.SolrConfig Loaded SolrConfig: solrconfig.xml
   [junit4]   2> 95127 INFO  (coreLoadExecutor-371-thread-1-processing-n:127.0.0.1:61151_) [n:127.0.0.1:61151_ c:tmp_collection   x:collection1] o.a.s.s.IndexSchema [collection1] Schema name=test
   [junit4]   2> 95196 INFO  (coreLoadExecutor-371-thread-1-processing-n:127.0.0.1:61151_) [n:127.0.0.1:61151_ c:tmp_collection   x:collection1] o.a.s.s.IndexSchema default search field in schema is text
   [junit4]   2> 95197 INFO  (coreLoadExecutor-371-thread-1-processing-n:127.0.0.1:61151_) [n:127.0.0.1:61151_ c:tmp_collection   x:collection1] o.a.s.s.IndexSchema unique key field: id
   [junit4]   2> 95197 INFO  (coreLoadExecutor-371-thread-1-processing-n:127.0.0.1:61151_) [n:127.0.0.1:61151_ c:tmp_collection   x:collection1] o.a.s.s.FileExchangeRateProvider Reloading exchange rates from file currency.xml
   [junit4]   2> 95202 INFO  (coreLoadExecutor-371-thread-1-processing-n:127.0.0.1:61151_) [n:127.0.0.1:61151_ c:tmp_collection   x:collection1] o.a.s.s.FileExchangeRateProvider Reloading exchange rates from file currency.xml
   [junit4]   2> 95286 INFO  (coreLoadExecutor-371-thread-1-processing-n:127.0.0.1:61151_) [n:127.0.0.1:61151_ c:tmp_collection   x:collection1] o.a.s.c.ConfigSetProperties Did not find ConfigSet properties, assuming default properties: Can't find resource 'configsetprops.json' in classpath or '/configs/conf1', cwd=C:\Users\jenkins\workspace\Lucene-Solr-master-Windows\solr\build\solr-core\test\J1
   [junit4]   2> 95288 INFO  (coreLoadExecutor-371-thread-1-processing-n:127.0.0.1:61151_) [n:127.0.0.1:61151_ c:tmp_collection   x:collection1] o.a.s.c.CoreContainer Creating SolrCore 'collection1' using configuration from collection tmp_collection
   [junit4]   2> 95288 INFO  (coreLoadExecutor-371-thread-1-processing-n:127.0.0.1:61151_) [n:127.0.0.1:61151_ c:tmp_collection s:shard1 r:core_node2 x:collection1] o.a.s.c.SolrCore org.apache.solr.core.MockDirectoryFactory
   [junit4]   2> 95288 INFO  (coreLoadExecutor-371-thread-1-processing-n:127.0.0.1:61151_) [n:127.0.0.1:61151_ c:tmp_collection s:shard1 r:core_node2 x:collection1] o.a.s.c.SolrCore [[collection1] ] Opening new SolrCore at [C:\Users\jenkins\workspace\Lucene-Solr-master-Windows\solr\build\solr-core\test\J1\temp\solr.cloud.CdcrVersionReplicationTest_84DD82B2D66BA97A-001\jetty-002\cores\collection1], dataDir=[C:\Users\jenkins\workspace\Lucene-Solr-master-Windows\solr\build\solr-core\test\J1\temp\solr.cloud.CdcrVersionReplicationTest_84DD82B2D66BA97A-001\jetty-002\cores\collection1\data\]
   [junit4]   2> 95288 INFO  (coreLoadExecutor-371-thread-1-processing-n:127.0.0.1:61151_) [n:127.0.0.1:61151_ c:tmp_collection s:shard1 r:core_node2 x:collection1] o.a.s.c.JmxMonitoredMap JMX monitoring is enabled. Adding Solr mbeans to JMX Server: com.sun.jmx.mbeanserver.JmxMBeanServer@452ccb4a
   [junit4]   2> 95289 INFO  (coreLoadExecutor-371-thread-1-processing-n:127.0.0.1:61151_) [n:127.0.0.1:61151_ c:tmp_collection s:shard1 r:core_node2 x:collection1] o.a.s.c.CachingDirectoryFactory return new directory for C:\Users\jenkins\workspace\Lucene-Solr-master-Windows\solr\build\solr-core\test\J1\temp\solr.cloud.CdcrVersionReplicationTest_84DD82B2D66BA97A-001\jetty-002\cores\collection1\data\
   [junit4]   2> 95289 INFO  (coreLoadExecutor-371-thread-1-processing-n:127.0.0.1:61151_) [n:127.0.0.1:61151_ c:tmp_collection s:shard1 r:core_node2 x:collection1] o.a.s.c.SolrCore New index directory detected: old=null new=C:\Users\jenkins\workspace\Lucene-Solr-master-Windows\solr\build\solr-core\test\J1\temp\solr.cloud.CdcrVersionReplicationTest_84DD82B2D66BA97A-001\jetty-002\cores\collection1\data\index/
   [junit4]   2> 95289 WARN  (coreLoadExecutor-371-thread-1-processing-n:127.0.0.1:61151_) [n:127.0.0.1:61151_ c:tmp_collection s:shard1 r:core_node2 x:collection1] o.a.s.c.SolrCore [collection1] Solr index directory 'C:\Users\jenkins\workspace\Lucene-Solr-master-Windows\solr\build\solr-core\test\J1\temp\solr.cloud.CdcrVersionReplicationTest_84DD82B2D66BA97A-001\jetty-002\cores\collection1\data\index' doesn't exist. Creating new index...
   [junit4]   2> 95289 INFO  (coreLoadExecutor-371-thread-1-processing-n:127.0.0.1:61151_) [n:127.0.0.1:61151_ c:tmp_collection s:shard1 r:core_node2 x:collection1] o.a.s.c.CachingDirectoryFactory return new directory for C:\Users\jenkins\workspace\Lucene-Solr-master-Windows\solr\build\solr-core\test\J1\temp\solr.cloud.CdcrVersionReplicationTest_84DD82B2D66BA97A-001\jetty-002\cores\collection1\data\index
   [junit4]   2> 95294 INFO  (coreLoadExecutor-371-thread-1-processing-n:127.0.0.1:61151_) [n:127.0.0.1:61151_ c:tmp_collection s:shard1 r:core_node2 x:collection1] o.a.s.u.RandomMergePolicy RandomMergePolicy wrapping class org.apache.lucene.index.LogByteSizeMergePolicy: [LogByteSizeMergePolicy: minMergeSize=1677721, mergeFactor=43, maxMergeSize=2147483648, maxMergeSizeForForcedMerge=9223372036854775807, calibrateSizeByDeletes=false, maxMergeDocs=2147483647, maxCFSSegmentSizeMB=8.796093022207999E12, noCFSRatio=0.24750232848033393]
   [junit4]   2> 95345 INFO  (coreLoadExecutor-371-thread-1-processing-n:127.0.0.1:61151_) [n:127.0.0.1:61151_ c:tmp_collection s:shard1 r:core_node2 x:collection1] o.a.s.c.SolrDeletionPolicy SolrDeletionPolicy.onCommit: commits: num=1
   [junit4]   2> 	commit{dir=MockDirectoryWrapper(RAMDirectory@1c232d27 lockFactory=org.apache.lucene.store.SingleInstanceLockFactory@98ece77),segFN=segments_1,generation=1}
   [junit4]   2> 95345 INFO  (coreLoadExecutor-371-thread-1-processing-n:127.0.0.1:61151_) [n:127.0.0.1:61151_ c:tmp_collection s:shard1 r:core_node2 x:collection1] o.a.s.c.SolrDeletionPolicy newest commit generation = 1
   [junit4]   2> 95349 INFO  (coreLoadExecutor-371-thread-1-processing-n:127.0.0.1:61151_) [n:127.0.0.1:61151_ c:tmp_collection s:shard1 r:core_node2 x:collection1] o.a.s.u.p.UpdateRequestProcessorChain creating updateRequestProcessorChain "cdcr-processor-chain"
   [junit4]   2> 95349 INFO  (coreLoadExecutor-371-thread-1-processing-n:127.0.0.1:61151_) [n:127.0.0.1:61151_ c:tmp_collection s:shard1 r:core_node2 x:collection1] o.a.s.c.SolrCore no updateRequestProcessorChain defined as default, creating implicit default
   [junit4]   2> 95357 INFO  (coreLoadExecutor-371-thread-1-processing-n:127.0.0.1:61151_) [n:127.0.0.1:61151_ c:tmp_collection s:shard1 r:core_node2 x:collection1] o.a.s.h.l.XMLLoader xsltCacheLifetimeSeconds=60
   [junit4]   2> 95358 INFO  (coreLoadExecutor-371-thread-1-processing-n:127.0.0.1:61151_) [n:127.0.0.1:61151_ c:tmp_collection s:shard1 r:core_node2 x:collection1] o.a.s.h.l.XMLLoader xsltCacheLifetimeSeconds=60
   [junit4]   2> 95359 INFO  (coreLoadExecutor-371-thread-1-processing-n:127.0.0.1:61151_) [n:127.0.0.1:61151_ c:tmp_collection s:shard1 r:core_node2 x:collection1] o.a.s.h.l.XMLLoader xsltCacheLifetimeSec

[...truncated too long message...]

\solr.cloud.CdcrVersionReplicationTest_84DD82B2D66BA97A-001\jetty-004\cores\source_collection_shard1_replica2\data\ [CachedDir<<refCount=0;path=C:\Users\jenkins\workspace\Lucene-Solr-master-Windows\solr\build\solr-core\test\J1\temp\solr.cloud.CdcrVersionReplicationTest_84DD82B2D66BA97A-001\jetty-004\cores\source_collection_shard1_replica2\data\;done=false>>]
   [junit4]   2> 125390 INFO  (zkCallback-162-thread-2-processing-n:127.0.0.1:61176_) [n:127.0.0.1:61176_ c:source_collection s:shard1 r:core_node2 x:source_collection_shard1_replica2] o.a.s.c.CachingDirectoryFactory Closing directory, CoreContainer#isShutdown=true
   [junit4]   2> 125390 INFO  (zkCallback-162-thread-2-processing-n:127.0.0.1:61176_) [n:127.0.0.1:61176_ c:source_collection s:shard1 r:core_node2 x:source_collection_shard1_replica2] o.a.s.c.CachingDirectoryFactory Closing directory: C:\Users\jenkins\workspace\Lucene-Solr-master-Windows\solr\build\solr-core\test\J1\temp\solr.cloud.CdcrVersionReplicationTest_84DD82B2D66BA97A-001\jetty-004\cores\source_collection_shard1_replica2\data\
   [junit4]   2> 125390 INFO  (zkCallback-162-thread-2-processing-n:127.0.0.1:61176_) [n:127.0.0.1:61176_ c:source_collection s:shard1 r:core_node2 x:source_collection_shard1_replica2] o.a.s.c.CachingDirectoryFactory looking to close C:\Users\jenkins\workspace\Lucene-Solr-master-Windows\solr\build\solr-core\test\J1\temp\solr.cloud.CdcrVersionReplicationTest_84DD82B2D66BA97A-001\jetty-004\cores\source_collection_shard1_replica2\data\index [CachedDir<<refCount=0;path=C:\Users\jenkins\workspace\Lucene-Solr-master-Windows\solr\build\solr-core\test\J1\temp\solr.cloud.CdcrVersionReplicationTest_84DD82B2D66BA97A-001\jetty-004\cores\source_collection_shard1_replica2\data\index;done=false>>]
   [junit4]   2> 125390 INFO  (zkCallback-162-thread-2-processing-n:127.0.0.1:61176_) [n:127.0.0.1:61176_ c:source_collection s:shard1 r:core_node2 x:source_collection_shard1_replica2] o.a.s.c.CachingDirectoryFactory Closing directory, CoreContainer#isShutdown=true
   [junit4]   2> 125390 INFO  (zkCallback-162-thread-2-processing-n:127.0.0.1:61176_) [n:127.0.0.1:61176_ c:source_collection s:shard1 r:core_node2 x:source_collection_shard1_replica2] o.a.s.c.CachingDirectoryFactory Closing directory: C:\Users\jenkins\workspace\Lucene-Solr-master-Windows\solr\build\solr-core\test\J1\temp\solr.cloud.CdcrVersionReplicationTest_84DD82B2D66BA97A-001\jetty-004\cores\source_collection_shard1_replica2\data\index
   [junit4]   2> 125392 INFO  (TEST-CdcrVersionReplicationTest.testCdcrDocVersions-seed#[84DD82B2D66BA97A]) [    ] o.e.j.s.ServerConnector Stopped ServerConnector@523e1046{HTTP/1.1,[http/1.1]}{127.0.0.1:0}
   [junit4]   2> 125392 INFO  (TEST-CdcrVersionReplicationTest.testCdcrDocVersions-seed#[84DD82B2D66BA97A]) [    ] o.e.j.s.h.ContextHandler Stopped o.e.j.s.ServletContextHandler@746be965{/,null,UNAVAILABLE}
   [junit4]   2> 125403 INFO  (TEST-CdcrVersionReplicationTest.testCdcrDocVersions-seed#[84DD82B2D66BA97A]) [    ] o.a.s.SolrTestCaseJ4 ###Ending testCdcrDocVersions
   [junit4]   2> 125405 INFO  (TEST-CdcrVersionReplicationTest.testCdcrDocVersions-seed#[84DD82B2D66BA97A]) [    ] o.a.s.c.ZkTestServer connecting to 127.0.0.1:61132 61132
   [junit4]   2> 125408 INFO  (Thread-330) [    ] o.a.s.c.ZkTestServer connecting to 127.0.0.1:61132 61132
   [junit4]   2> 125409 WARN  (Thread-330) [    ] o.a.s.c.ZkTestServer Watch limit violations: 
   [junit4]   2> Maximum concurrent create/delete watches above limit:
   [junit4]   2> 
   [junit4]   2> 	16	/solr/aliases.json
   [junit4]   2> 	16	/solr/clusterprops.json
   [junit4]   2> 	8	/solr/configs/conf1
   [junit4]   2> 	4	/solr/collections/tmp_collection/state.json
   [junit4]   2> 	4	/solr/security.json
   [junit4]   2> 	2	/solr/collections/tmp_collection/leaders/shard2/leader
   [junit4]   2> 	2	/solr/collections/tmp_collection/leaders/shard1/leader
   [junit4]   2> 	2	/solr/collections/source_collection/leaders/shard1/leader
   [junit4]   2> 	2	/solr/collections/source_collection/leaders/shard2/leader
   [junit4]   2> 
   [junit4]   2> Maximum concurrent data watches above limit:
   [junit4]   2> 
   [junit4]   2> 	16	/solr/clusterstate.json
   [junit4]   2> 	4	/solr/collections/source_collection/cdcr/state/buffer
   [junit4]   2> 	4	/solr/collections/source_collection/cdcr/state/process
   [junit4]   2> 	4	/solr/collections/tmp_collection/cdcr/state/buffer
   [junit4]   2> 	4	/solr/collections/source_collection/state.json
   [junit4]   2> 	4	/solr/collections/tmp_collection/cdcr/state/process
   [junit4]   2> 
   [junit4]   2> Maximum concurrent children watches above limit:
   [junit4]   2> 
   [junit4]   2> 	16	/solr/live_nodes
   [junit4]   2> 	16	/solr/collections
   [junit4]   2> 	3	/solr/overseer/queue
   [junit4]   2> 	3	/solr/overseer/collection-queue-work
   [junit4]   2> 
   [junit4]   2> 125411 INFO  (SUITE-CdcrVersionReplicationTest-seed#[84DD82B2D66BA97A]-worker) [    ] o.a.s.SolrTestCaseJ4 ###deleteCore
   [junit4]   2> ObjectTracker found 1 object(s) that were not released!!! [InternalHttpClient]
   [junit4]   2> org.apache.solr.common.util.ObjectReleaseTracker$ObjectTrackerException
   [junit4]   2> 	at org.apache.solr.common.util.ObjectReleaseTracker.track(ObjectReleaseTracker.java:42)
   [junit4]   2> 	at org.apache.solr.client.solrj.impl.HttpClientUtil.createClient(HttpClientUtil.java:268)
   [junit4]   2> 	at org.apache.solr.client.solrj.impl.HttpClientUtil.createClient(HttpClientUtil.java:211)
   [junit4]   2> 	at org.apache.solr.client.solrj.impl.HttpClientUtil.createClient(HttpClientUtil.java:203)
   [junit4]   2> 	at org.apache.solr.client.solrj.impl.HttpSolrClient.<init>(HttpSolrClient.java:207)
   [junit4]   2> 	at org.apache.solr.client.solrj.impl.HttpSolrClient$Builder.build(HttpSolrClient.java:799)
   [junit4]   2> 	at org.apache.solr.handler.CdcrUpdateLogSynchronizer$UpdateLogSynchronisation.run(CdcrUpdateLogSynchronizer.java:134)
   [junit4]   2> 	at java.util.concurrent.Executors$RunnableAdapter.call(Executors.java:511)
   [junit4]   2> 	at java.util.concurrent.FutureTask.runAndReset(FutureTask.java:308)
   [junit4]   2> 	at java.util.concurrent.ScheduledThreadPoolExecutor$ScheduledFutureTask.access$301(ScheduledThreadPoolExecutor.java:180)
   [junit4]   2> 	at java.util.concurrent.ScheduledThreadPoolExecutor$ScheduledFutureTask.run(ScheduledThreadPoolExecutor.java:294)
   [junit4]   2> 	at java.util.concurrent.ThreadPoolExecutor.runWorker(ThreadPoolExecutor.java:1142)
   [junit4]   2> 	at java.util.concurrent.ThreadPoolExecutor$Worker.run(ThreadPoolExecutor.java:617)
   [junit4]   2> 	at java.lang.Thread.run(Thread.java:745)
   [junit4]   2> 
   [junit4]   2> May 23, 2016 9:34:16 AM com.carrotsearch.randomizedtesting.ThreadLeakControl checkThreadLeaks
   [junit4]   2> WARNING: Will linger awaiting termination of 3 leaked thread(s).
   [junit4]   2> 126276 WARN  (cdcr-update-log-synchronizer-422-thread-1) [n:127.0.0.1:61176_ c:source_collection s:shard1 r:core_node2 x:source_collection_shard1_replica2] o.a.s.h.CdcrUpdateLogSynchronizer Couldn't get last processed version from leader http://127.0.0.1:61163/source_collection_shard1_replica1/: Server refused connection at: http://127.0.0.1:61163/source_collection_shard1_replica1
   [junit4]   2> NOTE: test params are: codec=Asserting(Lucene62): {_version_=Lucene50(blocksize=128), id=PostingsFormat(name=MockRandom)}, docValues:{}, maxPointsInLeafNode=192, maxMBSortInHeap=7.03227935011336, sim=RandomSimilarity(queryNorm=false,coord=no): {}, locale=en-SG, timezone=Asia/Beirut
   [junit4]   2> NOTE: Windows 10 10.0 amd64/Oracle Corporation 1.8.0_92 (64-bit)/cpus=3,threads=1,free=52336624,total=141778944
   [junit4]   2> NOTE: All tests run in this JVM: [TestMiniSolrCloudClusterSSL, TestIndexSearcher, DistributedFacetPivotWhiteBoxTest, CdcrVersionReplicationTest]
   [junit4]   2> NOTE: reproduce with: ant test  -Dtestcase=CdcrVersionReplicationTest -Dtests.seed=84DD82B2D66BA97A -Dtests.slow=true -Dtests.locale=en-SG -Dtests.timezone=Asia/Beirut -Dtests.asserts=true -Dtests.file.encoding=Cp1252
   [junit4] ERROR   0.00s J1 | CdcrVersionReplicationTest (suite) <<<
   [junit4]    > Throwable #1: java.lang.AssertionError: ObjectTracker found 1 object(s) that were not released!!! [InternalHttpClient]
   [junit4]    > 	at __randomizedtesting.SeedInfo.seed([84DD82B2D66BA97A]:0)
   [junit4]    > 	at org.apache.solr.SolrTestCaseJ4.afterClass(SolrTestCaseJ4.java:255)
   [junit4]    > 	at java.lang.Thread.run(Thread.java:745)
   [junit4] Completed [13/597 (1!)] on J1 in 37.41s, 1 test, 1 failure <<< FAILURES!

[...truncated 1913 lines...]
BUILD FAILED
C:\Users\jenkins\workspace\Lucene-Solr-master-Windows\build.xml:740: The following error occurred while executing this line:
C:\Users\jenkins\workspace\Lucene-Solr-master-Windows\build.xml:684: The following error occurred while executing this line:
C:\Users\jenkins\workspace\Lucene-Solr-master-Windows\build.xml:59: The following error occurred while executing this line:
C:\Users\jenkins\workspace\Lucene-Solr-master-Windows\solr\build.xml:233: The following error occurred while executing this line:
C:\Users\jenkins\workspace\Lucene-Solr-master-Windows\solr\common-build.xml:531: The following error occurred while executing this line:
C:\Users\jenkins\workspace\Lucene-Solr-master-Windows\lucene\common-build.xml:1427: The following error occurred while executing this line:
C:\Users\jenkins\workspace\Lucene-Solr-master-Windows\lucene\common-build.xml:984: There were test failures: 597 suites (10 ignored), 2428 tests, 1 suite-level error, 126 ignored (82 assumptions) [seed: 84DD82B2D66BA97A]

Total time: 73 minutes 22 seconds
Build step 'Invoke Ant' marked build as failure
Archiving artifacts
[WARNINGS] Skipping publisher since build result is FAILURE
Recording test results
Email was triggered for: Failure - Any
Sending email for trigger: Failure - Any



Mime
View raw message