lucene-dev mailing list archives

Site index · List index
Message view « Date » · « Thread »
Top « Date » · « Thread »
From Policeman Jenkins Server <jenk...@thetaphi.de>
Subject [JENKINS-EA] Lucene-Solr-6.x-Linux (32bit/jdk-9-ea+116) - Build # 610 - Still Failing!
Date Tue, 10 May 2016 05:48:37 GMT
Build: http://jenkins.thetaphi.de/job/Lucene-Solr-6.x-Linux/610/
Java: 32bit/jdk-9-ea+116 -client -XX:+UseG1GC

1 tests failed.
FAILED:  org.apache.solr.cloud.CollectionsAPIDistributedZkTest.test

Error Message:
Timeout occured while waiting response from server at: http://127.0.0.1:34439/_tq/q

Stack Trace:
org.apache.solr.client.solrj.SolrServerException: Timeout occured while waiting response from server at: http://127.0.0.1:34439/_tq/q
	at __randomizedtesting.SeedInfo.seed([7EE1F80BF1C1289E:F6B5C7D15F3D4566]:0)
	at org.apache.solr.client.solrj.impl.HttpSolrClient.executeMethod(HttpSolrClient.java:601)
	at org.apache.solr.client.solrj.impl.HttpSolrClient.request(HttpSolrClient.java:259)
	at org.apache.solr.client.solrj.impl.HttpSolrClient.request(HttpSolrClient.java:248)
	at org.apache.solr.client.solrj.SolrClient.request(SolrClient.java:1219)
	at org.apache.solr.cloud.CollectionsAPIDistributedZkTest.makeRequest(CollectionsAPIDistributedZkTest.java:399)
	at org.apache.solr.cloud.CollectionsAPIDistributedZkTest.deletePartiallyCreatedCollection(CollectionsAPIDistributedZkTest.java:231)
	at org.apache.solr.cloud.CollectionsAPIDistributedZkTest.test(CollectionsAPIDistributedZkTest.java:181)
	at jdk.internal.reflect.NativeMethodAccessorImpl.invoke0(java.base@9-ea/Native Method)
	at jdk.internal.reflect.NativeMethodAccessorImpl.invoke(java.base@9-ea/NativeMethodAccessorImpl.java:62)
	at jdk.internal.reflect.DelegatingMethodAccessorImpl.invoke(java.base@9-ea/DelegatingMethodAccessorImpl.java:43)
	at java.lang.reflect.Method.invoke(java.base@9-ea/Method.java:531)
	at com.carrotsearch.randomizedtesting.RandomizedRunner.invoke(RandomizedRunner.java:1764)
	at com.carrotsearch.randomizedtesting.RandomizedRunner$8.evaluate(RandomizedRunner.java:871)
	at com.carrotsearch.randomizedtesting.RandomizedRunner$9.evaluate(RandomizedRunner.java:907)
	at com.carrotsearch.randomizedtesting.RandomizedRunner$10.evaluate(RandomizedRunner.java:921)
	at org.apache.solr.BaseDistributedSearchTestCase$ShardsRepeatRule$ShardsFixedStatement.callStatement(BaseDistributedSearchTestCase.java:992)
	at org.apache.solr.BaseDistributedSearchTestCase$ShardsRepeatRule$ShardsStatement.evaluate(BaseDistributedSearchTestCase.java:967)
	at com.carrotsearch.randomizedtesting.rules.SystemPropertiesRestoreRule$1.evaluate(SystemPropertiesRestoreRule.java:57)
	at org.apache.lucene.util.TestRuleSetupTeardownChained$1.evaluate(TestRuleSetupTeardownChained.java:49)
	at org.apache.lucene.util.AbstractBeforeAfterRule$1.evaluate(AbstractBeforeAfterRule.java:45)
	at org.apache.lucene.util.TestRuleThreadAndTestName$1.evaluate(TestRuleThreadAndTestName.java:48)
	at org.apache.lucene.util.TestRuleIgnoreAfterMaxFailures$1.evaluate(TestRuleIgnoreAfterMaxFailures.java:64)
	at org.apache.lucene.util.TestRuleMarkFailure$1.evaluate(TestRuleMarkFailure.java:47)
	at com.carrotsearch.randomizedtesting.rules.StatementAdapter.evaluate(StatementAdapter.java:36)
	at com.carrotsearch.randomizedtesting.ThreadLeakControl$StatementRunner.run(ThreadLeakControl.java:367)
	at com.carrotsearch.randomizedtesting.ThreadLeakControl.forkTimeoutingTask(ThreadLeakControl.java:809)
	at com.carrotsearch.randomizedtesting.ThreadLeakControl$3.evaluate(ThreadLeakControl.java:460)
	at com.carrotsearch.randomizedtesting.RandomizedRunner.runSingleTest(RandomizedRunner.java:880)
	at com.carrotsearch.randomizedtesting.RandomizedRunner$5.evaluate(RandomizedRunner.java:781)
	at com.carrotsearch.randomizedtesting.RandomizedRunner$6.evaluate(RandomizedRunner.java:816)
	at com.carrotsearch.randomizedtesting.RandomizedRunner$7.evaluate(RandomizedRunner.java:827)
	at com.carrotsearch.randomizedtesting.rules.StatementAdapter.evaluate(StatementAdapter.java:36)
	at com.carrotsearch.randomizedtesting.rules.SystemPropertiesRestoreRule$1.evaluate(SystemPropertiesRestoreRule.java:57)
	at org.apache.lucene.util.AbstractBeforeAfterRule$1.evaluate(AbstractBeforeAfterRule.java:45)
	at com.carrotsearch.randomizedtesting.rules.StatementAdapter.evaluate(StatementAdapter.java:36)
	at org.apache.lucene.util.TestRuleStoreClassName$1.evaluate(TestRuleStoreClassName.java:41)
	at com.carrotsearch.randomizedtesting.rules.NoShadowingOrOverridesOnMethodsRule$1.evaluate(NoShadowingOrOverridesOnMethodsRule.java:40)
	at com.carrotsearch.randomizedtesting.rules.NoShadowingOrOverridesOnMethodsRule$1.evaluate(NoShadowingOrOverridesOnMethodsRule.java:40)
	at com.carrotsearch.randomizedtesting.rules.StatementAdapter.evaluate(StatementAdapter.java:36)
	at com.carrotsearch.randomizedtesting.rules.StatementAdapter.evaluate(StatementAdapter.java:36)
	at com.carrotsearch.randomizedtesting.rules.StatementAdapter.evaluate(StatementAdapter.java:36)
	at org.apache.lucene.util.TestRuleAssertionsRequired$1.evaluate(TestRuleAssertionsRequired.java:53)
	at org.apache.lucene.util.TestRuleMarkFailure$1.evaluate(TestRuleMarkFailure.java:47)
	at org.apache.lucene.util.TestRuleIgnoreAfterMaxFailures$1.evaluate(TestRuleIgnoreAfterMaxFailures.java:64)
	at org.apache.lucene.util.TestRuleIgnoreTestSuites$1.evaluate(TestRuleIgnoreTestSuites.java:54)
	at com.carrotsearch.randomizedtesting.rules.StatementAdapter.evaluate(StatementAdapter.java:36)
	at com.carrotsearch.randomizedtesting.ThreadLeakControl$StatementRunner.run(ThreadLeakControl.java:367)
	at java.lang.Thread.run(java.base@9-ea/Thread.java:804)
Caused by: java.net.SocketTimeoutException: Read timed out
	at java.net.SocketInputStream.socketRead0(java.base@9-ea/Native Method)
	at java.net.SocketInputStream.socketRead(java.base@9-ea/SocketInputStream.java:116)
	at java.net.SocketInputStream.read(java.base@9-ea/SocketInputStream.java:170)
	at java.net.SocketInputStream.read(java.base@9-ea/SocketInputStream.java:141)
	at org.apache.http.impl.io.AbstractSessionInputBuffer.fillBuffer(AbstractSessionInputBuffer.java:160)
	at org.apache.http.impl.io.SocketInputBuffer.fillBuffer(SocketInputBuffer.java:84)
	at org.apache.http.impl.io.AbstractSessionInputBuffer.readLine(AbstractSessionInputBuffer.java:273)
	at org.apache.http.impl.conn.DefaultHttpResponseParser.parseHead(DefaultHttpResponseParser.java:140)
	at org.apache.http.impl.conn.DefaultHttpResponseParser.parseHead(DefaultHttpResponseParser.java:57)
	at org.apache.http.impl.io.AbstractMessageParser.parse(AbstractMessageParser.java:261)
	at org.apache.http.impl.AbstractHttpClientConnection.receiveResponseHeader(AbstractHttpClientConnection.java:283)
	at org.apache.http.impl.conn.DefaultClientConnection.receiveResponseHeader(DefaultClientConnection.java:251)
	at org.apache.http.impl.conn.ManagedClientConnectionImpl.receiveResponseHeader(ManagedClientConnectionImpl.java:197)
	at org.apache.http.protocol.HttpRequestExecutor.doReceiveResponse(HttpRequestExecutor.java:272)
	at org.apache.http.protocol.HttpRequestExecutor.execute(HttpRequestExecutor.java:124)
	at org.apache.http.impl.client.DefaultRequestDirector.tryExecute(DefaultRequestDirector.java:685)
	at org.apache.http.impl.client.DefaultRequestDirector.execute(DefaultRequestDirector.java:487)
	at org.apache.http.impl.client.AbstractHttpClient.doExecute(AbstractHttpClient.java:882)
	at org.apache.http.impl.client.CloseableHttpClient.execute(CloseableHttpClient.java:82)
	at org.apache.http.impl.client.CloseableHttpClient.execute(CloseableHttpClient.java:107)
	at org.apache.http.impl.client.CloseableHttpClient.execute(CloseableHttpClient.java:55)
	at org.apache.solr.client.solrj.impl.HttpSolrClient.executeMethod(HttpSolrClient.java:495)
	... 47 more




Build Log:
[...truncated 11557 lines...]
   [junit4] Suite: org.apache.solr.cloud.CollectionsAPIDistributedZkTest
   [junit4]   2> Creating dataDir: /home/jenkins/workspace/Lucene-Solr-6.x-Linux/solr/build/solr-core/test/J1/temp/solr.cloud.CollectionsAPIDistributedZkTest_7EE1F80BF1C1289E-001/init-core-data-001
   [junit4]   2> 1092699 INFO  (SUITE-CollectionsAPIDistributedZkTest-seed#[7EE1F80BF1C1289E]-worker) [    ] o.a.s.SolrTestCaseJ4 Randomized ssl (false) and clientAuth (true)
   [junit4]   2> 1092699 INFO  (SUITE-CollectionsAPIDistributedZkTest-seed#[7EE1F80BF1C1289E]-worker) [    ] o.a.s.BaseDistributedSearchTestCase Setting hostContext system property: /_tq/q
   [junit4]   2> 1092700 INFO  (TEST-CollectionsAPIDistributedZkTest.test-seed#[7EE1F80BF1C1289E]) [    ] o.a.s.c.ZkTestServer STARTING ZK TEST SERVER
   [junit4]   2> 1092701 INFO  (Thread-2665) [    ] o.a.s.c.ZkTestServer client port:0.0.0.0/0.0.0.0:0
   [junit4]   2> 1092701 INFO  (Thread-2665) [    ] o.a.s.c.ZkTestServer Starting server
   [junit4]   2> 1092801 INFO  (TEST-CollectionsAPIDistributedZkTest.test-seed#[7EE1F80BF1C1289E]) [    ] o.a.s.c.ZkTestServer start zk server on port:33562
   [junit4]   2> 1092801 INFO  (TEST-CollectionsAPIDistributedZkTest.test-seed#[7EE1F80BF1C1289E]) [    ] o.a.s.c.c.SolrZkClient Using default ZkCredentialsProvider
   [junit4]   2> 1092801 INFO  (TEST-CollectionsAPIDistributedZkTest.test-seed#[7EE1F80BF1C1289E]) [    ] o.a.s.c.c.ConnectionManager Waiting for client to connect to ZooKeeper
   [junit4]   2> 1092803 INFO  (zkCallback-1064-thread-1) [    ] o.a.s.c.c.ConnectionManager Watcher org.apache.solr.common.cloud.ConnectionManager@1bef1a8 name:ZooKeeperConnection Watcher:127.0.0.1:33562 got event WatchedEvent state:SyncConnected type:None path:null path:null type:None
   [junit4]   2> 1092803 INFO  (TEST-CollectionsAPIDistributedZkTest.test-seed#[7EE1F80BF1C1289E]) [    ] o.a.s.c.c.ConnectionManager Client is connected to ZooKeeper
   [junit4]   2> 1092803 INFO  (TEST-CollectionsAPIDistributedZkTest.test-seed#[7EE1F80BF1C1289E]) [    ] o.a.s.c.c.SolrZkClient Using default ZkACLProvider
   [junit4]   2> 1092803 INFO  (TEST-CollectionsAPIDistributedZkTest.test-seed#[7EE1F80BF1C1289E]) [    ] o.a.s.c.c.SolrZkClient makePath: /solr
   [junit4]   2> 1092805 INFO  (TEST-CollectionsAPIDistributedZkTest.test-seed#[7EE1F80BF1C1289E]) [    ] o.a.s.c.c.SolrZkClient Using default ZkCredentialsProvider
   [junit4]   2> 1092805 INFO  (TEST-CollectionsAPIDistributedZkTest.test-seed#[7EE1F80BF1C1289E]) [    ] o.a.s.c.c.ConnectionManager Waiting for client to connect to ZooKeeper
   [junit4]   2> 1092806 INFO  (zkCallback-1065-thread-1) [    ] o.a.s.c.c.ConnectionManager Watcher org.apache.solr.common.cloud.ConnectionManager@b8af33 name:ZooKeeperConnection Watcher:127.0.0.1:33562/solr got event WatchedEvent state:SyncConnected type:None path:null path:null type:None
   [junit4]   2> 1092806 INFO  (TEST-CollectionsAPIDistributedZkTest.test-seed#[7EE1F80BF1C1289E]) [    ] o.a.s.c.c.ConnectionManager Client is connected to ZooKeeper
   [junit4]   2> 1092806 INFO  (TEST-CollectionsAPIDistributedZkTest.test-seed#[7EE1F80BF1C1289E]) [    ] o.a.s.c.c.SolrZkClient Using default ZkACLProvider
   [junit4]   2> 1092806 INFO  (TEST-CollectionsAPIDistributedZkTest.test-seed#[7EE1F80BF1C1289E]) [    ] o.a.s.c.c.SolrZkClient makePath: /collections/collection1
   [junit4]   2> 1092807 INFO  (TEST-CollectionsAPIDistributedZkTest.test-seed#[7EE1F80BF1C1289E]) [    ] o.a.s.c.c.SolrZkClient makePath: /collections/collection1/shards
   [junit4]   2> 1092807 INFO  (TEST-CollectionsAPIDistributedZkTest.test-seed#[7EE1F80BF1C1289E]) [    ] o.a.s.c.c.SolrZkClient makePath: /collections/control_collection
   [junit4]   2> 1092807 INFO  (TEST-CollectionsAPIDistributedZkTest.test-seed#[7EE1F80BF1C1289E]) [    ] o.a.s.c.c.SolrZkClient makePath: /collections/control_collection/shards
   [junit4]   2> 1092808 INFO  (TEST-CollectionsAPIDistributedZkTest.test-seed#[7EE1F80BF1C1289E]) [    ] o.a.s.c.AbstractZkTestCase put /home/jenkins/workspace/Lucene-Solr-6.x-Linux/solr/core/src/test-files/solr/collection1/conf/solrconfig-tlog.xml to /configs/conf1/solrconfig.xml
   [junit4]   2> 1092808 INFO  (TEST-CollectionsAPIDistributedZkTest.test-seed#[7EE1F80BF1C1289E]) [    ] o.a.s.c.c.SolrZkClient makePath: /configs/conf1/solrconfig.xml
   [junit4]   2> 1092809 INFO  (TEST-CollectionsAPIDistributedZkTest.test-seed#[7EE1F80BF1C1289E]) [    ] o.a.s.c.AbstractZkTestCase put /home/jenkins/workspace/Lucene-Solr-6.x-Linux/solr/core/src/test-files/solr/collection1/conf/schema.xml to /configs/conf1/schema.xml
   [junit4]   2> 1092809 INFO  (TEST-CollectionsAPIDistributedZkTest.test-seed#[7EE1F80BF1C1289E]) [    ] o.a.s.c.c.SolrZkClient makePath: /configs/conf1/schema.xml
   [junit4]   2> 1092809 INFO  (TEST-CollectionsAPIDistributedZkTest.test-seed#[7EE1F80BF1C1289E]) [    ] o.a.s.c.AbstractZkTestCase put /home/jenkins/workspace/Lucene-Solr-6.x-Linux/solr/core/src/test-files/solr/collection1/conf/solrconfig.snippet.randomindexconfig.xml to /configs/conf1/solrconfig.snippet.randomindexconfig.xml
   [junit4]   2> 1092810 INFO  (TEST-CollectionsAPIDistributedZkTest.test-seed#[7EE1F80BF1C1289E]) [    ] o.a.s.c.c.SolrZkClient makePath: /configs/conf1/solrconfig.snippet.randomindexconfig.xml
   [junit4]   2> 1092810 INFO  (TEST-CollectionsAPIDistributedZkTest.test-seed#[7EE1F80BF1C1289E]) [    ] o.a.s.c.AbstractZkTestCase put /home/jenkins/workspace/Lucene-Solr-6.x-Linux/solr/core/src/test-files/solr/collection1/conf/stopwords.txt to /configs/conf1/stopwords.txt
   [junit4]   2> 1092810 INFO  (TEST-CollectionsAPIDistributedZkTest.test-seed#[7EE1F80BF1C1289E]) [    ] o.a.s.c.c.SolrZkClient makePath: /configs/conf1/stopwords.txt
   [junit4]   2> 1092811 INFO  (TEST-CollectionsAPIDistributedZkTest.test-seed#[7EE1F80BF1C1289E]) [    ] o.a.s.c.AbstractZkTestCase put /home/jenkins/workspace/Lucene-Solr-6.x-Linux/solr/core/src/test-files/solr/collection1/conf/protwords.txt to /configs/conf1/protwords.txt
   [junit4]   2> 1092811 INFO  (TEST-CollectionsAPIDistributedZkTest.test-seed#[7EE1F80BF1C1289E]) [    ] o.a.s.c.c.SolrZkClient makePath: /configs/conf1/protwords.txt
   [junit4]   2> 1092811 INFO  (TEST-CollectionsAPIDistributedZkTest.test-seed#[7EE1F80BF1C1289E]) [    ] o.a.s.c.AbstractZkTestCase put /home/jenkins/workspace/Lucene-Solr-6.x-Linux/solr/core/src/test-files/solr/collection1/conf/currency.xml to /configs/conf1/currency.xml
   [junit4]   2> 1092811 INFO  (TEST-CollectionsAPIDistributedZkTest.test-seed#[7EE1F80BF1C1289E]) [    ] o.a.s.c.c.SolrZkClient makePath: /configs/conf1/currency.xml
   [junit4]   2> 1092812 INFO  (TEST-CollectionsAPIDistributedZkTest.test-seed#[7EE1F80BF1C1289E]) [    ] o.a.s.c.AbstractZkTestCase put /home/jenkins/workspace/Lucene-Solr-6.x-Linux/solr/core/src/test-files/solr/collection1/conf/enumsConfig.xml to /configs/conf1/enumsConfig.xml
   [junit4]   2> 1092812 INFO  (TEST-CollectionsAPIDistributedZkTest.test-seed#[7EE1F80BF1C1289E]) [    ] o.a.s.c.c.SolrZkClient makePath: /configs/conf1/enumsConfig.xml
   [junit4]   2> 1092813 INFO  (TEST-CollectionsAPIDistributedZkTest.test-seed#[7EE1F80BF1C1289E]) [    ] o.a.s.c.AbstractZkTestCase put /home/jenkins/workspace/Lucene-Solr-6.x-Linux/solr/core/src/test-files/solr/collection1/conf/open-exchange-rates.json to /configs/conf1/open-exchange-rates.json
   [junit4]   2> 1092813 INFO  (TEST-CollectionsAPIDistributedZkTest.test-seed#[7EE1F80BF1C1289E]) [    ] o.a.s.c.c.SolrZkClient makePath: /configs/conf1/open-exchange-rates.json
   [junit4]   2> 1092814 INFO  (TEST-CollectionsAPIDistributedZkTest.test-seed#[7EE1F80BF1C1289E]) [    ] o.a.s.c.AbstractZkTestCase put /home/jenkins/workspace/Lucene-Solr-6.x-Linux/solr/core/src/test-files/solr/collection1/conf/mapping-ISOLatin1Accent.txt to /configs/conf1/mapping-ISOLatin1Accent.txt
   [junit4]   2> 1092814 INFO  (TEST-CollectionsAPIDistributedZkTest.test-seed#[7EE1F80BF1C1289E]) [    ] o.a.s.c.c.SolrZkClient makePath: /configs/conf1/mapping-ISOLatin1Accent.txt
   [junit4]   2> 1092814 INFO  (TEST-CollectionsAPIDistributedZkTest.test-seed#[7EE1F80BF1C1289E]) [    ] o.a.s.c.AbstractZkTestCase put /home/jenkins/workspace/Lucene-Solr-6.x-Linux/solr/core/src/test-files/solr/collection1/conf/old_synonyms.txt to /configs/conf1/old_synonyms.txt
   [junit4]   2> 1092814 INFO  (TEST-CollectionsAPIDistributedZkTest.test-seed#[7EE1F80BF1C1289E]) [    ] o.a.s.c.c.SolrZkClient makePath: /configs/conf1/old_synonyms.txt
   [junit4]   2> 1092815 INFO  (TEST-CollectionsAPIDistributedZkTest.test-seed#[7EE1F80BF1C1289E]) [    ] o.a.s.c.AbstractZkTestCase put /home/jenkins/workspace/Lucene-Solr-6.x-Linux/solr/core/src/test-files/solr/collection1/conf/synonyms.txt to /configs/conf1/synonyms.txt
   [junit4]   2> 1092815 INFO  (TEST-CollectionsAPIDistributedZkTest.test-seed#[7EE1F80BF1C1289E]) [    ] o.a.s.c.c.SolrZkClient makePath: /configs/conf1/synonyms.txt
   [junit4]   2> 1092816 INFO  (TEST-CollectionsAPIDistributedZkTest.test-seed#[7EE1F80BF1C1289E]) [    ] o.a.s.c.c.SolrZkClient Using default ZkCredentialsProvider
   [junit4]   2> 1092816 INFO  (TEST-CollectionsAPIDistributedZkTest.test-seed#[7EE1F80BF1C1289E]) [    ] o.a.s.c.c.ConnectionManager Waiting for client to connect to ZooKeeper
   [junit4]   2> 1092817 INFO  (zkCallback-1066-thread-1) [    ] o.a.s.c.c.ConnectionManager Watcher org.apache.solr.common.cloud.ConnectionManager@335822 name:ZooKeeperConnection Watcher:127.0.0.1:33562 got event WatchedEvent state:SyncConnected type:None path:null path:null type:None
   [junit4]   2> 1092817 INFO  (TEST-CollectionsAPIDistributedZkTest.test-seed#[7EE1F80BF1C1289E]) [    ] o.a.s.c.c.ConnectionManager Client is connected to ZooKeeper
   [junit4]   2> 1092817 INFO  (TEST-CollectionsAPIDistributedZkTest.test-seed#[7EE1F80BF1C1289E]) [    ] o.a.s.c.c.SolrZkClient Using default ZkACLProvider
   [junit4]   2> 1092817 INFO  (TEST-CollectionsAPIDistributedZkTest.test-seed#[7EE1F80BF1C1289E]) [    ] o.a.s.c.c.SolrZkClient makePath: /solr
   [junit4]   2> 1092817 INFO  (TEST-CollectionsAPIDistributedZkTest.test-seed#[7EE1F80BF1C1289E]) [    ] o.a.s.c.c.SolrZkClient Using default ZkCredentialsProvider
   [junit4]   2> 1092818 INFO  (TEST-CollectionsAPIDistributedZkTest.test-seed#[7EE1F80BF1C1289E]) [    ] o.a.s.c.c.ConnectionManager Waiting for client to connect to ZooKeeper
   [junit4]   2> 1092818 INFO  (zkCallback-1067-thread-1) [    ] o.a.s.c.c.ConnectionManager Watcher org.apache.solr.common.cloud.ConnectionManager@107cae4 name:ZooKeeperConnection Watcher:127.0.0.1:33562/solr got event WatchedEvent state:SyncConnected type:None path:null path:null type:None
   [junit4]   2> 1092818 INFO  (TEST-CollectionsAPIDistributedZkTest.test-seed#[7EE1F80BF1C1289E]) [    ] o.a.s.c.c.ConnectionManager Client is connected to ZooKeeper
   [junit4]   2> 1092818 INFO  (TEST-CollectionsAPIDistributedZkTest.test-seed#[7EE1F80BF1C1289E]) [    ] o.a.s.c.c.SolrZkClient Using default ZkACLProvider
   [junit4]   2> 1092819 INFO  (TEST-CollectionsAPIDistributedZkTest.test-seed#[7EE1F80BF1C1289E]) [    ] o.a.s.c.AbstractZkTestCase put /home/jenkins/workspace/Lucene-Solr-6.x-Linux/solr/core/src/test-files/solr/collection1/conf/solrconfig-tlog.xml to /configs/conf2/solrconfig.xml
   [junit4]   2> 1092819 INFO  (TEST-CollectionsAPIDistributedZkTest.test-seed#[7EE1F80BF1C1289E]) [    ] o.a.s.c.c.SolrZkClient makePath: /configs/conf2/solrconfig.xml
   [junit4]   2> 1092819 INFO  (TEST-CollectionsAPIDistributedZkTest.test-seed#[7EE1F80BF1C1289E]) [    ] o.a.s.c.AbstractZkTestCase put /home/jenkins/workspace/Lucene-Solr-6.x-Linux/solr/core/src/test-files/solr/collection1/conf/schema.xml to /configs/conf2/schema.xml
   [junit4]   2> 1092819 INFO  (TEST-CollectionsAPIDistributedZkTest.test-seed#[7EE1F80BF1C1289E]) [    ] o.a.s.c.c.SolrZkClient makePath: /configs/conf2/schema.xml
   [junit4]   2> 1092820 INFO  (TEST-CollectionsAPIDistributedZkTest.test-seed#[7EE1F80BF1C1289E]) [    ] o.a.s.c.AbstractZkTestCase put /home/jenkins/workspace/Lucene-Solr-6.x-Linux/solr/core/src/test-files/solr/collection1/conf/enumsConfig.xml to /configs/conf2/enumsConfig.xml
   [junit4]   2> 1092820 INFO  (TEST-CollectionsAPIDistributedZkTest.test-seed#[7EE1F80BF1C1289E]) [    ] o.a.s.c.c.SolrZkClient makePath: /configs/conf2/enumsConfig.xml
   [junit4]   2> 1092821 INFO  (TEST-CollectionsAPIDistributedZkTest.test-seed#[7EE1F80BF1C1289E]) [    ] o.a.s.c.AbstractZkTestCase put /home/jenkins/workspace/Lucene-Solr-6.x-Linux/solr/core/src/test-files/solr/collection1/conf/solrconfig.snippet.randomindexconfig.xml to /configs/conf2/solrconfig.snippet.randomindexconfig.xml
   [junit4]   2> 1092821 INFO  (TEST-CollectionsAPIDistributedZkTest.test-seed#[7EE1F80BF1C1289E]) [    ] o.a.s.c.c.SolrZkClient makePath: /configs/conf2/solrconfig.snippet.randomindexconfig.xml
   [junit4]   2> 1092822 INFO  (TEST-CollectionsAPIDistributedZkTest.test-seed#[7EE1F80BF1C1289E]) [    ] o.a.s.c.AbstractZkTestCase put /home/jenkins/workspace/Lucene-Solr-6.x-Linux/solr/core/src/test-files/solr/collection1/conf/stopwords.txt to /configs/conf2/stopwords.txt
   [junit4]   2> 1092822 INFO  (TEST-CollectionsAPIDistributedZkTest.test-seed#[7EE1F80BF1C1289E]) [    ] o.a.s.c.c.SolrZkClient makePath: /configs/conf2/stopwords.txt
   [junit4]   2> 1092822 INFO  (TEST-CollectionsAPIDistributedZkTest.test-seed#[7EE1F80BF1C1289E]) [    ] o.a.s.c.AbstractZkTestCase put /home/jenkins/workspace/Lucene-Solr-6.x-Linux/solr/core/src/test-files/solr/collection1/conf/protwords.txt to /configs/conf2/protwords.txt
   [junit4]   2> 1092822 INFO  (TEST-CollectionsAPIDistributedZkTest.test-seed#[7EE1F80BF1C1289E]) [    ] o.a.s.c.c.SolrZkClient makePath: /configs/conf2/protwords.txt
   [junit4]   2> 1092823 INFO  (TEST-CollectionsAPIDistributedZkTest.test-seed#[7EE1F80BF1C1289E]) [    ] o.a.s.c.AbstractZkTestCase put /home/jenkins/workspace/Lucene-Solr-6.x-Linux/solr/core/src/test-files/solr/collection1/conf/currency.xml to /configs/conf2/currency.xml
   [junit4]   2> 1092823 INFO  (TEST-CollectionsAPIDistributedZkTest.test-seed#[7EE1F80BF1C1289E]) [    ] o.a.s.c.c.SolrZkClient makePath: /configs/conf2/currency.xml
   [junit4]   2> 1092823 INFO  (TEST-CollectionsAPIDistributedZkTest.test-seed#[7EE1F80BF1C1289E]) [    ] o.a.s.c.AbstractZkTestCase put /home/jenkins/workspace/Lucene-Solr-6.x-Linux/solr/core/src/test-files/solr/collection1/conf/open-exchange-rates.json to /configs/conf2/open-exchange-rates.json
   [junit4]   2> 1092824 INFO  (TEST-CollectionsAPIDistributedZkTest.test-seed#[7EE1F80BF1C1289E]) [    ] o.a.s.c.c.SolrZkClient makePath: /configs/conf2/open-exchange-rates.json
   [junit4]   2> 1092824 INFO  (TEST-CollectionsAPIDistributedZkTest.test-seed#[7EE1F80BF1C1289E]) [    ] o.a.s.c.AbstractZkTestCase put /home/jenkins/workspace/Lucene-Solr-6.x-Linux/solr/core/src/test-files/solr/collection1/conf/mapping-ISOLatin1Accent.txt to /configs/conf2/mapping-ISOLatin1Accent.txt
   [junit4]   2> 1092825 INFO  (TEST-CollectionsAPIDistributedZkTest.test-seed#[7EE1F80BF1C1289E]) [    ] o.a.s.c.c.SolrZkClient makePath: /configs/conf2/mapping-ISOLatin1Accent.txt
   [junit4]   2> 1092826 INFO  (TEST-CollectionsAPIDistributedZkTest.test-seed#[7EE1F80BF1C1289E]) [    ] o.a.s.c.AbstractZkTestCase put /home/jenkins/workspace/Lucene-Solr-6.x-Linux/solr/core/src/test-files/solr/collection1/conf/old_synonyms.txt to /configs/conf2/old_synonyms.txt
   [junit4]   2> 1092826 INFO  (TEST-CollectionsAPIDistributedZkTest.test-seed#[7EE1F80BF1C1289E]) [    ] o.a.s.c.c.SolrZkClient makePath: /configs/conf2/old_synonyms.txt
   [junit4]   2> 1092826 INFO  (TEST-CollectionsAPIDistributedZkTest.test-seed#[7EE1F80BF1C1289E]) [    ] o.a.s.c.AbstractZkTestCase put /home/jenkins/workspace/Lucene-Solr-6.x-Linux/solr/core/src/test-files/solr/collection1/conf/synonyms.txt to /configs/conf2/synonyms.txt
   [junit4]   2> 1092826 INFO  (TEST-CollectionsAPIDistributedZkTest.test-seed#[7EE1F80BF1C1289E]) [    ] o.a.s.c.c.SolrZkClient makePath: /configs/conf2/synonyms.txt
   [junit4]   2> 1092827 INFO  (TEST-CollectionsAPIDistributedZkTest.test-seed#[7EE1F80BF1C1289E]) [    ] o.a.s.c.AbstractZkTestCase put /home/jenkins/workspace/Lucene-Solr-6.x-Linux/solr/core/src/test-files/solr/collection1/conf/elevate.xml to /configs/conf2/elevate.xml
   [junit4]   2> 1092827 INFO  (TEST-CollectionsAPIDistributedZkTest.test-seed#[7EE1F80BF1C1289E]) [    ] o.a.s.c.c.SolrZkClient makePath: /configs/conf2/elevate.xml
   [junit4]   2> 1092943 INFO  (TEST-CollectionsAPIDistributedZkTest.test-seed#[7EE1F80BF1C1289E]) [    ] o.a.s.SolrTestCaseJ4 Writing core.properties file to /home/jenkins/workspace/Lucene-Solr-6.x-Linux/solr/build/solr-core/test/J1/temp/solr.cloud.CollectionsAPIDistributedZkTest_7EE1F80BF1C1289E-001/control-001/cores/collection1
   [junit4]   2> 1092944 INFO  (TEST-CollectionsAPIDistributedZkTest.test-seed#[7EE1F80BF1C1289E]) [    ] o.e.j.s.Server jetty-9.3.8.v20160314
   [junit4]   2> 1092945 INFO  (TEST-CollectionsAPIDistributedZkTest.test-seed#[7EE1F80BF1C1289E]) [    ] o.e.j.s.h.ContextHandler Started o.e.j.s.ServletContextHandler@1797f96{/_tq/q,null,AVAILABLE}
   [junit4]   2> 1092947 INFO  (TEST-CollectionsAPIDistributedZkTest.test-seed#[7EE1F80BF1C1289E]) [    ] o.e.j.s.ServerConnector Started ServerConnector@13351b3{HTTP/1.1,[http/1.1]}{127.0.0.1:42222}
   [junit4]   2> 1092947 INFO  (TEST-CollectionsAPIDistributedZkTest.test-seed#[7EE1F80BF1C1289E]) [    ] o.e.j.s.Server Started @1094807ms
   [junit4]   2> 1092947 INFO  (TEST-CollectionsAPIDistributedZkTest.test-seed#[7EE1F80BF1C1289E]) [    ] o.a.s.c.s.e.JettySolrRunner Jetty properties: {solr.data.dir=/home/jenkins/workspace/Lucene-Solr-6.x-Linux/solr/build/solr-core/test/J1/temp/solr.cloud.CollectionsAPIDistributedZkTest_7EE1F80BF1C1289E-001/tempDir-001/control/data, hostContext=/_tq/q, hostPort=42222, coreRootDirectory=/home/jenkins/workspace/Lucene-Solr-6.x-Linux/solr/build/solr-core/test/J1/../../../../../../../../../home/jenkins/workspace/Lucene-Solr-6.x-Linux/solr/build/solr-core/test/J1/temp/solr.cloud.CollectionsAPIDistributedZkTest_7EE1F80BF1C1289E-001/control-001/cores}
   [junit4]   2> 1092947 INFO  (TEST-CollectionsAPIDistributedZkTest.test-seed#[7EE1F80BF1C1289E]) [    ] o.a.s.s.SolrDispatchFilter SolrDispatchFilter.init(): jdk.internal.loader.ClassLoaders$AppClassLoader@a4a92b
   [junit4]   2> 1092947 INFO  (TEST-CollectionsAPIDistributedZkTest.test-seed#[7EE1F80BF1C1289E]) [    ] o.a.s.c.SolrResourceLoader new SolrResourceLoader for directory: '/home/jenkins/workspace/Lucene-Solr-6.x-Linux/solr/build/solr-core/test/J1/temp/solr.cloud.CollectionsAPIDistributedZkTest_7EE1F80BF1C1289E-001/control-001'
   [junit4]   2> 1092947 INFO  (TEST-CollectionsAPIDistributedZkTest.test-seed#[7EE1F80BF1C1289E]) [    ] o.a.s.c.SolrResourceLoader JNDI not configured for solr (NoInitialContextEx)
   [junit4]   2> 1092947 INFO  (TEST-CollectionsAPIDistributedZkTest.test-seed#[7EE1F80BF1C1289E]) [    ] o.a.s.c.SolrResourceLoader solr home defaulted to 'solr/' (could not find system property or JNDI)
   [junit4]   2> 1092947 INFO  (TEST-CollectionsAPIDistributedZkTest.test-seed#[7EE1F80BF1C1289E]) [    ] o.a.s.c.c.SolrZkClient Using default ZkCredentialsProvider
   [junit4]   2> 1092948 INFO  (TEST-CollectionsAPIDistributedZkTest.test-seed#[7EE1F80BF1C1289E]) [    ] o.a.s.c.c.ConnectionManager Waiting for client to connect to ZooKeeper
   [junit4]   2> 1092948 INFO  (zkCallback-1068-thread-1) [    ] o.a.s.c.c.ConnectionManager Watcher org.apache.solr.common.cloud.ConnectionManager@4d8234 name:ZooKeeperConnection Watcher:127.0.0.1:33562/solr got event WatchedEvent state:SyncConnected type:None path:null path:null type:None
   [junit4]   2> 1092948 INFO  (TEST-CollectionsAPIDistributedZkTest.test-seed#[7EE1F80BF1C1289E]) [    ] o.a.s.c.c.ConnectionManager Client is connected to ZooKeeper
   [junit4]   2> 1092949 INFO  (TEST-CollectionsAPIDistributedZkTest.test-seed#[7EE1F80BF1C1289E]) [    ] o.a.s.c.c.SolrZkClient Using default ZkACLProvider
   [junit4]   2> 1092949 INFO  (TEST-CollectionsAPIDistributedZkTest.test-seed#[7EE1F80BF1C1289E]) [    ] o.a.s.s.SolrDispatchFilter Loading solr.xml from SolrHome (not found in ZooKeeper)
   [junit4]   2> 1092949 INFO  (TEST-CollectionsAPIDistributedZkTest.test-seed#[7EE1F80BF1C1289E]) [    ] o.a.s.c.SolrXmlConfig Loading container configuration from /home/jenkins/workspace/Lucene-Solr-6.x-Linux/solr/build/solr-core/test/J1/temp/solr.cloud.CollectionsAPIDistributedZkTest_7EE1F80BF1C1289E-001/control-001/solr.xml
   [junit4]   2> 1092966 INFO  (TEST-CollectionsAPIDistributedZkTest.test-seed#[7EE1F80BF1C1289E]) [    ] o.a.s.c.CorePropertiesLocator Config-defined core root directory: /home/jenkins/workspace/Lucene-Solr-6.x-Linux/solr/build/solr-core/test/J1/../../../../../../../../../home/jenkins/workspace/Lucene-Solr-6.x-Linux/solr/build/solr-core/test/J1/temp/solr.cloud.CollectionsAPIDistributedZkTest_7EE1F80BF1C1289E-001/control-001/cores
   [junit4]   2> 1092966 INFO  (TEST-CollectionsAPIDistributedZkTest.test-seed#[7EE1F80BF1C1289E]) [    ] o.a.s.c.CoreContainer New CoreContainer 7201102
   [junit4]   2> 1092966 INFO  (TEST-CollectionsAPIDistributedZkTest.test-seed#[7EE1F80BF1C1289E]) [    ] o.a.s.c.CoreContainer Loading cores into CoreContainer [instanceDir=/home/jenkins/workspace/Lucene-Solr-6.x-Linux/solr/build/solr-core/test/J1/temp/solr.cloud.CollectionsAPIDistributedZkTest_7EE1F80BF1C1289E-001/control-001]
   [junit4]   2> 1092966 WARN  (TEST-CollectionsAPIDistributedZkTest.test-seed#[7EE1F80BF1C1289E]) [    ] o.a.s.c.CoreContainer Couldn't add files from /home/jenkins/workspace/Lucene-Solr-6.x-Linux/solr/build/solr-core/test/J1/temp/solr.cloud.CollectionsAPIDistributedZkTest_7EE1F80BF1C1289E-001/control-001/lib to classpath: /home/jenkins/workspace/Lucene-Solr-6.x-Linux/solr/build/solr-core/test/J1/temp/solr.cloud.CollectionsAPIDistributedZkTest_7EE1F80BF1C1289E-001/control-001/lib
   [junit4]   2> 1092967 INFO  (TEST-CollectionsAPIDistributedZkTest.test-seed#[7EE1F80BF1C1289E]) [    ] o.a.s.h.c.HttpShardHandlerFactory created with socketTimeout : 90000,urlScheme : ,connTimeout : 15000,maxConnectionsPerHost : 20,maxConnections : 10000,corePoolSize : 0,maximumPoolSize : 2147483647,maxThreadIdleTime : 5,sizeOfQueue : -1,fairnessPolicy : false,useRetries : false,
   [junit4]   2> 1092967 INFO  (TEST-CollectionsAPIDistributedZkTest.test-seed#[7EE1F80BF1C1289E]) [    ] o.a.s.u.UpdateShardHandler Creating UpdateShardHandler HTTP client with params: socketTimeout=340000&connTimeout=45000&retry=true
   [junit4]   2> 1092968 INFO  (TEST-CollectionsAPIDistributedZkTest.test-seed#[7EE1F80BF1C1289E]) [    ] o.a.s.l.LogWatcher SLF4J impl is org.slf4j.impl.Log4jLoggerFactory
   [junit4]   2> 1092968 INFO  (TEST-CollectionsAPIDistributedZkTest.test-seed#[7EE1F80BF1C1289E]) [    ] o.a.s.l.LogWatcher Registering Log Listener [Log4j (org.slf4j.impl.Log4jLoggerFactory)]
   [junit4]   2> 1092968 INFO  (TEST-CollectionsAPIDistributedZkTest.test-seed#[7EE1F80BF1C1289E]) [    ] o.a.s.c.ZkContainer Zookeeper client=127.0.0.1:33562/solr
   [junit4]   2> 1092968 INFO  (TEST-CollectionsAPIDistributedZkTest.test-seed#[7EE1F80BF1C1289E]) [    ] o.a.s.c.ZkController zkHost includes chroot
   [junit4]   2> 1092968 INFO  (TEST-CollectionsAPIDistributedZkTest.test-seed#[7EE1F80BF1C1289E]) [    ] o.a.s.c.c.SolrZkClient Using default ZkCredentialsProvider
   [junit4]   2> 1092968 INFO  (TEST-CollectionsAPIDistributedZkTest.test-seed#[7EE1F80BF1C1289E]) [    ] o.a.s.c.c.ConnectionManager Waiting for client to connect to ZooKeeper
   [junit4]   2> 1092970 INFO  (zkCallback-1071-thread-1) [    ] o.a.s.c.c.ConnectionManager Watcher org.apache.solr.common.cloud.ConnectionManager@4618c0 name:ZooKeeperConnection Watcher:127.0.0.1:33562 got event WatchedEvent state:SyncConnected type:None path:null path:null type:None
   [junit4]   2> 1092970 INFO  (TEST-CollectionsAPIDistributedZkTest.test-seed#[7EE1F80BF1C1289E]) [    ] o.a.s.c.c.ConnectionManager Client is connected to ZooKeeper
   [junit4]   2> 1092970 INFO  (TEST-CollectionsAPIDistributedZkTest.test-seed#[7EE1F80BF1C1289E]) [    ] o.a.s.c.c.SolrZkClient Using default ZkACLProvider
   [junit4]   2> 1092971 INFO  (TEST-CollectionsAPIDistributedZkTest.test-seed#[7EE1F80BF1C1289E]) [    ] o.a.s.c.ZkController Added new OnReconnect listener org.apache.solr.cloud.ZkController$$Lambda$101/715299@1b855ab
   [junit4]   2> 1092971 INFO  (TEST-CollectionsAPIDistributedZkTest.test-seed#[7EE1F80BF1C1289E]) [    ] o.a.s.c.c.ConnectionManager Waiting for client to connect to ZooKeeper
   [junit4]   2> 1092971 INFO  (zkCallback-1072-thread-1) [    ] o.a.s.c.c.ConnectionManager Watcher org.apache.solr.common.cloud.ConnectionManager@15bcad2 name:ZooKeeperConnection Watcher:127.0.0.1:33562/solr got event WatchedEvent state:SyncConnected type:None path:null path:null type:None
   [junit4]   2> 1092971 INFO  (TEST-CollectionsAPIDistributedZkTest.test-seed#[7EE1F80BF1C1289E]) [    ] o.a.s.c.c.ConnectionManager Client is connected to ZooKeeper
   [junit4]   2> 1092972 INFO  (TEST-CollectionsAPIDistributedZkTest.test-seed#[7EE1F80BF1C1289E]) [    ] o.a.s.c.c.SolrZkClient makePath: /overseer/queue
   [junit4]   2> 1092972 INFO  (TEST-CollectionsAPIDistributedZkTest.test-seed#[7EE1F80BF1C1289E]) [    ] o.a.s.c.c.SolrZkClient makePath: /overseer/collection-queue-work
   [junit4]   2> 1092973 INFO  (TEST-CollectionsAPIDistributedZkTest.test-seed#[7EE1F80BF1C1289E]) [    ] o.a.s.c.c.SolrZkClient makePath: /overseer/collection-map-running
   [junit4]   2> 1092974 INFO  (TEST-CollectionsAPIDistributedZkTest.test-seed#[7EE1F80BF1C1289E]) [    ] o.a.s.c.c.SolrZkClient makePath: /overseer/collection-map-completed
   [junit4]   2> 1092974 INFO  (TEST-CollectionsAPIDistributedZkTest.test-seed#[7EE1F80BF1C1289E]) [    ] o.a.s.c.c.SolrZkClient makePath: /overseer/collection-map-failure
   [junit4]   2> 1092975 INFO  (TEST-CollectionsAPIDistributedZkTest.test-seed#[7EE1F80BF1C1289E]) [    ] o.a.s.c.c.SolrZkClient makePath: /live_nodes
   [junit4]   2> 1092975 INFO  (TEST-CollectionsAPIDistributedZkTest.test-seed#[7EE1F80BF1C1289E]) [    ] o.a.s.c.c.SolrZkClient makePath: /aliases.json
   [junit4]   2> 1092975 INFO  (TEST-CollectionsAPIDistributedZkTest.test-seed#[7EE1F80BF1C1289E]) [    ] o.a.s.c.c.SolrZkClient makePath: /clusterstate.json
   [junit4]   2> 1092976 INFO  (TEST-CollectionsAPIDistributedZkTest.test-seed#[7EE1F80BF1C1289E]) [    ] o.a.s.c.c.SolrZkClient makePath: /security.json
   [junit4]   2> 1092976 INFO  (TEST-CollectionsAPIDistributedZkTest.test-seed#[7EE1F80BF1C1289E]) [    ] o.a.s.c.c.ZkStateReader Updating cluster state from ZooKeeper... 
   [junit4]   2> 1092976 INFO  (TEST-CollectionsAPIDistributedZkTest.test-seed#[7EE1F80BF1C1289E]) [    ] o.a.s.c.c.ZkStateReader Updated live nodes from ZooKeeper... (0) -> (0)
   [junit4]   2> 1092977 INFO  (TEST-CollectionsAPIDistributedZkTest.test-seed#[7EE1F80BF1C1289E]) [    ] o.a.s.c.c.SolrZkClient makePath: /overseer_elect
   [junit4]   2> 1092977 INFO  (TEST-CollectionsAPIDistributedZkTest.test-seed#[7EE1F80BF1C1289E]) [    ] o.a.s.c.c.SolrZkClient makePath: /overseer_elect/election
   [junit4]   2> 1092977 INFO  (TEST-CollectionsAPIDistributedZkTest.test-seed#[7EE1F80BF1C1289E]) [    ] o.a.s.c.Overseer Overseer (id=null) closing
   [junit4]   2> 1092978 INFO  (TEST-CollectionsAPIDistributedZkTest.test-seed#[7EE1F80BF1C1289E]) [    ] o.a.s.c.LeaderElector Joined leadership election with path: /overseer_elect/election/95869875137806342-127.0.0.1:42222__tq%2Fq-n_0000000000
   [junit4]   2> 1092978 INFO  (TEST-CollectionsAPIDistributedZkTest.test-seed#[7EE1F80BF1C1289E]) [    ] o.a.s.c.OverseerElectionContext I am going to be the leader 127.0.0.1:42222__tq%2Fq
   [junit4]   2> 1092978 INFO  (TEST-CollectionsAPIDistributedZkTest.test-seed#[7EE1F80BF1C1289E]) [    ] o.a.s.c.c.SolrZkClient makePath: /overseer_elect/leader
   [junit4]   2> 1092978 INFO  (TEST-CollectionsAPIDistributedZkTest.test-seed#[7EE1F80BF1C1289E]) [    ] o.a.s.c.Overseer Overseer (id=95869875137806342-127.0.0.1:42222__tq%2Fq-n_0000000000) starting
   [junit4]   2> 1092979 INFO  (TEST-CollectionsAPIDistributedZkTest.test-seed#[7EE1F80BF1C1289E]) [    ] o.a.s.c.c.SolrZkClient makePath: /overseer/queue-work
   [junit4]   2> 1092981 INFO  (TEST-CollectionsAPIDistributedZkTest.test-seed#[7EE1F80BF1C1289E]) [    ] o.a.s.c.OverseerAutoReplicaFailoverThread Starting OverseerAutoReplicaFailoverThread autoReplicaFailoverWorkLoopDelay=10000 autoReplicaFailoverWaitAfterExpiration=10000 autoReplicaFailoverBadNodeExpiration=60000
   [junit4]   2> 1092981 INFO  (OverseerCollectionConfigSetProcessor-95869875137806342-127.0.0.1:42222__tq%2Fq-n_0000000000) [    ] o.a.s.c.OverseerTaskProcessor Process current queue of overseer operations
   [junit4]   2> 1092981 INFO  (OverseerStateUpdate-95869875137806342-127.0.0.1:42222__tq%2Fq-n_0000000000) [    ] o.a.s.c.Overseer Starting to work on the main queue
   [junit4]   2> 1092981 INFO  (TEST-CollectionsAPIDistributedZkTest.test-seed#[7EE1F80BF1C1289E]) [    ] o.a.s.c.ZkController Register node as live in ZooKeeper:/live_nodes/127.0.0.1:42222__tq%2Fq
   [junit4]   2> 1092982 INFO  (TEST-CollectionsAPIDistributedZkTest.test-seed#[7EE1F80BF1C1289E]) [    ] o.a.s.c.c.SolrZkClient makePath: /live_nodes/127.0.0.1:42222__tq%2Fq
   [junit4]   2> 1092982 INFO  (OverseerStateUpdate-95869875137806342-127.0.0.1:42222__tq%2Fq-n_0000000000) [    ] o.a.s.c.c.ZkStateReader Updated live nodes from ZooKeeper... (0) -> (0)
   [junit4]   2> 1092983 INFO  (zkCallback-1072-thread-1) [    ] o.a.s.c.c.ZkStateReader A live node change: [WatchedEvent state:SyncConnected type:NodeChildrenChanged path:/live_nodes], has occurred - updating... (live nodes size: [0])
   [junit4]   2> 1092983 INFO  (zkCallback-1072-thread-1) [    ] o.a.s.c.c.ZkStateReader Updated live nodes from ZooKeeper... (0) -> (1)
   [junit4]   2> 1092998 INFO  (TEST-CollectionsAPIDistributedZkTest.test-seed#[7EE1F80BF1C1289E]) [    ] o.a.s.c.CoreContainer Security conf doesn't exist. Skipping setup for authorization module.
   [junit4]   2> 1092998 INFO  (TEST-CollectionsAPIDistributedZkTest.test-seed#[7EE1F80BF1C1289E]) [    ] o.a.s.c.CoreContainer No authentication plugin used.
   [junit4]   2> 1092999 INFO  (TEST-CollectionsAPIDistributedZkTest.test-seed#[7EE1F80BF1C1289E]) [    ] o.a.s.c.CorePropertiesLocator Looking for core definitions underneath /home/jenkins/workspace/Lucene-Solr-6.x-Linux/solr/build/solr-core/test/J1/../../../../../../../../../home/jenkins/workspace/Lucene-Solr-6.x-Linux/solr/build/solr-core/test/J1/temp/solr.cloud.CollectionsAPIDistributedZkTest_7EE1F80BF1C1289E-001/control-001/cores
   [junit4]   2> 1092999 INFO  (TEST-CollectionsAPIDistributedZkTest.test-seed#[7EE1F80BF1C1289E]) [    ] o.a.s.c.CoreDescriptor Created CoreDescriptor: {name=collection1, config=solrconfig.xml, transient=false, schema=schema.xml, loadOnStartup=true, configSetProperties=configsetprops.json, collection=control_collection, coreNodeName=, dataDir=data/, shard=}
   [junit4]   2> 1092999 INFO  (TEST-CollectionsAPIDistributedZkTest.test-seed#[7EE1F80BF1C1289E]) [    ] o.a.s.c.CorePropertiesLocator Found core collection1 in /home/jenkins/workspace/Lucene-Solr-6.x-Linux/solr/build/solr-core/test/J1/../../../../../../../../../home/jenkins/workspace/Lucene-Solr-6.x-Linux/solr/build/solr-core/test/J1/temp/solr.cloud.CollectionsAPIDistributedZkTest_7EE1F80BF1C1289E-001/control-001/cores/collection1
   [junit4]   2> 1092999 INFO  (TEST-CollectionsAPIDistributedZkTest.test-seed#[7EE1F80BF1C1289E]) [    ] o.a.s.c.CorePropertiesLocator Found 1 core definitions
   [junit4]   2> 1093000 INFO  (TEST-CollectionsAPIDistributedZkTest.test-seed#[7EE1F80BF1C1289E]) [    ] o.a.s.s.SolrDispatchFilter user.dir=/home/jenkins/workspace/Lucene-Solr-6.x-Linux/solr/build/solr-core/test/J1
   [junit4]   2> 1093000 INFO  (TEST-CollectionsAPIDistributedZkTest.test-seed#[7EE1F80BF1C1289E]) [    ] o.a.s.s.SolrDispatchFilter SolrDispatchFilter.init() done
   [junit4]   2> 1093000 INFO  (coreLoadExecutor-3325-thread-1) [    ] o.a.s.c.ZkController publishing state=down
   [junit4]   2> 1093000 INFO  (coreLoadExecutor-3325-thread-1) [    ] o.a.s.c.ZkController numShards not found on descriptor - reading it from system property
   [junit4]   2> 1093000 INFO  (coreLoadExecutor-3325-thread-1) [    ] o.a.s.c.ZkController Collection control_collection not visible yet, but flagging it so a watch is registered when it becomes visible
   [junit4]   2> 1093000 INFO  (coreLoadExecutor-3325-thread-1) [    ] o.a.s.c.c.ZkStateReader addZkWatch [control_collection]
   [junit4]   2> 1093000 INFO  (OverseerStateUpdate-95869875137806342-127.0.0.1:42222__tq%2Fq-n_0000000000) [    ] o.a.s.c.Overseer processMessage: queueSize: 1, message = {
   [junit4]   2>   "core":"collection1",
   [junit4]   2>   "roles":null,
   [junit4]   2>   "base_url":"http://127.0.0.1:42222/_tq/q",
   [junit4]   2>   "node_name":"127.0.0.1:42222__tq%2Fq",
   [junit4]   2>   "numShards":"1",
   [junit4]   2>   "state":"down",
   [junit4]   2>   "shard":null,
   [junit4]   2>   "collection":"control_collection",
   [junit4]   2>   "operation":"state"} current state version: 0
   [junit4]   2> 1093000 INFO  (coreLoadExecutor-3325-thread-1) [    ] o.a.s.c.c.ZkStateReader Deleting data for [control_collection]
   [junit4]   2> 1093001 INFO  (OverseerStateUpdate-95869875137806342-127.0.0.1:42222__tq%2Fq-n_0000000000) [    ] o.a.s.c.o.ReplicaMutator Update state numShards=1 message={
   [junit4]   2>   "core":"collection1",
   [junit4]   2>   "roles":null,
   [junit4]   2>   "base_url":"http://127.0.0.1:42222/_tq/q",
   [junit4]   2>   "node_name":"127.0.0.1:42222__tq%2Fq",
   [junit4]   2>   "numShards":"1",
   [junit4]   2>   "state":"down",
   [junit4]   2>   "shard":null,
   [junit4]   2>   "collection":"control_collection",
   [junit4]   2>   "operation":"state"}
   [junit4]   2> 1093001 INFO  (coreLoadExecutor-3325-thread-1) [    ] o.a.s.c.ZkController look for our core node name
   [junit4]   2> 1093001 INFO  (OverseerStateUpdate-95869875137806342-127.0.0.1:42222__tq%2Fq-n_0000000000) [    ] o.a.s.c.o.ClusterStateMutator building a new cName: control_collection
   [junit4]   2> 1093001 INFO  (OverseerStateUpdate-95869875137806342-127.0.0.1:42222__tq%2Fq-n_0000000000) [    ] o.a.s.c.o.ReplicaMutator Assigning new node to shard shard=shard1
   [junit4]   2> 1093001 INFO  (zkCallback-1072-thread-1) [    ] o.a.s.c.c.ZkStateReader A cluster state change: [WatchedEvent state:SyncConnected type:NodeDataChanged path:/clusterstate.json], has occurred - updating... (live nodes size: [1])
   [junit4]   2> 1094001 INFO  (coreLoadExecutor-3325-thread-1) [    ] o.a.s.c.ZkController waiting to find shard id in clusterstate for collection1
   [junit4]   2> 1094001 INFO  (coreLoadExecutor-3325-thread-1) [    ] o.a.s.c.ZkController Check for collection zkNode:control_collection
   [junit4]   2> 1094001 INFO  (coreLoadExecutor-3325-thread-1) [    ] o.a.s.c.ZkController Collection zkNode exists
   [junit4]   2> 1094001 INFO  (coreLoadExecutor-3325-thread-1) [    ] o.a.s.c.c.ZkStateReader Load collection config from: [/collections/control_collection]
   [junit4]   2> 1094002 INFO  (coreLoadExecutor-3325-thread-1) [    ] o.a.s.c.c.ZkStateReader path=[/collections/control_collection] [configName]=[conf1] specified config exists in ZooKeeper
   [junit4]   2> 1094002 INFO  (coreLoadExecutor-3325-thread-1) [    ] o.a.s.c.SolrResourceLoader new SolrResourceLoader for directory: '/home/jenkins/workspace/Lucene-Solr-6.x-Linux/solr/build/solr-core/test/J1/temp/solr.cloud.CollectionsAPIDistributedZkTest_7EE1F80BF1C1289E-001/control-001/cores/collection1'
   [junit4]   2> 1094002 INFO  (coreLoadExecutor-3325-thread-1) [    ] o.a.s.c.SolrResourceLoader JNDI not configured for solr (NoInitialContextEx)
   [junit4]   2> 1094002 INFO  (coreLoadExecutor-3325-thread-1) [    ] o.a.s.c.SolrResourceLoader solr home defaulted to 'solr/' (could not find system property or JNDI)
   [junit4]   2> 1094003 INFO  (coreLoadExecutor-3325-thread-1) [    ] o.a.s.c.Config loaded config solrconfig.xml with version 0 
   [junit4]   2> 1094009 INFO  (coreLoadExecutor-3325-thread-1) [    ] o.a.s.c.SolrConfig current version of requestparams : -1
   [junit4]   2> 1094014 INFO  (coreLoadExecutor-3325-thread-1) [    ] o.a.s.c.SolrConfig Using Lucene MatchVersion: 6.1.0
   [junit4]   2> 1094021 INFO  (coreLoadExecutor-3325-thread-1) [    ] o.a.s.c.SolrConfig Loaded SolrConfig: solrconfig.xml
   [junit4]   2> 1094028 INFO  (coreLoadExecutor-3325-thread-1) [    ] o.a.s.s.IndexSchema [collection1] Schema name=test
   [junit4]   2> 1094114 INFO  (coreLoadExecutor-3325-thread-1) [    ] o.a.s.s.OpenExchangeRatesOrgProvider Initialized with rates=open-exchange-rates.json, refreshInterval=1440.
   [junit4]   2> 1094120 INFO  (coreLoadExecutor-3325-thread-1) [    ] o.a.s.s.IndexSchema default search field in schema is text
   [junit4]   2> 1094122 INFO  (coreLoadExecutor-3325-thread-1) [    ] o.a.s.s.IndexSchema unique key field: id
   [junit4]   2> 1094127 INFO  (coreLoadExecutor-3325-thread-1) [    ] o.a.s.s.FileExchangeRateProvider Reloading exchange rates from file currency.xml
   [junit4]   2> 1094129 INFO  (coreLoadExecutor-3325-thread-1) [    ] o.a.s.s.FileExchangeRateProvider Reloading exchange rates from file currency.xml
   [junit4]   2> 1094130 INFO  (coreLoadExecutor-3325-thread-1) [    ] o.a.s.s.OpenExchangeRatesOrgProvider Reloading exchange rates from open-exchange-rates.json
   [junit4]   2> 1094131 INFO  (coreLoadExecutor-3325-thread-1) [    ] o.a.s.s.OpenExchangeRatesOrgProvider Reloading exchange rates from open-exchange-rates.json
   [junit4]   2> 1094132 INFO  (coreLoadExecutor-3325-thread-1) [    ] o.a.s.c.ConfigSetProperties Did not find ConfigSet properties, assuming default properties: Can't find resource 'configsetprops.json' in classpath or '/configs/conf1', cwd=/home/jenkins/workspace/Lucene-Solr-6.x-Linux/solr/build/solr-core/test/J1
   [junit4]   2> 1094132 INFO  (coreLoadExecutor-3325-thread-1) [    ] o.a.s.c.CoreContainer Creating SolrCore 'collection1' using configuration from collection control_collection
   [junit4]   2> 1094132 INFO  (coreLoadExecutor-3325-thread-1) [    ] o.a.s.c.SolrCore org.apache.solr.core.MockDirectoryFactory
   [junit4]   2> 1094132 INFO  (coreLoadExecutor-3325-thread-1) [    ] o.a.s.c.SolrCore [[collection1] ] Opening new SolrCore at [/home/jenkins/workspace/Lucene-Solr-6.x-Linux/solr/build/solr-core/test/J1/temp/solr.cloud.CollectionsAPIDistributedZkTest_7EE1F80BF1C1289E-001/control-001/cores/collection1], dataDir=[/home/jenkins/workspace/Lucene-Solr-6.x-Linux/solr/build/solr-core/test/J1/../../../../../../../../../home/jenkins/workspace/Lucene-Solr-6.x-Linux/solr/build/solr-core/test/J1/temp/solr.cloud.CollectionsAPIDistributedZkTest_7EE1F80BF1C1289E-001/control-001/cores/collection1/data/]
   [junit4]   2> 1094133 INFO  (coreLoadExecutor-3325-thread-1) [    ] o.a.s.c.JmxMonitoredMap JMX monitoring is enabled. Adding Solr mbeans to JMX Server: com.sun.jmx.mbeanserver.JmxMBeanServer@18dc696
   [junit4]   2> 1094133 INFO  (coreLoadExecutor-3325-thread-1) [    ] o.a.s.c.CachingDirectoryFactory return new directory for /home/jenkins/workspace/Lucene-Solr-6.x-Linux/solr/build/solr-core/test/J1/../../../../../../../../../home/jenkins/workspace/Lucene-Solr-6.x-Linux/solr/build/solr-core/test/J1/temp/solr.cloud.CollectionsAPIDistributedZkTest_7EE1F80BF1C1289E-001/control-001/cores/collection1/data
   [junit4]   2> 1094134 INFO  (coreLoadExecutor-3325-thread-1) [    ] o.a.s.c.SolrCore New index directory detected: old=null new=/home/jenkins/workspace/Lucene-Solr-6.x-Linux/solr/build/solr-core/test/J1/../../../../../../../../../home/jenkins/workspace/Lucene-Solr-6.x-Linux/solr/build/solr-core/test/J1/temp/solr.cloud.CollectionsAPIDistributedZkTest_7EE1F80BF1C1289E-001/control-001/cores/collection1/data/index/
   [junit4]   2> 1094134 WARN  (coreLoadExecutor-3325-thread-1) [    ] o.a.s.c.SolrCore [collection1] Solr index directory '/home/jenkins/workspace/Lucene-Solr-6.x-Linux/solr/build/solr-core/test/J1/../../../../../../../../../home/jenkins/workspace/Lucene-Solr-6.x-Linux/solr/build/solr-core/test/J1/temp/solr.cloud.CollectionsAPIDistributedZkTest_7EE1F80BF1C1289E-001/control-001/cores/collection1/data/index' doesn't exist. Creating new index...
   [junit4]   2> 1094134 INFO  (coreLoadExecutor-3325-thread-1) [    ] o.a.s.c.CachingDirectoryFactory return new directory for /home/jenkins/workspace/Lucene-Solr-6.x-Linux/solr/build/solr-core/test/J1/../../../../../../../../../home/jenkins/workspace/Lucene-Solr-6.x-Linux/solr/build/solr-core/test/J1/temp/solr.cloud.CollectionsAPIDistributedZkTest_7EE1F80BF1C1289E-001/control-001/cores/collection1/data/index
   [junit4]   2> 1094134 INFO  (coreLoadExecutor-3325-thread-1) [    ] o.a.s.u.RandomMergePolicy RandomMergePolicy wrapping class org.apache.lucene.index.MockRandomMergePolicy: org.apache.lucene.index.MockRandomMergePolicy@8a0de
   [junit4]   2> 1094134 INFO  (coreLoadExecutor-3325-thread-1) [    ] o.a.s.c.SolrDeletionPolicy SolrDeletionPolicy.onCommit: commits: num=1
   [junit4]   2> 	commit{dir=MockDirectoryWrapper(RAMDirectory@11472da lockFactory=org.apache.lucene.store.SingleInstanceLockFactory@1f46ed5),segFN=segments_1,generation=1}
   [junit4]   2> 1094134 INFO  (coreLoadExecutor-3325-thread-1) [    ] o.a.s.c.SolrDeletionPolicy newest commit generation = 1
   [junit4]   2> 1094135 INFO  (OldIndexDirectoryCleanupThreadForCore-collection1) [    ] o.a.s.c.SolrCore Looking for old index directories to cleanup for core collection1 in /home/jenkins/workspace/Lucene-Solr-6.x-Linux/solr/build/solr-core/test/J1/../../../../../../../../../home/jenkins/workspace/Lucene-Solr-6.x-Linux/solr/build/solr-core/test/J1/temp/solr.cloud.CollectionsAPIDistributedZkTest_7EE1F80BF1C1289E-001/control-001/cores/collection1/data/
   [junit4]   2> 1094135 WARN  (OldIndexDirectoryCleanupThreadForCore-collection1) [    ] o.a.s.c.DirectoryFactory /home/jenkins/workspace/Lucene-Solr-6.x-Linux/solr/build/solr-core/test/J1/../../../../../../../../../home/jenkins/workspace/Lucene-Solr-6.x-Linux/solr/build/solr-core/test/J1/temp/solr.cloud.CollectionsAPIDistributedZkTest_7EE1F80BF1C1289E-001/control-001/cores/collection1/data/ does not point to a valid data directory; skipping clean-up of old index directories.
   [junit4]   2> 1094137 INFO  (coreLoadExecutor-3325-thread-1) [    ] o.a.s.u.p.UpdateRequestProcessorChain creating updateRequestProcessorChain "nodistrib"
   [junit4]   2> 1094137 INFO  (coreLoadExecutor-3325-thread-1) [    ] o.a.s.u.p.UpdateRequestProcessorChain creating updateRequestProcessorChain "dedupe"
   [junit4]   2> 1094137 INFO  (coreLoadExecutor-3325-thread-1) [    ] o.a.s.u.p.UpdateRequestProcessorChain inserting DistributedUpdateProcessorFactory into updateRequestProcessorChain "dedupe"
   [junit4]   2> 1094137 INFO  (coreLoadExecutor-3325-thread-1) [    ] o.a.s.u.p.UpdateRequestProcessorChain creating updateRequestProcessorChain "stored_sig"
   [junit4]   2> 1094137 INFO  (coreLoadExecutor-3325-thread-1) [    ] o.a.s.u.p.UpdateRequestProcessorChain inserting DistributedUpdateProcessorFactory into updateRequestProcessorChain "stored_sig"
   [junit4]   2> 1094138 INFO  (coreLoadExecutor-3325-thread-1) [    ] o.a.s.u.p.UpdateRequestProcessorChain creating updateRequestProcessorChain "distrib-dup-test-chain-explicit"
   [junit4]   2> 1094138 INFO  (coreLoadExecutor-3325-thread-1) [    ] o.a.s.u.p.UpdateRequestProcessorChain creating updateRequestProcessorChain "distrib-dup-test-chain-implicit"
   [junit4]   2> 1094138 INFO  (coreLoadExecutor-3325-thread-1) [    ] o.a.s.u.p.UpdateRequestProcessorChain inserting DistributedUpdateProcessorFactory into updateRequestProcessorChain "distrib-dup-test-chain-implicit"
   [junit4]   2> 1094138 INFO  (coreLoadExecutor-3325-thread-1) [    ] o.a.s.c.SolrCore no updateRequestProcessorChain defined as default, creating implicit default
   [junit4]   2> 1094138 WARN  (coreLoadExecutor-3325-thread-1) [    ] o.a.s.c.RequestHandlers INVALID paramSet a in requestHandler {type = requestHandler,name = /dump,class = DumpRequestHandler,args = {defaults={a=A,b=B}}}
   [junit4]   2> 1094140 INFO  (coreLoadExecutor-3325-thread-1) [    ] o.a.s.h.l.XMLLoader xsltCacheLifetimeSeconds=60
   [junit4]   2> 1094141 INFO  (coreLoadExecutor-3325-thread-1) [    ] o.a.s.h.l.XMLLoader xsltCacheLifetimeSeconds=60
   [junit4]   2> 1094141 INFO  (coreLoadExecutor-3325-thread-1) [    ] o.a.s.h.l.XMLLoader xsltCacheLifetimeSeconds=60
   [junit4]   2> 1094142 INFO  (coreLoadExecutor-3325-thread-1) [    ] o.a.s.h.l.XMLLoader xsltCacheLifetimeSeconds=60
   [junit4]   2> 1094146 INFO  (coreLoadExecutor-3325-thread-1) [    ] o.a.s.c.RequestHandlers Registered paths: /admin/mbeans,standard,/update/json/docs,/admin/luke,/export,/get,/admin/properties,/update/json,/admin/threads,/dump,/update/csv,/sql,/graph,/admin/segments,/admin/system,/replication,/config,/stream,/schema,/admin/plugins,/admin/logging,/admin/ping,/update,/admin/file
   [junit4]   2> 1094146 INFO  (coreLoadExecutor-3325-thread-1) [    ] o.a.s.c.SolrCore Using default statsCache cache: org.apache.solr.search.stats.LocalStatsCache
   [junit4]   2> 1094146 INFO  (coreLoadExecutor-3325-thread-1) [    ] o.a.s.u.UpdateHandler Using UpdateLog implementation: org.apache.solr.update.UpdateLog
   [junit4]   2> 1094147 INFO  (coreLoadExecutor-3325-thread-1) [    ] o.a.s.u.UpdateLog Initializing UpdateLog: dataDir= defaultSyncLevel=FLUSH numRecordsToKeep=100 maxNumLogsToKeep=10 numVersionBuckets=65536
   [junit4]   2> 1094147 INFO  (coreLoadExecutor-3325-thread-1) [    ] o.a.s.u.CommitTracker Hard AutoCommit: disabled
   [junit4]   2> 1094147 INFO  (coreLoadExecutor-3325-thread-1) [    ] o.a.s.u.CommitTracker Soft AutoCommit: disabled
   [junit4]   2> 1094148 INFO  (coreLoadExecutor-3325-thread-1) [    ] o.a.s.u.RandomMergePolicy RandomMergePolicy wrapping class org.apache.lucene.index.LogDocMergePolicy: [LogDocMergePolicy: minMergeSize=1000, mergeFactor=30, maxMergeSize=9223372036854775807, maxMergeSizeForForcedMerge=9223372036854775807, calibrateSizeByDeletes=false, maxMergeDocs=2147483647, maxCFSSegmentSizeMB=8.796093022207999E12, noCFSRatio=1.0]
   [junit4]   2> 1094148 INFO  (coreLoadExecutor-3325-thread-1) [    ] o.a.s.c.SolrDeletionPolicy SolrDeletionPolicy.onInit: commits: num=1
   [junit4]   2> 	commit{dir=MockDirectoryWrapper(RAMDirectory@11472da lockFactory=org.apache.lucene.store.SingleInstanceLockFactory@1f46ed5),segFN=segments_1,generation=1}
   [junit4]   2> 1094148 INFO  (coreLoadExecutor-3325-thread-1) [    ] o.a.s.c.SolrDeletionPolicy newest commit generation = 1
   [junit4]   2> 1094148 INFO  (coreLoadExecutor-3325-thread-1) [    ] o.a.s.s.SolrIndexSearcher Opening [Searcher@65a02c[collection1] main]
   [junit4]   2> 1094148 INFO  (coreLoadExecutor-3325-thread-1) [    ] o.a.s.c.c.ZkStateReader Load collection config from: [/collections/control_collection]
   [junit4]   2> 1094149 INFO  (coreLoadExecutor-3325-thread-1) [    ] o.a.s.c.c.ZkStateReader path=[/collections/control_collection] [configName]=[conf1] specified config exists in ZooKeeper
   [junit4]   2> 1094149 INFO  (coreLoadExecutor-3325-thread-1) [    ] o.a.s.r.ManagedResourceStorage Setting up ZooKeeper-based storage for the RestManager with znodeBase: /configs/conf1
   [junit4]   2> 1094149 INFO  (coreLoadExecutor-3325-thread-1) [    ] o.a.s.r.ManagedResourceStorage Configured ZooKeeperStorageIO with znodeBase: /configs/conf1
   [junit4]   2> 1094149 INFO  (coreLoadExecutor-3325-thread-1) [    ] o.a.s.r.RestManager Initializing RestManager with initArgs: {}
   [junit4]   2> 1094149 INFO  (coreLoadExecutor-3325-thread-1) [    ] o.a.s.r.ManagedResourceStorage Reading _rest_managed.json using ZooKeeperStorageIO:path=/configs/conf1
   [junit4]   2> 1094149 INFO  (coreLoadExecutor-3325-thread-1) [    ] o.a.s.r.ManagedResourceStorage No data found for znode /configs/conf1/_rest_managed.json
   [junit4]   2> 1094149 INFO  (coreLoadExecutor-3325-thread-1) [    ] o.a.s.r.ManagedResourceStorage Loaded null at path _rest_managed.json using ZooKeeperStorageIO:path=/configs/conf1
   [junit4]   2> 1094149 INFO  (coreLoadExecutor-3325-thread-1) [    ] o.a.s.r.RestManager Initializing 0 registered ManagedResources
   [junit4]   2> 1094149 INFO  (coreLoadExecutor-3325-thread-1) [    ] o.a.s.h.ReplicationHandler Commits will be reserved for  10000
   [junit4]   2> 1094150 INFO  (searcherExecutor-3326-thread-1) [    ] o.a.s.c.SolrCore [collection1] Registered new searcher Searcher@65a02c[collection1] main{ExitableDirectoryReader(UninvertingDirectoryReader())}
   [junit4]   2> 1094150 INFO  (coreLoadExecutor-3325-thread-1) [    ] o.a.s.u.UpdateLog Looking up max value of version field to seed version buckets
   [junit4]   2> 1094150 INFO  (coreLoadExecutor-3325-thread-1) [    ] o.a.s.u.VersionInfo Refreshing highest value of _version_ for 65536 version buckets from index
   [junit4]   2> 1094150 INFO  (coreLoadExecutor-3325-thread-1) [    ] o.a.s.u.VersionInfo No terms found for _version_, cannot seed version bucket highest value from index
   [junit4]   2> 1094150 INFO  (coreLoadExecutor-3325-thread-1) [    ] o.a.s.u.UpdateLog Could not find max version in index or recent updates, using new clock 1533918003724288000
   [junit4]   2> 1094152 INFO  (coreLoadExecutor-3325-thread-1) [    ] o.a.s.u.UpdateLog Took 1.0ms to seed version buckets with highest version 1533918003724288000
   [junit4]   2> 1094152 INFO  (coreLoadExecutor-3325-thread-1) [    ] o.a.s.c.ZkController watch zkdir /configs/conf1
   [junit4]   2> 1094153 INFO  (coreLoadExecutor-3325-thread-1) [    ] o.a.s.c.CoreContainer registering core: collection1
   [junit4]   2> 1094153 INFO  (coreZkRegister-3319-thread-1) [    ] o.a.s.c.ZkController Register replica - core:collection1 address:http://127.0.0.1:42222/_tq/q collection:control_collection shard:shard1
   [junit4]   2> 1094153 INFO  (coreZkRegister-3319-thread-1) [    ] o.a.s.c.c.SolrZkClient makePath: /collections/control_collection/leader_elect/shard1/election
   [junit4]   2> 1094154 INFO  (coreZkRegister-3319-thread-1) [    ] o.a.s.c.LeaderElector Joined leadership election with path: /collections/control_collection/leader_elect/shard1/election/95869875137806342-core_node1-n_0000000000
   [junit4]   2> 1094154 INFO  (coreZkRegister-3319-thread-1) [    ] o.a.s.c.ShardLeaderElectionContext Running the leader process for shard=shard1 and weAreReplacement=false and leaderVoteWait=180000
   [junit4]   2> 1094155 INFO  (coreZkRegister-3319-thread-1) [    ] o.a.s.c.ShardLeaderElectionContext Enough replicas found to continue.
   [junit4]   2> 1094155 INFO  (coreZkRegister-3319-thread-1) [    ] o.a.s.c.ShardLeaderElectionContext I may be the new leader - try and sync
   [junit4]   2> 1094155 INFO  (coreZkRegister-3319-thread-1) [    ] o.a.s.c.SyncStrategy Sync replicas to http://127.0.0.1:42222/_tq/q/collection1/
   [junit4]   2> 1094155 INFO  (coreZkRegister-3319-thread-1) [    ] o.a.s.c.SyncStrategy Sync Success - now sync replicas to me
   [junit4]   2> 1094155 INFO  (coreZkRegister-3319-thread-1) [    ] o.a.s.c.SyncStrategy http://127.0.0.1:42222/_tq/q/collection1/ has no replicas
   [junit4]   2> 1094155 INFO  (OverseerStateUpdate-95869875137806342-127.0.0.1:42222__tq%2Fq-n_0000000000) [    ] o.a.s.c.Overseer processMessage: queueSize: 1, message = {
   [junit4]   2>   "operation":"leader",
   [junit4]   2>   "shard":"shard1",
   [junit4]   2>   "collection":"control_collection"} current state version: 1
   [junit4]   2> 1094155 INFO  (coreZkRegister-3319-thread-1) [    ] o.a.s.c.c.SolrZkClient makePath: /collections/control_collection/leaders/shard1
   [junit4]   2> 1094157 INFO  (coreZkRegister-3319-thread-1) [    ] o.a.s.c.ShardLeaderElectionContextBase Creating leader registration node /collections/control_collection/leaders/shard1/leader after winning as /collections/control_collection/leader_elect/shard1/election/95869875137806342-core_node1-n_0000000000
   [junit4]   2> 1094158 INFO  (coreZkRegister-3319-thread-1) [    ] o.a.s.c.ShardLeaderElectionContext I am the new leader: http://127.0.0.1:42222/_tq/q/collection1/ shard1
   [junit4]   2> 1094158 INFO  (OverseerStateUpdate-95869875137806342-127.0.0.1:42222__tq%2Fq-n_0000000000) [    ] o.a.s.c.Overseer processMessage: queueSize: 1, message = {
   [junit4]   2>   "operation":"leader",
   [junit4]   2>   "shard":"shard1",
   [junit4]   2>   "collection":"control_collection",
   [junit4]   2>   "base_url":"http://127.0.0.1:42222/_tq/q",
   [junit4]   2>   "core":"collection1",
   [junit4]   2>   "state":"active"} current state version: 1
   [junit4]   2> 1094260 INFO  (zkCallback-1072-thread-1) [    ] o.a.s.c.c.ZkStateReader A cluster state change: [WatchedEvent state:SyncConnected type:NodeDataChanged path:/clusterstate.json], has occurred - updating... (live nodes size: [1])
   [junit4]   2> 1094309 INFO  (coreZkRegister-3319-thread-1) [    ] o.a.s.c.ZkController We are http://127.0.0.1:42222/_tq/q/collection1/ and leader is http://127.0.0.1:42222/_tq/q/collection1/
   [junit4]   2> 1094309 INFO  (coreZkRegister-3319-thread-1) [    ] o.a.s.c.ZkController No LogReplay needed for core=collection1 baseURL=http://127.0.0.1:42222/_tq/q
   [junit4]   2> 1094309 INFO  (coreZkRegister-3319-thread-1) [    ] o.a.s.c.ZkController I am the leader, no recovery necessary
   [junit4]   2> 1094309 INFO  (coreZkRegister-3319-thread-1) [    ] o.a.s.c.ZkController publishing state=active
   [junit4]   2> 1094309 INFO  (coreZkRegister-3319-thread-1) [    ] o.a.s.c.ZkController numShards not found on descriptor - reading it from system property
   [junit4]   2> 1094310 INFO  (OverseerStateUpdate-95869875137806342-127.0.0.1:42222__tq%2Fq-n_0000000000) [    ] o.a.s.c.Overseer processMessage: queueSize: 1, message = {
   [junit4]   2>   "core":"collection1",
   [junit4]   2>   "core_node_name":"core_node1",
   [junit4]   2>   "roles":null,
   [junit4]   2>   "base_url":"http://127.0.0.1:42222/_tq/q",
   [junit4]   2>   "node_name":"127.0.0.1:42222__tq%2Fq",
   [junit4]   2>   "numShards":"1",
   [junit4]   2>   "state":"active",
   [junit4]   2>   "shard":"shard1",
   [junit4]   2>   "collection":"control_collection",
   [junit4]   2>   "operation":"state"} current state version: 2
   [junit4]   2> 1094310 INFO  (OverseerStateUpdate-95869875137806342-127.0.0.1:42222__tq%2Fq-n_0000000000) [    ] o.a.s.c.o.ReplicaMutator Update state numShards=1 message={
   [junit4]   2>   "core":"collection1",
   [junit4]   2>   "core_node_name":"core_node1",
   [junit4]   2>   "roles":null,
   [junit4]   2>   "base_url":"http://127.0.0.1:42222/_tq/q",
   [junit4]   2>   "node_name":"127.0.0.1:42222__tq%2Fq",
   [junit4]   2>   "numShards":"1",
   [junit4]   2>   "state":"active",
   [junit4]   2>   "shard":"shard1",
   [junit4]   2>   "collection":"control_collection",
   [junit4]   2>   "operation":"state"}
   [junit4]   2> 1094417 INFO  (zkCallback-1072-thread-1) [    ] o.a.s.c.c.ZkStateReader A cluster state change: [WatchedEvent state:SyncConnected type:NodeDataChanged path:/clusterstate.json], has occurred - updating... (live nodes size: [1])
   [junit4]   2> 1094501 INFO  (TEST-CollectionsAPIDistributedZkTest.test-seed#[7EE1F80BF1C1289E]) [    ] o.a.s.c.c.SolrZkClient Using default ZkCredentialsProvider
   [junit4]   2> 1094509 INFO  (TEST-CollectionsAPIDistributedZkTest.test-seed#[7EE1F80BF1C1289E]) [    ] o.a.s.c.c.ConnectionManager Waiting for client to connect to ZooKeeper
   [junit4]   2> 1094517 INFO  (zkCallback-1074-thread-1) [    ] o.a.s.c.c.ConnectionManager Watcher org.apache.solr.common.cloud.ConnectionManager@2eb65d name:ZooKeeperConnection Watcher:127.0.0.1:33562/solr got event WatchedEvent state:SyncConnected type:None path:null path:null type:None
   [junit4]   2> 1094517 INFO  (TEST-CollectionsAPIDistributedZkTest.test-seed#[7EE1F80BF1C1289E]) [    ] o.a.s.c.c.ConnectionManager Client is connected to ZooKeeper
   [junit4]   2> 1094517 INFO  (TEST-CollectionsAPIDistributedZkTest.test-seed#[7EE1F80BF1C1289E]) [    ] o.a.s.c.c.SolrZkClient Using default ZkACLProvider
   [junit4]   2> 1094517 INFO  (TEST-CollectionsAPIDistributedZkTest.test-seed#[7EE1F80BF1C1289E]) [    ] o.a.s.c.c.ZkStateReader Updating cluster state from ZooKeeper... 
   [junit4]   2> 1094518 INFO  (TEST-CollectionsAPIDistributedZkTest.test-seed#[7EE1F80BF1C1289E]) [    ] o.a.s.c.c.ZkStateReader Updated live nodes from ZooKeeper... (0) -> (1)
   [junit4]   2> 1094518 INFO  (TEST-CollectionsAPIDistributedZkTest.test-seed#[7EE1F80BF1C1289E]) [    ] o.a.s.c.ChaosMonkey monkey: init - expire sessions:false cause connection loss:false
   [junit4]   2> 1094519 INFO  (TEST-CollectionsAPIDistributedZkTest.test-seed#[7EE1F80BF1C1289E]) [    ] o.a.s.c.AbstractFullDistribZkTestBase Creating collection1 with stateFormat=2
   [junit4]   2> 1094519 INFO  (TEST-CollectionsAPIDistributedZkTest.test-seed#[7EE1F80BF1C1289E]) [    ] o.a.s.c.c.SolrZkClient Using default ZkCredentialsProvider
   [junit4]   2> 1094519 INFO  (TEST-CollectionsAPIDistributedZkTest.test-seed#[7EE1F80BF1C1289E]) [    ] o.a.s.c.c.ConnectionManager Waiting for client to connect to ZooKeeper
   [junit4]   2> 1094520 INFO  (zkCallback-1075-thread-1) [    ] o.a.s.c.c.ConnectionManager Watcher org.apache.solr.common.cloud.ConnectionManager@146490 name:ZooKeeperConnection Watcher:127.0.0.1:33562/solr got event WatchedEvent state:SyncConnected type:None path:null path:null type:None
   [junit4]   2> 1094520 INFO  (TEST-CollectionsAPIDistributedZkTest.test-seed#[7EE1F80BF1C1289E]) [    ] o.a.s.c.c.ConnectionManager Client is connected to ZooKeeper
   [junit4]   2> 1094521 INFO  (TEST-CollectionsAPIDistributedZkTest.test-seed#[7EE1F80BF1C1289E]) [    ] o.a.s.c.c.SolrZkClient Using default ZkACLProvider
   [junit4]   2> 1094522 INFO  (OverseerStateUpdate-95869875137806342-127.0.0.1:42222__tq%2Fq-n_0000000000) [    ] o.a.s.c.Overseer processMessage: queueSize: 1, message = {
   [junit4]   2>   "operation":"create",
   [junit4]   2>   "name":"collection1",
   [junit4]   2>   "numShards":"2",
   [junit4]   2>   "stateFormat":"2"} current state version: 3
   [junit4]   2> 1094522 INFO  (OverseerStateUpdate-95869875137806342-127.0.0.1:42222__tq%2Fq-n_0000000000) [    ] o.a.s.c.o.ClusterStateMutator building a new cName: collection1
   [junit4]   2> 1094602 INFO  (TEST-CollectionsAPIDistributedZkTest.test-seed#[7EE1F80BF1C1289E]) [    ] o.a.s.SolrTestCaseJ4 Writing core.properties file to /home/jenkins/workspace/Lucene-Solr-6.x-Linux/solr/build/solr-core/test/J1/temp/solr.cloud.CollectionsAPIDistributedZkTest_7EE1F80BF1C1289E-001/shard-1-001/cores/collection1
   [junit4]   2> 1094602 INFO  (TEST-CollectionsAPIDistributedZkTest.test-seed#[7EE1F80BF1C1289E]) [    ] o.a.s.c.AbstractFullDistribZkTestBase create jetty 1 in directory /home/jenkins/workspace/Lucene-Solr-6.x-Linux/solr/build/solr-core/test/J1/temp/solr.cloud.CollectionsAPIDistributedZkTest_7EE1F80BF1C1289E-001/shard-1-001
   [junit4]   2> 1094603 INFO  (TEST-CollectionsAPIDistributedZkTest.test-seed#[7EE1F80BF1C1289E]) [    ] o.e.j.s.Server jetty-9.3.8.v20160314
   [junit4]   2> 1094604 INFO  (TEST-CollectionsAPIDistributedZkTest.test-seed#[7EE1F80BF1C1289E]) [    ] o.e.j.s.h.ContextHandler Started o.e.j.s.ServletContextHandler@1bc3345{/_tq/q,null,AVAILABLE}
   [junit4]   2> 1094605 INFO  (TEST-CollectionsAPIDistributedZkTest.test-seed#[7EE1F80BF1C1289E]) [    ] o.e.j.s.ServerConnector Started ServerConnector@1b0e2a5{HTTP/1.1,[http/1.1]}{127.0.0.1:34439}
   [junit4]   2> 1094605 INFO  (TEST-CollectionsAPIDistributedZkTest.test-seed#[7EE1F80BF1C1289E]) [    ] o.e.j.s.Server Started @1096465ms
   [junit4]   2> 1094605 INFO  (TEST-CollectionsAPIDistributedZkTest.test-seed#[7EE1F80BF1C1289E]) [    ] o.a.s.c.s.e.JettySolrRunner Jetty properties: {solr.data.dir=/home/jenkins/workspace/Lucene-Solr-6.x-Linux/solr/build/solr-core/test/J1/temp/solr.cloud.CollectionsAPIDistributedZkTest_7EE1F80BF1C1289E-001/tempDir-001/jetty1, solrconfig=solrconfig.xml, hostContext=/_tq/q, hostPort=34439, coreRootDirectory=/home/jenkins/workspace/Lucene-Solr-6.x-Linux/solr/build/solr-core/test/J1/../../../../../../../../../home/jenkins/workspace/Lucene-Solr-6.x-Linux/solr/build/solr-core/test/J1/temp/solr.cloud.CollectionsAPIDistributedZkTest_7EE1F80BF1C1289E-001/shard-1-001/cores}
   [junit4]   2> 1094605 INFO  (TEST-CollectionsAPIDistributedZkTest.test-seed#[7EE1F80BF1C1289E]) [    ] o.a.s.s.SolrDispatchFilter SolrDispatchFilter.init(): jdk.internal.loader.ClassLoaders$AppClassLoader@a4a92b
   [junit4]   2> 1094605 INFO  (TEST-CollectionsAPIDistributedZkTest.test-seed#[7EE1F80BF1C1289E]) [    ] o.a.s.c.SolrResourceLoader new SolrResourceLoader for directory: '/home/jenkins/workspace/Lucene-Solr-6.x-Linux/solr/build/solr-core/test/J1/temp/solr.cloud.CollectionsAPIDistributedZkTest_7EE1F80BF1C1289E-001/shard-1-001'
   [junit4]   2> 1094606 INFO  (TEST-CollectionsAPIDistributedZkTest.test-seed#[7EE1F80BF1C1289E]) [    ] o.a.s.c.SolrResourceLoader JNDI not configured for solr (NoInitialContextEx)
   [junit4]   2> 1094606 INFO  (TEST-CollectionsAPIDistributedZkTest.test-seed#[7EE1F80BF1C1289E]) [    ] o.a.s.c.SolrResourceLoader solr home defaulted to 'solr/' (could not find system property or JNDI)
   [junit4]   2> 1094606 INFO  (TEST-CollectionsAPIDistributedZkTest.test-seed#[7EE1F80BF1C1289E]) [    ] o.a.s.c.c.SolrZkClient Using default ZkCredentialsProvider
   [junit4]   2> 1094606 INFO  (TEST-CollectionsAPIDistributedZkTest.test-seed#[7EE1F80BF1C1289E]) [    ] o.a.s.c.c.ConnectionManager Waiting for client to connect to ZooKeeper
   [junit4]   2> 1094607 INFO  (zkCallback-1076-thread-1) [    ] o.a.s.c.c.ConnectionManager Watcher org.apache.solr.common.cloud.ConnectionManager@1dfbe6b name:ZooKeeperConnection Watcher:127.0.0.1:33562/solr got event WatchedEvent state:SyncConnected type:None path:null path:null type:None
   [junit4]   2> 1094607 INFO  (TEST-CollectionsAPIDistributedZkTest.test-seed#[7EE1F80BF1C1289E]) [    ] o.a.s.c.c.ConnectionManager Client is connected to ZooKeeper
   [junit4]   2> 1094607 INFO  (TEST-CollectionsAPIDistributedZkTest.test-seed#[7EE1F80BF1C1289E]) [    ] o.a.s.c.c.SolrZkClient Using default ZkACLProvider
   [junit4]   2> 1094608 INFO  (TEST-CollectionsAPIDistributedZkTest.test-seed#[7EE1F80BF1C1289E]) [    ] o.a.s.s.SolrDispatchFilter Loading solr.xml from SolrHome (not found in ZooKeeper)
   [junit4]   2> 1094608 INFO  (TEST-CollectionsAPIDistributedZkTest.test-seed#[7EE1F80BF1C1289E]) [    ] o.a.s.c.SolrXmlConfig Loading container configuration from /home/jenkins/workspace/Lucene-Solr-6.x-Linux/solr/build/solr-core/test/J1/temp/solr.cloud.CollectionsAPIDistributedZkTest_7EE1F80BF1C1289E-001/shard-1-001/solr.xml
   [junit4]   2> 1094613 INFO  (TEST-CollectionsAPIDistributedZkTest.test-seed#[7EE1F80BF1C1289E]) [    ] o.a.s.c.CorePropertiesLocator Config-defined core root directory: /home/jenkins/workspace/Lucene-Solr-6.x-Linux/solr/build/solr-core/test/J1/../../../../../../../../../home/jenkins/workspace/Lucene-Solr-6.x-Linux/solr/build/solr-core/test/J1/temp/solr.cloud.CollectionsAPIDistributedZkTest_7EE1F80BF1C1289E-001/shard-1-001/cores
   [junit4]   2> 1094613 INFO  (TEST-CollectionsAPIDistributedZkTest.test-seed#[7EE1F80BF1C1289E]) [    ] o.a.s.c.CoreContainer New CoreContainer 8762542
   [junit4]   2> 1094613 INFO  (TEST-CollectionsAPIDistributedZkTest.test-seed#[7EE1F80BF1C1289E]) [    ] o.a.s.c.CoreContainer Loading cores into CoreContainer [instanceDir=/home/jenkins/workspace/Lucene-Solr-6.x-Linux/solr/build/solr-core/test/J1/temp/solr.cloud.CollectionsAPIDistributedZkTest_7EE1F80BF1C1289E-001/shard-1-001]
   [junit4]   2> 1094613 WARN  (TEST-CollectionsAPIDistributedZkTest.test-seed#[7EE1F80BF1C1289E]) [    ] o.a.s.c.CoreContainer Couldn't add files from /home/jenkins/workspace/Lucene-Solr-6.x-Linux/solr/build/solr-core/test/J1/temp/solr.cloud.CollectionsAPIDistributedZkTest_7EE1F80BF1C1289E-001/shard-1-001/lib to classpath: /home/jenkins/workspace/Lucene-Solr-6.x-Linux/solr/build/solr-core/test/J1/temp/solr.cloud.CollectionsAPIDistributedZkTest_7EE1F80BF1C1289E-001/shard-1-001/lib
   [junit4]   2> 1094614 INFO  (TEST-CollectionsAPIDistributedZkTest.test-seed#[7EE1F80BF1C1289E]) [    ] o.a.s.h.c.HttpShardHandlerFactory created with socketTimeout : 90000,urlScheme : ,connTimeout : 15000,maxConnectionsPerHost : 20,maxConnections : 10000,corePoolSize : 0,maximumPoolSize : 2147483647,maxThreadIdleTime : 5,sizeOfQueue : -1,fairnessPolicy : false,useRetries : false,
   [junit4]   2> 1094615 INFO  (TEST-CollectionsAPIDistributedZkTest.test-seed#[7EE1F80BF1C1289E]) [    ] o.a.s.u.UpdateShardHandler Creating UpdateShardHandler HTTP client with params: socketTimeout=340000&connTimeout=45000&retry=true
   [junit4]   2> 1094615 INFO  (TEST-CollectionsAPIDistributedZkTest.test-seed#[7EE1F80BF1C1289E]) [    ] o.a.s.l.LogWatcher SLF4J impl is org.slf4j.impl.Log4jLoggerFactory
   [junit4]   2> 1094615 INFO  (TEST-CollectionsAPIDistributedZkTest.test-seed#[7EE1F80BF1C1289E]) [    ] o.a.s.l.LogWatcher Registering Log Listener [Log4j (org.slf4j.impl.Log4jLoggerFactory)]
   [junit4]   2> 1094615 INFO  (TEST-CollectionsAPIDistributedZkTest.test-seed#[7EE1F80BF1C1289E]) [    ] o.a.s.c.ZkContainer Zookeeper client=127.0.0.1:33562/solr
   [junit4]   2> 1094615 INFO  (TEST-CollectionsAPIDistributedZkTest.test-seed#[7EE1F80BF1C1289E]) [    ] o.a.s.c.ZkController zkHost includes chroot
   [junit4]   2> 1094615 INFO  (TEST-CollectionsAPIDistributedZkTest.test-seed#[7EE1F80BF1C1289E]) [    ] o.a.s.c.c.SolrZkClient Using default ZkCredentialsProvider
   [junit4]   2> 1094616 INFO  (TEST-CollectionsAPIDistributedZkTest.test-seed#[7EE1F80BF1C1289E]) [    ] o.a.s.c.c.ConnectionManager Waiting for client to connect to ZooKeeper
   [junit4]   2> 1094617 INFO  (zkCallback-1079-thread-1) [    ] o.a.s.c.c.ConnectionManager Watcher org.apache.solr.common.cloud.ConnectionManager@17c0669 name:ZooKeeperConnection Watcher:127.0.0.1:33562 got event WatchedEvent state:SyncConnected type:None path:null path:null type:None
   [junit4]   2> 1094617 INFO  (TEST-CollectionsAPIDistributedZkTest.test-seed#[7EE1F80BF1C1289E]) [    ] o.a.s.c.c.ConnectionManager Client is connected to ZooKeeper
   [junit4]   2> 1094617 INFO  (TEST-CollectionsAPIDistributedZkTest.test-seed#[7EE1F80BF1C1289E]) [    ] o.a.s.c.c.SolrZkClient Using default ZkACLProvider
   [junit4]   2> 1094618 INFO  (TEST-CollectionsAPIDistributedZkTest.test-seed#[7EE1F80BF1C1289E]) [    ] o.a.s.c.ZkController Added new OnReconnect listener org.apache.solr.cloud.ZkController$$Lambda$101/715299@16bb861
   [junit4]   2> 1094618 INFO  (TEST-CollectionsAPIDistributedZkTest.test-seed#[7EE1F80BF1C1289E]) [    ] o.a.s.c.c.ConnectionManager Waiting for client to connect to ZooKeeper
   [junit4]   2> 1094618 INFO  (zkCallback-1080-thread-1) [    ] o.a.s.c.c.ConnectionManager Watcher org.apache.solr.common.cloud.ConnectionManager@1f59830 name:ZooKeeperConnection Watcher:127.0.0.1:33562/solr got event WatchedEvent state:SyncConnected type:None path:null path:null type:None
   [junit4]   2> 1094619 INFO  (TEST-CollectionsAPIDistributedZkTest.test-seed#[7EE1F80BF1C1289E]) [    ] o.a.s.c.c.ConnectionManager Client is connected to ZooKeeper
   [junit4]   2> 1094621 INFO  (TEST-CollectionsAPIDistributedZkTest.test-seed#[7EE1F80BF1C1289E]) [    ] o.a.s.c.c.ZkStateReader Updating cluster state from ZooKeeper... 
   [junit4]   2> 1094622 INFO  (TEST-CollectionsAPIDistributedZkTest.test-seed#[7EE1F80BF1C1289E]) [    ] o.a.s.c.c.ZkStateReader Updated live nodes from ZooKeeper... (0) -> (1)
   [junit4]   2> 1094622 INFO  (TEST-CollectionsAPIDistributedZkTest.test-seed#[7EE1F80BF1C1289E]) [    ] o.a.s.c.Overseer Overseer (id=null) closing
   [junit4]   2> 1094623 INFO  (TEST-CollectionsAPIDistributedZkTest.test-seed#[7EE1F80BF1C1289E]) [    ] o.a.s.c.LeaderElector Joined leadership election with path: /overseer_elect/election/95869875137806347-127.0.0.1:34439__tq%2Fq-n_0000000001
   [junit4]   2> 1094623 INFO  (TEST-CollectionsAPIDistributedZkTest.test-seed#[7EE1F80BF1C1289E]) [    ] o.a.s.c.LeaderElector Watching path /overseer_elect/election/95869875137806342-127.0.0.1:42222__tq%2Fq-n_0000000000 to know if I could be the leader
   [junit4]   2> 1094623 INFO  (TEST-CollectionsAPIDistributedZkTest.test-seed#[7EE1F80BF1C1289E]) [    ] o.a.s.c.ZkController Publish node=127.0.0.1:34439__tq%2Fq as DOWN
   [junit4]   2> 1094623 INFO  (OverseerStateUpdate-95869875137806342-127.0.0.1:42222__tq%2Fq-n_0000000000) [    ] o.a.s.c.o.ZkStateWriter going to create_collection /collections/collection1/state.json
   [junit4]   2> 1094625 INFO  (OverseerStateUpdate-95869875137806342-127.0.0.1:42222__tq%2Fq-n_0000000000) [    ] o.a.s.c.Overseer processMessage: queueSize: 1, message = {
   [junit4]   2>   "operation":"downnode",
   [junit4]   2>   "node_name":"127.0.0.1:34439__tq%2Fq"} current state version: 3
   [junit4]   2> 1094625 INFO  (OverseerStateUpdate-95869875137806342-127.0.0.1:42222__tq%2Fq-n_0000000000) [    ] o.a.s.c.o.NodeMutator DownNode state invoked for node: 127.0.0.1:34439__tq%2Fq
   [junit4]   2> 1094626 INFO  (zkCallback-1072-thread-1) [    ] o.a.s.c.c.ZkStateReader A cluster state change: [WatchedEvent state:SyncConnected type:NodeDataChanged path:/clusterstate.json], has occurred - updating... (live nodes size: [1])
   [junit4]   2> 1094626 INFO  (zkCallback-1080-thread-1) [    ] o.a.s.c.c.ZkStateReader A cluster state change: [WatchedEvent state:SyncConnected type:NodeDataChanged path:/clusterstate.json], has occurred - updating... (live nodes size: [1])
   [junit4]   2> 1094626 INFO  (zkCallback-1074-thread-1) [    ] o.a.s.c.c.ZkStateReader A cluster state change: [WatchedEvent state:SyncConnected type:NodeDataChanged path:/clusterstate.json], has occurred - updating... (live nodes size: [1])
   [junit4]   2> 1094728 INFO  (OverseerStateUpdate-95869875137806342-127.0.0.1:42222__tq%2Fq-n_0000000000) [    ] o.a.s.c.o.ZkStateWriter going to update_collection /collections/collection1/state.json version: 0
   [junit4]   2> 1095626 INFO  (TEST-CollectionsAPIDistributedZkTest.test-seed#[7EE1F80BF1C1289E]) [    ] o.a.s.c.ZkController Register node as live in ZooKeeper:/live_nodes/127.0.0.1:34439__tq%2Fq
   [junit4]   2> 1095626 INFO  (TEST-CollectionsAPIDistributedZkTest.test-seed#[7EE1F80BF1C1289E]) [    ] o.a.s.c.c.SolrZkClient makePath: /live_nodes/127.0.0.1:34439__tq%2Fq
   [junit4]   2> 1095627 INFO  (zkCallback-1072-thread-1) [    ] o.a.s.c.c.ZkStateReader A live node change: [WatchedEvent state:SyncConnected type:NodeChildrenChanged path:/live_nodes], has occurred - updating... (live nodes size: [1])
   [junit4]   2> 1095627 INFO  (zkCallback-1080-thread-1) [    ] o.a.s.c.c.ZkStateReader A live node change: [WatchedEvent state:SyncConnected type:NodeChildrenChanged path:/live_nodes], has occurred - updating... (live nodes size: [1])
   [junit4]   2> 1095627 INFO  (zkCallback-1074-thread-1) [    ] o.a.s.c.c.ZkStateReader A live node change: [WatchedEvent state:SyncConnected type:NodeChildrenChanged path:/live_nodes], has occurred - updating... (live nodes size: [1])
   [junit4]   2> 1095627 INFO  (zkCallback-1080-thread-1) [    ] o.a.s.c.c.ZkStateReader Updated live nodes from ZooKeeper... (1) -> (2)
   [junit4]   2> 1095627 INFO  (zkCallback-1072-thread-1) [    ] o.a.s.c.c.ZkStateReader Updated live nodes from ZooKeeper... (1) -> (2)
   [junit4]   2> 1095633 INFO  (zkCallback-1074-thread-1) [    ] o.a.s.c.c.ZkStateReader Updated live nodes from ZooKeeper... (1) -> (2)
   [junit4]   2> 1095646 INFO  (TEST-CollectionsAPIDistributedZkTest.test-seed#[7EE1F80BF1C1289E]) [    ] o.a.s.c.CoreContainer Security conf doesn't exist. Skipping setup for authorization module.
   [junit4]   2> 1095646 INFO  (TEST-CollectionsAPIDistributedZkTest.test-seed#[7EE1F80BF1C1289E]) [    ] o.a.s.c.CoreContainer No authentication plugin used.
   [junit4]   2> 1095646 INFO  (TEST-CollectionsAPIDistributedZkTest.test-seed#[7EE1F80BF1C1289E]) [    ] o.a.s.c.CorePropertiesLocator Looking for core definitions underneath /home/jenkins/workspace/Lucene-Solr-6.x-Linux/solr/build/solr-core/test/J1/../../../../../../../../../home/jenkins/workspace/Lucene-Solr-6.x-Linux/solr/build/solr-core/test/J1/temp/solr.cloud.CollectionsAPIDistributedZkTest_7EE1F80BF1C1289E-001/shard-1-001/cores
   [junit4]   2> 1095647 INFO  (TEST-CollectionsAPIDistributedZkTest.test-seed#[7EE1F80BF1C1289E]) [    ] o.a.s.c.CoreDescriptor Created CoreDescriptor: {name=collection1, config=solrconfig.xml, transient=false, schema=schema.xml, loadOnStartup=true, configSetProperties=configsetprops.json, collection=collection1, coreNodeName=, dataDir=data/, shard=}
   [junit4]   2> 1095647 INFO  (TEST-CollectionsAPIDistributedZkTest.test-seed#[7EE1F80BF1C1289E]) [    ] o.a.s.c.CorePropertiesLocator Found core collection1 in /home/jenkins/workspace/Lucene-Solr-6.x-Linux/solr/build/solr-core/test/J1/../../../../../../../../../home/jenkins/workspace/Lucene-Solr-6.x-Linux/solr/build/solr-core/test/J1/temp/solr.cloud.CollectionsAPIDistributedZkTest_7EE1F80BF1C1289E-001/shard-1-001/cores/collection1
   [junit4]   2> 1095647 INFO  (TEST-CollectionsAPIDistributedZkTest.test-seed#[7EE1F80BF1C1289E]) [    ] o.a.s.c.CorePropertiesLocator Found 1 core definitions
   [junit4]   2> 1095648 INFO  (TEST-CollectionsAPIDistributedZkTest.test-seed#[7EE1F80BF1C1289E]) [    ] o.a.s.s.SolrDispatchFilter user.dir=/home/jenkins/workspace/Lucene-Solr-6.x-Linux/solr/build/solr-core/test/J1
   [junit4]   2> 1095648 INFO  (coreLoadExecutor-3336-thread-1) [    ] o.a.s.c.ZkController publishing state=down
   [junit4]   2> 1095648 INFO  (coreLoadExecutor-3336-thread-1) [    ] o.a.s.c.ZkController numShards not found on descriptor - reading it from system property
   [junit4]   2> 1095648 INFO  (TEST-CollectionsAPIDistributedZkTest.test-seed#[7EE1F80BF1C1289E]) [    ] o.a.s.s.SolrDispatchFilter SolrDispatchFilter.init() done
   [junit4]   2> 1095648 INFO  (coreLoadExecutor-3336-thread-1) [    ] o.a.s.c.ZkController Registering watch for collection collection1
   [junit4]   2> 1095649 INFO  (coreLoadExecutor-3336-thread-1) [    ] o.a.s.c.c.ZkStateReader addZkWatch [collection1]
   [junit4]   2> 1095649 INFO  (OverseerStateUpdate-95869875137806342-127.0.0.1:42222__tq%2Fq-n_0000000000) [    ] o.a.s.c.Overseer processMessage: queueSize: 1, message = {
   [junit4]   2>   "core":"collection1",
   [junit4]   2>   "roles":null,
   [junit4]   2>   "base_url":"http://127.0.0.1:34439/_tq/q",
   [junit4]   2>   "node_name":"127.0.0.1:34439__tq%2Fq",
   [junit4]   2>   "numShards":"2",
   [junit4]   2>   "state":"down",
   [junit4]   2>   "shard":null,
   [junit4]   2>   "collection":"collection1",
   [junit4]   2>   "operation":"state"} current state version: 4
   [junit4]   2> 1095649 INFO  (coreLoadExecutor-3336-thread-1) [    ] o.a.s.c.c.ZkStateReader Add data for [collection1] ver [1]
   [junit4]   2> 1095649 INFO  (coreLoadExecutor-3336-thread-1) [    ] o.a.s.c.ZkController look for our core node name
   [junit4]   2> 1095649 INFO  (OverseerStateUpdate-95869875137806342-127.0.0.1:42222__tq%2Fq-n_0000000000) [    ] o.a.s.c.o.ReplicaMutator Update state numShards=2 message={
   [junit4]   2>   "core":"collection1",
   [junit4]   2>   "roles":null,
   [junit4]   2>   "base_url":"http://127.0.0.1:34439/_tq/q",
   [junit4]   2>   "node_name":"127.0.0.1:34439__tq%2Fq",
   [junit4]   2>   "numShards":"2",
   [junit4]   2>   "state":"down",
   [junit4]   2>   "shard":null,
   [junit4]   2>   "collection":"collection1",
   [junit4]   2>   "operation":"state"}
   [junit4]   2> 1095649 INFO  (OverseerStateUpdate-95869875137806342-127.0.0.1:42222__tq%2Fq-n_0000000000) [    ] o.a.s.c.o.ReplicaMutator Collection already exists with numShards=2
   [junit4]   2> 1095649 INFO  (OverseerStateUpdate-95869875137806342-127.0.0.1:42222__tq%2Fq-n_0000000000) [    ] o.a.s.c.o.ReplicaMutator Assigning new node to shard shard=shard2
   [junit4]   2> 1095752 INFO  (OverseerStateUpdate-95869875137806342-127.0.0.1:42222__tq%2Fq-n_0000000000) [    ] o.a.s.c.o.ZkStateWriter going to update_collection /collections/collection1/state.json version: 1
   [junit4]   2> 1095753 INFO  (zkCallback-1080-thread-1) [    ] o.a.s.c.c.ZkStateReader A cluster state change: [WatchedEvent state:SyncConnected type:NodeDataChanged path:/collections/collection1/state.json] for collection [collection1] has occurred - updating... (live nodes size: [2])
   [junit4]   2> 1095754 INFO  (zkCallback-1080-thread-1) [    ] o.a.s.c.c.ZkStateReader Updating data for [collection1] from [1] to [2]
   [junit4]   2> 1096649 INFO  (coreLoadExecutor-3336-thread-1) [    ] o.a.s.c.ZkController waiting to find shard id in clusterstate for collection1
   [junit4]   2> 1096649 INFO  (coreLoadExecutor-3336-thread-1) [    ] o.a.s.c.ZkController Check for collection zkNode:collection1
   [junit4]   2> 1096649 INFO  (coreLoadExecutor-3336-thread-1) [    ] o.a.s.c.ZkController Collection zkNode exists
   [junit4]   2> 1096649 INFO  (coreLoadExecutor-3336-thread-1) [    ] o.a.s.c.c.ZkStateReader Load collection config from: [/collections/collection1]
   [junit4]   2> 1096649 INFO  (coreLoadExecutor-3336-thread-1) [    ] o.a.s.c.c.ZkStateReader path=[/collections/collection1] [configName]=[conf1] specified config exists in ZooKeeper
   [junit4]   2> 1096650 INFO  (coreLoadExecutor-3336-thread-1) [    ] o.a.s.c.SolrResourceLoader new SolrResourceLoader for directory: '/home/jenkins/workspace/Lucene-Solr-6.x-Linux/solr/build/solr-core/test/J1/temp/solr.cloud.CollectionsAPIDistributedZkTest_7EE1F80BF1C1289E-001/shard-1-001/cores/collection1'
   [junit4]   2> 1096650 INFO  (coreLoadExecutor-3336-thread-1) [    ] o.a.s.c.SolrResourceLoader JNDI not configured for solr (NoInitialContextEx)
   [junit4]   2> 1096650 INFO  (coreLoadExecutor-3336-thread-1) [    ] o.a.s.c.SolrResourceLoader solr home defaulted to 'solr/' (could not find system property or JNDI)
   [junit4]   2> 1096650 INFO  (coreLoadExecutor-3336-thread-1) [    ] o.a.s.c.Config loaded config solrconfig.xml with version 0 
   [junit4]   2> 1096655 INFO  (coreLoadExecutor-3336-thread-1) [    ] o.a.s.c.SolrConfig current version of requestparams : -1
   [junit4]   2> 1096658 INFO  (coreLoadExecutor-3336-thread-1) [    ] o.a.s.c.SolrConfig Using Lucene MatchVersion: 6.1.0
   [junit4]   2> 1096666 INFO  (coreLoadExecutor-3336-thread-1) [    ] o.a.s.c.SolrConfig Loaded SolrConfig: solrconfig.xml
   [junit4]   2> 1096671 INFO  (coreLoadExecutor-3336-thread-1) [    ] o.a.s.s.IndexSchema [collection1] Schema name=test
   [junit4]   2> 1096786 INFO  (coreLoadExecutor-3336-thread-1) [    ] o.a.s.s.OpenExchangeRatesOrgProvider Initialized with rates=open-exchange-rates.json, refreshInterval=1440.
   [junit4]   2> 1097008 INFO  (coreLoadExecutor-3336-thread-1) [    ] o.a.s.s.IndexSchema default search field in schema is text
   [junit4]   2> 1097009 INFO  (coreLoadExecutor-3336-thread-1) [    ] o.a.s.s.IndexSchema unique key field: id
   [junit4]   2> 1097020 INFO  (coreLoadExecutor-3336-thread-1) [    ] o.a.s.s.FileExchangeRateProvider Reloading exchange rates from file currency.xml
   [junit4]   2> 1097021 INFO  (coreLoadExecutor-3336-thread-1) [    ] o.a.s.s.FileExchangeRateProvider Reloading exchange rates from file currency.xml
   [junit4]   2> 1097023 INFO  (coreLoadExecutor-3336-thread-1) [    ] o.a.s.s.OpenExchangeRatesOrgProvider Reloading exchange rates from open-exchange-rates.json
   [junit4]   2> 1097023 INFO  (coreLoadExecutor-3336-thread-1) [    ] o.a.s.s.OpenExchangeRatesOrgProvider Reloading exchange rates from open-exchange-rates.json
   [junit4]   2> 1097025 INFO  (coreLoadExecutor-3336-thread-1) [    ] o.a.s.c.ConfigSetProperties Did not find ConfigSet properties, assuming default properties: Can't find resource 'configsetprops.json' in classpath or '/configs/conf1', cwd=/home/jenkins/workspace/Lucene-Solr-6.x-Linux/solr/build/solr-core/test/J1
   [junit4]   2> 1097025 INFO  (coreLoadExecutor-3336-thread-1) [    ] o.a.s.c.CoreContainer Creating SolrCore 'collection1' using configuration from collection collection1
   [junit4]   2> 1097026 INFO  (coreLoadExecutor-3336-thread-1) [    ] o.a.s.c.SolrCore org.apache.solr.core.MockDirectoryFactory
   [junit4]   2> 1097026 INFO  (coreLoadExecutor-3336-thread-1) [    ] o.a.s.c.SolrCore [[collection1] ] Opening new SolrCore at [/home/jenkins/workspace/Lucene-Solr-6.x-Linux/solr/build/solr-core/test/J1/temp/solr.cloud.CollectionsAPIDistributedZkTest_7EE1F80BF1C1289E-001/shard-1-001/cores/collection1], dataDir=[/home/jenkins/workspace/Lucene-Solr-6.x-Linux/solr/build/solr-core/test/J1/../../../../../../../../../home/jenkins/workspace/Lucene-Solr-6.x-Linux/solr/build/solr-core/test/J1/temp/solr.cloud.CollectionsAPIDistributedZkTest_7EE1F80BF1C1289E-001/shard-1-001/cores/collection1/data/]
   [junit4]   2> 1097026 INFO  (coreLoadExecutor-3336-thread-1) [    ] o.a.s.c.JmxMonitoredMap JMX monitoring is enabled. Adding Solr mbeans to JMX Server: com.sun.jmx.mbeanserver.JmxMBeanServer@18dc696
   [junit4]   2> 1097027 INFO  (coreLoadExecutor-3336-thread-1) [    ] o.a.s.c.CachingDirectoryFactory return new directory for /home/jenkins/workspace/Lucene-Solr-6.x-Linux/solr/build/solr-core/test/J1/../../../../../../../../../home/jenkins/workspace/Lucene-Solr-6.x-Linux/solr/build/solr-core/test/J1/temp/solr.cloud.CollectionsAPIDistributedZkTest_7EE1F80BF1C1289E-001/shard-1-001/cores/collection1/data
   [junit4]   2> 1097027 INFO  (coreLoadExecutor-3336-thread-1) [    ] o.a.s.c.SolrCore New index directory detected: old=null new=/home/jenkins/workspace/Lucene-Solr-6.x-Linux/solr/build/solr-core/test/J1/../../../../../../../../../home/jenkins/workspace/Lucene-Solr-6.x-Linux/solr/build/solr-core/test/J1/temp/solr.cloud.CollectionsAPIDistributedZkTest_7EE1F80BF1C1289E-001/shard-1-001/cores/collection1/data/index/
   [junit4]   2> 1097027 WARN  (coreLoadExecutor-3336-thread-1) [    ] o.a.s.c.SolrCore [collection1] Solr index directory '/home/jenkins/workspace/Lucene-Solr-6.x-Linux/solr/build/solr-core/test/J1/../../../../../../../../../home/jenkins/workspace/Lucene-Solr-6.x-Linux/solr/build/solr-core/test/J1/temp/solr.cloud.CollectionsAPIDistri

[...truncated too long message...]

ection0_0/state.json
   [junit4]   2> 	4	/solr/clusterstate.json
   [junit4]   2> 	2	/solr/collections/acollectionafterbaddelete/state.json
   [junit4]   2> 	2	/solr/collections/awholynewcollection_2/state.json
   [junit4]   2> 
   [junit4]   2> Maximum concurrent children watches above limit:
   [junit4]   2> 
   [junit4]   2> 	4	/solr/live_nodes
   [junit4]   2> 	4	/solr/collections
   [junit4]   2> 	2	/solr/overseer/queue
   [junit4]   2> 	2	/solr/overseer/collection-queue-work
   [junit4]   2> 
   [junit4]   2> NOTE: reproduce with: ant test  -Dtestcase=CollectionsAPIDistributedZkTest -Dtests.method=test -Dtests.seed=7EE1F80BF1C1289E -Dtests.multiplier=3 -Dtests.slow=true -Dtests.locale=zh-CN -Dtests.timezone=America/Argentina/La_Rioja -Dtests.asserts=true -Dtests.file.encoding=ISO-8859-1
   [junit4] ERROR    155s J1 | CollectionsAPIDistributedZkTest.test <<<
   [junit4]    > Throwable #1: org.apache.solr.client.solrj.SolrServerException: Timeout occured while waiting response from server at: http://127.0.0.1:34439/_tq/q
   [junit4]    > 	at __randomizedtesting.SeedInfo.seed([7EE1F80BF1C1289E:F6B5C7D15F3D4566]:0)
   [junit4]    > 	at org.apache.solr.client.solrj.impl.HttpSolrClient.executeMethod(HttpSolrClient.java:601)
   [junit4]    > 	at org.apache.solr.client.solrj.impl.HttpSolrClient.request(HttpSolrClient.java:259)
   [junit4]    > 	at org.apache.solr.client.solrj.impl.HttpSolrClient.request(HttpSolrClient.java:248)
   [junit4]    > 	at org.apache.solr.client.solrj.SolrClient.request(SolrClient.java:1219)
   [junit4]    > 	at org.apache.solr.cloud.CollectionsAPIDistributedZkTest.makeRequest(CollectionsAPIDistributedZkTest.java:399)
   [junit4]    > 	at org.apache.solr.cloud.CollectionsAPIDistributedZkTest.deletePartiallyCreatedCollection(CollectionsAPIDistributedZkTest.java:231)
   [junit4]    > 	at org.apache.solr.cloud.CollectionsAPIDistributedZkTest.test(CollectionsAPIDistributedZkTest.java:181)
   [junit4]    > 	at jdk.internal.reflect.NativeMethodAccessorImpl.invoke0(java.base@9-ea/Native Method)
   [junit4]    > 	at jdk.internal.reflect.NativeMethodAccessorImpl.invoke(java.base@9-ea/NativeMethodAccessorImpl.java:62)
   [junit4]    > 	at jdk.internal.reflect.DelegatingMethodAccessorImpl.invoke(java.base@9-ea/DelegatingMethodAccessorImpl.java:43)
   [junit4]    > 	at org.apache.solr.BaseDistributedSearchTestCase$ShardsRepeatRule$ShardsFixedStatement.callStatement(BaseDistributedSearchTestCase.java:992)
   [junit4]    > 	at org.apache.solr.BaseDistributedSearchTestCase$ShardsRepeatRule$ShardsStatement.evaluate(BaseDistributedSearchTestCase.java:967)
   [junit4]    > 	at java.lang.Thread.run(java.base@9-ea/Thread.java:804)
   [junit4]    > Caused by: java.net.SocketTimeoutException: Read timed out
   [junit4]    > 	at java.net.SocketInputStream.socketRead0(java.base@9-ea/Native Method)
   [junit4]    > 	at java.net.SocketInputStream.socketRead(java.base@9-ea/SocketInputStream.java:116)
   [junit4]    > 	at java.net.SocketInputStream.read(java.base@9-ea/SocketInputStream.java:170)
   [junit4]    > 	at java.net.SocketInputStream.read(java.base@9-ea/SocketInputStream.java:141)
   [junit4]    > 	at org.apache.http.impl.io.AbstractSessionInputBuffer.fillBuffer(AbstractSessionInputBuffer.java:160)
   [junit4]    > 	at org.apache.http.impl.io.SocketInputBuffer.fillBuffer(SocketInputBuffer.java:84)
   [junit4]    > 	at org.apache.http.impl.io.AbstractSessionInputBuffer.readLine(AbstractSessionInputBuffer.java:273)
   [junit4]    > 	at org.apache.http.impl.conn.DefaultHttpResponseParser.parseHead(DefaultHttpResponseParser.java:140)
   [junit4]    > 	at org.apache.http.impl.conn.DefaultHttpResponseParser.parseHead(DefaultHttpResponseParser.java:57)
   [junit4]    > 	at org.apache.http.impl.io.AbstractMessageParser.parse(AbstractMessageParser.java:261)
   [junit4]    > 	at org.apache.http.impl.AbstractHttpClientConnection.receiveResponseHeader(AbstractHttpClientConnection.java:283)
   [junit4]    > 	at org.apache.http.impl.conn.DefaultClientConnection.receiveResponseHeader(DefaultClientConnection.java:251)
   [junit4]    > 	at org.apache.http.impl.conn.ManagedClientConnectionImpl.receiveResponseHeader(ManagedClientConnectionImpl.java:197)
   [junit4]    > 	at org.apache.http.protocol.HttpRequestExecutor.doReceiveResponse(HttpRequestExecutor.java:272)
   [junit4]    > 	at org.apache.http.protocol.HttpRequestExecutor.execute(HttpRequestExecutor.java:124)
   [junit4]    > 	at org.apache.http.impl.client.DefaultRequestDirector.tryExecute(DefaultRequestDirector.java:685)
   [junit4]    > 	at org.apache.http.impl.client.DefaultRequestDirector.execute(DefaultRequestDirector.java:487)
   [junit4]    > 	at org.apache.http.impl.client.AbstractHttpClient.doExecute(AbstractHttpClient.java:882)
   [junit4]    > 	at org.apache.http.impl.client.CloseableHttpClient.execute(CloseableHttpClient.java:82)
   [junit4]    > 	at org.apache.http.impl.client.CloseableHttpClient.execute(CloseableHttpClient.java:107)
   [junit4]    > 	at org.apache.http.impl.client.CloseableHttpClient.execute(CloseableHttpClient.java:55)
   [junit4]    > 	at org.apache.solr.client.solrj.impl.HttpSolrClient.executeMethod(HttpSolrClient.java:495)
   [junit4]    > 	... 47 more
   [junit4]   2> 1247280 INFO  (SUITE-CollectionsAPIDistributedZkTest-seed#[7EE1F80BF1C1289E]-worker) [    ] o.a.s.SolrTestCaseJ4 ###deleteCore
   [junit4]   2> NOTE: leaving temporary files on disk at: /home/jenkins/workspace/Lucene-Solr-6.x-Linux/solr/build/solr-core/test/J1/temp/solr.cloud.CollectionsAPIDistributedZkTest_7EE1F80BF1C1289E-001
   [junit4]   2> May 10, 2016 5:32:36 AM com.carrotsearch.randomizedtesting.ThreadLeakControl checkThreadLeaks
   [junit4]   2> WARNING: Will linger awaiting termination of 1 leaked thread(s).
   [junit4]   2> NOTE: test params are: codec=DummyCompressingStoredFields(storedFieldsFormat=CompressingStoredFieldsFormat(compressionMode=DUMMY, chunkSize=10, maxDocsPerChunk=707, blockSize=340), termVectorsFormat=CompressingTermVectorsFormat(compressionMode=DUMMY, chunkSize=10, blockSize=340)), sim=ClassicSimilarity, locale=zh-CN, timezone=America/Argentina/La_Rioja
   [junit4]   2> NOTE: Linux 4.4.0-21-generic i386/Oracle Corporation 9-ea (32-bit)/cpus=12,threads=1,free=177155768,total=535822336
   [junit4]   2> NOTE: All tests run in this JVM: [CloneFieldUpdateProcessorFactoryTest, OverseerRolesTest, DistributedMLTComponentTest, BadCopyFieldTest, TestRestManager, CursorMarkTest, ConfigSetsAPITest, CdcrReplicationHandlerTest, TestCopyFieldCollectionResource, TestSolrCoreProperties, ConvertedLegacyTest, TestUpdate, CollectionsAPIAsyncDistributedZkTest, TestStressVersions, FileUtilsTest, DocValuesMissingTest, BasicFunctionalityTest, ZkCLITest, AliasIntegrationTest, CheckHdfsIndexTest, SpellCheckComponentTest, TestCloudDeleteByQuery, TestScoreJoinQPNoScore, TestLRUStatsCache, NumericFieldsTest, BlockJoinFacetRandomTest, TestObjectReleaseTracker, TestCursorMarkWithoutUniqueKey, ChaosMonkeySafeLeaderTest, TestQueryWrapperFilter, TestManagedSchemaAPI, SpellPossibilityIteratorTest, MoreLikeThisHandlerTest, HttpPartitionTest, DirectSolrSpellCheckerTest, TestQuerySenderNoQuery, SolrXmlInZkTest, TestTestInjection, TestFieldSortValues, TestNRTOpen, TestTrie, MinimalSchemaTest, HdfsRecoverLeaseTest, TestHashQParserPlugin, HdfsUnloadDistributedZkTest, CdcrUpdateLogTest, SpellCheckCollatorTest, TestRawTransformer, TestLMJelinekMercerSimilarityFactory, TestSQLHandler, TolerantUpdateProcessorTest, TestDistribIDF, TestDFRSimilarityFactory, UniqFieldsUpdateProcessorFactoryTest, CloudMLTQParserTest, ShardRoutingCustomTest, TestUniqueKeyFieldResource, TestEmbeddedSolrServerConstructors, ShardRoutingTest, TestSolr4Spatial2, TestQueryTypes, OpenExchangeRatesOrgProviderTest, TestDownShardTolerantSearch, TestImplicitCoreProperties, RestartWhileUpdatingTest, TestHashPartitioner, CustomCollectionTest, TimeZoneUtilsTest, TestClusterStateMutator, RecoveryAfterSoftCommitTest, TestShortCircuitedRequests, TestSystemIdResolver, DistributedIntervalFacetingTest, TestSha256AuthenticationProvider, TestCodecSupport, TestSearcherReuse, TestBM25SimilarityFactory, HdfsChaosMonkeySafeLeaderTest, HLLSerializationTest, TestFreeTextSuggestions, TestReRankQParserPlugin, TestSchemaResource, SortByFunctionTest, TestLeaderInitiatedRecoveryThread, BitVectorTest, QueryResultKeyTest, OpenCloseCoreStressTest, DistributedFacetPivotWhiteBoxTest, BlockDirectoryTest, SortSpecParsingTest, TestSimpleTrackingShardHandler, TestCollapseQParserPlugin, DOMUtilTest, SchemaVersionSpecificBehaviorTest, TestConfigSetProperties, TestBulkSchemaConcurrent, UnloadDistributedZkTest, CollectionsAPIDistributedZkTest]
   [junit4] Completed [302/598 (1!)] on J1 in 154.85s, 1 test, 1 error <<< FAILURES!

[...truncated 928 lines...]
BUILD FAILED
/home/jenkins/workspace/Lucene-Solr-6.x-Linux/build.xml:740: The following error occurred while executing this line:
/home/jenkins/workspace/Lucene-Solr-6.x-Linux/build.xml:684: The following error occurred while executing this line:
/home/jenkins/workspace/Lucene-Solr-6.x-Linux/build.xml:59: The following error occurred while executing this line:
/home/jenkins/workspace/Lucene-Solr-6.x-Linux/solr/build.xml:233: The following error occurred while executing this line:
/home/jenkins/workspace/Lucene-Solr-6.x-Linux/solr/common-build.xml:529: The following error occurred while executing this line:
/home/jenkins/workspace/Lucene-Solr-6.x-Linux/lucene/common-build.xml:1457: The following error occurred while executing this line:
/home/jenkins/workspace/Lucene-Solr-6.x-Linux/lucene/common-build.xml:1014: There were test failures: 598 suites (10 ignored), 2419 tests, 1 error, 117 ignored (71 assumptions) [seed: 7EE1F80BF1C1289E]

Total time: 63 minutes 46 seconds
Build step 'Invoke Ant' marked build as failure
Archiving artifacts
[WARNINGS] Skipping publisher since build result is FAILURE
Recording test results
Email was triggered for: Failure - Any
Sending email for trigger: Failure - Any



Mime
View raw message