lucene-dev mailing list archives

Site index · List index
Message view « Date » · « Thread »
Top « Date » · « Thread »
From Policeman Jenkins Server <jenk...@thetaphi.de>
Subject [JENKINS] Lucene-Solr-6.x-MacOSX (64bit/jdk1.8.0) - Build # 162 - Failure!
Date Wed, 25 May 2016 21:01:18 GMT
Build: http://jenkins.thetaphi.de/job/Lucene-Solr-6.x-MacOSX/162/
Java: 64bit/jdk1.8.0 -XX:+UseCompressedOops -XX:+UseG1GC

1 tests failed.
FAILED:  org.apache.solr.schema.TestManagedSchemaAPI.test

Error Message:
Error from server at http://127.0.0.1:55682/solr/testschemaapi_shard1_replica1: ERROR: [doc=2] unknown field 'myNewField1'

Stack Trace:
org.apache.solr.client.solrj.impl.CloudSolrClient$RouteException: Error from server at http://127.0.0.1:55682/solr/testschemaapi_shard1_replica1: ERROR: [doc=2] unknown field 'myNewField1'
	at __randomizedtesting.SeedInfo.seed([B3E9F9E37A1DF316:3BBDC639D4E19EEE]:0)
	at org.apache.solr.client.solrj.impl.CloudSolrClient.directUpdate(CloudSolrClient.java:697)
	at org.apache.solr.client.solrj.impl.CloudSolrClient.sendRequest(CloudSolrClient.java:1109)
	at org.apache.solr.client.solrj.impl.CloudSolrClient.requestWithRetryOnStaleState(CloudSolrClient.java:998)
	at org.apache.solr.client.solrj.impl.CloudSolrClient.request(CloudSolrClient.java:934)
	at org.apache.solr.schema.TestManagedSchemaAPI.testAddFieldAndDocument(TestManagedSchemaAPI.java:86)
	at org.apache.solr.schema.TestManagedSchemaAPI.test(TestManagedSchemaAPI.java:55)
	at sun.reflect.NativeMethodAccessorImpl.invoke0(Native Method)
	at sun.reflect.NativeMethodAccessorImpl.invoke(NativeMethodAccessorImpl.java:62)
	at sun.reflect.DelegatingMethodAccessorImpl.invoke(DelegatingMethodAccessorImpl.java:43)
	at java.lang.reflect.Method.invoke(Method.java:498)
	at com.carrotsearch.randomizedtesting.RandomizedRunner.invoke(RandomizedRunner.java:1764)
	at com.carrotsearch.randomizedtesting.RandomizedRunner$8.evaluate(RandomizedRunner.java:871)
	at com.carrotsearch.randomizedtesting.RandomizedRunner$9.evaluate(RandomizedRunner.java:907)
	at com.carrotsearch.randomizedtesting.RandomizedRunner$10.evaluate(RandomizedRunner.java:921)
	at com.carrotsearch.randomizedtesting.rules.SystemPropertiesRestoreRule$1.evaluate(SystemPropertiesRestoreRule.java:57)
	at org.apache.lucene.util.TestRuleSetupTeardownChained$1.evaluate(TestRuleSetupTeardownChained.java:49)
	at org.apache.lucene.util.AbstractBeforeAfterRule$1.evaluate(AbstractBeforeAfterRule.java:45)
	at org.apache.lucene.util.TestRuleThreadAndTestName$1.evaluate(TestRuleThreadAndTestName.java:48)
	at org.apache.lucene.util.TestRuleIgnoreAfterMaxFailures$1.evaluate(TestRuleIgnoreAfterMaxFailures.java:64)
	at org.apache.lucene.util.TestRuleMarkFailure$1.evaluate(TestRuleMarkFailure.java:47)
	at com.carrotsearch.randomizedtesting.rules.StatementAdapter.evaluate(StatementAdapter.java:36)
	at com.carrotsearch.randomizedtesting.ThreadLeakControl$StatementRunner.run(ThreadLeakControl.java:367)
	at com.carrotsearch.randomizedtesting.ThreadLeakControl.forkTimeoutingTask(ThreadLeakControl.java:809)
	at com.carrotsearch.randomizedtesting.ThreadLeakControl$3.evaluate(ThreadLeakControl.java:460)
	at com.carrotsearch.randomizedtesting.RandomizedRunner.runSingleTest(RandomizedRunner.java:880)
	at com.carrotsearch.randomizedtesting.RandomizedRunner$5.evaluate(RandomizedRunner.java:781)
	at com.carrotsearch.randomizedtesting.RandomizedRunner$6.evaluate(RandomizedRunner.java:816)
	at com.carrotsearch.randomizedtesting.RandomizedRunner$7.evaluate(RandomizedRunner.java:827)
	at com.carrotsearch.randomizedtesting.rules.StatementAdapter.evaluate(StatementAdapter.java:36)
	at com.carrotsearch.randomizedtesting.rules.SystemPropertiesRestoreRule$1.evaluate(SystemPropertiesRestoreRule.java:57)
	at org.apache.lucene.util.AbstractBeforeAfterRule$1.evaluate(AbstractBeforeAfterRule.java:45)
	at com.carrotsearch.randomizedtesting.rules.StatementAdapter.evaluate(StatementAdapter.java:36)
	at org.apache.lucene.util.TestRuleStoreClassName$1.evaluate(TestRuleStoreClassName.java:41)
	at com.carrotsearch.randomizedtesting.rules.NoShadowingOrOverridesOnMethodsRule$1.evaluate(NoShadowingOrOverridesOnMethodsRule.java:40)
	at com.carrotsearch.randomizedtesting.rules.NoShadowingOrOverridesOnMethodsRule$1.evaluate(NoShadowingOrOverridesOnMethodsRule.java:40)
	at com.carrotsearch.randomizedtesting.rules.StatementAdapter.evaluate(StatementAdapter.java:36)
	at com.carrotsearch.randomizedtesting.rules.StatementAdapter.evaluate(StatementAdapter.java:36)
	at com.carrotsearch.randomizedtesting.rules.StatementAdapter.evaluate(StatementAdapter.java:36)
	at org.apache.lucene.util.TestRuleAssertionsRequired$1.evaluate(TestRuleAssertionsRequired.java:53)
	at org.apache.lucene.util.TestRuleMarkFailure$1.evaluate(TestRuleMarkFailure.java:47)
	at org.apache.lucene.util.TestRuleIgnoreAfterMaxFailures$1.evaluate(TestRuleIgnoreAfterMaxFailures.java:64)
	at org.apache.lucene.util.TestRuleIgnoreTestSuites$1.evaluate(TestRuleIgnoreTestSuites.java:54)
	at com.carrotsearch.randomizedtesting.rules.StatementAdapter.evaluate(StatementAdapter.java:36)
	at com.carrotsearch.randomizedtesting.ThreadLeakControl$StatementRunner.run(ThreadLeakControl.java:367)
	at java.lang.Thread.run(Thread.java:745)
Caused by: org.apache.solr.client.solrj.impl.HttpSolrClient$RemoteSolrException: Error from server at http://127.0.0.1:55682/solr/testschemaapi_shard1_replica1: ERROR: [doc=2] unknown field 'myNewField1'
	at org.apache.solr.client.solrj.impl.HttpSolrClient.executeMethod(HttpSolrClient.java:590)
	at org.apache.solr.client.solrj.impl.HttpSolrClient.request(HttpSolrClient.java:259)
	at org.apache.solr.client.solrj.impl.HttpSolrClient.request(HttpSolrClient.java:248)
	at org.apache.solr.client.solrj.impl.LBHttpSolrClient.doRequest(LBHttpSolrClient.java:404)
	at org.apache.solr.client.solrj.impl.LBHttpSolrClient.request(LBHttpSolrClient.java:357)
	at org.apache.solr.client.solrj.impl.CloudSolrClient.lambda$directUpdate$0(CloudSolrClient.java:674)
	at java.util.concurrent.FutureTask.run(FutureTask.java:266)
	at org.apache.solr.common.util.ExecutorUtil$MDCAwareThreadPoolExecutor.lambda$execute$0(ExecutorUtil.java:229)
	at java.util.concurrent.ThreadPoolExecutor.runWorker(ThreadPoolExecutor.java:1142)
	at java.util.concurrent.ThreadPoolExecutor$Worker.run(ThreadPoolExecutor.java:617)
	... 1 more




Build Log:
[...truncated 12225 lines...]
   [junit4] Suite: org.apache.solr.schema.TestManagedSchemaAPI
   [junit4]   2> Creating dataDir: /Users/jenkins/workspace/Lucene-Solr-6.x-MacOSX/solr/build/solr-core/test/J0/temp/solr.schema.TestManagedSchemaAPI_B3E9F9E37A1DF316-001/init-core-data-001
   [junit4]   2> 3701403 INFO  (SUITE-TestManagedSchemaAPI-seed#[B3E9F9E37A1DF316]-worker) [    ] o.a.s.SolrTestCaseJ4 Randomized ssl (false) and clientAuth (false)
   [junit4]   2> 3701409 INFO  (SUITE-TestManagedSchemaAPI-seed#[B3E9F9E37A1DF316]-worker) [    ] o.a.s.c.ZkTestServer STARTING ZK TEST SERVER
   [junit4]   2> 3701409 INFO  (Thread-7014) [    ] o.a.s.c.ZkTestServer client port:0.0.0.0/0.0.0.0:0
   [junit4]   2> 3701409 INFO  (Thread-7014) [    ] o.a.s.c.ZkTestServer Starting server
   [junit4]   2> 3701519 INFO  (SUITE-TestManagedSchemaAPI-seed#[B3E9F9E37A1DF316]-worker) [    ] o.a.s.c.ZkTestServer start zk server on port:55679
   [junit4]   2> 3701519 INFO  (SUITE-TestManagedSchemaAPI-seed#[B3E9F9E37A1DF316]-worker) [    ] o.a.s.c.c.SolrZkClient Using default ZkCredentialsProvider
   [junit4]   2> 3701520 INFO  (SUITE-TestManagedSchemaAPI-seed#[B3E9F9E37A1DF316]-worker) [    ] o.a.s.c.c.ConnectionManager Waiting for client to connect to ZooKeeper
   [junit4]   2> 3701530 INFO  (zkCallback-4170-thread-1) [    ] o.a.s.c.c.ConnectionManager Watcher org.apache.solr.common.cloud.ConnectionManager@117b169 name:ZooKeeperConnection Watcher:127.0.0.1:55679 got event WatchedEvent state:SyncConnected type:None path:null path:null type:None
   [junit4]   2> 3701530 INFO  (SUITE-TestManagedSchemaAPI-seed#[B3E9F9E37A1DF316]-worker) [    ] o.a.s.c.c.ConnectionManager Client is connected to ZooKeeper
   [junit4]   2> 3701530 INFO  (SUITE-TestManagedSchemaAPI-seed#[B3E9F9E37A1DF316]-worker) [    ] o.a.s.c.c.SolrZkClient Using default ZkACLProvider
   [junit4]   2> 3701530 INFO  (SUITE-TestManagedSchemaAPI-seed#[B3E9F9E37A1DF316]-worker) [    ] o.a.s.c.c.SolrZkClient makePath: /solr/solr.xml
   [junit4]   2> 3701538 INFO  (jetty-launcher-4169-thread-1) [    ] o.e.j.s.Server jetty-9.3.8.v20160314
   [junit4]   2> 3701538 INFO  (jetty-launcher-4169-thread-2) [    ] o.e.j.s.Server jetty-9.3.8.v20160314
   [junit4]   2> 3701541 INFO  (jetty-launcher-4169-thread-1) [    ] o.e.j.s.h.ContextHandler Started o.e.j.s.ServletContextHandler@58ef5a82{/solr,null,AVAILABLE}
   [junit4]   2> 3701542 INFO  (jetty-launcher-4169-thread-2) [    ] o.e.j.s.h.ContextHandler Started o.e.j.s.ServletContextHandler@452e3b26{/solr,null,AVAILABLE}
   [junit4]   2> 3701542 INFO  (jetty-launcher-4169-thread-1) [    ] o.e.j.s.ServerConnector Started ServerConnector@3350075c{HTTP/1.1,[http/1.1]}{127.0.0.1:55681}
   [junit4]   2> 3701542 INFO  (jetty-launcher-4169-thread-1) [    ] o.e.j.s.Server Started @3707067ms
   [junit4]   2> 3701542 INFO  (jetty-launcher-4169-thread-1) [    ] o.a.s.c.s.e.JettySolrRunner Jetty properties: {hostContext=/solr, hostPort=55681}
   [junit4]   2> 3701543 INFO  (jetty-launcher-4169-thread-2) [    ] o.e.j.s.ServerConnector Started ServerConnector@5e185e62{HTTP/1.1,[http/1.1]}{127.0.0.1:55682}
   [junit4]   2> 3701543 INFO  (jetty-launcher-4169-thread-1) [    ] o.a.s.s.SolrDispatchFilter SolrDispatchFilter.init(): sun.misc.Launcher$AppClassLoader@4554617c
   [junit4]   2> 3701543 INFO  (jetty-launcher-4169-thread-2) [    ] o.e.j.s.Server Started @3707068ms
   [junit4]   2> 3701543 INFO  (jetty-launcher-4169-thread-1) [    ] o.a.s.c.SolrResourceLoader new SolrResourceLoader for directory: '/Users/jenkins/workspace/Lucene-Solr-6.x-MacOSX/solr/build/solr-core/test/J0/temp/solr.schema.TestManagedSchemaAPI_B3E9F9E37A1DF316-001/tempDir-001/node1'
   [junit4]   2> 3701543 INFO  (jetty-launcher-4169-thread-2) [    ] o.a.s.c.s.e.JettySolrRunner Jetty properties: {hostContext=/solr, hostPort=55682}
   [junit4]   2> 3701543 INFO  (jetty-launcher-4169-thread-1) [    ] o.a.s.c.SolrResourceLoader JNDI not configured for solr (NoInitialContextEx)
   [junit4]   2> 3701543 INFO  (jetty-launcher-4169-thread-2) [    ] o.a.s.s.SolrDispatchFilter SolrDispatchFilter.init(): sun.misc.Launcher$AppClassLoader@4554617c
   [junit4]   2> 3701543 INFO  (jetty-launcher-4169-thread-1) [    ] o.a.s.c.SolrResourceLoader solr home defaulted to 'solr/' (could not find system property or JNDI)
   [junit4]   2> 3701543 INFO  (jetty-launcher-4169-thread-2) [    ] o.a.s.c.SolrResourceLoader new SolrResourceLoader for directory: '/Users/jenkins/workspace/Lucene-Solr-6.x-MacOSX/solr/build/solr-core/test/J0/temp/solr.schema.TestManagedSchemaAPI_B3E9F9E37A1DF316-001/tempDir-001/node2'
   [junit4]   2> 3701544 INFO  (jetty-launcher-4169-thread-2) [    ] o.a.s.c.SolrResourceLoader JNDI not configured for solr (NoInitialContextEx)
   [junit4]   2> 3701544 INFO  (jetty-launcher-4169-thread-2) [    ] o.a.s.c.SolrResourceLoader solr home defaulted to 'solr/' (could not find system property or JNDI)
   [junit4]   2> 3701544 INFO  (jetty-launcher-4169-thread-1) [    ] o.a.s.c.c.SolrZkClient Using default ZkCredentialsProvider
   [junit4]   2> 3701544 INFO  (jetty-launcher-4169-thread-2) [    ] o.a.s.c.c.SolrZkClient Using default ZkCredentialsProvider
   [junit4]   2> 3701545 INFO  (jetty-launcher-4169-thread-1) [    ] o.a.s.c.c.ConnectionManager Waiting for client to connect to ZooKeeper
   [junit4]   2> 3701545 INFO  (jetty-launcher-4169-thread-2) [    ] o.a.s.c.c.ConnectionManager Waiting for client to connect to ZooKeeper
   [junit4]   2> 3701546 INFO  (zkCallback-4171-thread-1) [    ] o.a.s.c.c.ConnectionManager Watcher org.apache.solr.common.cloud.ConnectionManager@4aa01e31 name:ZooKeeperConnection Watcher:127.0.0.1:55679/solr got event WatchedEvent state:SyncConnected type:None path:null path:null type:None
   [junit4]   2> 3701546 INFO  (jetty-launcher-4169-thread-1) [    ] o.a.s.c.c.ConnectionManager Client is connected to ZooKeeper
   [junit4]   2> 3701546 INFO  (jetty-launcher-4169-thread-1) [    ] o.a.s.c.c.SolrZkClient Using default ZkACLProvider
   [junit4]   2> 3701546 INFO  (zkCallback-4172-thread-1) [    ] o.a.s.c.c.ConnectionManager Watcher org.apache.solr.common.cloud.ConnectionManager@3638b8cf name:ZooKeeperConnection Watcher:127.0.0.1:55679/solr got event WatchedEvent state:SyncConnected type:None path:null path:null type:None
   [junit4]   2> 3701547 INFO  (jetty-launcher-4169-thread-2) [    ] o.a.s.c.c.ConnectionManager Client is connected to ZooKeeper
   [junit4]   2> 3701547 INFO  (jetty-launcher-4169-thread-2) [    ] o.a.s.c.c.SolrZkClient Using default ZkACLProvider
   [junit4]   2> 3701547 INFO  (jetty-launcher-4169-thread-1) [    ] o.a.s.s.SolrDispatchFilter solr.xml found in ZooKeeper. Loading...
   [junit4]   2> 3701547 INFO  (jetty-launcher-4169-thread-2) [    ] o.a.s.s.SolrDispatchFilter solr.xml found in ZooKeeper. Loading...
   [junit4]   2> 3701557 INFO  (jetty-launcher-4169-thread-2) [    ] o.a.s.c.CorePropertiesLocator Config-defined core root directory: /Users/jenkins/workspace/Lucene-Solr-6.x-MacOSX/solr/build/solr-core/test/J0/temp/solr.schema.TestManagedSchemaAPI_B3E9F9E37A1DF316-001/tempDir-001/node2/.
   [junit4]   2> 3701558 INFO  (jetty-launcher-4169-thread-1) [    ] o.a.s.c.CorePropertiesLocator Config-defined core root directory: /Users/jenkins/workspace/Lucene-Solr-6.x-MacOSX/solr/build/solr-core/test/J0/temp/solr.schema.TestManagedSchemaAPI_B3E9F9E37A1DF316-001/tempDir-001/node1/.
   [junit4]   2> 3701558 INFO  (jetty-launcher-4169-thread-2) [    ] o.a.s.c.CoreContainer New CoreContainer 316081643
   [junit4]   2> 3701558 INFO  (jetty-launcher-4169-thread-1) [    ] o.a.s.c.CoreContainer New CoreContainer 1973423426
   [junit4]   2> 3701558 INFO  (jetty-launcher-4169-thread-2) [    ] o.a.s.c.CoreContainer Loading cores into CoreContainer [instanceDir=/Users/jenkins/workspace/Lucene-Solr-6.x-MacOSX/solr/build/solr-core/test/J0/temp/solr.schema.TestManagedSchemaAPI_B3E9F9E37A1DF316-001/tempDir-001/node2]
   [junit4]   2> 3701558 INFO  (jetty-launcher-4169-thread-1) [    ] o.a.s.c.CoreContainer Loading cores into CoreContainer [instanceDir=/Users/jenkins/workspace/Lucene-Solr-6.x-MacOSX/solr/build/solr-core/test/J0/temp/solr.schema.TestManagedSchemaAPI_B3E9F9E37A1DF316-001/tempDir-001/node1]
   [junit4]   2> 3701558 WARN  (jetty-launcher-4169-thread-2) [    ] o.a.s.c.CoreContainer Couldn't add files from /Users/jenkins/workspace/Lucene-Solr-6.x-MacOSX/solr/build/solr-core/test/J0/temp/solr.schema.TestManagedSchemaAPI_B3E9F9E37A1DF316-001/tempDir-001/node2/lib to classpath: /Users/jenkins/workspace/Lucene-Solr-6.x-MacOSX/solr/build/solr-core/test/J0/temp/solr.schema.TestManagedSchemaAPI_B3E9F9E37A1DF316-001/tempDir-001/node2/lib
   [junit4]   2> 3701558 WARN  (jetty-launcher-4169-thread-1) [    ] o.a.s.c.CoreContainer Couldn't add files from /Users/jenkins/workspace/Lucene-Solr-6.x-MacOSX/solr/build/solr-core/test/J0/temp/solr.schema.TestManagedSchemaAPI_B3E9F9E37A1DF316-001/tempDir-001/node1/lib to classpath: /Users/jenkins/workspace/Lucene-Solr-6.x-MacOSX/solr/build/solr-core/test/J0/temp/solr.schema.TestManagedSchemaAPI_B3E9F9E37A1DF316-001/tempDir-001/node1/lib
   [junit4]   2> 3701558 INFO  (jetty-launcher-4169-thread-2) [    ] o.a.s.h.c.HttpShardHandlerFactory created with socketTimeout : 90000,urlScheme : ,connTimeout : 15000,maxConnectionsPerHost : 20,maxConnections : 10000,corePoolSize : 0,maximumPoolSize : 2147483647,maxThreadIdleTime : 5,sizeOfQueue : -1,fairnessPolicy : false,useRetries : false,
   [junit4]   2> 3701558 INFO  (jetty-launcher-4169-thread-1) [    ] o.a.s.h.c.HttpShardHandlerFactory created with socketTimeout : 90000,urlScheme : ,connTimeout : 15000,maxConnectionsPerHost : 20,maxConnections : 10000,corePoolSize : 0,maximumPoolSize : 2147483647,maxThreadIdleTime : 5,sizeOfQueue : -1,fairnessPolicy : false,useRetries : false,
   [junit4]   2> 3701562 INFO  (jetty-launcher-4169-thread-2) [    ] o.a.s.u.UpdateShardHandler Creating UpdateShardHandler HTTP client with params: socketTimeout=340000&connTimeout=45000&retry=true
   [junit4]   2> 3701562 INFO  (jetty-launcher-4169-thread-1) [    ] o.a.s.u.UpdateShardHandler Creating UpdateShardHandler HTTP client with params: socketTimeout=340000&connTimeout=45000&retry=true
   [junit4]   2> 3701562 INFO  (jetty-launcher-4169-thread-2) [    ] o.a.s.l.LogWatcher SLF4J impl is org.slf4j.impl.Log4jLoggerFactory
   [junit4]   2> 3701562 INFO  (jetty-launcher-4169-thread-2) [    ] o.a.s.l.LogWatcher Registering Log Listener [Log4j (org.slf4j.impl.Log4jLoggerFactory)]
   [junit4]   2> 3701562 INFO  (jetty-launcher-4169-thread-1) [    ] o.a.s.l.LogWatcher SLF4J impl is org.slf4j.impl.Log4jLoggerFactory
   [junit4]   2> 3701562 INFO  (jetty-launcher-4169-thread-1) [    ] o.a.s.l.LogWatcher Registering Log Listener [Log4j (org.slf4j.impl.Log4jLoggerFactory)]
   [junit4]   2> 3701562 INFO  (jetty-launcher-4169-thread-2) [    ] o.a.s.c.ZkContainer Zookeeper client=127.0.0.1:55679/solr
   [junit4]   2> 3701562 INFO  (jetty-launcher-4169-thread-1) [    ] o.a.s.c.ZkContainer Zookeeper client=127.0.0.1:55679/solr
   [junit4]   2> 3701562 INFO  (jetty-launcher-4169-thread-2) [    ] o.a.s.c.ZkController zkHost includes chroot
   [junit4]   2> 3701562 INFO  (jetty-launcher-4169-thread-1) [    ] o.a.s.c.ZkController zkHost includes chroot
   [junit4]   2> 3701562 INFO  (jetty-launcher-4169-thread-2) [    ] o.a.s.c.c.SolrZkClient Using default ZkCredentialsProvider
   [junit4]   2> 3701563 INFO  (jetty-launcher-4169-thread-1) [    ] o.a.s.c.c.SolrZkClient Using default ZkCredentialsProvider
   [junit4]   2> 3701563 INFO  (jetty-launcher-4169-thread-2) [    ] o.a.s.c.c.ConnectionManager Waiting for client to connect to ZooKeeper
   [junit4]   2> 3701564 INFO  (jetty-launcher-4169-thread-1) [    ] o.a.s.c.c.ConnectionManager Waiting for client to connect to ZooKeeper
   [junit4]   2> 3701565 INFO  (zkCallback-4177-thread-1) [    ] o.a.s.c.c.ConnectionManager Watcher org.apache.solr.common.cloud.ConnectionManager@97cf58 name:ZooKeeperConnection Watcher:127.0.0.1:55679 got event WatchedEvent state:SyncConnected type:None path:null path:null type:None
   [junit4]   2> 3701565 INFO  (jetty-launcher-4169-thread-2) [    ] o.a.s.c.c.ConnectionManager Client is connected to ZooKeeper
   [junit4]   2> 3701565 INFO  (jetty-launcher-4169-thread-2) [    ] o.a.s.c.c.SolrZkClient Using default ZkACLProvider
   [junit4]   2> 3701565 INFO  (zkCallback-4178-thread-1) [    ] o.a.s.c.c.ConnectionManager Watcher org.apache.solr.common.cloud.ConnectionManager@bc36789 name:ZooKeeperConnection Watcher:127.0.0.1:55679 got event WatchedEvent state:SyncConnected type:None path:null path:null type:None
   [junit4]   2> 3701565 INFO  (jetty-launcher-4169-thread-1) [    ] o.a.s.c.c.ConnectionManager Client is connected to ZooKeeper
   [junit4]   2> 3701565 INFO  (jetty-launcher-4169-thread-1) [    ] o.a.s.c.c.SolrZkClient Using default ZkACLProvider
   [junit4]   2> 3701567 INFO  (jetty-launcher-4169-thread-2) [n:127.0.0.1:55682_solr    ] o.a.s.c.ZkController Added new OnReconnect listener org.apache.solr.cloud.ZkController$$Lambda$28/205133518@533b1111
   [junit4]   2> 3701567 INFO  (jetty-launcher-4169-thread-2) [n:127.0.0.1:55682_solr    ] o.a.s.c.c.ConnectionManager Waiting for client to connect to ZooKeeper
   [junit4]   2> 3701568 INFO  (jetty-launcher-4169-thread-1) [n:127.0.0.1:55681_solr    ] o.a.s.c.ZkController Added new OnReconnect listener org.apache.solr.cloud.ZkController$$Lambda$28/205133518@6df488a
   [junit4]   2> 3701569 INFO  (jetty-launcher-4169-thread-1) [n:127.0.0.1:55681_solr    ] o.a.s.c.c.ConnectionManager Waiting for client to connect to ZooKeeper
   [junit4]   2> 3701570 INFO  (zkCallback-4179-thread-1-processing-n:127.0.0.1:55682_solr) [n:127.0.0.1:55682_solr    ] o.a.s.c.c.ConnectionManager Watcher org.apache.solr.common.cloud.ConnectionManager@8f78799 name:ZooKeeperConnection Watcher:127.0.0.1:55679/solr got event WatchedEvent state:SyncConnected type:None path:null path:null type:None
   [junit4]   2> 3701571 INFO  (jetty-launcher-4169-thread-2) [n:127.0.0.1:55682_solr    ] o.a.s.c.c.ConnectionManager Client is connected to ZooKeeper
   [junit4]   2> 3701571 INFO  (zkCallback-4180-thread-1-processing-n:127.0.0.1:55681_solr) [n:127.0.0.1:55681_solr    ] o.a.s.c.c.ConnectionManager Watcher org.apache.solr.common.cloud.ConnectionManager@5ec9fa97 name:ZooKeeperConnection Watcher:127.0.0.1:55679/solr got event WatchedEvent state:SyncConnected type:None path:null path:null type:None
   [junit4]   2> 3701571 INFO  (jetty-launcher-4169-thread-1) [n:127.0.0.1:55681_solr    ] o.a.s.c.c.ConnectionManager Client is connected to ZooKeeper
   [junit4]   2> 3701574 INFO  (jetty-launcher-4169-thread-2) [n:127.0.0.1:55682_solr    ] o.a.s.c.c.SolrZkClient makePath: /overseer/queue
   [junit4]   2> 3701575 INFO  (jetty-launcher-4169-thread-1) [n:127.0.0.1:55681_solr    ] o.a.s.c.c.SolrZkClient makePath: /overseer/queue
   [junit4]   2> 3701579 INFO  (jetty-launcher-4169-thread-2) [n:127.0.0.1:55682_solr    ] o.a.s.c.c.SolrZkClient makePath: /overseer/collection-queue-work
   [junit4]   2> 3701579 INFO  (jetty-launcher-4169-thread-1) [n:127.0.0.1:55681_solr    ] o.a.s.c.c.SolrZkClient makePath: /overseer/collection-queue-work
   [junit4]   2> 3701584 INFO  (jetty-launcher-4169-thread-2) [n:127.0.0.1:55682_solr    ] o.a.s.c.c.SolrZkClient makePath: /overseer/collection-map-running
   [junit4]   2> 3701584 INFO  (jetty-launcher-4169-thread-1) [n:127.0.0.1:55681_solr    ] o.a.s.c.c.SolrZkClient makePath: /overseer/collection-map-running
   [junit4]   2> 3701586 INFO  (jetty-launcher-4169-thread-1) [n:127.0.0.1:55681_solr    ] o.a.s.c.c.SolrZkClient makePath: /overseer/collection-map-completed
   [junit4]   2> 3701587 INFO  (jetty-launcher-4169-thread-2) [n:127.0.0.1:55682_solr    ] o.a.s.c.c.SolrZkClient makePath: /overseer/collection-map-completed
   [junit4]   2> 3701590 INFO  (jetty-launcher-4169-thread-2) [n:127.0.0.1:55682_solr    ] o.a.s.c.c.SolrZkClient makePath: /overseer/collection-map-failure
   [junit4]   2> 3701590 INFO  (jetty-launcher-4169-thread-1) [n:127.0.0.1:55681_solr    ] o.a.s.c.c.SolrZkClient makePath: /overseer/collection-map-failure
   [junit4]   2> 3701592 INFO  (jetty-launcher-4169-thread-1) [n:127.0.0.1:55681_solr    ] o.a.s.c.c.SolrZkClient makePath: /live_nodes
   [junit4]   2> 3701592 INFO  (jetty-launcher-4169-thread-2) [n:127.0.0.1:55682_solr    ] o.a.s.c.c.SolrZkClient makePath: /live_nodes
   [junit4]   2> 3701594 INFO  (jetty-launcher-4169-thread-1) [n:127.0.0.1:55681_solr    ] o.a.s.c.c.SolrZkClient makePath: /collections
   [junit4]   2> 3701594 INFO  (jetty-launcher-4169-thread-2) [n:127.0.0.1:55682_solr    ] o.a.s.c.c.SolrZkClient makePath: /collections
   [junit4]   2> 3701596 INFO  (jetty-launcher-4169-thread-2) [n:127.0.0.1:55682_solr    ] o.a.s.c.c.SolrZkClient makePath: /aliases.json
   [junit4]   2> 3701596 INFO  (jetty-launcher-4169-thread-1) [n:127.0.0.1:55681_solr    ] o.a.s.c.c.SolrZkClient makePath: /aliases.json
   [junit4]   2> 3701598 INFO  (jetty-launcher-4169-thread-1) [n:127.0.0.1:55681_solr    ] o.a.s.c.c.SolrZkClient makePath: /clusterstate.json
   [junit4]   2> 3701598 INFO  (jetty-launcher-4169-thread-2) [n:127.0.0.1:55682_solr    ] o.a.s.c.c.SolrZkClient makePath: /clusterstate.json
   [junit4]   2> 3701599 INFO  (jetty-launcher-4169-thread-2) [n:127.0.0.1:55682_solr    ] o.a.s.c.c.SolrZkClient makePath: /security.json
   [junit4]   2> 3701600 INFO  (jetty-launcher-4169-thread-1) [n:127.0.0.1:55681_solr    ] o.a.s.c.c.SolrZkClient makePath: /security.json
   [junit4]   2> 3701601 INFO  (jetty-launcher-4169-thread-2) [n:127.0.0.1:55682_solr    ] o.a.s.c.c.ZkStateReader Updating cluster state from ZooKeeper... 
   [junit4]   2> 3701601 INFO  (jetty-launcher-4169-thread-1) [n:127.0.0.1:55681_solr    ] o.a.s.c.c.ZkStateReader Updating cluster state from ZooKeeper... 
   [junit4]   2> 3701602 INFO  (jetty-launcher-4169-thread-2) [n:127.0.0.1:55682_solr    ] o.a.s.c.c.ZkStateReader Loaded empty cluster properties
   [junit4]   2> 3701602 INFO  (jetty-launcher-4169-thread-1) [n:127.0.0.1:55681_solr    ] o.a.s.c.c.ZkStateReader Loaded empty cluster properties
   [junit4]   2> 3701603 INFO  (jetty-launcher-4169-thread-2) [n:127.0.0.1:55682_solr    ] o.a.s.c.c.ZkStateReader Updated live nodes from ZooKeeper... (0) -> (0)
   [junit4]   2> 3701604 INFO  (jetty-launcher-4169-thread-1) [n:127.0.0.1:55681_solr    ] o.a.s.c.c.ZkStateReader Updated live nodes from ZooKeeper... (0) -> (0)
   [junit4]   2> 3701608 INFO  (jetty-launcher-4169-thread-2) [n:127.0.0.1:55682_solr    ] o.a.s.c.c.SolrZkClient makePath: /overseer_elect
   [junit4]   2> 3701608 INFO  (jetty-launcher-4169-thread-1) [n:127.0.0.1:55681_solr    ] o.a.s.c.c.SolrZkClient makePath: /overseer_elect
   [junit4]   2> 3701610 INFO  (jetty-launcher-4169-thread-1) [n:127.0.0.1:55681_solr    ] o.a.s.c.c.SolrZkClient makePath: /overseer_elect/election
   [junit4]   2> 3701610 INFO  (jetty-launcher-4169-thread-2) [n:127.0.0.1:55682_solr    ] o.a.s.c.c.SolrZkClient makePath: /overseer_elect/election
   [junit4]   2> 3701612 INFO  (jetty-launcher-4169-thread-2) [n:127.0.0.1:55682_solr    ] o.a.s.c.Overseer Overseer (id=null) closing
   [junit4]   2> 3701612 INFO  (jetty-launcher-4169-thread-1) [n:127.0.0.1:55681_solr    ] o.a.s.c.Overseer Overseer (id=null) closing
   [junit4]   2> 3701612 INFO  (jetty-launcher-4169-thread-2) [n:127.0.0.1:55682_solr    ] o.a.s.c.LeaderElector Joined leadership election with path: /overseer_elect/election/95958459389509637-127.0.0.1:55682_solr-n_0000000000
   [junit4]   2> 3701613 INFO  (jetty-launcher-4169-thread-1) [n:127.0.0.1:55681_solr    ] o.a.s.c.LeaderElector Joined leadership election with path: /overseer_elect/election/95958459389509638-127.0.0.1:55681_solr-n_0000000001
   [junit4]   2> 3701613 INFO  (jetty-launcher-4169-thread-2) [n:127.0.0.1:55682_solr    ] o.a.s.c.OverseerElectionContext I am going to be the leader 127.0.0.1:55682_solr
   [junit4]   2> 3701613 INFO  (jetty-launcher-4169-thread-2) [n:127.0.0.1:55682_solr    ] o.a.s.c.c.SolrZkClient makePath: /overseer_elect/leader
   [junit4]   2> 3701614 INFO  (jetty-launcher-4169-thread-1) [n:127.0.0.1:55681_solr    ] o.a.s.c.LeaderElector Watching path /overseer_elect/election/95958459389509637-127.0.0.1:55682_solr-n_0000000000 to know if I could be the leader
   [junit4]   2> 3701614 INFO  (jetty-launcher-4169-thread-1) [n:127.0.0.1:55681_solr    ] o.a.s.c.ZkController Register node as live in ZooKeeper:/live_nodes/127.0.0.1:55681_solr
   [junit4]   2> 3701615 INFO  (jetty-launcher-4169-thread-1) [n:127.0.0.1:55681_solr    ] o.a.s.c.c.SolrZkClient makePath: /live_nodes/127.0.0.1:55681_solr
   [junit4]   2> 3701615 INFO  (jetty-launcher-4169-thread-2) [n:127.0.0.1:55682_solr    ] o.a.s.c.Overseer Overseer (id=95958459389509637-127.0.0.1:55682_solr-n_0000000000) starting
   [junit4]   2> 3701617 INFO  (zkCallback-4179-thread-1-processing-n:127.0.0.1:55682_solr) [n:127.0.0.1:55682_solr    ] o.a.s.c.c.ZkStateReader A live node change: [WatchedEvent state:SyncConnected type:NodeChildrenChanged path:/live_nodes], has occurred - updating... (live nodes size: [0])
   [junit4]   2> 3701617 INFO  (zkCallback-4180-thread-1-processing-n:127.0.0.1:55681_solr) [n:127.0.0.1:55681_solr    ] o.a.s.c.c.ZkStateReader A live node change: [WatchedEvent state:SyncConnected type:NodeChildrenChanged path:/live_nodes], has occurred - updating... (live nodes size: [0])
   [junit4]   2> 3701619 INFO  (zkCallback-4180-thread-1-processing-n:127.0.0.1:55681_solr) [n:127.0.0.1:55681_solr    ] o.a.s.c.c.ZkStateReader Updated live nodes from ZooKeeper... (0) -> (1)
   [junit4]   2> 3701619 INFO  (zkCallback-4179-thread-1-processing-n:127.0.0.1:55682_solr) [n:127.0.0.1:55682_solr    ] o.a.s.c.c.ZkStateReader Updated live nodes from ZooKeeper... (0) -> (1)
   [junit4]   2> 3701620 INFO  (jetty-launcher-4169-thread-2) [n:127.0.0.1:55682_solr    ] o.a.s.c.c.SolrZkClient makePath: /overseer/queue-work
   [junit4]   2> 3701626 INFO  (jetty-launcher-4169-thread-1) [n:127.0.0.1:55681_solr    ] o.a.s.c.CoreContainer Security conf doesn't exist. Skipping setup for authorization module.
   [junit4]   2> 3701626 INFO  (jetty-launcher-4169-thread-1) [n:127.0.0.1:55681_solr    ] o.a.s.c.CoreContainer No authentication plugin used.
   [junit4]   2> 3701630 INFO  (jetty-launcher-4169-thread-1) [n:127.0.0.1:55681_solr    ] o.a.s.c.CorePropertiesLocator Looking for core definitions underneath /Users/jenkins/workspace/Lucene-Solr-6.x-MacOSX/solr/build/solr-core/test/J0/temp/solr.schema.TestManagedSchemaAPI_B3E9F9E37A1DF316-001/tempDir-001/node1/.
   [junit4]   2> 3701630 INFO  (jetty-launcher-4169-thread-1) [n:127.0.0.1:55681_solr    ] o.a.s.c.CorePropertiesLocator Found 0 core definitions
   [junit4]   2> 3701631 INFO  (jetty-launcher-4169-thread-1) [n:127.0.0.1:55681_solr    ] o.a.s.s.SolrDispatchFilter user.dir=/Users/jenkins/workspace/Lucene-Solr-6.x-MacOSX/solr/build/solr-core/test/J0
   [junit4]   2> 3701631 INFO  (jetty-launcher-4169-thread-1) [n:127.0.0.1:55681_solr    ] o.a.s.s.SolrDispatchFilter SolrDispatchFilter.init() done
   [junit4]   2> 3701635 INFO  (jetty-launcher-4169-thread-2) [n:127.0.0.1:55682_solr    ] o.a.s.c.OverseerAutoReplicaFailoverThread Starting OverseerAutoReplicaFailoverThread autoReplicaFailoverWorkLoopDelay=10000 autoReplicaFailoverWaitAfterExpiration=30000 autoReplicaFailoverBadNodeExpiration=60000
   [junit4]   2> 3701635 INFO  (OverseerCollectionConfigSetProcessor-95958459389509637-127.0.0.1:55682_solr-n_0000000000) [n:127.0.0.1:55682_solr    ] o.a.s.c.OverseerTaskProcessor Process current queue of overseer operations
   [junit4]   2> 3701636 INFO  (OverseerStateUpdate-95958459389509637-127.0.0.1:55682_solr-n_0000000000) [n:127.0.0.1:55682_solr    ] o.a.s.c.Overseer Starting to work on the main queue
   [junit4]   2> 3701637 INFO  (jetty-launcher-4169-thread-2) [n:127.0.0.1:55682_solr    ] o.a.s.c.ZkController Publish node=127.0.0.1:55682_solr as DOWN
   [junit4]   2> 3701639 INFO  (OverseerStateUpdate-95958459389509637-127.0.0.1:55682_solr-n_0000000000) [n:127.0.0.1:55682_solr    ] o.a.s.c.c.ZkStateReader Updated live nodes from ZooKeeper... (1) -> (1)
   [junit4]   2> 3701641 INFO  (OverseerStateUpdate-95958459389509637-127.0.0.1:55682_solr-n_0000000000) [n:127.0.0.1:55682_solr    ] o.a.s.c.Overseer processMessage: queueSize: 1, message = {
   [junit4]   2>   "operation":"downnode",
   [junit4]   2>   "node_name":"127.0.0.1:55682_solr"} current state version: 0
   [junit4]   2> 3701641 INFO  (OverseerStateUpdate-95958459389509637-127.0.0.1:55682_solr-n_0000000000) [n:127.0.0.1:55682_solr    ] o.a.s.c.o.NodeMutator DownNode state invoked for node: 127.0.0.1:55682_solr
   [junit4]   2> 3702649 INFO  (jetty-launcher-4169-thread-2) [n:127.0.0.1:55682_solr    ] o.a.s.c.ZkController Register node as live in ZooKeeper:/live_nodes/127.0.0.1:55682_solr
   [junit4]   2> 3702650 INFO  (jetty-launcher-4169-thread-2) [n:127.0.0.1:55682_solr    ] o.a.s.c.c.SolrZkClient makePath: /live_nodes/127.0.0.1:55682_solr
   [junit4]   2> 3702652 INFO  (zkCallback-4179-thread-1-processing-n:127.0.0.1:55682_solr) [n:127.0.0.1:55682_solr    ] o.a.s.c.c.ZkStateReader A live node change: [WatchedEvent state:SyncConnected type:NodeChildrenChanged path:/live_nodes], has occurred - updating... (live nodes size: [1])
   [junit4]   2> 3702652 INFO  (zkCallback-4180-thread-1-processing-n:127.0.0.1:55681_solr) [n:127.0.0.1:55681_solr    ] o.a.s.c.c.ZkStateReader A live node change: [WatchedEvent state:SyncConnected type:NodeChildrenChanged path:/live_nodes], has occurred - updating... (live nodes size: [1])
   [junit4]   2> 3702653 INFO  (zkCallback-4179-thread-1-processing-n:127.0.0.1:55682_solr) [n:127.0.0.1:55682_solr    ] o.a.s.c.c.ZkStateReader Updated live nodes from ZooKeeper... (1) -> (2)
   [junit4]   2> 3702653 INFO  (zkCallback-4180-thread-1-processing-n:127.0.0.1:55681_solr) [n:127.0.0.1:55681_solr    ] o.a.s.c.c.ZkStateReader Updated live nodes from ZooKeeper... (1) -> (2)
   [junit4]   2> 3702659 INFO  (jetty-launcher-4169-thread-2) [n:127.0.0.1:55682_solr    ] o.a.s.c.CoreContainer Security conf doesn't exist. Skipping setup for authorization module.
   [junit4]   2> 3702659 INFO  (jetty-launcher-4169-thread-2) [n:127.0.0.1:55682_solr    ] o.a.s.c.CoreContainer No authentication plugin used.
   [junit4]   2> 3702660 INFO  (jetty-launcher-4169-thread-2) [n:127.0.0.1:55682_solr    ] o.a.s.c.CorePropertiesLocator Looking for core definitions underneath /Users/jenkins/workspace/Lucene-Solr-6.x-MacOSX/solr/build/solr-core/test/J0/temp/solr.schema.TestManagedSchemaAPI_B3E9F9E37A1DF316-001/tempDir-001/node2/.
   [junit4]   2> 3702660 INFO  (jetty-launcher-4169-thread-2) [n:127.0.0.1:55682_solr    ] o.a.s.c.CorePropertiesLocator Found 0 core definitions
   [junit4]   2> 3702662 INFO  (jetty-launcher-4169-thread-2) [n:127.0.0.1:55682_solr    ] o.a.s.s.SolrDispatchFilter user.dir=/Users/jenkins/workspace/Lucene-Solr-6.x-MacOSX/solr/build/solr-core/test/J0
   [junit4]   2> 3702662 INFO  (jetty-launcher-4169-thread-2) [n:127.0.0.1:55682_solr    ] o.a.s.s.SolrDispatchFilter SolrDispatchFilter.init() done
   [junit4]   2> 3702662 INFO  (SUITE-TestManagedSchemaAPI-seed#[B3E9F9E37A1DF316]-worker) [    ] o.a.s.c.c.SolrZkClient Using default ZkCredentialsProvider
   [junit4]   2> 3702662 INFO  (SUITE-TestManagedSchemaAPI-seed#[B3E9F9E37A1DF316]-worker) [    ] o.a.s.c.c.ConnectionManager Waiting for client to connect to ZooKeeper
   [junit4]   2> 3702664 INFO  (zkCallback-4183-thread-1) [    ] o.a.s.c.c.ConnectionManager Watcher org.apache.solr.common.cloud.ConnectionManager@16d1ead3 name:ZooKeeperConnection Watcher:127.0.0.1:55679 got event WatchedEvent state:SyncConnected type:None path:null path:null type:None
   [junit4]   2> 3702664 INFO  (SUITE-TestManagedSchemaAPI-seed#[B3E9F9E37A1DF316]-worker) [    ] o.a.s.c.c.ConnectionManager Client is connected to ZooKeeper
   [junit4]   2> 3702664 INFO  (SUITE-TestManagedSchemaAPI-seed#[B3E9F9E37A1DF316]-worker) [    ] o.a.s.c.c.SolrZkClient Using default ZkACLProvider
   [junit4]   2> 3702666 INFO  (SUITE-TestManagedSchemaAPI-seed#[B3E9F9E37A1DF316]-worker) [    ] o.a.s.c.s.i.CloudSolrClient Final constructed zkHost string: 127.0.0.1:55679/solr
   [junit4]   2> 3702666 INFO  (SUITE-TestManagedSchemaAPI-seed#[B3E9F9E37A1DF316]-worker) [    ] o.a.s.c.c.SolrZkClient Using default ZkCredentialsProvider
   [junit4]   2> 3702667 INFO  (SUITE-TestManagedSchemaAPI-seed#[B3E9F9E37A1DF316]-worker) [    ] o.a.s.c.c.ConnectionManager Waiting for client to connect to ZooKeeper
   [junit4]   2> 3702668 INFO  (zkCallback-4186-thread-1) [    ] o.a.s.c.c.ConnectionManager Watcher org.apache.solr.common.cloud.ConnectionManager@2a470c90 name:ZooKeeperConnection Watcher:127.0.0.1:55679/solr got event WatchedEvent state:SyncConnected type:None path:null path:null type:None
   [junit4]   2> 3702668 INFO  (SUITE-TestManagedSchemaAPI-seed#[B3E9F9E37A1DF316]-worker) [    ] o.a.s.c.c.ConnectionManager Client is connected to ZooKeeper
   [junit4]   2> 3702669 INFO  (SUITE-TestManagedSchemaAPI-seed#[B3E9F9E37A1DF316]-worker) [    ] o.a.s.c.c.SolrZkClient Using default ZkACLProvider
   [junit4]   2> 3702669 INFO  (SUITE-TestManagedSchemaAPI-seed#[B3E9F9E37A1DF316]-worker) [    ] o.a.s.c.c.ZkStateReader Updating cluster state from ZooKeeper... 
   [junit4]   2> 3702670 INFO  (SUITE-TestManagedSchemaAPI-seed#[B3E9F9E37A1DF316]-worker) [    ] o.a.s.c.c.ZkStateReader Loaded empty cluster properties
   [junit4]   2> 3702671 INFO  (SUITE-TestManagedSchemaAPI-seed#[B3E9F9E37A1DF316]-worker) [    ] o.a.s.c.c.ZkStateReader Updated live nodes from ZooKeeper... (0) -> (2)
   [junit4]   2> 3702673 INFO  (SUITE-TestManagedSchemaAPI-seed#[B3E9F9E37A1DF316]-worker) [    ] o.a.s.c.c.SolrZkClient makePath: /configs/conf1/managed-schema
   [junit4]   2> 3702677 INFO  (SUITE-TestManagedSchemaAPI-seed#[B3E9F9E37A1DF316]-worker) [    ] o.a.s.c.c.SolrZkClient makePath: /configs/conf1/solrconfig.xml
   [junit4]   2> 3702702 INFO  (TEST-TestManagedSchemaAPI.test-seed#[B3E9F9E37A1DF316]) [    ] o.a.s.SolrTestCaseJ4 ###Starting test
   [junit4]   2> 3702706 INFO  (qtp1128485469-21507) [n:127.0.0.1:55682_solr    ] o.a.s.h.a.CollectionsHandler Invoked Collection Action :create with params replicationFactor=2&collection.configName=conf1&name=testschemaapi&action=CREATE&numShards=1&wt=javabin&version=2 and sendToOCPQueue=true
   [junit4]   2> 3702710 INFO  (OverseerCollectionConfigSetProcessor-95958459389509637-127.0.0.1:55682_solr-n_0000000000) [n:127.0.0.1:55682_solr    ] o.a.s.c.OverseerTaskProcessor Overseer Collection Message Handler: Get the message id:/overseer/collection-queue-work/qn-0000000000 message:{
   [junit4]   2>   "name":"testschemaapi",
   [junit4]   2>   "fromApi":"true",
   [junit4]   2>   "replicationFactor":"2",
   [junit4]   2>   "collection.configName":"conf1",
   [junit4]   2>   "numShards":"1",
   [junit4]   2>   "stateFormat":"2",
   [junit4]   2>   "operation":"create"}
   [junit4]   2> 3702711 INFO  (OverseerThreadFactory-10171-thread-1-processing-n:127.0.0.1:55682_solr) [n:127.0.0.1:55682_solr    ] o.a.s.c.OverseerCollectionMessageHandler OverseerCollectionMessageHandler.processMessage : create , {
   [junit4]   2>   "name":"testschemaapi",
   [junit4]   2>   "fromApi":"true",
   [junit4]   2>   "replicationFactor":"2",
   [junit4]   2>   "collection.configName":"conf1",
   [junit4]   2>   "numShards":"1",
   [junit4]   2>   "stateFormat":"2",
   [junit4]   2>   "operation":"create"}
   [junit4]   2> 3702711 INFO  (OverseerThreadFactory-10171-thread-1-processing-n:127.0.0.1:55682_solr) [n:127.0.0.1:55682_solr    ] o.a.s.c.OverseerCollectionMessageHandler Create collection testschemaapi
   [junit4]   2> 3702712 INFO  (OverseerThreadFactory-10171-thread-1-processing-n:127.0.0.1:55682_solr) [n:127.0.0.1:55682_solr    ] o.a.s.c.OverseerCollectionMessageHandler creating collections conf node /collections/testschemaapi 
   [junit4]   2> 3702713 INFO  (OverseerThreadFactory-10171-thread-1-processing-n:127.0.0.1:55682_solr) [n:127.0.0.1:55682_solr    ] o.a.s.c.c.SolrZkClient makePath: /collections/testschemaapi
   [junit4]   2> 3702715 INFO  (zkCallback-4186-thread-1) [    ] o.a.s.c.c.ZkStateReader A collections change: [WatchedEvent state:SyncConnected type:NodeChildrenChanged path:/collections], has occurred - updating...
   [junit4]   2> 3702715 INFO  (zkCallback-4179-thread-1-processing-n:127.0.0.1:55682_solr) [n:127.0.0.1:55682_solr    ] o.a.s.c.c.ZkStateReader A collections change: [WatchedEvent state:SyncConnected type:NodeChildrenChanged path:/collections], has occurred - updating...
   [junit4]   2> 3702715 INFO  (zkCallback-4180-thread-1-processing-n:127.0.0.1:55681_solr) [n:127.0.0.1:55681_solr    ] o.a.s.c.c.ZkStateReader A collections change: [WatchedEvent state:SyncConnected type:NodeChildrenChanged path:/collections], has occurred - updating...
   [junit4]   2> 3702720 INFO  (OverseerStateUpdate-95958459389509637-127.0.0.1:55682_solr-n_0000000000) [n:127.0.0.1:55682_solr    ] o.a.s.c.Overseer processMessage: queueSize: 1, message = {
   [junit4]   2>   "name":"testschemaapi",
   [junit4]   2>   "fromApi":"true",
   [junit4]   2>   "replicationFactor":"2",
   [junit4]   2>   "collection.configName":"conf1",
   [junit4]   2>   "numShards":"1",
   [junit4]   2>   "stateFormat":"2",
   [junit4]   2>   "operation":"create"} current state version: 0
   [junit4]   2> 3702721 INFO  (OverseerStateUpdate-95958459389509637-127.0.0.1:55682_solr-n_0000000000) [n:127.0.0.1:55682_solr    ] o.a.s.c.o.ClusterStateMutator building a new cName: testschemaapi
   [junit4]   2> 3702722 INFO  (OverseerStateUpdate-95958459389509637-127.0.0.1:55682_solr-n_0000000000) [n:127.0.0.1:55682_solr    ] o.a.s.c.o.ZkStateWriter going to create_collection /collections/testschemaapi/state.json
   [junit4]   2> 3702820 INFO  (OverseerThreadFactory-10171-thread-1-processing-n:127.0.0.1:55682_solr) [n:127.0.0.1:55682_solr    ] o.a.s.c.OverseerCollectionMessageHandler Creating SolrCores for new collection testschemaapi, shardNames [shard1] , replicationFactor : 2
   [junit4]   2> 3702820 INFO  (OverseerThreadFactory-10171-thread-1-processing-n:127.0.0.1:55682_solr) [n:127.0.0.1:55682_solr    ] o.a.s.c.OverseerCollectionMessageHandler Creating core testschemaapi_shard1_replica1 as part of shard shard1 of collection testschemaapi on 127.0.0.1:55682_solr
   [junit4]   2> 3702821 INFO  (OverseerThreadFactory-10171-thread-1-processing-n:127.0.0.1:55682_solr) [n:127.0.0.1:55682_solr    ] o.a.s.c.OverseerCollectionMessageHandler Creating core testschemaapi_shard1_replica2 as part of shard shard1 of collection testschemaapi on 127.0.0.1:55681_solr
   [junit4]   2> 3702824 INFO  (qtp1128485469-21510) [n:127.0.0.1:55682_solr    ] o.a.s.h.a.CoreAdminOperation core create command qt=/admin/cores&collection.configName=conf1&name=testschemaapi_shard1_replica1&action=CREATE&numShards=1&collection=testschemaapi&shard=shard1&wt=javabin&version=2
   [junit4]   2> 3702824 INFO  (qtp1572750433-21499) [n:127.0.0.1:55681_solr    ] o.a.s.h.a.CoreAdminOperation core create command qt=/admin/cores&collection.configName=conf1&name=testschemaapi_shard1_replica2&action=CREATE&numShards=1&collection=testschemaapi&shard=shard1&wt=javabin&version=2
   [junit4]   2> 3702825 INFO  (qtp1572750433-21499) [n:127.0.0.1:55681_solr    ] o.a.s.c.CoreDescriptor Created CoreDescriptor: {name=testschemaapi_shard1_replica2, collection.configName=conf1, config=solrconfig.xml, transient=false, schema=schema.xml, loadOnStartup=true, configSetProperties=configsetprops.json, collection=testschemaapi, numShards=1, dataDir=data/, shard=shard1}
   [junit4]   2> 3702825 INFO  (qtp1128485469-21510) [n:127.0.0.1:55682_solr    ] o.a.s.c.CoreDescriptor Created CoreDescriptor: {name=testschemaapi_shard1_replica1, collection.configName=conf1, config=solrconfig.xml, transient=false, schema=schema.xml, loadOnStartup=true, configSetProperties=configsetprops.json, collection=testschemaapi, numShards=1, dataDir=data/, shard=shard1}
   [junit4]   2> 3702826 INFO  (qtp1572750433-21499) [n:127.0.0.1:55681_solr c:testschemaapi s:shard1  x:testschemaapi_shard1_replica2] o.a.s.c.ZkController publishing state=down
   [junit4]   2> 3702826 INFO  (qtp1128485469-21510) [n:127.0.0.1:55682_solr c:testschemaapi s:shard1  x:testschemaapi_shard1_replica1] o.a.s.c.ZkController publishing state=down
   [junit4]   2> 3702827 INFO  (qtp1572750433-21499) [n:127.0.0.1:55681_solr c:testschemaapi s:shard1  x:testschemaapi_shard1_replica2] o.a.s.c.ZkController Registering watch for collection testschemaapi
   [junit4]   2> 3702828 INFO  (qtp1128485469-21510) [n:127.0.0.1:55682_solr c:testschemaapi s:shard1  x:testschemaapi_shard1_replica1] o.a.s.c.ZkController Registering watch for collection testschemaapi
   [junit4]   2> 3702828 INFO  (qtp1572750433-21499) [n:127.0.0.1:55681_solr c:testschemaapi s:shard1  x:testschemaapi_shard1_replica2] o.a.s.c.c.ZkStateReader Add data for [testschemaapi] ver [0]
   [junit4]   2> 3702828 INFO  (OverseerStateUpdate-95958459389509637-127.0.0.1:55682_solr-n_0000000000) [n:127.0.0.1:55682_solr    ] o.a.s.c.Overseer processMessage: queueSize: 2, message = {
   [junit4]   2>   "core":"testschemaapi_shard1_replica2",
   [junit4]   2>   "roles":null,
   [junit4]   2>   "base_url":"http://127.0.0.1:55681/solr",
   [junit4]   2>   "node_name":"127.0.0.1:55681_solr",
   [junit4]   2>   "numShards":"1",
   [junit4]   2>   "state":"down",
   [junit4]   2>   "shard":"shard1",
   [junit4]   2>   "collection":"testschemaapi",
   [junit4]   2>   "operation":"state"} current state version: 0
   [junit4]   2> 3702829 INFO  (qtp1572750433-21499) [n:127.0.0.1:55681_solr c:testschemaapi s:shard1  x:testschemaapi_shard1_replica2] o.a.s.c.ZkController look for our core node name
   [junit4]   2> 3702829 INFO  (qtp1128485469-21510) [n:127.0.0.1:55682_solr c:testschemaapi s:shard1  x:testschemaapi_shard1_replica1] o.a.s.c.c.ZkStateReader Add data for [testschemaapi] ver [0]
   [junit4]   2> 3702829 INFO  (OverseerStateUpdate-95958459389509637-127.0.0.1:55682_solr-n_0000000000) [n:127.0.0.1:55682_solr    ] o.a.s.c.o.ReplicaMutator Update state numShards=1 message={
   [junit4]   2>   "core":"testschemaapi_shard1_replica2",
   [junit4]   2>   "roles":null,
   [junit4]   2>   "base_url":"http://127.0.0.1:55681/solr",
   [junit4]   2>   "node_name":"127.0.0.1:55681_solr",
   [junit4]   2>   "numShards":"1",
   [junit4]   2>   "state":"down",
   [junit4]   2>   "shard":"shard1",
   [junit4]   2>   "collection":"testschemaapi",
   [junit4]   2>   "operation":"state"}
   [junit4]   2> 3702830 INFO  (qtp1128485469-21510) [n:127.0.0.1:55682_solr c:testschemaapi s:shard1  x:testschemaapi_shard1_replica1] o.a.s.c.ZkController look for our core node name
   [junit4]   2> 3702832 INFO  (OverseerStateUpdate-95958459389509637-127.0.0.1:55682_solr-n_0000000000) [n:127.0.0.1:55682_solr    ] o.a.s.c.Overseer processMessage: queueSize: 2, message = {
   [junit4]   2>   "core":"testschemaapi_shard1_replica1",
   [junit4]   2>   "roles":null,
   [junit4]   2>   "base_url":"http://127.0.0.1:55682/solr",
   [junit4]   2>   "node_name":"127.0.0.1:55682_solr",
   [junit4]   2>   "numShards":"1",
   [junit4]   2>   "state":"down",
   [junit4]   2>   "shard":"shard1",
   [junit4]   2>   "collection":"testschemaapi",
   [junit4]   2>   "operation":"state"} current state version: 0
   [junit4]   2> 3702832 INFO  (OverseerStateUpdate-95958459389509637-127.0.0.1:55682_solr-n_0000000000) [n:127.0.0.1:55682_solr    ] o.a.s.c.o.ReplicaMutator Update state numShards=1 message={
   [junit4]   2>   "core":"testschemaapi_shard1_replica1",
   [junit4]   2>   "roles":null,
   [junit4]   2>   "base_url":"http://127.0.0.1:55682/solr",
   [junit4]   2>   "node_name":"127.0.0.1:55682_solr",
   [junit4]   2>   "numShards":"1",
   [junit4]   2>   "state":"down",
   [junit4]   2>   "shard":"shard1",
   [junit4]   2>   "collection":"testschemaapi",
   [junit4]   2>   "operation":"state"}
   [junit4]   2> 3702937 INFO  (OverseerStateUpdate-95958459389509637-127.0.0.1:55682_solr-n_0000000000) [n:127.0.0.1:55682_solr    ] o.a.s.c.o.ZkStateWriter going to update_collection /collections/testschemaapi/state.json version: 0
   [junit4]   2> 3702938 INFO  (zkCallback-4180-thread-1-processing-n:127.0.0.1:55681_solr) [n:127.0.0.1:55681_solr    ] o.a.s.c.c.ZkStateReader A cluster state change: [WatchedEvent state:SyncConnected type:NodeDataChanged path:/collections/testschemaapi/state.json] for collection [testschemaapi] has occurred - updating... (live nodes size: [2])
   [junit4]   2> 3702938 INFO  (zkCallback-4179-thread-1-processing-n:127.0.0.1:55682_solr) [n:127.0.0.1:55682_solr    ] o.a.s.c.c.ZkStateReader A cluster state change: [WatchedEvent state:SyncConnected type:NodeDataChanged path:/collections/testschemaapi/state.json] for collection [testschemaapi] has occurred - updating... (live nodes size: [2])
   [junit4]   2> 3702939 INFO  (zkCallback-4180-thread-1-processing-n:127.0.0.1:55681_solr) [n:127.0.0.1:55681_solr    ] o.a.s.c.c.ZkStateReader Updating data for [testschemaapi] from [0] to [1]
   [junit4]   2> 3702939 INFO  (zkCallback-4179-thread-1-processing-n:127.0.0.1:55682_solr) [n:127.0.0.1:55682_solr    ] o.a.s.c.c.ZkStateReader Updating data for [testschemaapi] from [0] to [1]
   [junit4]   2> 3703829 INFO  (qtp1572750433-21499) [n:127.0.0.1:55681_solr c:testschemaapi s:shard1  x:testschemaapi_shard1_replica2] o.a.s.c.ZkController waiting to find shard id in clusterstate for testschemaapi_shard1_replica2
   [junit4]   2> 3703830 INFO  (qtp1572750433-21499) [n:127.0.0.1:55681_solr c:testschemaapi s:shard1  x:testschemaapi_shard1_replica2] o.a.s.c.ZkController Check for collection zkNode:testschemaapi
   [junit4]   2> 3703830 INFO  (qtp1128485469-21510) [n:127.0.0.1:55682_solr c:testschemaapi s:shard1  x:testschemaapi_shard1_replica1] o.a.s.c.ZkController waiting to find shard id in clusterstate for testschemaapi_shard1_replica1
   [junit4]   2> 3703830 INFO  (qtp1572750433-21499) [n:127.0.0.1:55681_solr c:testschemaapi s:shard1  x:testschemaapi_shard1_replica2] o.a.s.c.ZkController Collection zkNode exists
   [junit4]   2> 3703830 INFO  (qtp1572750433-21499) [n:127.0.0.1:55681_solr c:testschemaapi s:shard1  x:testschemaapi_shard1_replica2] o.a.s.c.c.ZkStateReader Load collection config from: [/collections/testschemaapi]
   [junit4]   2> 3703830 INFO  (qtp1128485469-21510) [n:127.0.0.1:55682_solr c:testschemaapi s:shard1  x:testschemaapi_shard1_replica1] o.a.s.c.ZkController Check for collection zkNode:testschemaapi
   [junit4]   2> 3703831 INFO  (qtp1128485469-21510) [n:127.0.0.1:55682_solr c:testschemaapi s:shard1  x:testschemaapi_shard1_replica1] o.a.s.c.ZkController Collection zkNode exists
   [junit4]   2> 3703831 INFO  (qtp1128485469-21510) [n:127.0.0.1:55682_solr c:testschemaapi s:shard1  x:testschemaapi_shard1_replica1] o.a.s.c.c.ZkStateReader Load collection config from: [/collections/testschemaapi]
   [junit4]   2> 3703831 INFO  (qtp1572750433-21499) [n:127.0.0.1:55681_solr c:testschemaapi s:shard1  x:testschemaapi_shard1_replica2] o.a.s.c.c.ZkStateReader path=[/collections/testschemaapi] [configName]=[conf1] specified config exists in ZooKeeper
   [junit4]   2> 3703831 INFO  (qtp1572750433-21499) [n:127.0.0.1:55681_solr c:testschemaapi s:shard1  x:testschemaapi_shard1_replica2] o.a.s.c.SolrResourceLoader new SolrResourceLoader for directory: '/Users/jenkins/workspace/Lucene-Solr-6.x-MacOSX/solr/build/solr-core/test/J0/temp/solr.schema.TestManagedSchemaAPI_B3E9F9E37A1DF316-001/tempDir-001/node1/testschemaapi_shard1_replica2'
   [junit4]   2> 3703832 INFO  (qtp1572750433-21499) [n:127.0.0.1:55681_solr c:testschemaapi s:shard1  x:testschemaapi_shard1_replica2] o.a.s.c.SolrResourceLoader JNDI not configured for solr (NoInitialContextEx)
   [junit4]   2> 3703832 INFO  (qtp1572750433-21499) [n:127.0.0.1:55681_solr c:testschemaapi s:shard1  x:testschemaapi_shard1_replica2] o.a.s.c.SolrResourceLoader solr home defaulted to 'solr/' (could not find system property or JNDI)
   [junit4]   2> 3703833 INFO  (qtp1128485469-21510) [n:127.0.0.1:55682_solr c:testschemaapi s:shard1  x:testschemaapi_shard1_replica1] o.a.s.c.c.ZkStateReader path=[/collections/testschemaapi] [configName]=[conf1] specified config exists in ZooKeeper
   [junit4]   2> 3703833 INFO  (qtp1128485469-21510) [n:127.0.0.1:55682_solr c:testschemaapi s:shard1  x:testschemaapi_shard1_replica1] o.a.s.c.SolrResourceLoader new SolrResourceLoader for directory: '/Users/jenkins/workspace/Lucene-Solr-6.x-MacOSX/solr/build/solr-core/test/J0/temp/solr.schema.TestManagedSchemaAPI_B3E9F9E37A1DF316-001/tempDir-001/node2/testschemaapi_shard1_replica1'
   [junit4]   2> 3703834 INFO  (qtp1128485469-21510) [n:127.0.0.1:55682_solr c:testschemaapi s:shard1  x:testschemaapi_shard1_replica1] o.a.s.c.SolrResourceLoader JNDI not configured for solr (NoInitialContextEx)
   [junit4]   2> 3703834 INFO  (qtp1128485469-21510) [n:127.0.0.1:55682_solr c:testschemaapi s:shard1  x:testschemaapi_shard1_replica1] o.a.s.c.SolrResourceLoader solr home defaulted to 'solr/' (could not find system property or JNDI)
   [junit4]   2> 3703835 INFO  (qtp1572750433-21499) [n:127.0.0.1:55681_solr c:testschemaapi s:shard1  x:testschemaapi_shard1_replica2] o.a.s.c.Config loaded config solrconfig.xml with version 0 
   [junit4]   2> 3703836 INFO  (qtp1128485469-21510) [n:127.0.0.1:55682_solr c:testschemaapi s:shard1  x:testschemaapi_shard1_replica1] o.a.s.c.Config loaded config solrconfig.xml with version 0 
   [junit4]   2> 3703840 INFO  (qtp1128485469-21510) [n:127.0.0.1:55682_solr c:testschemaapi s:shard1  x:testschemaapi_shard1_replica1] o.a.s.c.SolrConfig current version of requestparams : -1
   [junit4]   2> 3703840 INFO  (qtp1572750433-21499) [n:127.0.0.1:55681_solr c:testschemaapi s:shard1  x:testschemaapi_shard1_replica2] o.a.s.c.SolrConfig current version of requestparams : -1
   [junit4]   2> 3703843 INFO  (qtp1572750433-21499) [n:127.0.0.1:55681_solr c:testschemaapi s:shard1  x:testschemaapi_shard1_replica2] o.a.s.c.SolrConfig Using Lucene MatchVersion: 6.1.0
   [junit4]   2> 3703844 INFO  (qtp1128485469-21510) [n:127.0.0.1:55682_solr c:testschemaapi s:shard1  x:testschemaapi_shard1_replica1] o.a.s.c.SolrConfig Using Lucene MatchVersion: 6.1.0
   [junit4]   2> 3703850 INFO  (qtp1572750433-21499) [n:127.0.0.1:55681_solr c:testschemaapi s:shard1  x:testschemaapi_shard1_replica2] o.a.s.c.SolrConfig Loaded SolrConfig: solrconfig.xml
   [junit4]   2> 3703851 INFO  (qtp1128485469-21510) [n:127.0.0.1:55682_solr c:testschemaapi s:shard1  x:testschemaapi_shard1_replica1] o.a.s.c.SolrConfig Loaded SolrConfig: solrconfig.xml
   [junit4]   2> 3703855 INFO  (qtp1572750433-21499) [n:127.0.0.1:55681_solr c:testschemaapi s:shard1  x:testschemaapi_shard1_replica2] o.a.s.s.IndexSchema [testschemaapi_shard1_replica2] Schema name=minimal
   [junit4]   2> 3703855 INFO  (qtp1128485469-21510) [n:127.0.0.1:55682_solr c:testschemaapi s:shard1  x:testschemaapi_shard1_replica1] o.a.s.s.IndexSchema [testschemaapi_shard1_replica1] Schema name=minimal
   [junit4]   2> 3703901 INFO  (qtp1128485469-21510) [n:127.0.0.1:55682_solr c:testschemaapi s:shard1  x:testschemaapi_shard1_replica1] o.a.s.s.IndexSchema unique key field: id
   [junit4]   2> 3703901 INFO  (qtp1572750433-21499) [n:127.0.0.1:55681_solr c:testschemaapi s:shard1  x:testschemaapi_shard1_replica2] o.a.s.s.IndexSchema unique key field: id
   [junit4]   2> 3703904 INFO  (qtp1572750433-21499) [n:127.0.0.1:55681_solr c:testschemaapi s:shard1  x:testschemaapi_shard1_replica2] o.a.s.c.ConfigSetProperties Did not find ConfigSet properties, assuming default properties: Can't find resource 'configsetprops.json' in classpath or '/configs/conf1', cwd=/Users/jenkins/workspace/Lucene-Solr-6.x-MacOSX/solr/build/solr-core/test/J0
   [junit4]   2> 3703904 INFO  (qtp1128485469-21510) [n:127.0.0.1:55682_solr c:testschemaapi s:shard1  x:testschemaapi_shard1_replica1] o.a.s.c.ConfigSetProperties Did not find ConfigSet properties, assuming default properties: Can't find resource 'configsetprops.json' in classpath or '/configs/conf1', cwd=/Users/jenkins/workspace/Lucene-Solr-6.x-MacOSX/solr/build/solr-core/test/J0
   [junit4]   2> 3703904 INFO  (qtp1572750433-21499) [n:127.0.0.1:55681_solr c:testschemaapi s:shard1  x:testschemaapi_shard1_replica2] o.a.s.c.CoreContainer Creating SolrCore 'testschemaapi_shard1_replica2' using configuration from collection testschemaapi
   [junit4]   2> 3703904 INFO  (qtp1128485469-21510) [n:127.0.0.1:55682_solr c:testschemaapi s:shard1  x:testschemaapi_shard1_replica1] o.a.s.c.CoreContainer Creating SolrCore 'testschemaapi_shard1_replica1' using configuration from collection testschemaapi
   [junit4]   2> 3703905 INFO  (qtp1572750433-21499) [n:127.0.0.1:55681_solr c:testschemaapi s:shard1 r:core_node1 x:testschemaapi_shard1_replica2] o.a.s.c.SolrCore org.apache.solr.core.MockDirectoryFactory
   [junit4]   2> 3703905 INFO  (qtp1128485469-21510) [n:127.0.0.1:55682_solr c:testschemaapi s:shard1 r:core_node2 x:testschemaapi_shard1_replica1] o.a.s.c.SolrCore org.apache.solr.core.MockDirectoryFactory
   [junit4]   2> 3703905 INFO  (qtp1572750433-21499) [n:127.0.0.1:55681_solr c:testschemaapi s:shard1 r:core_node1 x:testschemaapi_shard1_replica2] o.a.s.c.SolrCore [[testschemaapi_shard1_replica2] ] Opening new SolrCore at [/Users/jenkins/workspace/Lucene-Solr-6.x-MacOSX/solr/build/solr-core/test/J0/temp/solr.schema.TestManagedSchemaAPI_B3E9F9E37A1DF316-001/tempDir-001/node1/testschemaapi_shard1_replica2], dataDir=[/Users/jenkins/workspace/Lucene-Solr-6.x-MacOSX/solr/build/solr-core/test/J0/temp/solr.schema.TestManagedSchemaAPI_B3E9F9E37A1DF316-001/tempDir-001/node1/./testschemaapi_shard1_replica2/data/]
   [junit4]   2> 3703905 INFO  (qtp1572750433-21499) [n:127.0.0.1:55681_solr c:testschemaapi s:shard1 r:core_node1 x:testschemaapi_shard1_replica2] o.a.s.c.SolrCore JMX monitoring not detected for core: testschemaapi_shard1_replica2
   [junit4]   2> 3703905 INFO  (qtp1128485469-21510) [n:127.0.0.1:55682_solr c:testschemaapi s:shard1 r:core_node2 x:testschemaapi_shard1_replica1] o.a.s.c.SolrCore [[testschemaapi_shard1_replica1] ] Opening new SolrCore at [/Users/jenkins/workspace/Lucene-Solr-6.x-MacOSX/solr/build/solr-core/test/J0/temp/solr.schema.TestManagedSchemaAPI_B3E9F9E37A1DF316-001/tempDir-001/node2/testschemaapi_shard1_replica1], dataDir=[/Users/jenkins/workspace/Lucene-Solr-6.x-MacOSX/solr/build/solr-core/test/J0/temp/solr.schema.TestManagedSchemaAPI_B3E9F9E37A1DF316-001/tempDir-001/node2/./testschemaapi_shard1_replica1/data/]
   [junit4]   2> 3703905 INFO  (qtp1128485469-21510) [n:127.0.0.1:55682_solr c:testschemaapi s:shard1 r:core_node2 x:testschemaapi_shard1_replica1] o.a.s.c.SolrCore JMX monitoring not detected for core: testschemaapi_shard1_replica1
   [junit4]   2> 3703906 INFO  (qtp1572750433-21499) [n:127.0.0.1:55681_solr c:testschemaapi s:shard1 r:core_node1 x:testschemaapi_shard1_replica2] o.a.s.c.CachingDirectoryFactory return new directory for /Users/jenkins/workspace/Lucene-Solr-6.x-MacOSX/solr/build/solr-core/test/J0/temp/solr.schema.TestManagedSchemaAPI_B3E9F9E37A1DF316-001/tempDir-001/node1/./testschemaapi_shard1_replica2/data
   [junit4]   2> 3703906 INFO  (qtp1572750433-21499) [n:127.0.0.1:55681_solr c:testschemaapi s:shard1 r:core_node1 x:testschemaapi_shard1_replica2] o.a.s.c.SolrCore New index directory detected: old=null new=/Users/jenkins/workspace/Lucene-Solr-6.x-MacOSX/solr/build/solr-core/test/J0/temp/solr.schema.TestManagedSchemaAPI_B3E9F9E37A1DF316-001/tempDir-001/node1/./testschemaapi_shard1_replica2/data/index/
   [junit4]   2> 3703906 INFO  (qtp1128485469-21510) [n:127.0.0.1:55682_solr c:testschemaapi s:shard1 r:core_node2 x:testschemaapi_shard1_replica1] o.a.s.c.CachingDirectoryFactory return new directory for /Users/jenkins/workspace/Lucene-Solr-6.x-MacOSX/solr/build/solr-core/test/J0/temp/solr.schema.TestManagedSchemaAPI_B3E9F9E37A1DF316-001/tempDir-001/node2/./testschemaapi_shard1_replica1/data
   [junit4]   2> 3703906 WARN  (qtp1572750433-21499) [n:127.0.0.1:55681_solr c:testschemaapi s:shard1 r:core_node1 x:testschemaapi_shard1_replica2] o.a.s.c.SolrCore [testschemaapi_shard1_replica2] Solr index directory '/Users/jenkins/workspace/Lucene-Solr-6.x-MacOSX/solr/build/solr-core/test/J0/temp/solr.schema.TestManagedSchemaAPI_B3E9F9E37A1DF316-001/tempDir-001/node1/./testschemaapi_shard1_replica2/data/index' doesn't exist. Creating new index...
   [junit4]   2> 3703906 INFO  (qtp1128485469-21510) [n:127.0.0.1:55682_solr c:testschemaapi s:shard1 r:core_node2 x:testschemaapi_shard1_replica1] o.a.s.c.SolrCore New index directory detected: old=null new=/Users/jenkins/workspace/Lucene-Solr-6.x-MacOSX/solr/build/solr-core/test/J0/temp/solr.schema.TestManagedSchemaAPI_B3E9F9E37A1DF316-001/tempDir-001/node2/./testschemaapi_shard1_replica1/data/index/
   [junit4]   2> 3703907 WARN  (qtp1128485469-21510) [n:127.0.0.1:55682_solr c:testschemaapi s:shard1 r:core_node2 x:testschemaapi_shard1_replica1] o.a.s.c.SolrCore [testschemaapi_shard1_replica1] Solr index directory '/Users/jenkins/workspace/Lucene-Solr-6.x-MacOSX/solr/build/solr-core/test/J0/temp/solr.schema.TestManagedSchemaAPI_B3E9F9E37A1DF316-001/tempDir-001/node2/./testschemaapi_shard1_replica1/data/index' doesn't exist. Creating new index...
   [junit4]   2> 3703907 INFO  (qtp1572750433-21499) [n:127.0.0.1:55681_solr c:testschemaapi s:shard1 r:core_node1 x:testschemaapi_shard1_replica2] o.a.s.c.CachingDirectoryFactory return new directory for /Users/jenkins/workspace/Lucene-Solr-6.x-MacOSX/solr/build/solr-core/test/J0/temp/solr.schema.TestManagedSchemaAPI_B3E9F9E37A1DF316-001/tempDir-001/node1/./testschemaapi_shard1_replica2/data/index
   [junit4]   2> 3703907 INFO  (qtp1128485469-21510) [n:127.0.0.1:55682_solr c:testschemaapi s:shard1 r:core_node2 x:testschemaapi_shard1_replica1] o.a.s.c.CachingDirectoryFactory return new directory for /Users/jenkins/workspace/Lucene-Solr-6.x-MacOSX/solr/build/solr-core/test/J0/temp/solr.schema.TestManagedSchemaAPI_B3E9F9E37A1DF316-001/tempDir-001/node2/./testschemaapi_shard1_replica1/data/index
   [junit4]   2> 3703908 INFO  (qtp1572750433-21499) [n:127.0.0.1:55681_solr c:testschemaapi s:shard1 r:core_node1 x:testschemaapi_shard1_replica2] o.a.s.c.SolrDeletionPolicy SolrDeletionPolicy.onCommit: commits: num=1
   [junit4]   2> 	commit{dir=MockDirectoryWrapper(RAMDirectory@19a967bb lockFactory=org.apache.lucene.store.SingleInstanceLockFactory@45c9e942),segFN=segments_1,generation=1}
   [junit4]   2> 3703908 INFO  (qtp1572750433-21499) [n:127.0.0.1:55681_solr c:testschemaapi s:shard1 r:core_node1 x:testschemaapi_shard1_replica2] o.a.s.c.SolrDeletionPolicy newest commit generation = 1
   [junit4]   2> 3703908 INFO  (qtp1128485469-21510) [n:127.0.0.1:55682_solr c:testschemaapi s:shard1 r:core_node2 x:testschemaapi_shard1_replica1] o.a.s.c.SolrDeletionPolicy SolrDeletionPolicy.onCommit: commits: num=1
   [junit4]   2> 	commit{dir=MockDirectoryWrapper(RAMDirectory@6843e487 lockFactory=org.apache.lucene.store.SingleInstanceLockFactory@573e3947),segFN=segments_1,generation=1}
   [junit4]   2> 3703908 INFO  (qtp1128485469-21510) [n:127.0.0.1:55682_solr c:testschemaapi s:shard1 r:core_node2 x:testschemaapi_shard1_replica1] o.a.s.c.SolrDeletionPolicy newest commit generation = 1
   [junit4]   2> 3703909 INFO  (OldIndexDirectoryCleanupThreadForCore-testschemaapi_shard1_replica2) [n:127.0.0.1:55681_solr c:testschemaapi s:shard1 r:core_node1 x:testschemaapi_shard1_replica2] o.a.s.c.SolrCore Looking for old index directories to cleanup for core testschemaapi_shard1_replica2 in /Users/jenkins/workspace/Lucene-Solr-6.x-MacOSX/solr/build/solr-core/test/J0/temp/solr.schema.TestManagedSchemaAPI_B3E9F9E37A1DF316-001/tempDir-001/node1/./testschemaapi_shard1_replica2/data/
   [junit4]   2> 3703909 WARN  (OldIndexDirectoryCleanupThreadForCore-testschemaapi_shard1_replica2) [n:127.0.0.1:55681_solr c:testschemaapi s:shard1 r:core_node1 x:testschemaapi_shard1_replica2] o.a.s.c.DirectoryFactory /Users/jenkins/workspace/Lucene-Solr-6.x-MacOSX/solr/build/solr-core/test/J0/temp/solr.schema.TestManagedSchemaAPI_B3E9F9E37A1DF316-001/tempDir-001/node1/./testschemaapi_shard1_replica2/data/ does not point to a valid data directory; skipping clean-up of old index directories.
   [junit4]   2> 3703909 INFO  (OldIndexDirectoryCleanupThreadForCore-testschemaapi_shard1_replica1) [n:127.0.0.1:55682_solr c:testschemaapi s:shard1 r:core_node2 x:testschemaapi_shard1_replica1] o.a.s.c.SolrCore Looking for old index directories to cleanup for core testschemaapi_shard1_replica1 in /Users/jenkins/workspace/Lucene-Solr-6.x-MacOSX/solr/build/solr-core/test/J0/temp/solr.schema.TestManagedSchemaAPI_B3E9F9E37A1DF316-001/tempDir-001/node2/./testschemaapi_shard1_replica1/data/
   [junit4]   2> 3703910 WARN  (OldIndexDirectoryCleanupThreadForCore-testschemaapi_shard1_replica1) [n:127.0.0.1:55682_solr c:testschemaapi s:shard1 r:core_node2 x:testschemaapi_shard1_replica1] o.a.s.c.DirectoryFactory /Users/jenkins/workspace/Lucene-Solr-6.x-MacOSX/solr/build/solr-core/test/J0/temp/solr.schema.TestManagedSchemaAPI_B3E9F9E37A1DF316-001/tempDir-001/node2/./testschemaapi_shard1_replica1/data/ does not point to a valid data directory; skipping clean-up of old index directories.
   [junit4]   2> 3703910 INFO  (qtp1572750433-21499) [n:127.0.0.1:55681_solr c:testschemaapi s:shard1 r:core_node1 x:testschemaapi_shard1_replica2] o.a.s.c.SolrCore no updateRequestProcessorChain defined as default, creating implicit default
   [junit4]   2> 3703911 INFO  (qtp1128485469-21510) [n:127.0.0.1:55682_solr c:testschemaapi s:shard1 r:core_node2 x:testschemaapi_shard1_replica1] o.a.s.c.SolrCore no updateRequestProcessorChain defined as default, creating implicit default
   [junit4]   2> 3703916 INFO  (qtp1572750433-21499) [n:127.0.0.1:55681_solr c:testschemaapi s:shard1 r:core_node1 x:testschemaapi_shard1_replica2] o.a.s.h.l.XMLLoader xsltCacheLifetimeSeconds=60
   [junit4]   2> 3703916 INFO  (qtp1128485469-21510) [n:127.0.0.1:55682_solr c:testschemaapi s:shard1 r:core_node2 x:testschemaapi_shard1_replica1] o.a.s.h.l.XMLLoader xsltCacheLifetimeSeconds=60
   [junit4]   2> 3703917 INFO  (qtp1572750433-21499) [n:127.0.0.1:55681_solr c:testschemaapi s:shard1 r:core_node1 x:testschemaapi_shard1_replica2] o.a.s.h.l.XMLLoader xsltCacheLifetimeSeconds=60
   [junit4]   2> 3703918 INFO  (qtp1128485469-21510) [n:127.0.0.1:55682_solr c:testschemaapi s:shard1 r:core_node2 x:testschemaapi_shard1_replica1] o.a.s.h.l.XMLLoader xsltCacheLifetimeSeconds=60
   [junit4]   2> 3703919 INFO  (qtp1128485469-21510) [n:127.0.0.1:55682_solr c:testschemaapi s:shard1 r:core_node2 x:testschemaapi_shard1_replica1] o.a.s.h.l.XMLLoader xsltCacheLifetimeSeconds=60
   [junit4]   2> 3703919 INFO  (qtp1572750433-21499) [n:127.0.0.1:55681_solr c:testschemaapi s:shard1 r:core_node1 x:testschemaapi_shard1_replica2] o.a.s.h.l.XMLLoader xsltCacheLifetimeSeconds=60
   [junit4]   2> 3703920 INFO  (qtp1128485469-21510) [n:127.0.0.1:55682_solr c:testschemaapi s:shard1 r:core_node2 x:testschemaapi_shard1_replica1] o.a.s.h.l.XMLLoader xsltCacheLifetimeSeconds=60
   [junit4]   2> 3703920 INFO  (qtp1572750433-21499) [n:127.0.0.1:55681_solr c:testschemaapi s:shard1 r:core_node1 x:testschemaapi_shard1_replica2] o.a.s.h.l.XMLLoader xsltCacheLifetimeSeconds=60
   [junit4]   2> 3703922 INFO  (qtp1572750433-21499) [n:127.0.0.1:55681_solr c:testschemaapi s:shard1 r:core_node1 x:testschemaapi_shard1_replica2] o.a.s.c.RequestHandlers Registered paths: /admin/mbeans,/update/csv,/sql,/update/json/docs,/admin/luke,/graph,/export,/select,/admin/segments,/get,/admin/system,/replication,/admin/properties,/config,/stream,/schema,/admin/plugins,/admin/logging,/update/json,/admin/ping,/admin/threads,/update,/admin/file
   [junit4]   2> 3703922 INFO  (qtp1572750433-21499) [n:127.0.0.1:55681_solr c:testschemaapi s:shard1 r:core_node1 x:testschemaapi_shard1_replica2] o.a.s.c.SolrCore Using default statsCache cache: org.apache.solr.search.stats.LocalStatsCache
   [junit4]   2> 3703923 INFO  (qtp1128485469-21510) [n:127.0.0.1:55682_solr c:testschemaapi s:shard1 r:core_node2 x:testschemaapi_shard1_replica1] o.a.s.c.RequestHandlers Registered paths: /admin/mbeans,/update/csv,/sql,/update/json/docs,/admin/luke,/graph,/export,/select,/admin/segments,/get,/admin/system,/replication,/admin/properties,/config,/stream,/schema,/admin/plugins,/admin/logging,/update/json,/admin/ping,/admin/threads,/update,/admin/file
   [junit4]   2> 3703923 INFO  (qtp1128485469-21510) [n:127.0.0.1:55682_solr c:testschemaapi s:shard1 r:core_node2 x:testschemaapi_shard1_replica1] o.a.s.c.SolrCore Using default statsCache cache: org.apache.solr.search.stats.LocalStatsCache
   [junit4]   2> 3703923 INFO  (qtp1572750433-21499) [n:127.0.0.1:55681_solr c:testschemaapi s:shard1 r:core_node1 x:testschemaapi_shard1_replica2] o.a.s.u.UpdateHandler Using UpdateLog implementation: org.apache.solr.update.UpdateLog
   [junit4]   2> 3703923 INFO  (qtp1572750433-21499) [n:127.0.0.1:55681_solr c:testschemaapi s:shard1 r:core_node1 x:testschemaapi_shard1_replica2] o.a.s.u.UpdateLog Initializing UpdateLog: dataDir=null defaultSyncLevel=FLUSH numRecordsToKeep=100 maxNumLogsToKeep=10 numVersionBuckets=65536
   [junit4]   2> 3703924 INFO  (qtp1128485469-21510) [n:127.0.0.1:55682_solr c:testschemaapi s:shard1 r:core_node2 x:testschemaapi_shard1_replica1] o.a.s.u.UpdateHandler Using UpdateLog implementation: org.apache.solr.update.UpdateLog
   [junit4]   2> 3703924 INFO  (qtp1128485469-21510) [n:127.0.0.1:55682_solr c:testschemaapi s:shard1 r:core_node2 x:testschemaapi_shard1_replica1] o.a.s.u.UpdateLog Initializing UpdateLog: dataDir=null defaultSyncLevel=FLUSH numRecordsToKeep=100 maxNumLogsToKeep=10 numVersionBuckets=65536
   [junit4]   2> 3703926 INFO  (qtp1572750433-21499) [n:127.0.0.1:55681_solr c:testschemaapi s:shard1 r:core_node1 x:testschemaapi_shard1_replica2] o.a.s.u.CommitTracker Hard AutoCommit: disabled
   [junit4]   2> 3703926 INFO  (qtp1572750433-21499) [n:127.0.0.1:55681_solr c:testschemaapi s:shard1 r:core_node1 x:testschemaapi_shard1_replica2] o.a.s.u.CommitTracker Soft AutoCommit: disabled
   [junit4]   2> 3703927 INFO  (qtp1572750433-21499) [n:127.0.0.1:55681_solr c:testschemaapi s:shard1 r:core_node1 x:testschemaapi_shard1_replica2] o.a.s.c.SolrDeletionPolicy SolrDeletionPolicy.onInit: commits: num=1
   [junit4]   2> 	commit{dir=MockDirectoryWrapper(RAMDirectory@19a967bb lockFactory=org.apache.lucene.store.SingleInstanceLockFactory@45c9e942),segFN=segments_1,generation=1}
   [junit4]   2> 3703927 INFO  (qtp1572750433-21499) [n:127.0.0.1:55681_solr c:testschemaapi s:shard1 r:core_node1 x:testschemaapi_shard1_replica2] o.a.s.c.SolrDeletionPolicy newest commit generation = 1
   [junit4]   2> 3703927 INFO  (qtp1572750433-21499) [n:127.0.0.1:55681_solr c:testschemaapi s:shard1 r:core_node1 x:testschemaapi_shard1_replica2] o.a.s.s.SolrIndexSearcher Opening [Searcher@177f8569[testschemaapi_shard1_replica2] main]
   [junit4]   2> 3703927 INFO  (qtp1572750433-21499) [n:127.0.0.1:55681_solr c:testschemaapi s:shard1 r:core_node1 x:testschemaapi_shard1_replica2] o.a.s.c.c.ZkStateReader Load collection config from: [/collections/testschemaapi]
   [junit4]   2> 3703927 INFO  (qtp1128485469-21510) [n:127.0.0.1:55682_solr c:testschemaapi s:shard1 r:core_node2 x:testschemaapi_shard1_replica1] o.a.s.u.CommitTracker Hard AutoCommit: disabled
   [junit4]   2> 3703927 INFO  (qtp1128485469-21510) [n:127.0.0.1:55682_solr c:testschemaapi s:shard1 r:core_node2 x:testschemaapi_shard1_replica1] o.a.s.u.CommitTracker Soft AutoCommit: disabled
   [junit4]   2> 3703928 INFO  (qtp1128485469-21510) [n:127.0.0.1:55682_solr c:testschemaapi s:shard1 r:core_node2 x:testschemaapi_shard1_replica1] o.a.s.c.SolrDeletionPolicy SolrDeletionPolicy.onInit: commits: num=1
   [junit4]   2> 	commit{dir=MockDirectoryWrapper(RAMDirectory@6843e487 lockFactory=org.apache.lucene.store.SingleInstanceLockFactory@573e3947),segFN=segments_1,generation=1}
   [junit4]   2> 3703928 INFO  (qtp1128485469-21510) [n:127.0.0.1:55682_solr c:testschemaapi s:shard1 r:core_node2 x:testschemaapi_shard1_replica1] o.a.s.c.SolrDeletionPolicy newest commit generation = 1
   [junit4]   2> 3703928 INFO  (qtp1128485469-21510) [n:127.0.0.1:55682_solr c:testschemaapi s:shard1 r:core_node2 x:testschemaapi_shard1_replica1] o.a.s.s.SolrIndexSearcher Opening [Searcher@15833608[testschemaapi_shard1_replica1] main]
   [junit4]   2> 3703928 INFO  (qtp1128485469-21510) [n:127.0.0.1:55682_solr c:testschemaapi s:shard1 r:core_node2 x:testschemaapi_shard1_replica1] o.a.s.c.c.ZkStateReader Load collection config from: [/collections/testschemaapi]
   [junit4]   2> 3703928 INFO  (qtp1572750433-21499) [n:127.0.0.1:55681_solr c:testschemaapi s:shard1 r:core_node1 x:testschemaapi_shard1_replica2] o.a.s.c.c.ZkStateReader path=[/collections/testschemaapi] [configName]=[conf1] specified config exists in ZooKeeper
   [junit4]   2> 3703928 INFO  (qtp1572750433-21499) [n:127.0.0.1:55681_solr c:testschemaapi s:shard1 r:core_node1 x:testschemaapi_shard1_replica2] o.a.s.r.ManagedResourceStorage Setting up ZooKeeper-based storage for the RestManager with znodeBase: /configs/conf1
   [junit4]   2> 3703929 INFO  (qtp1572750433-21499) [n:127.0.0.1:55681_solr c:testschemaapi s:shard1 r:core_node1 x:testschemaapi_shard1_replica2] o.a.s.r.ManagedResourceStorage Configured ZooKeeperStorageIO with znodeBase: /configs/conf1
   [junit4]   2> 3703929 INFO  (qtp1572750433-21499) [n:127.0.0.1:55681_solr c:testschemaapi s:shard1 r:core_node1 x:testschemaapi_shard1_replica2] o.a.s.r.RestManager Initializing RestManager with initArgs: {}
   [junit4]   2> 3703929 INFO  (qtp1128485469-21510) [n:127.0.0.1:55682_solr c:testschemaapi s:shard1 r:core_node2 x:testschemaapi_shard1_replica1] o.a.s.c.c.ZkStateReader path=[/collections/testschemaapi] [configName]=[conf1] specified config exists in ZooKeeper
   [junit4]   2> 3703929 INFO  (qtp1128485469-21510) [n:127.0.0.1:55682_solr c:testschemaapi s:shard1 r:core_node2 x:testschemaapi_shard1_replica1] o.a.s.r.ManagedResourceStorage Setting up ZooKeeper-based storage for the RestManager with znodeBase: /configs/conf1
   [junit4]   2> 3703929 INFO  (qtp1572750433-21499) [n:127.0.0.1:55681_solr c:testschemaapi s:shard1 r:core_node1 x:testschemaapi_shard1_replica2] o.a.s.r.ManagedResourceStorage Reading _rest_managed.json using ZooKeeperStorageIO:path=/configs/conf1
   [junit4]   2> 3703930 INFO  (qtp1128485469-21510) [n:127.0.0.1:55682_solr c:testschemaapi s:shard1 r:core_node2 x:testschemaapi_shard1_replica1] o.a.s.r.ManagedResourceStorage Configured ZooKeeperStorageIO with znodeBase: /configs/conf1
   [junit4]   2> 3703930 INFO  (qtp1572750433-21499) [n:127.0.0.1:55681_solr c:testschemaapi s:shard1 r:core_node1 x:testschemaapi_shard1_replica2] o.a.s.r.ManagedResourceStorage No data found for znode /configs/conf1/_rest_managed.json
   [junit4]   2> 3703930 INFO  (qtp1128485469-21510) [n:127.0.0.1:55682_solr c:testschemaapi s:shard1 r:core_node2 x:testschemaapi_shard1_replica1] o.a.s.r.RestManager Initializing RestManager with initArgs: {}
   [junit4]   2> 3703930 INFO  (qtp1572750433-21499) [n:127.0.0.1:55681_solr c:testschemaapi s:shard1 r:core_node1 x:testschemaapi_shard1_replica2] o.a.s.r.ManagedResourceStorage Loaded null at path _rest_managed.json using ZooKeeperStorageIO:path=/configs/conf1
   [junit4]   2> 3703930 INFO  (qtp1128485469-21510) [n:127.0.0.1:55682_solr c:testschemaapi s:shard1 r:core_node2 x:testschemaapi_shard1_replica1] o.a.s.r.ManagedResourceStorage Reading _rest_managed.json using ZooKeeperStorageIO:path=/configs/conf1
   [junit4]   2> 3703930 INFO  (qtp1572750433-21499) [n:127.0.0.1:55681_solr c:testschemaapi s:shard1 r:core_node1 x:testschemaapi_shard1_replica2] o.a.s.r.RestManager Initializing 0 registered ManagedResources
   [junit4]   2> 3703931 INFO  (qtp1572750433-21499) [n:127.0.0.1:55681_solr c:testschemaapi s:shard1 r:core_node1 x:testschemaapi_shard1_replica2] o.a.s.s.ZkIndexSchemaReader Creating ZooKeeper watch for the managed schema at /configs/conf1/managed-schema
   [junit4]   2> 3703931 INFO  (qtp1128485469-21510) [n:127.0.0.1:55682_solr c:testschemaapi s:shard1 r:core_node2 x:testschemaapi_shard1_replica1] o.a.s.r.ManagedResourceStorage No data found for znode /configs/conf1/_rest_managed.json
   [junit4]   2> 3703931 INFO  (qtp1128485469-21510) [n:127.0.0.1:55682_solr c:testschemaapi s:shard1 r:core_node2 x:testschemaapi_shard1_replica1] o.a.s.r.ManagedResourceStorage Loaded null at path _rest_managed.json using ZooKeeperStorageIO:path=/configs/conf1
   [junit4]   2> 3703931 INFO  (qtp1128485469-21510) [n:127.0.0.1:55682_solr c:testschemaapi s:shard1 r:core_node2 x:testschemaapi_shard1_replica1] o.a.s.r.RestManager Initializing 0 registered ManagedResources
   [junit4]   2> 3703931 INFO  (qtp1128485469-21510) [n:127.0.0.1:55682_solr c:testschemaapi s:shard1 r:core_node2 x:testschemaapi_shard1_replica1] o.a.s.s.ZkIndexSchemaReader Creating ZooKeeper watch for the managed schema at /configs/conf1/managed-schema
   [junit4]   2> 3703931 INFO  (qtp1572750433-21499) [n:127.0.0.1:55681_solr c:testschemaapi s:shard1 r:core_node1 x:testschemaapi_shard1_replica2] o.a.s.c.ZkController Added new OnReconnect listener ZkIndexSchemaReader: /configs/conf1/managed-schema, uniqueCoreId: testschemaapi_shard1_replica2:1668026876484479
   [junit4]   2> 3703931 INFO  (qtp1572750433-21499) [n:127.0.0.1:55681_solr c:testschemaapi s:shard1 r:core_node1 x:testschemaapi_shard1_replica2] o.a.s.h.ReplicationHandler Commits will be reserved for  10000
   [junit4]   2> 3703932 INFO  (qtp1572750433-21499) [n:127.0.0.1:55681_solr c:testschemaapi s:shard1 r:core_node1 x:testschemaapi_shard1_replica2] o.a.s.u.UpdateLog Looking up max value of version field to seed version buckets
   [junit4]   2> 3703932 INFO  (searcherExecutor-10174-thread-1-processing-n:127.0.0.1:55681_solr x:testschemaapi_shard1_replica2 s:shard1 c:testschemaapi r:core_node1) [n:127.0.0.1:55681_solr c:testschemaapi s:shard1 r:core_node1 x:testschemaapi_shard1_replica2] o.a.s.c.SolrCore [testschemaapi_shard1_replica2] Registered new searcher Searcher@177f8569[testschemaapi_shard1_replica2] main{ExitableDirectoryReader(UninvertingDirectoryReader())}
   [junit4]   2> 3703932 INFO  (qtp1572750433-21499) [n:127.0.0.1:55681_solr c:testschemaapi s:shard1 r:core_node1 x:testschemaapi_shard1_replica2] o.a.s.u.VersionInfo Refreshing highest value of _version_ for 65536 version buckets from index
   [junit4]   2> 3703932 INFO  (qtp1572750433-21499) [n:127.0.0.1:55681_solr c:testschemaapi s:shard1 r:core_node1 x:testschemaapi_shard1_replica2] o.a.s.u.VersionInfo No terms found for _version_, cannot seed version bucket highest value from index
   [junit4]   2> 3703932 INFO  (qtp1128485469-21510) [n:127.0.0.1:55682_solr c:testschemaapi s:shard1 r:core_node2 x:testschemaapi_shard1_replica1] o.a.s.c.ZkController Added new OnReconnect listener ZkIndexSchemaReader: /configs/conf1/managed-schema, uniqueCoreId: testschemaapi_shard1_replica1:1668026876556376
   [junit4]   2> 3703932 INFO  (qtp1572750433-21499) [n:127.0.0.1:55681_solr c:testschemaapi s:shard1 r:core_node1 x:testschemaapi_shard1_replica2] o.a.s.u.UpdateLog Could not find max version in index or recent updates, using new clock 1535335352874565632
   [junit4]   2> 3703932 INFO  (qtp1128485469-21510) [n:127.0.0.1:55682_solr c:testschemaapi s:shard1 r:core_node2 x:testschemaapi_shard1_replica1] o.a.s.h.ReplicationHandler Commits will be reserved for  10000
   [junit4]   2> 3703932 INFO  (qtp1128485469-21510) [n:127.0.0.1:55682_solr c:testschemaapi s:shard1 r:core_node2 x:testschemaapi_shard1_replica1] o.a.s.u.UpdateLog Looking up max value of version field to seed version buckets
   [junit4]   2> 3703933 INFO  (qtp1128485469-21510) [n:127.0.0.1:55682_solr c:testschemaapi s:shard1 r:core_node2 x:testschemaapi_shard1_replica1] o.a.s.u.VersionInfo Refreshing highest value of _version_ for 65536 version buckets from index
   [junit4]   2> 3703933 INFO  (qtp1128485469-21510) [n:127.0.0.1:55682_solr c:testschemaapi s:shard1 r:core_node2 x:testschemaapi_shard1_replica1] o.a.s.u.VersionInfo No terms found for _version_, cannot seed version bucket highest value from index
   [junit4]   2> 3703933 INFO  (searcherExecutor-10175-thread-1-processing-n:127.0.0.1:55682_solr x:testschemaapi_shard1_replica1 s:shard1 c:testschemaapi r:core_node2) [n:127.0.0.1:55682_solr c:testschemaapi s:shard1 r:core_node2 x:testschemaapi_shard1_replica1] o.a.s.c.SolrCore [testschemaapi_shard1_replica1] Registered new searcher Searcher@15833608[testschemaapi_shard1_replica1] main{ExitableDirectoryReader(UninvertingDirectoryReader())}
   [junit4]   2> 3703933 INFO  (qtp1128485469-21510) [n:127.0.0.1:55682_solr c:testschemaapi s:shard1 r:core_node2 x:testschemaapi_shard1_replica1] o.a.s.u.UpdateLog Could not find max version in index or recent updates, using new clock 1535335352875614208
   [junit4]   2> 3703934 INFO  (qtp1572750433-21499) [n:127.0.0.1:55681_solr c:testschemaapi s:shard1 r:core_node1 x:testschemaapi_shard1_replica2] o.a.s.u.UpdateLog Took 2.0ms to seed version buckets with highest version 1535335352874565632
   [junit4]   2> 3703934 INFO  (qtp1572750433-21499) [n:127.0.0.1:55681_solr c:testschemaapi s:shard1 r:core_node1 x:testschemaapi_shard1_replica2] o.a.s.c.ZkController watch zkdir /configs/conf1
   [junit4]   2> 3703935 INFO  (qtp1128485469-21510) [n:127.0.0.1:55682_solr c:testschemaapi s:shard1 r:core_node2 x:testschemaapi_shard1_replica1] o.a.s.u.UpdateLog Took 2.0ms to seed version buckets with highest version 1535335352875614208
   [junit4]   2> 3703935 INFO  (qtp1128485469-21510) [n:127.0.0.1:55682_solr c:testschemaapi s:shard1 r:core_node2 x:testschemaapi_shard1_replica1] o.a.s.c.ZkController watch zkdir /configs/conf1
   [junit4]   2> 3703935 INFO  (qtp1572750433-21499) [n:127.0.0.1:55681_solr c:testschemaapi s:shard1 r:core_node1 x:testschemaapi_shard1_replica2] o.a.s.c.CoreContainer registering core: testschemaapi_shard1_replica2
   [junit4]   2> 3703936 INFO  (qtp1572750433-21499) [n:127.0.0.1:55681_solr c:testschemaapi s:shard1 r:core_node1 x:testschemaapi_shard1_replica2] o.a.s.c.ZkController Register replica - core:testschemaapi_shard1_replica2 address:http://127.0.0.1:55681/solr collection:testschemaapi shard:shard1
   [junit4]   2> 3703936 INFO  (qtp1128485469-21510) [n:127.0.0.1:55682_solr c:testschemaapi s:shard1 r:core_node2 x:testschemaapi_shard1_replica1] o.a.s.c.CoreContainer registering core: testschemaapi_shard1_replica1
   [junit4]   2> 3703936 INFO  (qtp1128485469-21510) [n:127.0.0.1:55682_solr c:testschemaapi s:shard1 r:core_node2 x:testschemaapi_shard1_replica1] o.a.s.c.ZkController Register replica - core:testschemaapi_shard1_replica1 address:http://127.0.0.1:55682/solr collection:testschemaapi shard:shard1
   [junit4]   2> 3703937 INFO  (qtp1572750433-21499) [n:127.0.0.1:55681_solr c:testschemaapi s:shard1 r:core_node1 x:testschemaapi_shard1_replica2] o.a.s.c.c.SolrZkClient makePath: /collections/testschemaapi/leader_elect/shard1/election
   [junit4]   2> 3703937 INFO  (qtp1128485469-21510) [n:127.0.0.1:55682_solr c:testschemaapi s:shard1 r:core_node2 x:testschemaapi_shard1_replica1] o.a.s.c.c.SolrZkClient makePath: /collections/testschemaapi/leader_elect/shard1/election
   [junit4]   2> 3703943 INFO  (qtp1128485469-21510) [n:127.0.0.1:55682_solr c:testschemaapi s:shard1 r:core_node2 x:testschemaapi_shard1_replica1] o.a.s.c.LeaderElector Joined leadership election with path: /collections/testschemaapi/leader_elect/shard1/election/95958459389509637-core_node2-n_0000000000
   [junit4]   2> 3703943 INFO  (qtp1572750433-21499) [n:127.0.0.1:55681_solr c:testschemaapi s:shard1 r:core_node1 x:testschemaapi_shard1_replica2] o.a.s.c.LeaderElector Joined leadership election with path: /collections/testschemaapi/leader_elect/shard1/election/95958459389509638-core_node1-n_0000000001
   [junit4]   2> 3703944 INFO  (qtp1128485469-21510) [n:127.0.0.1:55682_solr c:testschemaapi s:shard1 r:core_node2 x:testschemaapi_shard1_replica1] o.a.s.c.ShardLeaderElectionContext Running the leader process for shard=shard1 and weAreReplacement=false and leaderVoteWait=10000
   [junit4]   2> 3703945 INFO  (qtp1572750433-21499) [n:127.0.0.1:55681_solr c:testschemaapi s:shard1 r:core_node1 x:testschemaapi_shard1_replica2] o.a.s.c.LeaderElector Watching path /collections/testschemaapi/leader_elect/shard1/election/95958459389509637-core_node2-n_0000000000 to know if I could be the leader
   [junit4]   2> 3703947 INFO  (qtp1128485469-21510) [n:127.0.0.1:55682_solr c:testschemaapi s:shard1 r:core_node2 x:testschemaapi_shard1_replica1] o.a.s.c.ShardLeaderElectionContext Enough replicas found to continue.
   [junit4]   2> 3703947 INFO  (qtp1128485469-21510) [n:127.0.0.1:55682_solr c:testschemaapi s:shard1 r:core_node2 x:testschemaapi_shard1_replica1] o.a.s.c.ShardLeaderElectionContext I may be the new leader - try and sync
   [junit4]   2> 3703947 INFO  (qtp1128485469-21510) [n:127.0.0.1:55682_solr c:testschemaapi s:shard1 r:core_node2 x:testschemaapi_shard1_replica1] o.a.s.c.SyncStrategy Sync replicas to http://127.0.0.1:55682/solr/testschemaapi_shard1_replica1/
   [junit4]   2> 3703947 INFO  (qtp1128485469-21510) [n:127.0.0.1:55682_solr c:testschemaapi s:shard1 r:core_node2 x:testschemaapi_shard1_replica1] o.a.s.u.PeerSync PeerSync: core=testschemaapi_shard1_replica1 url=http://127.0.0.1:55682/solr START replicas=[http://127.0.0.1:55681/solr/testschemaapi_shard1_replica2/] nUpdates=100
   [junit4]   2> 3703948 INFO  (OverseerStateUpdate-95958459389509637-127.0.0.1:55682_solr-n_0000000000) [n:127.0.0.1:55682_solr    ] o.a.s.c.Overseer processMessage: queueSize: 1, message = {
   [junit4]   2>   "operation":"leader",
   [junit4]   2>   "shard":"shard1",
   [junit4]   2>   "collection":"testschemaapi"} current state version: 0
   [junit4]   2> 3703948 INFO  (qtp1128485469-21510) [n:127.0.0.1:55682_solr c:testschemaapi s:shard1 r:core_node2 x:testschemaapi_shard1_replica1] o.a.s.u.PeerSync PeerSync: core=testschemaapi_shard1_replica1 url=http://127.0.0.1:55682/solr DONE.  We have no versions.  sync failed.
   [junit4]   2> 3703948 INFO  (qtp1128485469-21510) [n:127.0.0.1:55682_solr c:testschemaapi s:shard1 r:core_node2 x:testschemaapi_shard1_replica1] o.a.s.c.SyncStrategy Leader's attempt to sync with shard failed, moving to the next candidate
   [junit4]   2> 3703948 INFO  (qtp1128485469-21510) [n:127.0.0.1:55682_solr c:testschemaapi s:shard1 r:core_node2 x:testschemaapi_shard1_replica1] o.a.s.c.ShardLeaderElectionContext We failed sync, but we have no versions - we can't sync in that case - we were active before, so become leader anyway
   [junit4]   2> 3703951 INFO  (qtp1128485469-21510) [n:127.0.0.1:55682_solr c:testschemaapi s:shard1 r:core_node2 x:testschemaapi_shard1_replica1] o.a.s.c.c.SolrZkClient makePath: /collections/testschemaapi/leaders/shard1
   [junit4]   2> 3703951 INFO  (qtp1572750433-21502) [n:127.0.0.1:55681_solr c:testschemaapi s:shard1 r:core_node1 x:testschemaapi_shard1_replica2] o.a.s.c.S.Request [testschemaapi_shard1_replica2]  webapp=/solr path=/get params={distrib=false&qt=/get&fingerprint=false&getVersions=100&wt=javabin&version=2} status=0 QTime=0
   [junit4]   2> 3703955 INFO  (qtp1128485469-21510) [n:127.0.0.1:55682_solr c:testschemaapi s:shard1 r:core_node2 x:testschemaapi_shard1_replica1] o.a.s.c.ShardLeaderElectionContextBase Creating leader registration node /collections/testschemaapi/leaders/shard1/leader after winning as /collections/testschemaapi/leader_elect/shard1/election/95958459389509637-core_node2-n_0000000000
   [junit4]   2> 3703959 INFO  (qtp1128485469-21510) [n:127.0.0.1:55682_solr c:testschemaapi s:shard1 r:core_node2 x:testschemaapi_shard1_replica1] o.a.s.c.ShardLeaderElectionContext I am the new leader: http://127.0.0.1:55682/solr/testschemaapi_shard1_replica1/ shard1
   [junit4]   2> 3703961 INFO  (OverseerStateUpdate-95958459389509637-127.0.0.1:55682_solr-n_0000000000) [n:127.0.0.1:55682_solr    ] o.a.s.c.Overseer processMessage: queueSize: 1, message = {
   [junit4]   2>   "operation":"leader",
   [junit4]   2>   "shard":"shard1",
   [junit4]   2>   "collection":"testschemaapi",
   [junit4]   2>   "base_url":"http://127.0.0.1:55682/solr",
   [junit4]   2>   "core":"testschemaapi_shard1_replica1",
   [junit4]   2>   "state":"active"} current state version: 0
   [junit4]   2> 3704065 INFO  (OverseerStateUpdate-95958459389509637-127.0.0.1:55682_solr-n_0000000000) [n:127.0.0.1:55682_solr    ] o.a.s.c.o.ZkStateWriter going to update_collection /collections/testschemaapi/state.json version: 1
   [junit4]   2> 3704065 INFO  (zkCallback-4179-thread-1-processing-n:127.0.0.1:55682_solr) [n:127.0.0.1:55682_solr    ] o.a.s.c.c.ZkStateReader A cluster state change: [WatchedEvent state:SyncConnected type:NodeDataChanged path:/collections/testschemaapi/state.json] for collection [testschemaapi] has occurred - updating... (live nodes size: [2])
   [junit4]   2> 3704066 INFO  (zkCallback-4180-thread-1-processing-n:127.0.0.1:55681_solr) [n:127.0.0.1:55681_solr    ] o.a.s.c.c.ZkStateReader A cluster state change: [WatchedEvent state:SyncConnected type:NodeDataChanged path:/collections/testschemaapi/state.json] for collection [testschemaapi] has occurred - updating... (live nodes size: [2])
   [junit4]   2> 3704066 INFO  (zkCallback-4179-thread-1-processing-n:127.0.0.1:55682_solr) [n:127.0.0.1:55682_solr    ] o.a.s.c.c.ZkStateReader Updating data for [testschemaapi] from [1] to [2]
   [junit4]   2> 3704067 INFO  (zkCallback-4180-thread-1-processing-n:127.0.0.1:55681_solr) [n:127.0.0.1:55681_solr    ] o.a.s.c.c.ZkStateReader Updating data for [testschemaapi] from [1] to [2]
   [junit4]   2> 3704118 INFO  (qtp1128485469-21510) [n:127.0.0.1:55682_solr c:testschemaapi s:shard1 r:core_node2 x:testschemaapi_shard1_replica1] o.a.s.c.ZkController We are http://127.0.0.1:55682/solr/testschemaapi_shard1_replica1/ and leader is http://127.0.0.1:55682/solr/testschemaapi_shard1_replica1/
   [junit4]   2> 3704118 INFO  (qtp1128485469-21510) [n:127.0.0.1:55682_solr c:testschemaapi s:shard1 r:core_node2 x:testschemaapi_shard1_replica1] o.a.s.c.ZkController No LogReplay needed for core=testschemaapi_shard1_replica1 baseURL=http://127.0.0.1:55682/solr
   [junit4]   2> 3704118 INFO  (qtp1128485469-21510) [n:127.0.0.1:55682_solr c:testschemaapi s:shard1 r:core_node2 x:testschemaapi_shard1_replica1] o.a.s.c.ZkController I am the leader, no recovery necessary
   [junit4]   2> 3704118 INFO  (qtp1128485469-21510) [n:127.0.0.1:55682_solr c:testschemaapi s:shard1 r:core_node2 x:testschemaapi_shard1_replica1] o.a.s.c.ZkController publishing state=active
   [junit4]   2> 3704121 INFO  (OverseerStateUpdate-95958459389509637-127.0.0.1:55682_solr-n_0000000000) [n:127.0.0.1:55682_solr    ] o.a.s.c.Overseer processMessage: queueSize: 1, message = {
   [junit4]   2>   "core":"testschemaapi_shard1_replica1",
   [junit4]   2>   "core_node_name":"core_node2",
   [junit4]   2>   "roles":null,
   [junit4]   2>   "base_url":"http://127.0.0.1:55682/solr",
   [junit4]   2>   "node_name":"127.0.0.1:55682_solr",
   [junit4]   2>   "numShards":"1",
   [junit4]   2>   "state":"active",
   [junit4]   2>   "shard":"shard1",
   [junit4]   2>   "collection":"testschemaapi",
   [junit4]   2>   "operation":"state"} current state version: 0
   [junit4]   2> 3704121 INFO  (OverseerStateUpdate-95958459389509637-127.0.0.1:55682_solr-n_0000000000) [n:127.0.0.1:55682_solr    ] o.a.s.c.o.ReplicaMutator Update state numShards=1 message={
   [junit4]   2>   "core":"testschemaapi_shard1_replica1",
   [junit4]   2>   "core_node_name":"core_node2",
   [junit4]   2>   "roles":null,
   [junit4]   2>   "base_u

[...truncated too long message...]

16093 WARN  (zkCallback-4179-thread-3-processing-n:127.0.0.1:55682_solr) [n:127.0.0.1:55682_solr    ] o.a.s.c.c.ZkStateReader ZooKeeper watch triggered, but Solr cannot talk to ZK: [KeeperErrorCode = Session expired for /live_nodes]
   [junit4]   2> 3716094 INFO  (jetty-launcher-4169-thread-1) [    ] o.e.j.s.h.ContextHandler Stopped o.e.j.s.ServletContextHandler@452e3b26{/solr,null,UNAVAILABLE}
   [junit4]   2> 3716106 INFO  (SUITE-TestManagedSchemaAPI-seed#[B3E9F9E37A1DF316]-worker) [    ] o.a.s.c.ZkTestServer connecting to 127.0.0.1:55679 55679
   [junit4]   2> 3716125 INFO  (Thread-7014) [    ] o.a.s.c.ZkTestServer connecting to 127.0.0.1:55679 55679
   [junit4]   2> 3718137 WARN  (Thread-7014) [    ] o.a.s.c.ZkTestServer Watch limit violations: 
   [junit4]   2> Maximum concurrent create/delete watches above limit:
   [junit4]   2> 
   [junit4]   2> 	6	/solr/configs/conf1/managed-schema
   [junit4]   2> 	6	/solr/configs/conf1
   [junit4]   2> 	3	/solr/aliases.json
   [junit4]   2> 	3	/solr/clusterprops.json
   [junit4]   2> 	2	/solr/security.json
   [junit4]   2> 
   [junit4]   2> Maximum concurrent data watches above limit:
   [junit4]   2> 
   [junit4]   2> 	3	/solr/clusterstate.json
   [junit4]   2> 	2	/solr/collections/testschemaapi/state.json
   [junit4]   2> 
   [junit4]   2> Maximum concurrent children watches above limit:
   [junit4]   2> 
   [junit4]   2> 	3	/solr/live_nodes
   [junit4]   2> 	3	/solr/collections
   [junit4]   2> 
   [junit4]   2> 3718139 INFO  (SUITE-TestManagedSchemaAPI-seed#[B3E9F9E37A1DF316]-worker) [    ] o.a.s.SolrTestCaseJ4 ###deleteCore
   [junit4]   2> NOTE: leaving temporary files on disk at: /Users/jenkins/workspace/Lucene-Solr-6.x-MacOSX/solr/build/solr-core/test/J0/temp/solr.schema.TestManagedSchemaAPI_B3E9F9E37A1DF316-001
   [junit4]   2> NOTE: test params are: codec=FastDecompressionCompressingStoredFields(storedFieldsFormat=CompressingStoredFieldsFormat(compressionMode=FAST_DECOMPRESSION, chunkSize=1332, maxDocsPerChunk=486, blockSize=480), termVectorsFormat=CompressingTermVectorsFormat(compressionMode=FAST_DECOMPRESSION, chunkSize=1332, blockSize=480)), sim=ClassicSimilarity, locale=sr-Latn-ME, timezone=Etc/GMT+7
   [junit4]   2> NOTE: Mac OS X 10.11.4 x86_64/Oracle Corporation 1.8.0_72 (64-bit)/cpus=3,threads=1,free=267076856,total=536870912
   [junit4]   2> NOTE: All tests run in this JVM: [TestCollationFieldDocValues, TestCryptoKeys, AssignTest, TestStressUserVersions, DocExpirationUpdateProcessorFactoryTest, SpatialFilterTest, IndexBasedSpellCheckerTest, BlockJoinFacetDistribTest, RecoveryAfterSoftCommitTest, LeaderElectionTest, TestQueryWrapperFilter, UnloadDistributedZkTest, TestCollapseQParserPlugin, ChaosMonkeyNothingIsSafeTest, TestDownShardTolerantSearch, TestSolrFieldCacheMBean, TimeZoneUtilsTest, SecurityConfHandlerTest, TestCloudBackupRestore, RankQueryTest, PingRequestHandlerTest, DocValuesMultiTest, TestManagedResourceStorage, RuleEngineTest, TestSubQueryTransformer, TestImplicitCoreProperties, TestStressReorder, TestUpdate, SampleTest, TestFieldTypeCollectionResource, CursorPagingTest, AsyncMigrateRouteKeyTest, EnumFieldTest, TestCloudInspectUtil, TestConfigSetsAPIExclusivity, BitVectorTest, StandardRequestHandlerTest, ClusterStateUpdateTest, TestManagedStopFilterFactory, DeleteLastCustomShardedReplicaTest, RecoveryZkTest, PolyFieldTest, RegexBoostProcessorTest, TestCollectionAPI, TestLazyCores, CollectionsAPIAsyncDistributedZkTest, TestCopyFieldCollectionResource, TestSchemaSimilarityResource, HdfsDirectoryTest, TestSweetSpotSimilarityFactory, RequiredFieldsTest, CollectionStateFormat2Test, TestDistribIDF, SimpleCollectionCreateDeleteTest, DistributedQueryElevationComponentTest, CircularListTest, OutOfBoxZkACLAndCredentialsProvidersTest, TestJmxIntegration, TestCursorMarkWithoutUniqueKey, TestStressCloudBlindAtomicUpdates, TestBlobHandler, XmlUpdateRequestHandlerTest, SystemInfoHandlerTest, PathHierarchyTokenizerFactoryTest, TestCustomDocTransformer, TestFilteredDocIdSet, TestJmxMonitoredMap, JavabinLoaderTest, TestCoreContainer, ConnectionManagerTest, ParsingFieldUpdateProcessorsTest, PrimitiveFieldTypeTest, OverseerCollectionConfigSetProcessorTest, TestReloadAndDeleteDocs, TestElisionMultitermQuery, TestDocumentBuilder, ReplicationFactorTest, TlogReplayBufferedWhileIndexingTest, HdfsRecoveryZkTest, TestRawTransformer, TestPhraseSuggestions, TestSearchPerf, TestNoOpRegenerator, SyncSliceTest, DistributedVersionInfoTest, TestRemoteStreaming, TestXmlQParser, TestWordDelimiterFilterFactory, ZkCLITest, TestFieldCollectionResource, TestPseudoReturnFields, JSONWriterTest, VMParamsZkACLAndCredentialsProvidersTest, BigEndianAscendingWordDeserializerTest, QueryResultKeyTest, AlternateDirectoryTest, TestSort, TestEmbeddedSolrServerConstructors, ActionThrottleTest, TestMinMaxOnMultiValuedField, TestDynamicFieldCollectionResource, TestDocBasedVersionConstraints, TestReplicationHandlerBackup, PreAnalyzedFieldTest, UUIDFieldTest, TestLFUCache, HttpPartitionTest, TestLRUCache, TestSolrConfigHandler, IndexSchemaTest, TestTolerantUpdateProcessorCloud, DeleteShardTest, DocValuesTest, TestFileDictionaryLookup, TestExactStatsCache, TestConfig, DistributedFacetPivotSmallAdvancedTest, PeerSyncTest, TestXIncludeConfig, TestSerializedLuceneMatchVersion, URLClassifyProcessorTest, TestHdfsUpdateLog, SuggestComponentContextFilterQueryTest, TestNamedUpdateProcessors, TestSchemaNameResource, SolrXmlInZkTest, BadComponentTest, ScriptEngineTest, DistributedFacetPivotLargeTest, UUIDUpdateProcessorFallbackTest, TestJsonRequest, StatelessScriptUpdateProcessorFactoryTest, TestObjectReleaseTracker, DistributedFacetPivotWhiteBoxTest, AddSchemaFieldsUpdateProcessorFactoryTest, TestSortByMinMaxFunction, HdfsWriteToMultipleCollectionsTest, TestComponentsName, HdfsTlogReplayBufferedWhileIndexingTest, TestDFRSimilarityFactory, TestAuthorizationFramework, SimpleMLTQParserTest, FastVectorHighlighterTest, ResponseHeaderTest, TestTolerantSearch, BasicDistributedZkTest, ChaosMonkeySafeLeaderTest, OverseerTest, LeaderElectionIntegrationTest, BasicZkTest, TestReplicationHandler, TestDistributedGrouping, TestFaceting, TestHashPartitioner, DistributedSpellCheckComponentTest, ZkControllerTest, TestJoin, TestStressVersions, HardAutoCommitTest, TestRangeQuery, SimpleFacetsTest, SolrCoreTest, StatsComponentTest, SpellCheckComponentTest, TestGroupingSearch, SolrCmdDistributorTest, QueryElevationComponentTest, ConvertedLegacyTest, BasicFunctionalityTest, TestBadConfig, HighlighterTest, CurrencyFieldXmlFileTest, SolrIndexSplitterTest, SimplePostToolTest, TestCoreDiscovery, AnalysisAfterCoreReloadTest, TestExtendedDismaxParser, SpellCheckCollatorTest, CoreAdminHandlerTest, SuggesterTSTTest, TestStressLucene, SuggesterWFSTTest, SchemaVersionSpecificBehaviorTest, DirectUpdateHandlerOptimizeTest, DefaultValueUpdateProcessorTest, TestSolrDeletionPolicy1, XsltUpdateRequestHandlerTest, TestSurroundQueryParser, DisMaxRequestHandlerTest, TestQueryUtils, DirectSolrSpellCheckerTest, TestReversedWildcardFilterFactory, DocumentAnalysisRequestHandlerTest, TermsComponentTest, DocumentBuilderTest, TermVectorComponentTest, MoreLikeThisHandlerTest, TestSolrQueryParser, TestCollationField, ReturnFieldsTest, TestAnalyzedSuggestions, BinaryUpdateRequestHandlerTest, TestPHPSerializedResponseWriter, SearchHandlerTest, TestDistributedMissingSort, ConnectionReuseTest, AsyncCallRequestStatusResponseTest, CdcrReplicationDistributedZkTest, CdcrReplicationHandlerTest, CdcrRequestHandlerTest, CleanupOldIndexTest, CollectionTooManyReplicasTest, ConcurrentDeleteAndCreateCollectionTest, ConfigSetsAPITest, CustomCollectionTest, DistribJoinFromCollectionTest, LeaderInitiatedRecoveryOnShardRestartTest, MigrateRouteKeyTest, OverseerRolesTest, OverseerStatusTest, RemoteQueryErrorTest, SSLMigrationTest, SaslZkACLProviderTest, SharedFSAutoReplicaFailoverTest, SharedFSAutoReplicaFailoverUtilsTest, TestAuthenticationFramework, TestMiniSolrCloudClusterSSL, TestOnReconnectListenerSupport, TestRandomRequestDistribution, TestRebalanceLeaders, TestSSLRandomization, TestSizeLimitedDistributedMap, TestTolerantUpdateProcessorRandomCloud, HdfsBasicDistributedZkTest, HdfsChaosMonkeyNothingIsSafeTest, HdfsChaosMonkeySafeLeaderTest, HdfsCollectionsAPIDistributedZkTest, HdfsNNFailoverTest, HdfsSyncSliceTest, HdfsThreadLeakTest, StressHdfsTest, TestClusterStateMutator, ZkStateReaderTest, BlobRepositoryCloudTest, ExitableDirectoryReaderTest, HdfsDirectoryFactoryTest, TestConfigOverlay, TestConfigSetImmutable, TestSolrConfigHandlerCloud, FacetPivotSmallTest, TestDistributedStatsComponentCardinality, TestCloudManagedSchema, TestManagedSchemaAPI]
   [junit4] Completed [550/599 (1!)] on J0 in 16.75s, 1 test, 1 error <<< FAILURES!

[...truncated 179 lines...]
BUILD FAILED
/Users/jenkins/workspace/Lucene-Solr-6.x-MacOSX/build.xml:740: The following error occurred while executing this line:
/Users/jenkins/workspace/Lucene-Solr-6.x-MacOSX/build.xml:684: The following error occurred while executing this line:
/Users/jenkins/workspace/Lucene-Solr-6.x-MacOSX/build.xml:59: The following error occurred while executing this line:
/Users/jenkins/workspace/Lucene-Solr-6.x-MacOSX/solr/build.xml:233: The following error occurred while executing this line:
/Users/jenkins/workspace/Lucene-Solr-6.x-MacOSX/solr/common-build.xml:531: The following error occurred while executing this line:
/Users/jenkins/workspace/Lucene-Solr-6.x-MacOSX/lucene/common-build.xml:1427: The following error occurred while executing this line:
/Users/jenkins/workspace/Lucene-Solr-6.x-MacOSX/lucene/common-build.xml:984: There were test failures: 599 suites (10 ignored), 2440 tests, 1 error, 122 ignored (72 assumptions) [seed: B3E9F9E37A1DF316]

Total time: 88 minutes 46 seconds
Build step 'Invoke Ant' marked build as failure
Archiving artifacts
[WARNINGS] Skipping publisher since build result is FAILURE
Recording test results
Email was triggered for: Failure - Any
Sending email for trigger: Failure - Any



Mime
View raw message