lucene-dev mailing list archives

Site index · List index
Message view « Date » · « Thread »
Top « Date » · « Thread »
From Policeman Jenkins Server <jenk...@thetaphi.de>
Subject [JENKINS-EA] Lucene-Solr-master-Linux (64bit/jdk-9-ea+119) - Build # 16833 - Failure!
Date Thu, 26 May 2016 01:35:57 GMT
Build: http://jenkins.thetaphi.de/job/Lucene-Solr-master-Linux/16833/
Java: 64bit/jdk-9-ea+119 -XX:-UseCompressedOops -XX:+UseSerialGC

1 tests failed.
FAILED:  org.apache.solr.schema.TestManagedSchemaAPI.test

Error Message:
Error from server at http://127.0.0.1:39291/solr/testschemaapi_shard1_replica1: ERROR: [doc=2] unknown field 'myNewField1'

Stack Trace:
org.apache.solr.client.solrj.impl.CloudSolrClient$RouteException: Error from server at http://127.0.0.1:39291/solr/testschemaapi_shard1_replica1: ERROR: [doc=2] unknown field 'myNewField1'
	at __randomizedtesting.SeedInfo.seed([D9C15A6788B034D8:519565BD264C5920]:0)
	at org.apache.solr.client.solrj.impl.CloudSolrClient.directUpdate(CloudSolrClient.java:697)
	at org.apache.solr.client.solrj.impl.CloudSolrClient.sendRequest(CloudSolrClient.java:1109)
	at org.apache.solr.client.solrj.impl.CloudSolrClient.requestWithRetryOnStaleState(CloudSolrClient.java:998)
	at org.apache.solr.client.solrj.impl.CloudSolrClient.request(CloudSolrClient.java:934)
	at org.apache.solr.schema.TestManagedSchemaAPI.testAddFieldAndDocument(TestManagedSchemaAPI.java:86)
	at org.apache.solr.schema.TestManagedSchemaAPI.test(TestManagedSchemaAPI.java:55)
	at jdk.internal.reflect.NativeMethodAccessorImpl.invoke0(java.base@9-ea/Native Method)
	at jdk.internal.reflect.NativeMethodAccessorImpl.invoke(java.base@9-ea/NativeMethodAccessorImpl.java:62)
	at jdk.internal.reflect.DelegatingMethodAccessorImpl.invoke(java.base@9-ea/DelegatingMethodAccessorImpl.java:43)
	at java.lang.reflect.Method.invoke(java.base@9-ea/Method.java:531)
	at com.carrotsearch.randomizedtesting.RandomizedRunner.invoke(RandomizedRunner.java:1764)
	at com.carrotsearch.randomizedtesting.RandomizedRunner$8.evaluate(RandomizedRunner.java:871)
	at com.carrotsearch.randomizedtesting.RandomizedRunner$9.evaluate(RandomizedRunner.java:907)
	at com.carrotsearch.randomizedtesting.RandomizedRunner$10.evaluate(RandomizedRunner.java:921)
	at com.carrotsearch.randomizedtesting.rules.SystemPropertiesRestoreRule$1.evaluate(SystemPropertiesRestoreRule.java:57)
	at org.apache.lucene.util.TestRuleSetupTeardownChained$1.evaluate(TestRuleSetupTeardownChained.java:49)
	at org.apache.lucene.util.AbstractBeforeAfterRule$1.evaluate(AbstractBeforeAfterRule.java:45)
	at org.apache.lucene.util.TestRuleThreadAndTestName$1.evaluate(TestRuleThreadAndTestName.java:48)
	at org.apache.lucene.util.TestRuleIgnoreAfterMaxFailures$1.evaluate(TestRuleIgnoreAfterMaxFailures.java:64)
	at org.apache.lucene.util.TestRuleMarkFailure$1.evaluate(TestRuleMarkFailure.java:47)
	at com.carrotsearch.randomizedtesting.rules.StatementAdapter.evaluate(StatementAdapter.java:36)
	at com.carrotsearch.randomizedtesting.ThreadLeakControl$StatementRunner.run(ThreadLeakControl.java:367)
	at com.carrotsearch.randomizedtesting.ThreadLeakControl.forkTimeoutingTask(ThreadLeakControl.java:809)
	at com.carrotsearch.randomizedtesting.ThreadLeakControl$3.evaluate(ThreadLeakControl.java:460)
	at com.carrotsearch.randomizedtesting.RandomizedRunner.runSingleTest(RandomizedRunner.java:880)
	at com.carrotsearch.randomizedtesting.RandomizedRunner$5.evaluate(RandomizedRunner.java:781)
	at com.carrotsearch.randomizedtesting.RandomizedRunner$6.evaluate(RandomizedRunner.java:816)
	at com.carrotsearch.randomizedtesting.RandomizedRunner$7.evaluate(RandomizedRunner.java:827)
	at com.carrotsearch.randomizedtesting.rules.StatementAdapter.evaluate(StatementAdapter.java:36)
	at com.carrotsearch.randomizedtesting.rules.SystemPropertiesRestoreRule$1.evaluate(SystemPropertiesRestoreRule.java:57)
	at org.apache.lucene.util.AbstractBeforeAfterRule$1.evaluate(AbstractBeforeAfterRule.java:45)
	at com.carrotsearch.randomizedtesting.rules.StatementAdapter.evaluate(StatementAdapter.java:36)
	at org.apache.lucene.util.TestRuleStoreClassName$1.evaluate(TestRuleStoreClassName.java:41)
	at com.carrotsearch.randomizedtesting.rules.NoShadowingOrOverridesOnMethodsRule$1.evaluate(NoShadowingOrOverridesOnMethodsRule.java:40)
	at com.carrotsearch.randomizedtesting.rules.NoShadowingOrOverridesOnMethodsRule$1.evaluate(NoShadowingOrOverridesOnMethodsRule.java:40)
	at com.carrotsearch.randomizedtesting.rules.StatementAdapter.evaluate(StatementAdapter.java:36)
	at com.carrotsearch.randomizedtesting.rules.StatementAdapter.evaluate(StatementAdapter.java:36)
	at com.carrotsearch.randomizedtesting.rules.StatementAdapter.evaluate(StatementAdapter.java:36)
	at org.apache.lucene.util.TestRuleAssertionsRequired$1.evaluate(TestRuleAssertionsRequired.java:53)
	at org.apache.lucene.util.TestRuleMarkFailure$1.evaluate(TestRuleMarkFailure.java:47)
	at org.apache.lucene.util.TestRuleIgnoreAfterMaxFailures$1.evaluate(TestRuleIgnoreAfterMaxFailures.java:64)
	at org.apache.lucene.util.TestRuleIgnoreTestSuites$1.evaluate(TestRuleIgnoreTestSuites.java:54)
	at com.carrotsearch.randomizedtesting.rules.StatementAdapter.evaluate(StatementAdapter.java:36)
	at com.carrotsearch.randomizedtesting.ThreadLeakControl$StatementRunner.run(ThreadLeakControl.java:367)
	at java.lang.Thread.run(java.base@9-ea/Thread.java:804)
Caused by: org.apache.solr.client.solrj.impl.HttpSolrClient$RemoteSolrException: Error from server at http://127.0.0.1:39291/solr/testschemaapi_shard1_replica1: ERROR: [doc=2] unknown field 'myNewField1'
	at org.apache.solr.client.solrj.impl.HttpSolrClient.executeMethod(HttpSolrClient.java:606)
	at org.apache.solr.client.solrj.impl.HttpSolrClient.request(HttpSolrClient.java:259)
	at org.apache.solr.client.solrj.impl.HttpSolrClient.request(HttpSolrClient.java:248)
	at org.apache.solr.client.solrj.impl.LBHttpSolrClient.doRequest(LBHttpSolrClient.java:413)
	at org.apache.solr.client.solrj.impl.LBHttpSolrClient.request(LBHttpSolrClient.java:366)
	at org.apache.solr.client.solrj.impl.CloudSolrClient.lambda$directUpdate$0(CloudSolrClient.java:674)
	at java.util.concurrent.FutureTask.run(java.base@9-ea/FutureTask.java:266)
	at org.apache.solr.common.util.ExecutorUtil$MDCAwareThreadPoolExecutor.lambda$execute$0(ExecutorUtil.java:229)
	at java.util.concurrent.ThreadPoolExecutor.runWorker(java.base@9-ea/ThreadPoolExecutor.java:1158)
	at java.util.concurrent.ThreadPoolExecutor$Worker.run(java.base@9-ea/ThreadPoolExecutor.java:632)
	... 1 more




Build Log:
[...truncated 11253 lines...]
   [junit4] Suite: org.apache.solr.schema.TestManagedSchemaAPI
   [junit4]   2> Creating dataDir: /home/jenkins/workspace/Lucene-Solr-master-Linux/solr/build/solr-core/test/J0/temp/solr.schema.TestManagedSchemaAPI_D9C15A6788B034D8-001/init-core-data-001
   [junit4]   2> 931877 INFO  (SUITE-TestManagedSchemaAPI-seed#[D9C15A6788B034D8]-worker) [    ] o.a.s.SolrTestCaseJ4 Randomized ssl (false) and clientAuth (true)
   [junit4]   2> 931880 INFO  (SUITE-TestManagedSchemaAPI-seed#[D9C15A6788B034D8]-worker) [    ] o.a.s.c.ZkTestServer STARTING ZK TEST SERVER
   [junit4]   2> 931880 INFO  (Thread-2462) [    ] o.a.s.c.ZkTestServer client port:0.0.0.0/0.0.0.0:0
   [junit4]   2> 931880 INFO  (Thread-2462) [    ] o.a.s.c.ZkTestServer Starting server
   [junit4]   2> 931980 INFO  (SUITE-TestManagedSchemaAPI-seed#[D9C15A6788B034D8]-worker) [    ] o.a.s.c.ZkTestServer start zk server on port:40414
   [junit4]   2> 931980 INFO  (SUITE-TestManagedSchemaAPI-seed#[D9C15A6788B034D8]-worker) [    ] o.a.s.c.c.SolrZkClient Using default ZkCredentialsProvider
   [junit4]   2> 931981 INFO  (SUITE-TestManagedSchemaAPI-seed#[D9C15A6788B034D8]-worker) [    ] o.a.s.c.c.ConnectionManager Waiting for client to connect to ZooKeeper
   [junit4]   2> 931990 INFO  (zkCallback-1114-thread-1) [    ] o.a.s.c.c.ConnectionManager Watcher org.apache.solr.common.cloud.ConnectionManager@2c54ef9c name:ZooKeeperConnection Watcher:127.0.0.1:40414 got event WatchedEvent state:SyncConnected type:None path:null path:null type:None
   [junit4]   2> 931991 INFO  (SUITE-TestManagedSchemaAPI-seed#[D9C15A6788B034D8]-worker) [    ] o.a.s.c.c.ConnectionManager Client is connected to ZooKeeper
   [junit4]   2> 931991 INFO  (SUITE-TestManagedSchemaAPI-seed#[D9C15A6788B034D8]-worker) [    ] o.a.s.c.c.SolrZkClient Using default ZkACLProvider
   [junit4]   2> 931991 INFO  (SUITE-TestManagedSchemaAPI-seed#[D9C15A6788B034D8]-worker) [    ] o.a.s.c.c.SolrZkClient makePath: /solr/solr.xml
   [junit4]   2> 932002 INFO  (jetty-launcher-1113-thread-1) [    ] o.e.j.s.Server jetty-9.3.8.v20160314
   [junit4]   2> 932002 INFO  (jetty-launcher-1113-thread-2) [    ] o.e.j.s.Server jetty-9.3.8.v20160314
   [junit4]   2> 932002 INFO  (jetty-launcher-1113-thread-1) [    ] o.e.j.s.h.ContextHandler Started o.e.j.s.ServletContextHandler@1ae982e9{/solr,null,AVAILABLE}
   [junit4]   2> 932003 INFO  (jetty-launcher-1113-thread-2) [    ] o.e.j.s.h.ContextHandler Started o.e.j.s.ServletContextHandler@5f7b79de{/solr,null,AVAILABLE}
   [junit4]   2> 932004 INFO  (jetty-launcher-1113-thread-1) [    ] o.e.j.s.ServerConnector Started ServerConnector@365229c7{HTTP/1.1,[http/1.1]}{127.0.0.1:39291}
   [junit4]   2> 932004 INFO  (jetty-launcher-1113-thread-2) [    ] o.e.j.s.ServerConnector Started ServerConnector@48838e7a{HTTP/1.1,[http/1.1]}{127.0.0.1:41098}
   [junit4]   2> 932004 INFO  (jetty-launcher-1113-thread-1) [    ] o.e.j.s.Server Started @934273ms
   [junit4]   2> 932004 INFO  (jetty-launcher-1113-thread-2) [    ] o.e.j.s.Server Started @934273ms
   [junit4]   2> 932004 INFO  (jetty-launcher-1113-thread-1) [    ] o.a.s.c.s.e.JettySolrRunner Jetty properties: {hostContext=/solr, hostPort=39291}
   [junit4]   2> 932004 INFO  (jetty-launcher-1113-thread-2) [    ] o.a.s.c.s.e.JettySolrRunner Jetty properties: {hostContext=/solr, hostPort=41098}
   [junit4]   2> 932004 INFO  (jetty-launcher-1113-thread-2) [    ] o.a.s.s.SolrDispatchFilter SolrDispatchFilter.init(): jdk.internal.loader.ClassLoaders$AppClassLoader@67117f44
   [junit4]   2> 932004 INFO  (jetty-launcher-1113-thread-1) [    ] o.a.s.s.SolrDispatchFilter SolrDispatchFilter.init(): jdk.internal.loader.ClassLoaders$AppClassLoader@67117f44
   [junit4]   2> 932004 INFO  (jetty-launcher-1113-thread-2) [    ] o.a.s.c.SolrResourceLoader new SolrResourceLoader for directory: '/home/jenkins/workspace/Lucene-Solr-master-Linux/solr/build/solr-core/test/J0/temp/solr.schema.TestManagedSchemaAPI_D9C15A6788B034D8-001/tempDir-001/node2'
   [junit4]   2> 932004 INFO  (jetty-launcher-1113-thread-1) [    ] o.a.s.c.SolrResourceLoader new SolrResourceLoader for directory: '/home/jenkins/workspace/Lucene-Solr-master-Linux/solr/build/solr-core/test/J0/temp/solr.schema.TestManagedSchemaAPI_D9C15A6788B034D8-001/tempDir-001/node1'
   [junit4]   2> 932004 INFO  (jetty-launcher-1113-thread-2) [    ] o.a.s.c.SolrResourceLoader JNDI not configured for solr (NoInitialContextEx)
   [junit4]   2> 932004 INFO  (jetty-launcher-1113-thread-1) [    ] o.a.s.c.SolrResourceLoader JNDI not configured for solr (NoInitialContextEx)
   [junit4]   2> 932004 INFO  (jetty-launcher-1113-thread-2) [    ] o.a.s.c.SolrResourceLoader solr home defaulted to 'solr/' (could not find system property or JNDI)
   [junit4]   2> 932004 INFO  (jetty-launcher-1113-thread-1) [    ] o.a.s.c.SolrResourceLoader solr home defaulted to 'solr/' (could not find system property or JNDI)
   [junit4]   2> 932004 INFO  (jetty-launcher-1113-thread-2) [    ] o.a.s.c.c.SolrZkClient Using default ZkCredentialsProvider
   [junit4]   2> 932004 INFO  (jetty-launcher-1113-thread-1) [    ] o.a.s.c.c.SolrZkClient Using default ZkCredentialsProvider
   [junit4]   2> 932005 INFO  (jetty-launcher-1113-thread-2) [    ] o.a.s.c.c.ConnectionManager Waiting for client to connect to ZooKeeper
   [junit4]   2> 932005 INFO  (jetty-launcher-1113-thread-1) [    ] o.a.s.c.c.ConnectionManager Waiting for client to connect to ZooKeeper
   [junit4]   2> 932006 INFO  (zkCallback-1116-thread-1) [    ] o.a.s.c.c.ConnectionManager Watcher org.apache.solr.common.cloud.ConnectionManager@1ed69d07 name:ZooKeeperConnection Watcher:127.0.0.1:40414/solr got event WatchedEvent state:SyncConnected type:None path:null path:null type:None
   [junit4]   2> 932006 INFO  (jetty-launcher-1113-thread-1) [    ] o.a.s.c.c.ConnectionManager Client is connected to ZooKeeper
   [junit4]   2> 932006 INFO  (zkCallback-1115-thread-1) [    ] o.a.s.c.c.ConnectionManager Watcher org.apache.solr.common.cloud.ConnectionManager@3ab2863f name:ZooKeeperConnection Watcher:127.0.0.1:40414/solr got event WatchedEvent state:SyncConnected type:None path:null path:null type:None
   [junit4]   2> 932006 INFO  (jetty-launcher-1113-thread-2) [    ] o.a.s.c.c.ConnectionManager Client is connected to ZooKeeper
   [junit4]   2> 932006 INFO  (jetty-launcher-1113-thread-1) [    ] o.a.s.c.c.SolrZkClient Using default ZkACLProvider
   [junit4]   2> 932007 INFO  (jetty-launcher-1113-thread-2) [    ] o.a.s.c.c.SolrZkClient Using default ZkACLProvider
   [junit4]   2> 932007 INFO  (jetty-launcher-1113-thread-1) [    ] o.a.s.s.SolrDispatchFilter solr.xml found in ZooKeeper. Loading...
   [junit4]   2> 932007 INFO  (jetty-launcher-1113-thread-2) [    ] o.a.s.s.SolrDispatchFilter solr.xml found in ZooKeeper. Loading...
   [junit4]   2> 932011 INFO  (jetty-launcher-1113-thread-1) [    ] o.a.s.c.CorePropertiesLocator Config-defined core root directory: /home/jenkins/workspace/Lucene-Solr-master-Linux/solr/build/solr-core/test/J0/temp/solr.schema.TestManagedSchemaAPI_D9C15A6788B034D8-001/tempDir-001/node1/.
   [junit4]   2> 932011 WARN  (NIOServerCxn.Factory:0.0.0.0/0.0.0.0:0) [    ] o.a.z.s.NIOServerCnxn caught end of stream exception
   [junit4]   2> EndOfStreamException: Unable to read additional data from client sessionid 0x154ea9b7ae50002, likely client has closed socket
   [junit4]   2> 	at org.apache.zookeeper.server.NIOServerCnxn.doIO(NIOServerCnxn.java:228)
   [junit4]   2> 	at org.apache.zookeeper.server.NIOServerCnxnFactory.run(NIOServerCnxnFactory.java:208)
   [junit4]   2> 	at java.lang.Thread.run(java.base@9-ea/Thread.java:804)
   [junit4]   2> 932011 INFO  (jetty-launcher-1113-thread-2) [    ] o.a.s.c.CorePropertiesLocator Config-defined core root directory: /home/jenkins/workspace/Lucene-Solr-master-Linux/solr/build/solr-core/test/J0/temp/solr.schema.TestManagedSchemaAPI_D9C15A6788B034D8-001/tempDir-001/node2/.
   [junit4]   2> 932011 INFO  (jetty-launcher-1113-thread-1) [    ] o.a.s.c.CoreContainer New CoreContainer 1309981198
   [junit4]   2> 932011 INFO  (jetty-launcher-1113-thread-2) [    ] o.a.s.c.CoreContainer New CoreContainer 361714971
   [junit4]   2> 932011 INFO  (jetty-launcher-1113-thread-1) [    ] o.a.s.c.CoreContainer Loading cores into CoreContainer [instanceDir=/home/jenkins/workspace/Lucene-Solr-master-Linux/solr/build/solr-core/test/J0/temp/solr.schema.TestManagedSchemaAPI_D9C15A6788B034D8-001/tempDir-001/node1]
   [junit4]   2> 932011 INFO  (jetty-launcher-1113-thread-2) [    ] o.a.s.c.CoreContainer Loading cores into CoreContainer [instanceDir=/home/jenkins/workspace/Lucene-Solr-master-Linux/solr/build/solr-core/test/J0/temp/solr.schema.TestManagedSchemaAPI_D9C15A6788B034D8-001/tempDir-001/node2]
   [junit4]   2> 932012 WARN  (jetty-launcher-1113-thread-1) [    ] o.a.s.c.CoreContainer Couldn't add files from /home/jenkins/workspace/Lucene-Solr-master-Linux/solr/build/solr-core/test/J0/temp/solr.schema.TestManagedSchemaAPI_D9C15A6788B034D8-001/tempDir-001/node1/lib to classpath: /home/jenkins/workspace/Lucene-Solr-master-Linux/solr/build/solr-core/test/J0/temp/solr.schema.TestManagedSchemaAPI_D9C15A6788B034D8-001/tempDir-001/node1/lib
   [junit4]   2> 932012 WARN  (jetty-launcher-1113-thread-2) [    ] o.a.s.c.CoreContainer Couldn't add files from /home/jenkins/workspace/Lucene-Solr-master-Linux/solr/build/solr-core/test/J0/temp/solr.schema.TestManagedSchemaAPI_D9C15A6788B034D8-001/tempDir-001/node2/lib to classpath: /home/jenkins/workspace/Lucene-Solr-master-Linux/solr/build/solr-core/test/J0/temp/solr.schema.TestManagedSchemaAPI_D9C15A6788B034D8-001/tempDir-001/node2/lib
   [junit4]   2> 932012 INFO  (jetty-launcher-1113-thread-1) [    ] o.a.s.h.c.HttpShardHandlerFactory created with socketTimeout : 90000,urlScheme : ,connTimeout : 15000,maxConnectionsPerHost : 20,maxConnections : 10000,corePoolSize : 0,maximumPoolSize : 2147483647,maxThreadIdleTime : 5,sizeOfQueue : -1,fairnessPolicy : false,
   [junit4]   2> 932012 INFO  (jetty-launcher-1113-thread-2) [    ] o.a.s.h.c.HttpShardHandlerFactory created with socketTimeout : 90000,urlScheme : ,connTimeout : 15000,maxConnectionsPerHost : 20,maxConnections : 10000,corePoolSize : 0,maximumPoolSize : 2147483647,maxThreadIdleTime : 5,sizeOfQueue : -1,fairnessPolicy : false,
   [junit4]   2> 932013 INFO  (jetty-launcher-1113-thread-1) [    ] o.a.s.u.UpdateShardHandler Creating UpdateShardHandler HTTP client with params: 
   [junit4]   2> 932013 INFO  (jetty-launcher-1113-thread-2) [    ] o.a.s.u.UpdateShardHandler Creating UpdateShardHandler HTTP client with params: 
   [junit4]   2> 932013 INFO  (jetty-launcher-1113-thread-1) [    ] o.a.s.l.LogWatcher SLF4J impl is org.slf4j.impl.Log4jLoggerFactory
   [junit4]   2> 932013 INFO  (jetty-launcher-1113-thread-2) [    ] o.a.s.l.LogWatcher SLF4J impl is org.slf4j.impl.Log4jLoggerFactory
   [junit4]   2> 932013 INFO  (jetty-launcher-1113-thread-1) [    ] o.a.s.l.LogWatcher Registering Log Listener [Log4j (org.slf4j.impl.Log4jLoggerFactory)]
   [junit4]   2> 932013 INFO  (jetty-launcher-1113-thread-2) [    ] o.a.s.l.LogWatcher Registering Log Listener [Log4j (org.slf4j.impl.Log4jLoggerFactory)]
   [junit4]   2> 932013 INFO  (jetty-launcher-1113-thread-2) [    ] o.a.s.c.ZkContainer Zookeeper client=127.0.0.1:40414/solr
   [junit4]   2> 932013 INFO  (jetty-launcher-1113-thread-1) [    ] o.a.s.c.ZkContainer Zookeeper client=127.0.0.1:40414/solr
   [junit4]   2> 932013 INFO  (jetty-launcher-1113-thread-2) [    ] o.a.s.c.ZkController zkHost includes chroot
   [junit4]   2> 932014 INFO  (jetty-launcher-1113-thread-1) [    ] o.a.s.c.ZkController zkHost includes chroot
   [junit4]   2> 932014 INFO  (jetty-launcher-1113-thread-2) [    ] o.a.s.c.c.SolrZkClient Using default ZkCredentialsProvider
   [junit4]   2> 932014 INFO  (jetty-launcher-1113-thread-1) [    ] o.a.s.c.c.SolrZkClient Using default ZkCredentialsProvider
   [junit4]   2> 932014 INFO  (jetty-launcher-1113-thread-2) [    ] o.a.s.c.c.ConnectionManager Waiting for client to connect to ZooKeeper
   [junit4]   2> 932014 INFO  (jetty-launcher-1113-thread-1) [    ] o.a.s.c.c.ConnectionManager Waiting for client to connect to ZooKeeper
   [junit4]   2> 932028 INFO  (zkCallback-1121-thread-1) [    ] o.a.s.c.c.ConnectionManager Watcher org.apache.solr.common.cloud.ConnectionManager@19a0770b name:ZooKeeperConnection Watcher:127.0.0.1:40414 got event WatchedEvent state:SyncConnected type:None path:null path:null type:None
   [junit4]   2> 932028 INFO  (zkCallback-1122-thread-1) [    ] o.a.s.c.c.ConnectionManager Watcher org.apache.solr.common.cloud.ConnectionManager@69cd9648 name:ZooKeeperConnection Watcher:127.0.0.1:40414 got event WatchedEvent state:SyncConnected type:None path:null path:null type:None
   [junit4]   2> 932028 INFO  (jetty-launcher-1113-thread-2) [    ] o.a.s.c.c.ConnectionManager Client is connected to ZooKeeper
   [junit4]   2> 932028 INFO  (jetty-launcher-1113-thread-1) [    ] o.a.s.c.c.ConnectionManager Client is connected to ZooKeeper
   [junit4]   2> 932029 INFO  (jetty-launcher-1113-thread-1) [    ] o.a.s.c.c.SolrZkClient Using default ZkACLProvider
   [junit4]   2> 932029 INFO  (jetty-launcher-1113-thread-2) [    ] o.a.s.c.c.SolrZkClient Using default ZkACLProvider
   [junit4]   2> 932032 INFO  (jetty-launcher-1113-thread-2) [    ] o.a.s.c.ZkController Added new OnReconnect listener org.apache.solr.cloud.ZkController$$Lambda$140/297464292@6c62357
   [junit4]   2> 932033 INFO  (jetty-launcher-1113-thread-1) [    ] o.a.s.c.ZkController Added new OnReconnect listener org.apache.solr.cloud.ZkController$$Lambda$140/297464292@4874cc7f
   [junit4]   2> 932033 INFO  (jetty-launcher-1113-thread-2) [    ] o.a.s.c.c.ConnectionManager Waiting for client to connect to ZooKeeper
   [junit4]   2> 932034 INFO  (jetty-launcher-1113-thread-1) [    ] o.a.s.c.c.ConnectionManager Waiting for client to connect to ZooKeeper
   [junit4]   2> 932034 INFO  (zkCallback-1123-thread-1) [    ] o.a.s.c.c.ConnectionManager Watcher org.apache.solr.common.cloud.ConnectionManager@63c85a25 name:ZooKeeperConnection Watcher:127.0.0.1:40414/solr got event WatchedEvent state:SyncConnected type:None path:null path:null type:None
   [junit4]   2> 932034 INFO  (jetty-launcher-1113-thread-2) [    ] o.a.s.c.c.ConnectionManager Client is connected to ZooKeeper
   [junit4]   2> 932035 INFO  (zkCallback-1124-thread-1) [    ] o.a.s.c.c.ConnectionManager Watcher org.apache.solr.common.cloud.ConnectionManager@104553ed name:ZooKeeperConnection Watcher:127.0.0.1:40414/solr got event WatchedEvent state:SyncConnected type:None path:null path:null type:None
   [junit4]   2> 932035 INFO  (jetty-launcher-1113-thread-1) [    ] o.a.s.c.c.ConnectionManager Client is connected to ZooKeeper
   [junit4]   2> 932037 INFO  (jetty-launcher-1113-thread-2) [    ] o.a.s.c.c.SolrZkClient makePath: /overseer/queue
   [junit4]   2> 932037 INFO  (jetty-launcher-1113-thread-1) [    ] o.a.s.c.c.SolrZkClient makePath: /overseer/queue
   [junit4]   2> 932037 INFO  (jetty-launcher-1113-thread-2) [    ] o.a.s.c.c.SolrZkClient makePath: /overseer/collection-queue-work
   [junit4]   2> 932038 INFO  (jetty-launcher-1113-thread-1) [    ] o.a.s.c.c.SolrZkClient makePath: /overseer/collection-queue-work
   [junit4]   2> 932039 INFO  (jetty-launcher-1113-thread-1) [    ] o.a.s.c.c.SolrZkClient makePath: /overseer/collection-map-running
   [junit4]   2> 932039 INFO  (jetty-launcher-1113-thread-2) [    ] o.a.s.c.c.SolrZkClient makePath: /overseer/collection-map-running
   [junit4]   2> 932040 INFO  (jetty-launcher-1113-thread-1) [    ] o.a.s.c.c.SolrZkClient makePath: /overseer/collection-map-completed
   [junit4]   2> 932040 INFO  (jetty-launcher-1113-thread-2) [    ] o.a.s.c.c.SolrZkClient makePath: /overseer/collection-map-completed
   [junit4]   2> 932040 INFO  (jetty-launcher-1113-thread-1) [    ] o.a.s.c.c.SolrZkClient makePath: /overseer/collection-map-failure
   [junit4]   2> 932041 INFO  (jetty-launcher-1113-thread-2) [    ] o.a.s.c.c.SolrZkClient makePath: /overseer/collection-map-failure
   [junit4]   2> 932041 INFO  (jetty-launcher-1113-thread-1) [    ] o.a.s.c.c.SolrZkClient makePath: /live_nodes
   [junit4]   2> 932041 INFO  (jetty-launcher-1113-thread-2) [    ] o.a.s.c.c.SolrZkClient makePath: /live_nodes
   [junit4]   2> 932042 INFO  (jetty-launcher-1113-thread-2) [    ] o.a.s.c.c.SolrZkClient makePath: /collections
   [junit4]   2> 932042 INFO  (jetty-launcher-1113-thread-1) [    ] o.a.s.c.c.SolrZkClient makePath: /collections
   [junit4]   2> 932042 INFO  (jetty-launcher-1113-thread-1) [    ] o.a.s.c.c.SolrZkClient makePath: /aliases.json
   [junit4]   2> 932042 INFO  (jetty-launcher-1113-thread-2) [    ] o.a.s.c.c.SolrZkClient makePath: /aliases.json
   [junit4]   2> 932042 INFO  (jetty-launcher-1113-thread-1) [    ] o.a.s.c.c.SolrZkClient makePath: /clusterstate.json
   [junit4]   2> 932043 INFO  (jetty-launcher-1113-thread-2) [    ] o.a.s.c.c.SolrZkClient makePath: /clusterstate.json
   [junit4]   2> 932050 INFO  (jetty-launcher-1113-thread-2) [    ] o.a.s.c.c.SolrZkClient makePath: /security.json
   [junit4]   2> 932050 INFO  (jetty-launcher-1113-thread-1) [    ] o.a.s.c.c.SolrZkClient makePath: /security.json
   [junit4]   2> 932050 INFO  (jetty-launcher-1113-thread-2) [    ] o.a.s.c.c.ZkStateReader Updating cluster state from ZooKeeper... 
   [junit4]   2> 932050 INFO  (jetty-launcher-1113-thread-1) [    ] o.a.s.c.c.ZkStateReader Updating cluster state from ZooKeeper... 
   [junit4]   2> 932051 INFO  (jetty-launcher-1113-thread-2) [    ] o.a.s.c.c.ZkStateReader Loaded empty cluster properties
   [junit4]   2> 932051 INFO  (jetty-launcher-1113-thread-1) [    ] o.a.s.c.c.ZkStateReader Loaded empty cluster properties
   [junit4]   2> 932051 INFO  (jetty-launcher-1113-thread-2) [    ] o.a.s.c.c.ZkStateReader Updated live nodes from ZooKeeper... (0) -> (0)
   [junit4]   2> 932051 INFO  (jetty-launcher-1113-thread-1) [    ] o.a.s.c.c.ZkStateReader Updated live nodes from ZooKeeper... (0) -> (0)
   [junit4]   2> 932052 INFO  (jetty-launcher-1113-thread-1) [    ] o.a.s.c.c.SolrZkClient makePath: /overseer_elect
   [junit4]   2> 932052 INFO  (jetty-launcher-1113-thread-2) [    ] o.a.s.c.c.SolrZkClient makePath: /overseer_elect
   [junit4]   2> 932052 INFO  (jetty-launcher-1113-thread-1) [    ] o.a.s.c.c.SolrZkClient makePath: /overseer_elect/election
   [junit4]   2> 932052 INFO  (jetty-launcher-1113-thread-2) [    ] o.a.s.c.c.SolrZkClient makePath: /overseer_elect/election
   [junit4]   2> 932053 INFO  (jetty-launcher-1113-thread-1) [    ] o.a.s.c.Overseer Overseer (id=null) closing
   [junit4]   2> 932053 INFO  (jetty-launcher-1113-thread-2) [    ] o.a.s.c.Overseer Overseer (id=null) closing
   [junit4]   2> 932053 INFO  (jetty-launcher-1113-thread-1) [    ] o.a.s.c.LeaderElector Joined leadership election with path: /overseer_elect/election/95959445584281606-127.0.0.1:39291_solr-n_0000000000
   [junit4]   2> 932053 INFO  (jetty-launcher-1113-thread-2) [    ] o.a.s.c.LeaderElector Joined leadership election with path: /overseer_elect/election/95959445584281605-127.0.0.1:41098_solr-n_0000000001
   [junit4]   2> 932053 INFO  (jetty-launcher-1113-thread-1) [    ] o.a.s.c.OverseerElectionContext I am going to be the leader 127.0.0.1:39291_solr
   [junit4]   2> 932053 INFO  (jetty-launcher-1113-thread-1) [    ] o.a.s.c.c.SolrZkClient makePath: /overseer_elect/leader
   [junit4]   2> 932053 INFO  (jetty-launcher-1113-thread-2) [    ] o.a.s.c.LeaderElector Watching path /overseer_elect/election/95959445584281606-127.0.0.1:39291_solr-n_0000000000 to know if I could be the leader
   [junit4]   2> 932054 INFO  (jetty-launcher-1113-thread-2) [    ] o.a.s.c.ZkController Register node as live in ZooKeeper:/live_nodes/127.0.0.1:41098_solr
   [junit4]   2> 932054 INFO  (jetty-launcher-1113-thread-1) [    ] o.a.s.c.Overseer Overseer (id=95959445584281606-127.0.0.1:39291_solr-n_0000000000) starting
   [junit4]   2> 932054 INFO  (jetty-launcher-1113-thread-2) [    ] o.a.s.c.c.SolrZkClient makePath: /live_nodes/127.0.0.1:41098_solr
   [junit4]   2> 932054 INFO  (zkCallback-1124-thread-1) [    ] o.a.s.c.c.ZkStateReader A live node change: [WatchedEvent state:SyncConnected type:NodeChildrenChanged path:/live_nodes], has occurred - updating... (live nodes size: [0])
   [junit4]   2> 932054 INFO  (zkCallback-1123-thread-1) [    ] o.a.s.c.c.ZkStateReader A live node change: [WatchedEvent state:SyncConnected type:NodeChildrenChanged path:/live_nodes], has occurred - updating... (live nodes size: [0])
   [junit4]   2> 932055 INFO  (zkCallback-1123-thread-1) [    ] o.a.s.c.c.ZkStateReader Updated live nodes from ZooKeeper... (0) -> (1)
   [junit4]   2> 932055 INFO  (zkCallback-1124-thread-1) [    ] o.a.s.c.c.ZkStateReader Updated live nodes from ZooKeeper... (0) -> (1)
   [junit4]   2> 932055 INFO  (jetty-launcher-1113-thread-1) [    ] o.a.s.c.c.SolrZkClient makePath: /overseer/queue-work
   [junit4]   2> 932057 INFO  (jetty-launcher-1113-thread-1) [    ] o.a.s.c.OverseerAutoReplicaFailoverThread Starting OverseerAutoReplicaFailoverThread autoReplicaFailoverWorkLoopDelay=10000 autoReplicaFailoverWaitAfterExpiration=30000 autoReplicaFailoverBadNodeExpiration=60000
   [junit4]   2> 932058 INFO  (OverseerCollectionConfigSetProcessor-95959445584281606-127.0.0.1:39291_solr-n_0000000000) [    ] o.a.s.c.OverseerTaskProcessor Process current queue of overseer operations
   [junit4]   2> 932058 INFO  (jetty-launcher-1113-thread-1) [    ] o.a.s.c.ZkController Publish node=127.0.0.1:39291_solr as DOWN
   [junit4]   2> 932058 INFO  (OverseerStateUpdate-95959445584281606-127.0.0.1:39291_solr-n_0000000000) [    ] o.a.s.c.Overseer Starting to work on the main queue
   [junit4]   2> 932059 INFO  (OverseerStateUpdate-95959445584281606-127.0.0.1:39291_solr-n_0000000000) [    ] o.a.s.c.c.ZkStateReader Updated live nodes from ZooKeeper... (1) -> (1)
   [junit4]   2> 932059 INFO  (OverseerStateUpdate-95959445584281606-127.0.0.1:39291_solr-n_0000000000) [    ] o.a.s.c.Overseer processMessage: queueSize: 1, message = {
   [junit4]   2>   "operation":"downnode",
   [junit4]   2>   "node_name":"127.0.0.1:39291_solr"} current state version: 0
   [junit4]   2> 932059 INFO  (OverseerStateUpdate-95959445584281606-127.0.0.1:39291_solr-n_0000000000) [    ] o.a.s.c.o.NodeMutator DownNode state invoked for node: 127.0.0.1:39291_solr
   [junit4]   2> 932067 INFO  (jetty-launcher-1113-thread-2) [    ] o.a.s.c.CoreContainer Security conf doesn't exist. Skipping setup for authorization module.
   [junit4]   2> 932067 INFO  (jetty-launcher-1113-thread-2) [    ] o.a.s.c.CoreContainer No authentication plugin used.
   [junit4]   2> 932068 INFO  (jetty-launcher-1113-thread-2) [    ] o.a.s.c.CorePropertiesLocator Looking for core definitions underneath /home/jenkins/workspace/Lucene-Solr-master-Linux/solr/build/solr-core/test/J0/temp/solr.schema.TestManagedSchemaAPI_D9C15A6788B034D8-001/tempDir-001/node2/.
   [junit4]   2> 932068 INFO  (jetty-launcher-1113-thread-2) [    ] o.a.s.c.CorePropertiesLocator Found 0 core definitions
   [junit4]   2> 932068 INFO  (jetty-launcher-1113-thread-2) [    ] o.a.s.s.SolrDispatchFilter user.dir=/home/jenkins/workspace/Lucene-Solr-master-Linux/solr/build/solr-core/test/J0
   [junit4]   2> 932068 INFO  (jetty-launcher-1113-thread-2) [    ] o.a.s.s.SolrDispatchFilter SolrDispatchFilter.init() done
   [junit4]   2> 933058 INFO  (jetty-launcher-1113-thread-1) [    ] o.a.s.c.ZkController Register node as live in ZooKeeper:/live_nodes/127.0.0.1:39291_solr
   [junit4]   2> 933059 INFO  (jetty-launcher-1113-thread-1) [    ] o.a.s.c.c.SolrZkClient makePath: /live_nodes/127.0.0.1:39291_solr
   [junit4]   2> 933060 INFO  (zkCallback-1123-thread-1) [    ] o.a.s.c.c.ZkStateReader A live node change: [WatchedEvent state:SyncConnected type:NodeChildrenChanged path:/live_nodes], has occurred - updating... (live nodes size: [1])
   [junit4]   2> 933060 INFO  (zkCallback-1124-thread-1) [    ] o.a.s.c.c.ZkStateReader A live node change: [WatchedEvent state:SyncConnected type:NodeChildrenChanged path:/live_nodes], has occurred - updating... (live nodes size: [1])
   [junit4]   2> 933060 INFO  (zkCallback-1123-thread-1) [    ] o.a.s.c.c.ZkStateReader Updated live nodes from ZooKeeper... (1) -> (2)
   [junit4]   2> 933060 INFO  (zkCallback-1124-thread-1) [    ] o.a.s.c.c.ZkStateReader Updated live nodes from ZooKeeper... (1) -> (2)
   [junit4]   2> 933064 INFO  (jetty-launcher-1113-thread-1) [    ] o.a.s.c.CoreContainer Security conf doesn't exist. Skipping setup for authorization module.
   [junit4]   2> 933064 INFO  (jetty-launcher-1113-thread-1) [    ] o.a.s.c.CoreContainer No authentication plugin used.
   [junit4]   2> 933064 INFO  (jetty-launcher-1113-thread-1) [    ] o.a.s.c.CorePropertiesLocator Looking for core definitions underneath /home/jenkins/workspace/Lucene-Solr-master-Linux/solr/build/solr-core/test/J0/temp/solr.schema.TestManagedSchemaAPI_D9C15A6788B034D8-001/tempDir-001/node1/.
   [junit4]   2> 933064 INFO  (jetty-launcher-1113-thread-1) [    ] o.a.s.c.CorePropertiesLocator Found 0 core definitions
   [junit4]   2> 933064 INFO  (jetty-launcher-1113-thread-1) [    ] o.a.s.s.SolrDispatchFilter user.dir=/home/jenkins/workspace/Lucene-Solr-master-Linux/solr/build/solr-core/test/J0
   [junit4]   2> 933064 INFO  (jetty-launcher-1113-thread-1) [    ] o.a.s.s.SolrDispatchFilter SolrDispatchFilter.init() done
   [junit4]   2> 933065 INFO  (SUITE-TestManagedSchemaAPI-seed#[D9C15A6788B034D8]-worker) [    ] o.a.s.c.c.SolrZkClient Using default ZkCredentialsProvider
   [junit4]   2> 933065 INFO  (SUITE-TestManagedSchemaAPI-seed#[D9C15A6788B034D8]-worker) [    ] o.a.s.c.c.ConnectionManager Waiting for client to connect to ZooKeeper
   [junit4]   2> 933066 INFO  (zkCallback-1127-thread-1) [    ] o.a.s.c.c.ConnectionManager Watcher org.apache.solr.common.cloud.ConnectionManager@79fb3a11 name:ZooKeeperConnection Watcher:127.0.0.1:40414 got event WatchedEvent state:SyncConnected type:None path:null path:null type:None
   [junit4]   2> 933066 INFO  (SUITE-TestManagedSchemaAPI-seed#[D9C15A6788B034D8]-worker) [    ] o.a.s.c.c.ConnectionManager Client is connected to ZooKeeper
   [junit4]   2> 933066 INFO  (SUITE-TestManagedSchemaAPI-seed#[D9C15A6788B034D8]-worker) [    ] o.a.s.c.c.SolrZkClient Using default ZkACLProvider
   [junit4]   2> 933067 WARN  (NIOServerCxn.Factory:0.0.0.0/0.0.0.0:0) [    ] o.a.z.s.NIOServerCnxn caught end of stream exception
   [junit4]   2> EndOfStreamException: Unable to read additional data from client sessionid 0x154ea9b7ae50007, likely client has closed socket
   [junit4]   2> 	at org.apache.zookeeper.server.NIOServerCnxn.doIO(NIOServerCnxn.java:228)
   [junit4]   2> 	at org.apache.zookeeper.server.NIOServerCnxnFactory.run(NIOServerCnxnFactory.java:208)
   [junit4]   2> 	at java.lang.Thread.run(java.base@9-ea/Thread.java:804)
   [junit4]   2> 933067 INFO  (SUITE-TestManagedSchemaAPI-seed#[D9C15A6788B034D8]-worker) [    ] o.a.s.c.s.i.CloudSolrClient Final constructed zkHost string: 127.0.0.1:40414/solr
   [junit4]   2> 933068 INFO  (SUITE-TestManagedSchemaAPI-seed#[D9C15A6788B034D8]-worker) [    ] o.a.s.c.c.SolrZkClient Using default ZkCredentialsProvider
   [junit4]   2> 933069 INFO  (SUITE-TestManagedSchemaAPI-seed#[D9C15A6788B034D8]-worker) [    ] o.a.s.c.c.ConnectionManager Waiting for client to connect to ZooKeeper
   [junit4]   2> 933069 INFO  (zkCallback-1130-thread-1) [    ] o.a.s.c.c.ConnectionManager Watcher org.apache.solr.common.cloud.ConnectionManager@1d2aca0b name:ZooKeeperConnection Watcher:127.0.0.1:40414/solr got event WatchedEvent state:SyncConnected type:None path:null path:null type:None
   [junit4]   2> 933069 INFO  (SUITE-TestManagedSchemaAPI-seed#[D9C15A6788B034D8]-worker) [    ] o.a.s.c.c.ConnectionManager Client is connected to ZooKeeper
   [junit4]   2> 933070 INFO  (SUITE-TestManagedSchemaAPI-seed#[D9C15A6788B034D8]-worker) [    ] o.a.s.c.c.SolrZkClient Using default ZkACLProvider
   [junit4]   2> 933070 INFO  (SUITE-TestManagedSchemaAPI-seed#[D9C15A6788B034D8]-worker) [    ] o.a.s.c.c.ZkStateReader Updating cluster state from ZooKeeper... 
   [junit4]   2> 933070 INFO  (SUITE-TestManagedSchemaAPI-seed#[D9C15A6788B034D8]-worker) [    ] o.a.s.c.c.ZkStateReader Loaded empty cluster properties
   [junit4]   2> 933070 INFO  (SUITE-TestManagedSchemaAPI-seed#[D9C15A6788B034D8]-worker) [    ] o.a.s.c.c.ZkStateReader Updated live nodes from ZooKeeper... (0) -> (2)
   [junit4]   2> 933071 INFO  (SUITE-TestManagedSchemaAPI-seed#[D9C15A6788B034D8]-worker) [    ] o.a.s.c.c.SolrZkClient makePath: /configs/conf1/solrconfig.xml
   [junit4]   2> 933072 INFO  (SUITE-TestManagedSchemaAPI-seed#[D9C15A6788B034D8]-worker) [    ] o.a.s.c.c.SolrZkClient makePath: /configs/conf1/managed-schema
   [junit4]   2> 933085 INFO  (TEST-TestManagedSchemaAPI.test-seed#[D9C15A6788B034D8]) [    ] o.a.s.SolrTestCaseJ4 ###Starting test
   [junit4]   2> 933087 INFO  (qtp28474793-7303) [    ] o.a.s.h.a.CollectionsHandler Invoked Collection Action :create with params replicationFactor=2&collection.configName=conf1&name=testschemaapi&action=CREATE&numShards=1&wt=javabin&version=2 and sendToOCPQueue=true
   [junit4]   2> 933088 INFO  (OverseerCollectionConfigSetProcessor-95959445584281606-127.0.0.1:39291_solr-n_0000000000) [    ] o.a.s.c.OverseerTaskProcessor Overseer Collection Message Handler: Get the message id:/overseer/collection-queue-work/qn-0000000000 message:{
   [junit4]   2>   "name":"testschemaapi",
   [junit4]   2>   "fromApi":"true",
   [junit4]   2>   "replicationFactor":"2",
   [junit4]   2>   "collection.configName":"conf1",
   [junit4]   2>   "numShards":"1",
   [junit4]   2>   "stateFormat":"2",
   [junit4]   2>   "operation":"create"}
   [junit4]   2> 933088 INFO  (OverseerThreadFactory-3804-thread-1) [    ] o.a.s.c.OverseerCollectionMessageHandler OverseerCollectionMessageHandler.processMessage : create , {
   [junit4]   2>   "name":"testschemaapi",
   [junit4]   2>   "fromApi":"true",
   [junit4]   2>   "replicationFactor":"2",
   [junit4]   2>   "collection.configName":"conf1",
   [junit4]   2>   "numShards":"1",
   [junit4]   2>   "stateFormat":"2",
   [junit4]   2>   "operation":"create"}
   [junit4]   2> 933088 INFO  (OverseerThreadFactory-3804-thread-1) [    ] o.a.s.c.OverseerCollectionMessageHandler Create collection testschemaapi
   [junit4]   2> 933088 INFO  (OverseerThreadFactory-3804-thread-1) [    ] o.a.s.c.OverseerCollectionMessageHandler creating collections conf node /collections/testschemaapi 
   [junit4]   2> 933088 INFO  (OverseerThreadFactory-3804-thread-1) [    ] o.a.s.c.c.SolrZkClient makePath: /collections/testschemaapi
   [junit4]   2> 933088 INFO  (zkCallback-1124-thread-1) [    ] o.a.s.c.c.ZkStateReader A collections change: [WatchedEvent state:SyncConnected type:NodeChildrenChanged path:/collections], has occurred - updating...
   [junit4]   2> 933089 INFO  (zkCallback-1123-thread-1) [    ] o.a.s.c.c.ZkStateReader A collections change: [WatchedEvent state:SyncConnected type:NodeChildrenChanged path:/collections], has occurred - updating...
   [junit4]   2> 933089 INFO  (zkCallback-1130-thread-1) [    ] o.a.s.c.c.ZkStateReader A collections change: [WatchedEvent state:SyncConnected type:NodeChildrenChanged path:/collections], has occurred - updating...
   [junit4]   2> 933090 INFO  (OverseerStateUpdate-95959445584281606-127.0.0.1:39291_solr-n_0000000000) [    ] o.a.s.c.Overseer processMessage: queueSize: 1, message = {
   [junit4]   2>   "name":"testschemaapi",
   [junit4]   2>   "fromApi":"true",
   [junit4]   2>   "replicationFactor":"2",
   [junit4]   2>   "collection.configName":"conf1",
   [junit4]   2>   "numShards":"1",
   [junit4]   2>   "stateFormat":"2",
   [junit4]   2>   "operation":"create"} current state version: 0
   [junit4]   2> 933090 INFO  (OverseerStateUpdate-95959445584281606-127.0.0.1:39291_solr-n_0000000000) [    ] o.a.s.c.o.ClusterStateMutator building a new cName: testschemaapi
   [junit4]   2> 933090 INFO  (OverseerStateUpdate-95959445584281606-127.0.0.1:39291_solr-n_0000000000) [    ] o.a.s.c.o.ZkStateWriter going to create_collection /collections/testschemaapi/state.json
   [junit4]   2> 933190 INFO  (OverseerThreadFactory-3804-thread-1) [    ] o.a.s.c.OverseerCollectionMessageHandler Creating SolrCores for new collection testschemaapi, shardNames [shard1] , replicationFactor : 2
   [junit4]   2> 933190 INFO  (OverseerThreadFactory-3804-thread-1) [    ] o.a.s.c.OverseerCollectionMessageHandler Creating core testschemaapi_shard1_replica2 as part of shard shard1 of collection testschemaapi on 127.0.0.1:41098_solr
   [junit4]   2> 933190 INFO  (OverseerThreadFactory-3804-thread-1) [    ] o.a.s.c.OverseerCollectionMessageHandler Creating core testschemaapi_shard1_replica1 as part of shard shard1 of collection testschemaapi on 127.0.0.1:39291_solr
   [junit4]   2> 933191 INFO  (qtp28474793-7307) [    ] o.a.s.h.a.CoreAdminOperation core create command qt=/admin/cores&collection.configName=conf1&name=testschemaapi_shard1_replica2&action=CREATE&numShards=1&collection=testschemaapi&shard=shard1&wt=javabin&version=2
   [junit4]   2> 933191 INFO  (qtp1478856805-7302) [    ] o.a.s.h.a.CoreAdminOperation core create command qt=/admin/cores&collection.configName=conf1&name=testschemaapi_shard1_replica1&action=CREATE&numShards=1&collection=testschemaapi&shard=shard1&wt=javabin&version=2
   [junit4]   2> 933191 INFO  (qtp28474793-7307) [    ] o.a.s.c.CoreDescriptor Created CoreDescriptor: {name=testschemaapi_shard1_replica2, collection.configName=conf1, config=solrconfig.xml, transient=false, schema=schema.xml, loadOnStartup=true, configSetProperties=configsetprops.json, collection=testschemaapi, numShards=1, dataDir=data/, shard=shard1}
   [junit4]   2> 933191 INFO  (qtp1478856805-7302) [    ] o.a.s.c.CoreDescriptor Created CoreDescriptor: {name=testschemaapi_shard1_replica1, collection.configName=conf1, config=solrconfig.xml, transient=false, schema=schema.xml, loadOnStartup=true, configSetProperties=configsetprops.json, collection=testschemaapi, numShards=1, dataDir=data/, shard=shard1}
   [junit4]   2> 933192 INFO  (qtp28474793-7307) [    ] o.a.s.c.ZkController publishing state=down
   [junit4]   2> 933192 INFO  (qtp1478856805-7302) [    ] o.a.s.c.ZkController publishing state=down
   [junit4]   2> 933192 INFO  (qtp28474793-7307) [    ] o.a.s.c.ZkController Registering watch for collection testschemaapi
   [junit4]   2> 933192 INFO  (qtp1478856805-7302) [    ] o.a.s.c.ZkController Registering watch for collection testschemaapi
   [junit4]   2> 933192 INFO  (qtp28474793-7307) [    ] o.a.s.c.c.ZkStateReader Add data for [testschemaapi] ver [0]
   [junit4]   2> 933192 INFO  (OverseerStateUpdate-95959445584281606-127.0.0.1:39291_solr-n_0000000000) [    ] o.a.s.c.Overseer processMessage: queueSize: 2, message = {
   [junit4]   2>   "core":"testschemaapi_shard1_replica2",
   [junit4]   2>   "roles":null,
   [junit4]   2>   "base_url":"http://127.0.0.1:41098/solr",
   [junit4]   2>   "node_name":"127.0.0.1:41098_solr",
   [junit4]   2>   "numShards":"1",
   [junit4]   2>   "state":"down",
   [junit4]   2>   "shard":"shard1",
   [junit4]   2>   "collection":"testschemaapi",
   [junit4]   2>   "operation":"state"} current state version: 0
   [junit4]   2> 933192 INFO  (qtp28474793-7307) [    ] o.a.s.c.ZkController look for our core node name
   [junit4]   2> 933192 INFO  (OverseerStateUpdate-95959445584281606-127.0.0.1:39291_solr-n_0000000000) [    ] o.a.s.c.o.ReplicaMutator Update state numShards=1 message={
   [junit4]   2>   "core":"testschemaapi_shard1_replica2",
   [junit4]   2>   "roles":null,
   [junit4]   2>   "base_url":"http://127.0.0.1:41098/solr",
   [junit4]   2>   "node_name":"127.0.0.1:41098_solr",
   [junit4]   2>   "numShards":"1",
   [junit4]   2>   "state":"down",
   [junit4]   2>   "shard":"shard1",
   [junit4]   2>   "collection":"testschemaapi",
   [junit4]   2>   "operation":"state"}
   [junit4]   2> 933192 INFO  (qtp1478856805-7302) [    ] o.a.s.c.c.ZkStateReader Add data for [testschemaapi] ver [0]
   [junit4]   2> 933192 INFO  (qtp1478856805-7302) [    ] o.a.s.c.ZkController look for our core node name
   [junit4]   2> 933193 INFO  (OverseerStateUpdate-95959445584281606-127.0.0.1:39291_solr-n_0000000000) [    ] o.a.s.c.Overseer processMessage: queueSize: 2, message = {
   [junit4]   2>   "core":"testschemaapi_shard1_replica1",
   [junit4]   2>   "roles":null,
   [junit4]   2>   "base_url":"http://127.0.0.1:39291/solr",
   [junit4]   2>   "node_name":"127.0.0.1:39291_solr",
   [junit4]   2>   "numShards":"1",
   [junit4]   2>   "state":"down",
   [junit4]   2>   "shard":"shard1",
   [junit4]   2>   "collection":"testschemaapi",
   [junit4]   2>   "operation":"state"} current state version: 0
   [junit4]   2> 933193 INFO  (OverseerStateUpdate-95959445584281606-127.0.0.1:39291_solr-n_0000000000) [    ] o.a.s.c.o.ReplicaMutator Update state numShards=1 message={
   [junit4]   2>   "core":"testschemaapi_shard1_replica1",
   [junit4]   2>   "roles":null,
   [junit4]   2>   "base_url":"http://127.0.0.1:39291/solr",
   [junit4]   2>   "node_name":"127.0.0.1:39291_solr",
   [junit4]   2>   "numShards":"1",
   [junit4]   2>   "state":"down",
   [junit4]   2>   "shard":"shard1",
   [junit4]   2>   "collection":"testschemaapi",
   [junit4]   2>   "operation":"state"}
   [junit4]   2> 933294 INFO  (OverseerStateUpdate-95959445584281606-127.0.0.1:39291_solr-n_0000000000) [    ] o.a.s.c.o.ZkStateWriter going to update_collection /collections/testschemaapi/state.json version: 0
   [junit4]   2> 933294 INFO  (zkCallback-1124-thread-1) [    ] o.a.s.c.c.ZkStateReader A cluster state change: [WatchedEvent state:SyncConnected type:NodeDataChanged path:/collections/testschemaapi/state.json] for collection [testschemaapi] has occurred - updating... (live nodes size: [2])
   [junit4]   2> 933294 INFO  (zkCallback-1123-thread-1) [    ] o.a.s.c.c.ZkStateReader A cluster state change: [WatchedEvent state:SyncConnected type:NodeDataChanged path:/collections/testschemaapi/state.json] for collection [testschemaapi] has occurred - updating... (live nodes size: [2])
   [junit4]   2> 933294 INFO  (zkCallback-1124-thread-1) [    ] o.a.s.c.c.ZkStateReader Updating data for [testschemaapi] from [0] to [1]
   [junit4]   2> 933294 INFO  (zkCallback-1123-thread-1) [    ] o.a.s.c.c.ZkStateReader Updating data for [testschemaapi] from [0] to [1]
   [junit4]   2> 934192 INFO  (qtp28474793-7307) [    ] o.a.s.c.ZkController waiting to find shard id in clusterstate for testschemaapi_shard1_replica2
   [junit4]   2> 934192 INFO  (qtp28474793-7307) [    ] o.a.s.c.ZkController Check for collection zkNode:testschemaapi
   [junit4]   2> 934192 INFO  (qtp1478856805-7302) [    ] o.a.s.c.ZkController waiting to find shard id in clusterstate for testschemaapi_shard1_replica1
   [junit4]   2> 934193 INFO  (qtp1478856805-7302) [    ] o.a.s.c.ZkController Check for collection zkNode:testschemaapi
   [junit4]   2> 934193 INFO  (qtp28474793-7307) [    ] o.a.s.c.ZkController Collection zkNode exists
   [junit4]   2> 934193 INFO  (qtp28474793-7307) [    ] o.a.s.c.c.ZkStateReader Load collection config from: [/collections/testschemaapi]
   [junit4]   2> 934193 INFO  (qtp1478856805-7302) [    ] o.a.s.c.ZkController Collection zkNode exists
   [junit4]   2> 934193 INFO  (qtp1478856805-7302) [    ] o.a.s.c.c.ZkStateReader Load collection config from: [/collections/testschemaapi]
   [junit4]   2> 934193 INFO  (qtp28474793-7307) [    ] o.a.s.c.c.ZkStateReader path=[/collections/testschemaapi] [configName]=[conf1] specified config exists in ZooKeeper
   [junit4]   2> 934193 INFO  (qtp28474793-7307) [    ] o.a.s.c.SolrResourceLoader new SolrResourceLoader for directory: '/home/jenkins/workspace/Lucene-Solr-master-Linux/solr/build/solr-core/test/J0/temp/solr.schema.TestManagedSchemaAPI_D9C15A6788B034D8-001/tempDir-001/node2/testschemaapi_shard1_replica2'
   [junit4]   2> 934193 INFO  (qtp1478856805-7302) [    ] o.a.s.c.c.ZkStateReader path=[/collections/testschemaapi] [configName]=[conf1] specified config exists in ZooKeeper
   [junit4]   2> 934193 INFO  (qtp1478856805-7302) [    ] o.a.s.c.SolrResourceLoader new SolrResourceLoader for directory: '/home/jenkins/workspace/Lucene-Solr-master-Linux/solr/build/solr-core/test/J0/temp/solr.schema.TestManagedSchemaAPI_D9C15A6788B034D8-001/tempDir-001/node1/testschemaapi_shard1_replica1'
   [junit4]   2> 934193 INFO  (qtp28474793-7307) [    ] o.a.s.c.SolrResourceLoader JNDI not configured for solr (NoInitialContextEx)
   [junit4]   2> 934193 INFO  (qtp28474793-7307) [    ] o.a.s.c.SolrResourceLoader solr home defaulted to 'solr/' (could not find system property or JNDI)
   [junit4]   2> 934193 INFO  (qtp1478856805-7302) [    ] o.a.s.c.SolrResourceLoader JNDI not configured for solr (NoInitialContextEx)
   [junit4]   2> 934193 INFO  (qtp1478856805-7302) [    ] o.a.s.c.SolrResourceLoader solr home defaulted to 'solr/' (could not find system property or JNDI)
   [junit4]   2> 934194 INFO  (qtp1478856805-7302) [    ] o.a.s.c.Config loaded config solrconfig.xml with version 0 
   [junit4]   2> 934194 INFO  (qtp28474793-7307) [    ] o.a.s.c.Config loaded config solrconfig.xml with version 0 
   [junit4]   2> 934196 INFO  (qtp1478856805-7302) [    ] o.a.s.c.SolrConfig current version of requestparams : -1
   [junit4]   2> 934196 INFO  (qtp28474793-7307) [    ] o.a.s.c.SolrConfig current version of requestparams : -1
   [junit4]   2> 934198 INFO  (qtp28474793-7307) [    ] o.a.s.c.SolrConfig Using Lucene MatchVersion: 7.0.0
   [junit4]   2> 934198 INFO  (qtp1478856805-7302) [    ] o.a.s.c.SolrConfig Using Lucene MatchVersion: 7.0.0
   [junit4]   2> 934203 INFO  (qtp1478856805-7302) [    ] o.a.s.c.SolrConfig Loaded SolrConfig: solrconfig.xml
   [junit4]   2> 934204 INFO  (qtp28474793-7307) [    ] o.a.s.c.SolrConfig Loaded SolrConfig: solrconfig.xml
   [junit4]   2> 934205 INFO  (qtp1478856805-7302) [    ] o.a.s.s.IndexSchema [testschemaapi_shard1_replica1] Schema name=minimal
   [junit4]   2> 934205 INFO  (qtp28474793-7307) [    ] o.a.s.s.IndexSchema [testschemaapi_shard1_replica2] Schema name=minimal
   [junit4]   2> 934208 INFO  (qtp28474793-7307) [    ] o.a.s.s.IndexSchema unique key field: id
   [junit4]   2> 934208 INFO  (qtp1478856805-7302) [    ] o.a.s.s.IndexSchema unique key field: id
   [junit4]   2> 934209 INFO  (qtp1478856805-7302) [    ] o.a.s.c.ConfigSetProperties Did not find ConfigSet properties, assuming default properties: Can't find resource 'configsetprops.json' in classpath or '/configs/conf1', cwd=/home/jenkins/workspace/Lucene-Solr-master-Linux/solr/build/solr-core/test/J0
   [junit4]   2> 934209 INFO  (qtp28474793-7307) [    ] o.a.s.c.ConfigSetProperties Did not find ConfigSet properties, assuming default properties: Can't find resource 'configsetprops.json' in classpath or '/configs/conf1', cwd=/home/jenkins/workspace/Lucene-Solr-master-Linux/solr/build/solr-core/test/J0
   [junit4]   2> 934209 INFO  (qtp1478856805-7302) [    ] o.a.s.c.CoreContainer Creating SolrCore 'testschemaapi_shard1_replica1' using configuration from collection testschemaapi
   [junit4]   2> 934209 INFO  (qtp28474793-7307) [    ] o.a.s.c.CoreContainer Creating SolrCore 'testschemaapi_shard1_replica2' using configuration from collection testschemaapi
   [junit4]   2> 934209 INFO  (qtp1478856805-7302) [    ] o.a.s.c.SolrCore org.apache.solr.core.MockDirectoryFactory
   [junit4]   2> 934209 INFO  (qtp28474793-7307) [    ] o.a.s.c.SolrCore org.apache.solr.core.MockDirectoryFactory
   [junit4]   2> 934209 INFO  (qtp1478856805-7302) [    ] o.a.s.c.SolrCore [[testschemaapi_shard1_replica1] ] Opening new SolrCore at [/home/jenkins/workspace/Lucene-Solr-master-Linux/solr/build/solr-core/test/J0/temp/solr.schema.TestManagedSchemaAPI_D9C15A6788B034D8-001/tempDir-001/node1/testschemaapi_shard1_replica1], dataDir=[/home/jenkins/workspace/Lucene-Solr-master-Linux/solr/build/solr-core/test/J0/temp/solr.schema.TestManagedSchemaAPI_D9C15A6788B034D8-001/tempDir-001/node1/./testschemaapi_shard1_replica1/data/]
   [junit4]   2> 934209 INFO  (qtp1478856805-7302) [    ] o.a.s.c.SolrCore JMX monitoring not detected for core: testschemaapi_shard1_replica1
   [junit4]   2> 934209 INFO  (qtp28474793-7307) [    ] o.a.s.c.SolrCore [[testschemaapi_shard1_replica2] ] Opening new SolrCore at [/home/jenkins/workspace/Lucene-Solr-master-Linux/solr/build/solr-core/test/J0/temp/solr.schema.TestManagedSchemaAPI_D9C15A6788B034D8-001/tempDir-001/node2/testschemaapi_shard1_replica2], dataDir=[/home/jenkins/workspace/Lucene-Solr-master-Linux/solr/build/solr-core/test/J0/temp/solr.schema.TestManagedSchemaAPI_D9C15A6788B034D8-001/tempDir-001/node2/./testschemaapi_shard1_replica2/data/]
   [junit4]   2> 934209 INFO  (qtp28474793-7307) [    ] o.a.s.c.SolrCore JMX monitoring not detected for core: testschemaapi_shard1_replica2
   [junit4]   2> 934209 INFO  (qtp1478856805-7302) [    ] o.a.s.c.CachingDirectoryFactory return new directory for /home/jenkins/workspace/Lucene-Solr-master-Linux/solr/build/solr-core/test/J0/temp/solr.schema.TestManagedSchemaAPI_D9C15A6788B034D8-001/tempDir-001/node1/./testschemaapi_shard1_replica1/data
   [junit4]   2> 934210 INFO  (qtp1478856805-7302) [    ] o.a.s.c.SolrCore New index directory detected: old=null new=/home/jenkins/workspace/Lucene-Solr-master-Linux/solr/build/solr-core/test/J0/temp/solr.schema.TestManagedSchemaAPI_D9C15A6788B034D8-001/tempDir-001/node1/./testschemaapi_shard1_replica1/data/index/
   [junit4]   2> 934210 INFO  (qtp28474793-7307) [    ] o.a.s.c.CachingDirectoryFactory return new directory for /home/jenkins/workspace/Lucene-Solr-master-Linux/solr/build/solr-core/test/J0/temp/solr.schema.TestManagedSchemaAPI_D9C15A6788B034D8-001/tempDir-001/node2/./testschemaapi_shard1_replica2/data
   [junit4]   2> 934210 WARN  (qtp1478856805-7302) [    ] o.a.s.c.SolrCore [testschemaapi_shard1_replica1] Solr index directory '/home/jenkins/workspace/Lucene-Solr-master-Linux/solr/build/solr-core/test/J0/temp/solr.schema.TestManagedSchemaAPI_D9C15A6788B034D8-001/tempDir-001/node1/./testschemaapi_shard1_replica1/data/index' doesn't exist. Creating new index...
   [junit4]   2> 934210 INFO  (qtp28474793-7307) [    ] o.a.s.c.SolrCore New index directory detected: old=null new=/home/jenkins/workspace/Lucene-Solr-master-Linux/solr/build/solr-core/test/J0/temp/solr.schema.TestManagedSchemaAPI_D9C15A6788B034D8-001/tempDir-001/node2/./testschemaapi_shard1_replica2/data/index/
   [junit4]   2> 934210 WARN  (qtp28474793-7307) [    ] o.a.s.c.SolrCore [testschemaapi_shard1_replica2] Solr index directory '/home/jenkins/workspace/Lucene-Solr-master-Linux/solr/build/solr-core/test/J0/temp/solr.schema.TestManagedSchemaAPI_D9C15A6788B034D8-001/tempDir-001/node2/./testschemaapi_shard1_replica2/data/index' doesn't exist. Creating new index...
   [junit4]   2> 934210 INFO  (qtp1478856805-7302) [    ] o.a.s.c.CachingDirectoryFactory return new directory for /home/jenkins/workspace/Lucene-Solr-master-Linux/solr/build/solr-core/test/J0/temp/solr.schema.TestManagedSchemaAPI_D9C15A6788B034D8-001/tempDir-001/node1/./testschemaapi_shard1_replica1/data/index
   [junit4]   2> 934210 INFO  (qtp28474793-7307) [    ] o.a.s.c.CachingDirectoryFactory return new directory for /home/jenkins/workspace/Lucene-Solr-master-Linux/solr/build/solr-core/test/J0/temp/solr.schema.TestManagedSchemaAPI_D9C15A6788B034D8-001/tempDir-001/node2/./testschemaapi_shard1_replica2/data/index
   [junit4]   2> 934210 INFO  (qtp1478856805-7302) [    ] o.a.s.c.SolrDeletionPolicy SolrDeletionPolicy.onCommit: commits: num=1
   [junit4]   2> 	commit{dir=MockDirectoryWrapper(RAMDirectory@637caa5e lockFactory=org.apache.lucene.store.SingleInstanceLockFactory@3f907d9e),segFN=segments_1,generation=1}
   [junit4]   2> 934210 INFO  (qtp1478856805-7302) [    ] o.a.s.c.SolrDeletionPolicy newest commit generation = 1
   [junit4]   2> 934210 INFO  (qtp28474793-7307) [    ] o.a.s.c.SolrDeletionPolicy SolrDeletionPolicy.onCommit: commits: num=1
   [junit4]   2> 	commit{dir=MockDirectoryWrapper(RAMDirectory@5d7ee54a lockFactory=org.apache.lucene.store.SingleInstanceLockFactory@5b89da2c),segFN=segments_1,generation=1}
   [junit4]   2> 934210 INFO  (qtp28474793-7307) [    ] o.a.s.c.SolrDeletionPolicy newest commit generation = 1
   [junit4]   2> 934211 INFO  (OldIndexDirectoryCleanupThreadForCore-testschemaapi_shard1_replica1) [    ] o.a.s.c.SolrCore Looking for old index directories to cleanup for core testschemaapi_shard1_replica1 in /home/jenkins/workspace/Lucene-Solr-master-Linux/solr/build/solr-core/test/J0/temp/solr.schema.TestManagedSchemaAPI_D9C15A6788B034D8-001/tempDir-001/node1/./testschemaapi_shard1_replica1/data/
   [junit4]   2> 934211 INFO  (OldIndexDirectoryCleanupThreadForCore-testschemaapi_shard1_replica2) [    ] o.a.s.c.SolrCore Looking for old index directories to cleanup for core testschemaapi_shard1_replica2 in /home/jenkins/workspace/Lucene-Solr-master-Linux/solr/build/solr-core/test/J0/temp/solr.schema.TestManagedSchemaAPI_D9C15A6788B034D8-001/tempDir-001/node2/./testschemaapi_shard1_replica2/data/
   [junit4]   2> 934211 WARN  (OldIndexDirectoryCleanupThreadForCore-testschemaapi_shard1_replica1) [    ] o.a.s.c.DirectoryFactory /home/jenkins/workspace/Lucene-Solr-master-Linux/solr/build/solr-core/test/J0/temp/solr.schema.TestManagedSchemaAPI_D9C15A6788B034D8-001/tempDir-001/node1/./testschemaapi_shard1_replica1/data/ does not point to a valid data directory; skipping clean-up of old index directories.
   [junit4]   2> 934211 WARN  (OldIndexDirectoryCleanupThreadForCore-testschemaapi_shard1_replica2) [    ] o.a.s.c.DirectoryFactory /home/jenkins/workspace/Lucene-Solr-master-Linux/solr/build/solr-core/test/J0/temp/solr.schema.TestManagedSchemaAPI_D9C15A6788B034D8-001/tempDir-001/node2/./testschemaapi_shard1_replica2/data/ does not point to a valid data directory; skipping clean-up of old index directories.
   [junit4]   2> 934212 INFO  (qtp1478856805-7302) [    ] o.a.s.c.SolrCore no updateRequestProcessorChain defined as default, creating implicit default
   [junit4]   2> 934212 INFO  (qtp28474793-7307) [    ] o.a.s.c.SolrCore no updateRequestProcessorChain defined as default, creating implicit default
   [junit4]   2> 934213 INFO  (qtp1478856805-7302) [    ] o.a.s.h.l.XMLLoader xsltCacheLifetimeSeconds=60
   [junit4]   2> 934213 INFO  (qtp28474793-7307) [    ] o.a.s.h.l.XMLLoader xsltCacheLifetimeSeconds=60
   [junit4]   2> 934213 INFO  (qtp1478856805-7302) [    ] o.a.s.h.l.XMLLoader xsltCacheLifetimeSeconds=60
   [junit4]   2> 934213 INFO  (qtp28474793-7307) [    ] o.a.s.h.l.XMLLoader xsltCacheLifetimeSeconds=60
   [junit4]   2> 934214 INFO  (qtp1478856805-7302) [    ] o.a.s.h.l.XMLLoader xsltCacheLifetimeSeconds=60
   [junit4]   2> 934214 INFO  (qtp28474793-7307) [    ] o.a.s.h.l.XMLLoader xsltCacheLifetimeSeconds=60
   [junit4]   2> 934214 INFO  (qtp1478856805-7302) [    ] o.a.s.h.l.XMLLoader xsltCacheLifetimeSeconds=60
   [junit4]   2> 934214 INFO  (qtp28474793-7307) [    ] o.a.s.h.l.XMLLoader xsltCacheLifetimeSeconds=60
   [junit4]   2> 934215 INFO  (qtp1478856805-7302) [    ] o.a.s.c.RequestHandlers Registered paths: /admin/mbeans,/update/csv,/sql,/update/json/docs,/admin/luke,/graph,/export,/select,/admin/segments,/get,/admin/system,/replication,/admin/properties,/config,/stream,/schema,/admin/plugins,/admin/logging,/update/json,/admin/ping,/admin/threads,/update,/admin/file
   [junit4]   2> 934215 INFO  (qtp1478856805-7302) [    ] o.a.s.c.SolrCore Using default statsCache cache: org.apache.solr.search.stats.LocalStatsCache
   [junit4]   2> 934215 INFO  (qtp28474793-7307) [    ] o.a.s.c.RequestHandlers Registered paths: /admin/mbeans,/update/csv,/sql,/update/json/docs,/admin/luke,/graph,/export,/select,/admin/segments,/get,/admin/system,/replication,/admin/properties,/config,/stream,/schema,/admin/plugins,/admin/logging,/update/json,/admin/ping,/admin/threads,/update,/admin/file
   [junit4]   2> 934215 INFO  (qtp28474793-7307) [    ] o.a.s.c.SolrCore Using default statsCache cache: org.apache.solr.search.stats.LocalStatsCache
   [junit4]   2> 934216 INFO  (qtp28474793-7307) [    ] o.a.s.u.UpdateHandler Using UpdateLog implementation: org.apache.solr.update.UpdateLog
   [junit4]   2> 934216 INFO  (qtp1478856805-7302) [    ] o.a.s.u.UpdateHandler Using UpdateLog implementation: org.apache.solr.update.UpdateLog
   [junit4]   2> 934216 INFO  (qtp28474793-7307) [    ] o.a.s.u.UpdateLog Initializing UpdateLog: dataDir=null defaultSyncLevel=FLUSH numRecordsToKeep=100 maxNumLogsToKeep=10 numVersionBuckets=65536
   [junit4]   2> 934216 INFO  (qtp1478856805-7302) [    ] o.a.s.u.UpdateLog Initializing UpdateLog: dataDir=null defaultSyncLevel=FLUSH numRecordsToKeep=100 maxNumLogsToKeep=10 numVersionBuckets=65536
   [junit4]   2> 934217 INFO  (qtp1478856805-7302) [    ] o.a.s.u.CommitTracker Hard AutoCommit: disabled
   [junit4]   2> 934217 INFO  (qtp28474793-7307) [    ] o.a.s.u.CommitTracker Hard AutoCommit: disabled
   [junit4]   2> 934217 INFO  (qtp1478856805-7302) [    ] o.a.s.u.CommitTracker Soft AutoCommit: disabled
   [junit4]   2> 934217 INFO  (qtp28474793-7307) [    ] o.a.s.u.CommitTracker Soft AutoCommit: disabled
   [junit4]   2> 934217 INFO  (qtp1478856805-7302) [    ] o.a.s.c.SolrDeletionPolicy SolrDeletionPolicy.onInit: commits: num=1
   [junit4]   2> 	commit{dir=MockDirectoryWrapper(RAMDirectory@637caa5e lockFactory=org.apache.lucene.store.SingleInstanceLockFactory@3f907d9e),segFN=segments_1,generation=1}
   [junit4]   2> 934217 INFO  (qtp28474793-7307) [    ] o.a.s.c.SolrDeletionPolicy SolrDeletionPolicy.onInit: commits: num=1
   [junit4]   2> 	commit{dir=MockDirectoryWrapper(RAMDirectory@5d7ee54a lockFactory=org.apache.lucene.store.SingleInstanceLockFactory@5b89da2c),segFN=segments_1,generation=1}
   [junit4]   2> 934217 INFO  (qtp28474793-7307) [    ] o.a.s.c.SolrDeletionPolicy newest commit generation = 1
   [junit4]   2> 934217 INFO  (qtp1478856805-7302) [    ] o.a.s.c.SolrDeletionPolicy newest commit generation = 1
   [junit4]   2> 934217 INFO  (qtp28474793-7307) [    ] o.a.s.s.SolrIndexSearcher Opening [Searcher@5c47f82a[testschemaapi_shard1_replica2] main]
   [junit4]   2> 934217 INFO  (qtp1478856805-7302) [    ] o.a.s.s.SolrIndexSearcher Opening [Searcher@37f647f3[testschemaapi_shard1_replica1] main]
   [junit4]   2> 934217 INFO  (qtp28474793-7307) [    ] o.a.s.c.c.ZkStateReader Load collection config from: [/collections/testschemaapi]
   [junit4]   2> 934217 INFO  (qtp1478856805-7302) [    ] o.a.s.c.c.ZkStateReader Load collection config from: [/collections/testschemaapi]
   [junit4]   2> 934218 INFO  (qtp28474793-7307) [    ] o.a.s.c.c.ZkStateReader path=[/collections/testschemaapi] [configName]=[conf1] specified config exists in ZooKeeper
   [junit4]   2> 934218 INFO  (qtp1478856805-7302) [    ] o.a.s.c.c.ZkStateReader path=[/collections/testschemaapi] [configName]=[conf1] specified config exists in ZooKeeper
   [junit4]   2> 934218 INFO  (qtp1478856805-7302) [    ] o.a.s.r.ManagedResourceStorage Setting up ZooKeeper-based storage for the RestManager with znodeBase: /configs/conf1
   [junit4]   2> 934218 INFO  (qtp28474793-7307) [    ] o.a.s.r.ManagedResourceStorage Setting up ZooKeeper-based storage for the RestManager with znodeBase: /configs/conf1
   [junit4]   2> 934218 INFO  (qtp28474793-7307) [    ] o.a.s.r.ManagedResourceStorage Configured ZooKeeperStorageIO with znodeBase: /configs/conf1
   [junit4]   2> 934218 INFO  (qtp1478856805-7302) [    ] o.a.s.r.ManagedResourceStorage Configured ZooKeeperStorageIO with znodeBase: /configs/conf1
   [junit4]   2> 934218 INFO  (qtp28474793-7307) [    ] o.a.s.r.RestManager Initializing RestManager with initArgs: {}
   [junit4]   2> 934218 INFO  (qtp1478856805-7302) [    ] o.a.s.r.RestManager Initializing RestManager with initArgs: {}
   [junit4]   2> 934218 INFO  (qtp28474793-7307) [    ] o.a.s.r.ManagedResourceStorage Reading _rest_managed.json using ZooKeeperStorageIO:path=/configs/conf1
   [junit4]   2> 934218 INFO  (qtp1478856805-7302) [    ] o.a.s.r.ManagedResourceStorage Reading _rest_managed.json using ZooKeeperStorageIO:path=/configs/conf1
   [junit4]   2> 934218 INFO  (qtp28474793-7307) [    ] o.a.s.r.ManagedResourceStorage No data found for znode /configs/conf1/_rest_managed.json
   [junit4]   2> 934218 INFO  (qtp1478856805-7302) [    ] o.a.s.r.ManagedResourceStorage No data found for znode /configs/conf1/_rest_managed.json
   [junit4]   2> 934218 INFO  (qtp28474793-7307) [    ] o.a.s.r.ManagedResourceStorage Loaded null at path _rest_managed.json using ZooKeeperStorageIO:path=/configs/conf1
   [junit4]   2> 934219 INFO  (qtp1478856805-7302) [    ] o.a.s.r.ManagedResourceStorage Loaded null at path _rest_managed.json using ZooKeeperStorageIO:path=/configs/conf1
   [junit4]   2> 934219 INFO  (qtp28474793-7307) [    ] o.a.s.r.RestManager Initializing 0 registered ManagedResources
   [junit4]   2> 934219 INFO  (qtp1478856805-7302) [    ] o.a.s.r.RestManager Initializing 0 registered ManagedResources
   [junit4]   2> 934219 INFO  (qtp28474793-7307) [    ] o.a.s.s.ZkIndexSchemaReader Creating ZooKeeper watch for the managed schema at /configs/conf1/managed-schema
   [junit4]   2> 934219 INFO  (qtp1478856805-7302) [    ] o.a.s.s.ZkIndexSchemaReader Creating ZooKeeper watch for the managed schema at /configs/conf1/managed-schema
   [junit4]   2> 934219 INFO  (qtp28474793-7307) [    ] o.a.s.c.ZkController Added new OnReconnect listener ZkIndexSchemaReader: /configs/conf1/managed-schema, uniqueCoreId: testschemaapi_shard1_replica2:1683101021621277
   [junit4]   2> 934219 INFO  (qtp28474793-7307) [    ] o.a.s.h.ReplicationHandler Commits will be reserved for  10000
   [junit4]   2> 934219 INFO  (qtp1478856805-7302) [    ] o.a.s.c.ZkController Added new OnReconnect listener ZkIndexSchemaReader: /configs/conf1/managed-schema, uniqueCoreId: testschemaapi_shard1_replica1:1683101021593407
   [junit4]   2> 934219 INFO  (qtp1478856805-7302) [    ] o.a.s.h.ReplicationHandler Commits will be reserved for  10000
   [junit4]   2> 934219 INFO  (qtp28474793-7307) [    ] o.a.s.u.UpdateLog Looking up max value of version field to seed version buckets
   [junit4]   2> 934220 INFO  (searcherExecutor-3810-thread-1) [    ] o.a.s.c.SolrCore [testschemaapi_shard1_replica2] Registered new searcher Searcher@5c47f82a[testschemaapi_shard1_replica2] main{ExitableDirectoryReader(UninvertingDirectoryReader())}
   [junit4]   2> 934219 INFO  (searcherExecutor-3809-thread-1) [    ] o.a.s.c.SolrCore [testschemaapi_shard1_replica1] Registered new searcher Searcher@37f647f3[testschemaapi_shard1_replica1] main{ExitableDirectoryReader(UninvertingDirectoryReader())}
   [junit4]   2> 934220 INFO  (qtp28474793-7307) [    ] o.a.s.u.VersionInfo Refreshing highest value of _version_ for 65536 version buckets from index
   [junit4]   2> 934220 INFO  (qtp1478856805-7302) [    ] o.a.s.u.UpdateLog Looking up max value of version field to seed version buckets
   [junit4]   2> 934220 INFO  (qtp28474793-7307) [    ] o.a.s.u.VersionInfo No terms found for _version_, cannot seed version bucket highest value from index
   [junit4]   2> 934220 INFO  (qtp1478856805-7302) [    ] o.a.s.u.VersionInfo Refreshing highest value of _version_ for 65536 version buckets from index
   [junit4]   2> 934220 INFO  (qtp28474793-7307) [    ] o.a.s.u.UpdateLog Could not find max version in index or recent updates, using new clock 1535351131801124864
   [junit4]   2> 934220 INFO  (qtp1478856805-7302) [    ] o.a.s.u.VersionInfo No terms found for _version_, cannot seed version bucket highest value from index
   [junit4]   2> 934220 INFO  (qtp1478856805-7302) [    ] o.a.s.u.UpdateLog Could not find max version in index or recent updates, using new clock 1535351131801124864
   [junit4]   2> 934222 INFO  (qtp28474793-7307) [    ] o.a.s.u.UpdateLog Took 1.0ms to seed version buckets with highest version 1535351131801124864
   [junit4]   2> 934222 INFO  (qtp28474793-7307) [    ] o.a.s.c.ZkController watch zkdir /configs/conf1
   [junit4]   2> 934222 INFO  (qtp1478856805-7302) [    ] o.a.s.u.UpdateLog Took 1.0ms to seed version buckets with highest version 1535351131801124864
   [junit4]   2> 934222 INFO  (qtp1478856805-7302) [    ] o.a.s.c.ZkController watch zkdir /configs/conf1
   [junit4]   2> 934222 INFO  (qtp28474793-7307) [    ] o.a.s.c.CoreContainer registering core: testschemaapi_shard1_replica2
   [junit4]   2> 934222 INFO  (qtp28474793-7307) [    ] o.a.s.c.ZkController Register replica - core:testschemaapi_shard1_replica2 address:http://127.0.0.1:41098/solr collection:testschemaapi shard:shard1
   [junit4]   2> 934223 INFO  (qtp1478856805-7302) [    ] o.a.s.c.CoreContainer registering core: testschemaapi_shard1_replica1
   [junit4]   2> 934223 INFO  (qtp1478856805-7302) [    ] o.a.s.c.ZkController Register replica - core:testschemaapi_shard1_replica1 address:http://127.0.0.1:39291/solr collection:testschemaapi shard:shard1
   [junit4]   2> 934223 INFO  (qtp28474793-7307) [    ] o.a.s.c.c.SolrZkClient makePath: /collections/testschemaapi/leader_elect/shard1/election
   [junit4]   2> 934223 INFO  (qtp1478856805-7302) [    ] o.a.s.c.c.SolrZkClient makePath: /collections/testschemaapi/leader_elect/shard1/election
   [junit4]   2> 934224 INFO  (qtp1478856805-7302) [    ] o.a.s.c.LeaderElector Joined leadership election with path: /collections/testschemaapi/leader_elect/shard1/election/95959445584281606-core_node2-n_0000000000
   [junit4]   2> 934224 INFO  (qtp28474793-7307) [    ] o.a.s.c.LeaderElector Joined leadership election with path: /collections/testschemaapi/leader_elect/shard1/election/95959445584281605-core_node1-n_0000000001
   [junit4]   2> 934224 INFO  (qtp1478856805-7302) [    ] o.a.s.c.ShardLeaderElectionContext Running the leader process for shard=shard1 and weAreReplacement=false and leaderVoteWait=10000
   [junit4]   2> 934224 INFO  (qtp28474793-7307) [    ] o.a.s.c.LeaderElector Watching path /collections/testschemaapi/leader_elect/shard1/election/95959445584281606-core_node2-n_0000000000 to know if I could be the leader
   [junit4]   2> 934224 INFO  (qtp1478856805-7302) [    ] o.a.s.c.ShardLeaderElectionContext Enough replicas found to continue.
   [junit4]   2> 934225 INFO  (qtp1478856805-7302) [    ] o.a.s.c.ShardLeaderElectionContext I may be the new leader - try and sync
   [junit4]   2> 934225 INFO  (qtp1478856805-7302) [    ] o.a.s.c.SyncStrategy Sync replicas to http://127.0.0.1:39291/solr/testschemaapi_shard1_replica1/
   [junit4]   2> 934225 INFO  (qtp1478856805-7302) [    ] o.a.s.u.PeerSync PeerSync: core=testschemaapi_shard1_replica1 url=http://127.0.0.1:39291/solr START replicas=[http://127.0.0.1:41098/solr/testschemaapi_shard1_replica2/] nUpdates=100
   [junit4]   2> 934225 INFO  (OverseerStateUpdate-95959445584281606-127.0.0.1:39291_solr-n_0000000000) [    ] o.a.s.c.Overseer processMessage: queueSize: 1, message = {
   [junit4]   2>   "operation":"leader",
   [junit4]   2>   "shard":"shard1",
   [junit4]   2>   "collection":"testschemaapi"} current state version: 0
   [junit4]   2> 934225 INFO  (qtp1478856805-7302) [    ] o.a.s.u.PeerSync PeerSync: core=testschemaapi_shard1_replica1 url=http://127.0.0.1:39291/solr DONE.  We have no versions.  sync failed.
   [junit4]   2> 934225 INFO  (qtp1478856805-7302) [    ] o.a.s.c.SyncStrategy Leader's attempt to sync with shard failed, moving to the next candidate
   [junit4]   2> 934225 INFO  (qtp1478856805-7302) [    ] o.a.s.c.ShardLeaderElectionContext We failed sync, but we have no versions - we can't sync in that case - we were active before, so become leader anyway
   [junit4]   2> 934225 INFO  (qtp1478856805-7302) [    ] o.a.s.c.c.SolrZkClient makePath: /collections/testschemaapi/leaders/shard1
   [junit4]   2> 934225 INFO  (qtp28474793-7295) [    ] o.a.s.c.S.Request [testschemaapi_shard1_replica2]  webapp=/solr path=/get params={distrib=false&qt=/get&fingerprint=false&getVersions=100&wt=javabin&version=2} status=0 QTime=0
   [junit4]   2> 934226 INFO  (qtp1478856805-7302) [    ] o.a.s.c.ShardLeaderElectionContextBase Creating leader registration node /collections/testschemaapi/leaders/shard1/leader after winning as /collections/testschemaapi/leader_elect/shard1/election/95959445584281606-core_node2-n_0000000000
   [junit4]   2> 934227 INFO  (qtp1478856805-7302) [    ] o.a.s.c.ShardLeaderElectionContext I am the new leader: http://127.0.0.1:39291/solr/testschemaapi_shard1_replica1/ shard1
   [junit4]   2> 934227 INFO  (OverseerStateUpdate-95959445584281606-127.0.0.1:39291_solr-n_0000000000) [    ] o.a.s.c.Overseer processMessage: queueSize: 1, message = {
   [junit4]   2>   "operation":"leader",
   [junit4]   2>   "shard":"shard1",
   [junit4]   2>   "collection":"testschemaapi",
   [junit4]   2>   "base_url":"http://127.0.0.1:39291/solr",
   [junit4]   2>   "core":"testschemaapi_shard1_replica1",
   [junit4]   2>   "state":"active"} current state version: 0
   [junit4]   2> 934328 INFO  (OverseerStateUpdate-95959445584281606-127.0.0.1:39291_solr-n_0000000000) [    ] o.a.s.c.o.ZkStateWriter going to update_collection /collections/testschemaapi/state.json version: 1
   [junit4]   2> 934328 INFO  (zkCallback-1124-thread-1) [    ] o.a.s.c.c.ZkStateReader A cluster state change: [WatchedEvent state:SyncConnected type:NodeDataChanged path:/collections/testschemaapi/state.json] for collection [testschemaapi] has occurred - updating... (live nodes size: [2])
   [junit4]   2> 934328 INFO  (zkCallback-1123-thread-1) [    ] o.a.s.c.c.ZkStateReader A cluster state change: [WatchedEvent state:SyncConnected type:NodeDataChanged path:/collections/testschemaapi/state.json] for collection [testschemaapi] has occurred - updating... (live nodes size: [2])
   [junit4]   2> 934328 INFO  (zkCallback-1124-thread-1) [    ] o.a.s.c.c.ZkStateReader Updating data for [testschemaapi] from [1] to [2]
   [junit4]   2> 934328 INFO  (zkCallback-1123-thread-1) [    ] o.a.s.c.c.ZkStateReader Updating data for [testschemaapi] from [1] to [2]
   [junit4]   2> 934377 INFO  (qtp1478856805-7302) [    ] o.a.s.c.ZkController We are http://127.0.0.1:39291/solr/testschemaapi_shard1_replica1/ and leader is http://127.0.0.1:39291/solr/testschemaapi_shard1_replica1/
   [junit4]   2> 934377 INFO  (qtp1478856805-7302) [    ] o.a.s.c.ZkController No LogReplay needed for core=testschemaapi_shard1_replica1 baseURL=http://127.0.0.1:39291/solr
   [junit4]   2> 934377 INFO  (qtp1478856805-7302) [    ] o.a.s.c.ZkController I am the leader, no recovery necessary
   [junit4]   2> 934377 INFO  (qtp1478856805-7302) [    ] o.a.s.c.ZkController publishing state=active
   [junit4]   2> 934378 INFO  (OverseerStateUpdate-95959445584281606-127.0.0.1:39291_solr-n_0000000000) [    ] o.a.s.c.Overseer processMessage: queueSize: 1, message = {
   [junit4]   2>   "core":"testschemaapi_shard1_replica1",
   [junit4]   2>   "core_node_name":"core_node2",
   [junit4]   2>   "roles":null,
   [junit4]   2>   "base_url":"http://127.0.0.1:39291/solr",
   [junit4]   2>   "node_name":"127.0.0.1:39291_solr",
   [junit4]   2>   "numShards":"1",
   [junit4]   2>   "state":"active",
   [junit4]   2>   "shard":"shard1",
   [junit4]   2>   "collection":"testschemaapi",
   [junit4]   2>   "operation":"state"} current state version: 0
   [junit4]   2> 934378 INFO  (OverseerStateUpdate-95959445584281606-127.0.0.1:39291_solr-n_0000000000) [    ] o.a.s.c.o.ReplicaMutator Update state numShards=1 message={
   [junit4]   2>   "core":"testschemaapi_shard1_replica1",
   [junit4]   2>   "core_node_name":"core_node2",
   [junit4]   2>   "roles":null,
   [junit4]   2>   "base_url":"http://127.0.0.1:39291/solr",
   [junit4]   2>   "node_name":"127.0.0.1:39291_solr",
   [junit4]   2>   "numShards":"1",
   [junit4]   2>   "state":"active",
   [junit4]   2>   "shard":"shard1",
   [junit4]   2>   "collection":"testschemaapi",
   [junit4]   2>   "operation":"state"}
   [junit4]   2> 934378 INFO  (qtp1478856805-7302) [    ] o.a.s.s.HttpSolrCall [admin] webapp=null path=/admin/cores params={qt=/admin/cores&collection.configName=conf1&name=testschemaapi_shard1_replica1&action=CREATE&numShards=1&collection=testschemaapi&shard=shard1&wt=javabin&version=2} status=0 QTime=1187
   [junit4]   2> 934479 INFO  (OverseerStateUpdate-95959445584281606-127.0.0.1:39291_solr-n_0000000000) [    ] o.a.s.c.o.ZkStateWriter going to update_collection /collections/testschemaapi/state.json version: 2
   [junit4]   2> 934479 INFO  (zkCallback-1124-thread-1) [    ] o.a.s.c.c.ZkStateReader A cluster state change: [WatchedEvent state:SyncConnected type:NodeDataChanged path:/collections/testschemaapi/state.json] for collection [testschemaapi] has occurred - updating... (live nodes size: [2])
   [junit4]   2> 934479 INFO  (zkCallback-1123-thread-1) [    ] o.a.s.c.c.ZkStateReader A cluster state change: [WatchedEvent state:SyncConnected type:NodeDataChanged path:/collections/testschemaapi/state.json] for collection [testschemaapi] has occurred - updating... (live nodes size: [2])
   [junit4]   2> 934480 INFO  (zkCallback-1123-thread-1) [    ] o.a.s.c.c.ZkStateReader Updating data for [testschemaapi] from [2] to [3]
   [junit4]   2> 934480 INFO  (zkCallback-1124-thread-1) [    ] o.a.s.c.c.ZkStateReader Updating data for [testschemaapi] from [2] to [3]
   [junit4]   2> 935224 INFO  (qtp28474793-7307) [    ] o.a.s.c.ZkController We are http://127.0.0.1:41098/solr/testschemaapi_shard1_replica2/ and leader is http://127.0.0.1:39291/solr/testschemaapi_shard1_replica1/
   [junit4]   2> 935225 INFO  (qtp28474793-7307) [    ] o.a.s.c.ZkController No LogReplay needed for core=testschemaapi_shard1_replica2 baseURL=http://127.0.0.1:41098/solr
   [junit4]   2> 935225 INFO  (qtp28474793-7307) [    ] o.a.s.c.ZkController Core needs to recover:testschemaapi_shard1_replica2
   [junit4]   2> 935225 INFO  (updateExecutor-1119-thread-1) [    ] o.a.s.u.DefaultSolrCoreState Running recovery
   [junit4]   2> 935225 INFO  (recoveryExecutor-1120-thread-1) [    ] o.a.s.c.RecoveryStrategy Starting recovery process. recoveringAfterStartup=true
   [junit4]   2> 935225 INFO  (recoveryExecutor-1120-thread-1) [    ] o.a.s.c.RecoveryStrategy ###### startupVersions=[[]]
   [junit4]   2> 935225 INFO  (recoveryExecutor-1120-thread-1) [    ] o.a.s.c.RecoveryStrategy Begin buffering updates. core=[testschemaapi_shard1_replica2]
   [junit4]   2> 935225 INFO  (recoveryExecutor-1120-thread-1) [    ] o.a.s.u.UpdateLog Starting to buffer updates. FSUpdateLog{state=ACTIVE, tlog=null}
   [junit4]   2> 935225 INFO  (recoveryExecutor-1120-thread-1) [    ] o.a.s.c.RecoveryStrategy Publishing state of core [testschemaapi_shard1_replica2] as recovering, leader is [http://127.0.0.1:39291/solr/testschemaapi_shard1_replica1/] and I am [http://127.0.0.1:41098/solr/testschemaapi_shard1_replica2/]
   [junit4]   2> 935225 INFO  (recoveryExecutor-1120-thread-1) [    ] o.a.s.c.ZkController publishing state=recovering
   [junit4]   2> 935225 INFO  (qtp28474793-7307) [    ] o.a.s.s.HttpSolrCall [admin] webapp=null path=/admin/cores params={qt=/admin/cores&collection.configName=conf1&name=testschemaapi_shard1_replica2&action=CREATE&numShards=1&collection=testschemaapi&shard=shard1&wt=javabin&version=2} status=0 QTime=2034
   [junit4]   2> 935226 INFO  (OverseerThreadFactory-3804-thread-1) [    ] o.a.s.c.OverseerTaskProcessor Overseer Collection Message Handler: Message id:/overseer/collection-queue-work/qn-0000000000 complete, response:{success={127.0.0.1:39291_solr={responseHeader={status=0,QTime=1187},core=testschemaapi_shard1_replica1},127.0.0.1:41098_solr={responseHeader={status=0,QTime=2034},core=testschemaapi_shard1_replica2}}}
   [junit4]   2> 935226 INFO  (OverseerStateUpdate-95959445584281606-127.0.0.1:39291_solr-n_0000000000) [    ] o.a.s.c.Overseer processMessage: queueSize: 1, message = {
   [junit4]   2>   "core":"testschemaapi_shard1_replica2",
   [junit4]   2>   "core_node_name":"core_node1",
   [junit4]   2>   "roles":null,
   [junit4]   2>   "base_url":"http://127.0.0.1:41098/solr",
   [junit4]   2>   "node_name":"127.0.0.1:41098_solr",
   [junit4]   2>   "numShards":"1",
   [junit4]   2>   "state":"recovering",
   [junit4]   2>   "shard":"shard1",
   [junit4]   2>   "collection":"testschemaapi",
   [junit4]   2>   "operation":"state"} current state version: 0
   [junit4]   2> 935227 INFO  (OverseerStateUpdate-95959445584281606-127.0.0.1:39291_solr-n_0000000000) [    ] o.a.s.c.o.ReplicaMutator Update state numShards=1 message={
   [junit4]   2>   "core":"testschemaapi_shard1_replica2",
   [junit4]   2>   "core_node_name":"core_node1",
   [junit4]   2>   "roles":null,
   [junit4]   2>   "base_url":"http://127.0.0.1:41098/solr",
   [junit4]   2>   "node_name":"127.0.0.1:41098_solr",
   [junit4]   2>   "numShards":"1",
   [junit4]   2>   "state":"recovering",
   [junit4]   2>   "shard":"shard1",
   [junit4]   2>   "collection":"testschemaapi",
   [junit4]   2>   "operation":"state"}
   [junit4]   2> 935227 INFO  (zkCallback-1123-thread-1) [    ] o.a.s.c.OverseerTaskQueue NodeDataChanged fired on path /overseer/collection-queue-work/qnr-0000000000 state SyncConnected latchEventType null
   [junit4]   2> 935228 INFO  (qtp28474793-7303) [    ] o.a.s.h.a.CollectionsHandler Wait for new collection to be active for at most 30 seconds. Check all shard replicas
   [junit4]   2> 935228 INFO  (recoveryExecutor-1120-thread-1) [    ] o.a.s.c.RecoveryStrategy Sending prep recovery command to [http://127.0.0.1:39291/solr]; [WaitForState: action=PREPRECOVERY&core=testschemaapi_shard1_replica1&nodeName=127.0.0.1:41098_solr&coreNodeName=core_node1&state=recovering&checkLive=true&onlyIfLeader=true&onlyIfLeaderActive=true]
   [junit4]   2> 935229 INFO  (qtp1478856805-7306) [    ] o.a.s.h.a.CoreAdminOperation Going to wait for coreNodeName: core_node1, state: recovering, checkLive: true, onlyIfLeader: true, onlyIfLeaderActive: true
   [junit4]   2> 935229 INFO  (qtp1478856805-7306) [    ] o.a.s.h.a.CoreAdminOperation Will wait a max of 183 seconds to see testschemaapi_shard1_replica1 (shard1 of testschemaapi) have state: recovering
   [junit4]   2> 935229 INFO  (qtp1478856805-7306) [    ] o.a.s.h.a.CoreAdminOperation In WaitForState(recovering): collection=testschemaapi, shard=shard1, thisCore=testschemaapi_shard1_replica1, leaderDoesNotNeedRecovery=false, isLeader? true, live=true, checkLive=true, currentState=down, localState=active, nodeName=127.0.0.1:41098_solr, coreNodeName=core_node1, onlyIfActiveCheckResult=false, nodeProps: core_node1:{"core":"testschemaapi_shard1_replica2","base_url":"http://127.0.0.1:41098/solr","node_name":"127.0.0.1:41098_solr","state":"down"}
   [junit4]   2> 935328 INFO  (OverseerStateUpdate-95959445584281606-127.0.0.1:39291_solr-n_0000000000) [    ] o.a.s.c.o.ZkStateWriter going to update_collection /collections/testschemaapi/state.json version: 3
   [junit4]   2> 935329 INFO  (zkCallback-1124-thread-1) [    ] o.a.s.c.c.ZkStateReader A cluster state change: [WatchedEvent state:SyncConnected type:NodeDataChanged path:/collections/testschemaapi/state.json] for collection [testschemaapi] has occurred - updating... (live nodes size: [2])
   [junit4]   2> 935329 INFO  (zkCallback-1123-thread-1) [    ] o.a.s.c.c.ZkStateReader A cluster state change: [WatchedEvent state:SyncConnected type:NodeDataChanged path:/collections/testschemaapi/state.json] for collection [testschemaapi] has occurred - updating... (live nodes size: [2])
   [junit4]   2> 935329 INFO  (zkCallback-1124-thread-1) [    ] o.a.s.c.c.ZkStateReader Updating data for [testschemaapi] from [3] to [4]
   [junit4]   2> 935329 INFO  (zkCallback-1123-thread-1) [    ] o.a.s.c.c.ZkStateReader Updating data for [testschemaapi] from [3] to [4]
   [junit4]   2> 936229 INFO  (qtp1478856805-7306) [    ] o.a.s.h.a.CoreAdminOperation In WaitForState(recovering): collection=testschemaapi, shard=shard1, thisCore=testschemaapi_shard1_replica1, leaderDoesNotNeedRecovery=false, isLeader? true, live=true, checkLive=true, currentState=recovering, localState=active, nodeName=127.0.0.1:41098_solr, coreNodeName=core_node1, onlyIfActiveCheckResult=false, nodeProps: core_node1:{"core":"testschemaapi_shard1_replica2","base_url":"http://127.0.0.1:41098/solr","node_name":"127.0.0.1:41098_solr","state":"recovering"}
   [junit4]   2> 936230 INFO  (qtp1478856805-7306) [    ] o.a.s.h.a.CoreAdminOperation Waited coreNodeName: core_node1, state: recovering, checkLive: true, onlyIfLeader: true for: 1 seconds.
   [junit4]   2> 936230 INFO  (qtp1478856805-7306) [    ] o.a.s.s.HttpSolrCall [admin] webapp=null path=/admin/cores params={nodeName=127.0.0.1:41098_solr&onlyIfLeaderActive=true&core=testschemaapi_shard1_replica1&coreNodeName=core_node1&action=PREPRECOVERY&checkLive=true&state=recovering&onlyIfLeader=true&wt=javabin&version=2} status=0 QTime=1000
   [junit4]   2> 943230 INFO  (recoveryExecutor-1120-thread-1) [    ] o.a.s.c.RecoveryStrategy Attempting to PeerSync from [http://127.0.0.1:39291/solr/testschemaapi_shard1_replica1/] - recoveringAfterStartup=[true]
   [junit4]   2> 943230 INFO  (recoveryExecutor-1120-thread-1) [    ] o.a.s.u.PeerSync PeerSync: core=testschemaapi_shard1_replica2 url=http://127.0.0.1:41098/solr START replicas=[http://127.0.0.1:39291/solr/testschemaapi_shard1_replica1/] nUpdates=100
   [junit4]   2> 943230 WARN  (recoveryExecutor-1120-thread-1) [    ] o.a.s.u.PeerSync no frame of reference to tell if we've missed updates
   [junit4]   2> 943230 INFO  (recoveryExecutor-1120-thread-1) [    ] o.a.s.c.RecoveryStrategy PeerSync Recovery was not successful - trying replication.
   [junit4]   2> 943230 INFO  (recoveryExecutor-1120-thread-1) [    ] o.a.s.c.RecoveryStrategy Starting Replication Recovery.
   [junit4]   2> 943230 INFO  (recoveryExecutor-1120-thread-1) [    ] o.a.s.c.RecoveryStrategy Attempting to replicate from [http://127.0.0.1:39291/solr/testschemaapi_shard1_replica1/].
   [junit4]   2> 943231 INFO  (qtp1478856805-7306) [    ] o.a.s.u.IndexFingerprint IndexFingerprint millis:0.0 result:{maxVersionSpecified=9223372036854775807, maxVersionEncountered=0, maxInHash=0, versionsHash=0, numVersions=0, numDocs=0, maxDoc=0}
   [junit4]   2> 943231 INFO  (qtp1478856805-7306) [    ] o.a.s.c.S.Request [testschemaapi_shard1_replica1]  webapp=/solr path=/get params={distrib=false&qt=/get&fingerprint=true&getVersions=100&wt=javabin&version=2} status=0 QTime=0
   [junit4]   2> 943231 INFO  (qtp1478856805-7294) [    ] o.a.s.u.DirectUpdateHandler2 start commit{,optimize=false,openSearcher=false,waitSearcher=true,expungeDeletes=false,softCommit=false,prepareCommit=false}
   [junit4]   2> 943232 INFO  (qtp1478856805-7294) [    ] o.a.s.u.DirectUpdateHandler2 No uncommitted changes. Skipping IW.commit.
   [junit4]   2> 943232 INFO  (qtp1478856805-7294) [    ] o.a.s.u.DirectUpdateHandler2 end_commit_flush
   [junit4]   2> 943232 INFO  (qtp1478856805-7294) [    ] o.a.s.u.p.LogUpdateProcessorFactory [testschemaapi_shard1_replica1]  webapp=/solr path=/update params={waitSearcher=true&openSearcher=false&commit=true&softCommit=false&commit_end_point=true&wt=javabin&version=2}{commit=} 0 0
   [junit4]   2> 943233 INFO  (qtp1478856805-7292) [    ] o.a.s.c.S.Request [testschemaapi_shard1_replica1]  webapp=/solr path=/replication params={qt=/replication&wt=javabin&version=2&command=indexversion} status=0 QTime=0
   [junit4]   2> 943233 INFO  (recoveryExecutor-1120-thread-1) [    ] o.a.s.c.RecoveryStrategy No replay needed.
   [junit4]   2> 943233 INFO  (recoveryExecutor-1120-thread-1) [    ] o.a.s.c.RecoveryStrategy Replication Recovery was successful.
   [junit4]   2> 943233 INFO  (recoveryExecutor-1120-thread-1) [    ] o.a.s.c.RecoveryStrategy Registering as Active after recovery.
   [junit4]   2> 943233 INFO  (recoveryExecutor-1120-thread-1) [    ] o.a.s.c.ZkController publishing state=active
   [junit4]   2> 943234 INFO  (recoveryExecutor-1120-thread-1) [    ] o.a.s.c.RecoveryStrategy Updating version bucket highest from index after successful recovery.
   [junit4]   2> 943234 INFO  (recoveryExecutor-1120-thread-1) [    ] o.a.s.u.UpdateLog Looking up max value of version field to seed version buckets
   [junit4]   2> 943234 INFO  (recoveryExecutor-1120-thread-1) [    ] o.a.s.u.VersionInfo Refreshing highest value of _version_ for 65536 version buckets from index
   [junit4]   2> 943234 INFO  (recoveryExecutor-1120-thread-1) [    ] o.a.s.u.VersionInfo No terms found for _version_, cannot seed version bucket highest value from index
   [junit4]   2> 943234 INFO  (recoveryExecutor-1120-thread-1) [    ] o.a.s.u.UpdateLog Could not find max version in index or recent updates, using new clock 1535351141252988928
   [junit4]   2> 943234 INFO  (OverseerStateUpdate-95959445584281606-127.0.0.1:39291_solr-n_0000000000) [    ] o.a.s.c.Overseer processMessage: queueSize: 1, message = {
   [junit4]   2>   "core":"testschemaapi_shard1_replica2",
   [junit4]   2>   "core_node_name":"core_node1",
   [junit4]   2>   "roles":null,
   [junit4]   2>   "base_url":"http://127.0.0.1:41098/solr",
   [junit4]   2>   "node_name":"127.0.0.1:41098_solr",
   [junit4]   2>   "numShards":"1",
   [junit4]   2>   "state":"active",
   [junit4]   2>   "shard":"shard1",
   [junit4]   2>   "collection":"testschemaapi",
   [junit4]   2>   "operation":"state"} current state version: 0
   [junit4]   2> 943234 INFO  (OverseerStateUpdate-95959445584281606-127.0.0.1:39291_solr-n_0000000000) [    ] o.a.s.c.o.ReplicaMutator Update state numShards=1 message={
   [junit4]   2>   "core":"testschemaapi_shard1_replica2",
   [junit4]   2>   "core_node_name":"core_node1",
   [junit4]   2>   "roles":null,
   [junit4]   2>   "base_url":"http://127.0.0.1:41098/solr",
   [junit4]   2>   "node_name":"127.0.0.1:41098_solr",
   [junit4]   2>   "numShards":"1",
   [junit4]   2>   "state":"active",
   [junit4]   2>   "shard":"shard1",
   [junit4]   2>   "collection":"testschemaapi",
   [junit4]   2>   "operation":"state"}
   [junit4]   2> 943234 INFO  (OverseerStateUpdate-95959445584281606-127.0.0.1:39291_solr-n_0000000000) [    ] o.a.s.c.o.ZkStateWriter going to update_collection /collections/testschemaapi/state.json version: 4
   [junit4]   2> 943235 INFO  (zkCallback-1124-thread-1) [    ] o.a.s.c.c.ZkStateReader A cluster state change: [WatchedEvent state:SyncConnected type:NodeDataChanged path:/collections/testschemaapi/state.json] for collection [testschemaapi] has occurred - updating... (live nodes size: [2])
   [junit4]   2> 943235 INFO  (zkCallback-1123-thread-1) [    ] o.a.s.c.c.ZkStateReader A cluster state change: [WatchedEvent state:SyncConnected type:NodeDataChanged path:/collections/testschemaapi/state.json] for collection [testschemaapi] has occurred - updating... (live nodes size: [2])
   [junit4]   2> 943235 INFO  (zkCallback-1123-thread-1) [    ] o.a.s.c.c.ZkStateReader Updating data for [testschemaapi] from [4] to [5]
   [junit4]   2> 943235 INFO  (zkCallback-1124-thread-1) [    ] o.a.s.c.c.ZkStateReader Updating data for [testschemaapi] from [4] to [5]
   [junit4]   2> 943236 INFO  (recoveryExecutor-1120-thread-1) [    ] o.a.s.u.UpdateLog Took 2.0ms to seed version buckets with highest version 1535351141252988928
   [junit4]   2> 943236 INFO  (recoveryExecutor-1120-thread-1) [    ] o.a.s.c.RecoveryStrategy Finished recovery process, successful=[true]
   [junit4]   2> 944229 INFO  (qtp28474793-7303) [    ] o.a.s.s.HttpSolrCall [admin] webapp=null path=/admin/collections params={replicationFactor=2&collection.configName=conf1&name=testschemaapi&action=CREATE&numShards=1&wt=javabin&version=2} status=0 QTime=11142
   [junit4]   2> 944239 INFO  (qtp28474793-7305) [    ] o.a.s.s.SchemaManager managed schema loaded . version : 0 
   [junit4]   

[...truncated too long message...]

3	/solr/collections
   [junit4]   2> 
   [junit4]   2> 949389 INFO  (SUITE-TestManagedSchemaAPI-seed#[D9C15A6788B034D8]-worker) [    ] o.a.s.SolrTestCaseJ4 ###deleteCore
   [junit4]   2> NOTE: leaving temporary files on disk at: /home/jenkins/workspace/Lucene-Solr-master-Linux/solr/build/solr-core/test/J0/temp/solr.schema.TestManagedSchemaAPI_D9C15A6788B034D8-001
   [junit4]   2> May 26, 2016 1:09:16 AM com.carrotsearch.randomizedtesting.ThreadLeakControl checkThreadLeaks
   [junit4]   2> WARNING: Will linger awaiting termination of 2 leaked thread(s).
   [junit4]   2> 954378 WARN  (Thread-2498) [    ] o.a.s.c.ZkController listener throws error
   [junit4]   2> org.apache.solr.common.SolrException: Unable to reload core [testschemaapi_shard1_replica2]
   [junit4]   2> 	at org.apache.solr.core.CoreContainer.reload(CoreContainer.java:944)
   [junit4]   2> 	at org.apache.solr.core.SolrCore.lambda$getConfListener$6(SolrCore.java:2510)
   [junit4]   2> 	at org.apache.solr.cloud.ZkController$4.run(ZkController.java:2408)
   [junit4]   2> Caused by: org.apache.solr.common.SolrException: Could not load conf for core testschemaapi_shard1_replica2: Unable to load reader for ConfigSet properties: configsetprops.json
   [junit4]   2> 	at org.apache.solr.core.ConfigSetService.getConfig(ConfigSetService.java:86)
   [junit4]   2> 	at org.apache.solr.core.CoreContainer.reload(CoreContainer.java:936)
   [junit4]   2> 	... 2 more
   [junit4]   2> Caused by: org.apache.solr.common.SolrException: Unable to load reader for ConfigSet properties: configsetprops.json
   [junit4]   2> 	at org.apache.solr.core.ConfigSetProperties.readFromResourceLoader(ConfigSetProperties.java:57)
   [junit4]   2> 	at org.apache.solr.core.ConfigSetService.createConfigSetProperties(ConfigSetService.java:118)
   [junit4]   2> 	at org.apache.solr.core.ConfigSetService.getConfig(ConfigSetService.java:80)
   [junit4]   2> 	... 3 more
   [junit4]   2> Caused by: java.io.IOException: We re-tried 10 times but was still unable to fetch resource=configsetprops.json from ZK
   [junit4]   2> 	at org.apache.solr.cloud.ZkSolrResourceLoader.openResource(ZkSolrResourceLoader.java:116)
   [junit4]   2> 	at org.apache.solr.core.ConfigSetProperties.readFromResourceLoader(ConfigSetProperties.java:52)
   [junit4]   2> 	... 5 more
   [junit4]   2> Caused by: org.apache.zookeeper.KeeperException$SessionExpiredException: KeeperErrorCode = Session expired for /configs/conf1/configsetprops.json
   [junit4]   2> 	at org.apache.zookeeper.KeeperException.create(KeeperException.java:127)
   [junit4]   2> 	at org.apache.zookeeper.KeeperException.create(KeeperException.java:51)
   [junit4]   2> 	at org.apache.zookeeper.ZooKeeper.exists(ZooKeeper.java:1045)
   [junit4]   2> 	at org.apache.solr.common.cloud.SolrZkClient$5.execute(SolrZkClient.java:314)
   [junit4]   2> 	at org.apache.solr.common.cloud.SolrZkClient$5.execute(SolrZkClient.java:311)
   [junit4]   2> 	at org.apache.solr.common.cloud.ZkCmdExecutor.retryOperation(ZkCmdExecutor.java:60)
   [junit4]   2> 	at org.apache.solr.common.cloud.SolrZkClient.exists(SolrZkClient.java:311)
   [junit4]   2> 	at org.apache.solr.cloud.ZkController.pathExists(ZkController.java:796)
   [junit4]   2> 	at org.apache.solr.cloud.ZkSolrResourceLoader.openResource(ZkSolrResourceLoader.java:89)
   [junit4]   2> 	... 6 more
   [junit4]   2> 954378 WARN  (Thread-2499) [    ] o.a.s.c.ZkController listener throws error
   [junit4]   2> org.apache.solr.common.SolrException: Unable to reload core [testschemaapi_shard1_replica1]
   [junit4]   2> 	at org.apache.solr.core.CoreContainer.reload(CoreContainer.java:944)
   [junit4]   2> 	at org.apache.solr.core.SolrCore.lambda$getConfListener$6(SolrCore.java:2510)
   [junit4]   2> 	at org.apache.solr.cloud.ZkController$4.run(ZkController.java:2408)
   [junit4]   2> Caused by: org.apache.solr.common.SolrException: Could not load conf for core testschemaapi_shard1_replica1: Unable to load reader for ConfigSet properties: configsetprops.json
   [junit4]   2> 	at org.apache.solr.core.ConfigSetService.getConfig(ConfigSetService.java:86)
   [junit4]   2> 	at org.apache.solr.core.CoreContainer.reload(CoreContainer.java:936)
   [junit4]   2> 	... 2 more
   [junit4]   2> Caused by: org.apache.solr.common.SolrException: Unable to load reader for ConfigSet properties: configsetprops.json
   [junit4]   2> 	at org.apache.solr.core.ConfigSetProperties.readFromResourceLoader(ConfigSetProperties.java:57)
   [junit4]   2> 	at org.apache.solr.core.ConfigSetService.createConfigSetProperties(ConfigSetService.java:118)
   [junit4]   2> 	at org.apache.solr.core.ConfigSetService.getConfig(ConfigSetService.java:80)
   [junit4]   2> 	... 3 more
   [junit4]   2> Caused by: java.io.IOException: We re-tried 10 times but was still unable to fetch resource=configsetprops.json from ZK
   [junit4]   2> 	at org.apache.solr.cloud.ZkSolrResourceLoader.openResource(ZkSolrResourceLoader.java:116)
   [junit4]   2> 	at org.apache.solr.core.ConfigSetProperties.readFromResourceLoader(ConfigSetProperties.java:52)
   [junit4]   2> 	... 5 more
   [junit4]   2> Caused by: org.apache.zookeeper.KeeperException$SessionExpiredException: KeeperErrorCode = Session expired for /configs/conf1/configsetprops.json
   [junit4]   2> 	at org.apache.zookeeper.KeeperException.create(KeeperException.java:127)
   [junit4]   2> 	at org.apache.zookeeper.KeeperException.create(KeeperException.java:51)
   [junit4]   2> 	at org.apache.zookeeper.ZooKeeper.exists(ZooKeeper.java:1045)
   [junit4]   2> 	at org.apache.solr.common.cloud.SolrZkClient$5.execute(SolrZkClient.java:314)
   [junit4]   2> 	at org.apache.solr.common.cloud.SolrZkClient$5.execute(SolrZkClient.java:311)
   [junit4]   2> 	at org.apache.solr.common.cloud.ZkCmdExecutor.retryOperation(ZkCmdExecutor.java:60)
   [junit4]   2> 	at org.apache.solr.common.cloud.SolrZkClient.exists(SolrZkClient.java:311)
   [junit4]   2> 	at org.apache.solr.cloud.ZkController.pathExists(ZkController.java:796)
   [junit4]   2> 	at org.apache.solr.cloud.ZkSolrResourceLoader.openResource(ZkSolrResourceLoader.java:89)
   [junit4]   2> 	... 6 more
   [junit4]   2> NOTE: test params are: codec=Asserting(Lucene62): {_version_=TestBloomFilteredLucenePostings(BloomFilteringPostingsFormat(Lucene50(blocksize=128))), id=PostingsFormat(name=Direct), myNewField=TestBloomFilteredLucenePostings(BloomFilteringPostingsFormat(Lucene50(blocksize=128)))}, docValues:{}, maxPointsInLeafNode=896, maxMBSortInHeap=6.338972454991948, sim=ClassicSimilarity, locale=ko-KP, timezone=America/Regina
   [junit4]   2> NOTE: Linux 4.4.0-21-generic amd64/Oracle Corporation 9-ea (64-bit)/cpus=12,threads=1,free=288704976,total=518979584
   [junit4]   2> NOTE: All tests run in this JVM: [ForceLeaderTest, UUIDFieldTest, SyncSliceTest, TestRandomDVFaceting, DataDrivenBlockJoinTest, CollectionTooManyReplicasTest, TestLRUCache, DistributedExpandComponentTest, TestCollapseQParserPlugin, SortSpecParsingTest, TestLazyCores, TestIntervalFaceting, TestComponentsName, TestSolrCloudWithKerberosAlt, QueryElevationComponentTest, ReplicationFactorTest, MultiThreadedOCPTest, TestFaceting, ActionThrottleTest, TestCrossCoreJoin, TestLMDirichletSimilarityFactory, TestAnalyzedSuggestions, DocExpirationUpdateProcessorFactoryTest, TestChildDocTransformer, TestCSVLoader, TestDistribDocBasedVersion, TestDistributedSearch, HdfsCollectionsAPIDistributedZkTest, TestRTGBase, TestSolrConfigHandlerCloud, TestSolr4Spatial, UUIDUpdateProcessorFallbackTest, DistribJoinFromCollectionTest, ExternalFileFieldSortTest, PreAnalyzedUpdateProcessorTest, TestDocSet, RAMDirectoryFactoryTest, TestUseDocValuesAsStored2, TestLuceneMatchVersion, ExplicitHLLTest, DistributedSpellCheckComponentTest, CacheHeaderTest, SolrCoreTest, TestMissingGroups, DisMaxRequestHandlerTest, TestGeoJSONResponseWriter, TestFieldSortValues, BigEndianAscendingWordDeserializerTest, TestHdfsUpdateLog, SynonymTokenizerTest, TestConfig, AlternateDirectoryTest, IndexSchemaTest, TestReloadAndDeleteDocs, FacetPivotSmallTest, XsltUpdateRequestHandlerTest, TestValueSourceCache, TestPivotHelperCode, HdfsThreadLeakTest, AnalysisAfterCoreReloadTest, PolyFieldTest, TestPKIAuthenticationPlugin, SystemInfoHandlerTest, OverseerTaskQueueTest, HLLUtilTest, TestRangeQuery, ConnectionReuseTest, TestRandomFaceting, TestPseudoReturnFields, TestHashQParserPlugin, HighlighterMaxOffsetTest, TestReplicaProperties, TestReplicationHandler, TestStressUserVersions, SOLR749Test, CreateCollectionCleanupTest, TestTolerantUpdateProcessorCloud, DefaultValueUpdateProcessorTest, TestInfoStreamLogging, SSLMigrationTest, TestConfigSets, TestManagedSchemaAPI]
   [junit4] Completed [254/611 (1!)] on J0 in 22.55s, 1 test, 1 error <<< FAILURES!

[...truncated 1199 lines...]
BUILD FAILED
/home/jenkins/workspace/Lucene-Solr-master-Linux/build.xml:740: The following error occurred while executing this line:
/home/jenkins/workspace/Lucene-Solr-master-Linux/build.xml:684: The following error occurred while executing this line:
/home/jenkins/workspace/Lucene-Solr-master-Linux/build.xml:59: The following error occurred while executing this line:
/home/jenkins/workspace/Lucene-Solr-master-Linux/solr/build.xml:233: The following error occurred while executing this line:
/home/jenkins/workspace/Lucene-Solr-master-Linux/solr/common-build.xml:531: The following error occurred while executing this line:
/home/jenkins/workspace/Lucene-Solr-master-Linux/lucene/common-build.xml:1427: The following error occurred while executing this line:
/home/jenkins/workspace/Lucene-Solr-master-Linux/lucene/common-build.xml:984: There were test failures: 611 suites (10 ignored), 2554 tests, 1 error, 118 ignored (72 assumptions) [seed: D9C15A6788B034D8]

Total time: 64 minutes 52 seconds
Build step 'Invoke Ant' marked build as failure
Archiving artifacts
[WARNINGS] Skipping publisher since build result is FAILURE
Recording test results
Email was triggered for: Failure - Any
Sending email for trigger: Failure - Any



Mime
View raw message