lucene-dev mailing list archives

Site index · List index
Message view « Date » · « Thread »
Top « Date » · « Thread »
From Policeman Jenkins Server <jenk...@thetaphi.de>
Subject [JENKINS-EA] Lucene-Solr-6.x-Linux (64bit/jdk-9-ea+116) - Build # 576 - Still Failing!
Date Fri, 06 May 2016 01:35:54 GMT
Build: http://jenkins.thetaphi.de/job/Lucene-Solr-6.x-Linux/576/
Java: 64bit/jdk-9-ea+116 -XX:-UseCompressedOops -XX:+UseParallelGC

2 tests failed.
FAILED:  org.apache.solr.MinimalSchemaTest.testAllConfiguredHandlers

Error Message:
exception w/handler: '/graph'

Stack Trace:
java.lang.RuntimeException: exception w/handler: '/graph'
	at __randomizedtesting.SeedInfo.seed([1042F6400624135D:FD5C4D7A8D2912D9]:0)
	at org.apache.solr.MinimalSchemaTest.testAllConfiguredHandlers(MinimalSchemaTest.java:130)
	at jdk.internal.reflect.NativeMethodAccessorImpl.invoke0(java.base@9-ea/Native Method)
	at jdk.internal.reflect.NativeMethodAccessorImpl.invoke(java.base@9-ea/NativeMethodAccessorImpl.java:62)
	at jdk.internal.reflect.DelegatingMethodAccessorImpl.invoke(java.base@9-ea/DelegatingMethodAccessorImpl.java:43)
	at java.lang.reflect.Method.invoke(java.base@9-ea/Method.java:531)
	at com.carrotsearch.randomizedtesting.RandomizedRunner.invoke(RandomizedRunner.java:1764)
	at com.carrotsearch.randomizedtesting.RandomizedRunner$8.evaluate(RandomizedRunner.java:871)
	at com.carrotsearch.randomizedtesting.RandomizedRunner$9.evaluate(RandomizedRunner.java:907)
	at com.carrotsearch.randomizedtesting.RandomizedRunner$10.evaluate(RandomizedRunner.java:921)
	at com.carrotsearch.randomizedtesting.rules.SystemPropertiesRestoreRule$1.evaluate(SystemPropertiesRestoreRule.java:57)
	at org.apache.lucene.util.TestRuleSetupTeardownChained$1.evaluate(TestRuleSetupTeardownChained.java:49)
	at org.apache.lucene.util.AbstractBeforeAfterRule$1.evaluate(AbstractBeforeAfterRule.java:45)
	at org.apache.lucene.util.TestRuleThreadAndTestName$1.evaluate(TestRuleThreadAndTestName.java:48)
	at org.apache.lucene.util.TestRuleIgnoreAfterMaxFailures$1.evaluate(TestRuleIgnoreAfterMaxFailures.java:64)
	at org.apache.lucene.util.TestRuleMarkFailure$1.evaluate(TestRuleMarkFailure.java:47)
	at com.carrotsearch.randomizedtesting.rules.StatementAdapter.evaluate(StatementAdapter.java:36)
	at com.carrotsearch.randomizedtesting.ThreadLeakControl$StatementRunner.run(ThreadLeakControl.java:367)
	at com.carrotsearch.randomizedtesting.ThreadLeakControl.forkTimeoutingTask(ThreadLeakControl.java:809)
	at com.carrotsearch.randomizedtesting.ThreadLeakControl$3.evaluate(ThreadLeakControl.java:460)
	at com.carrotsearch.randomizedtesting.RandomizedRunner.runSingleTest(RandomizedRunner.java:880)
	at com.carrotsearch.randomizedtesting.RandomizedRunner$5.evaluate(RandomizedRunner.java:781)
	at com.carrotsearch.randomizedtesting.RandomizedRunner$6.evaluate(RandomizedRunner.java:816)
	at com.carrotsearch.randomizedtesting.RandomizedRunner$7.evaluate(RandomizedRunner.java:827)
	at com.carrotsearch.randomizedtesting.rules.StatementAdapter.evaluate(StatementAdapter.java:36)
	at com.carrotsearch.randomizedtesting.rules.SystemPropertiesRestoreRule$1.evaluate(SystemPropertiesRestoreRule.java:57)
	at org.apache.lucene.util.AbstractBeforeAfterRule$1.evaluate(AbstractBeforeAfterRule.java:45)
	at com.carrotsearch.randomizedtesting.rules.StatementAdapter.evaluate(StatementAdapter.java:36)
	at org.apache.lucene.util.TestRuleStoreClassName$1.evaluate(TestRuleStoreClassName.java:41)
	at com.carrotsearch.randomizedtesting.rules.NoShadowingOrOverridesOnMethodsRule$1.evaluate(NoShadowingOrOverridesOnMethodsRule.java:40)
	at com.carrotsearch.randomizedtesting.rules.NoShadowingOrOverridesOnMethodsRule$1.evaluate(NoShadowingOrOverridesOnMethodsRule.java:40)
	at com.carrotsearch.randomizedtesting.rules.StatementAdapter.evaluate(StatementAdapter.java:36)
	at com.carrotsearch.randomizedtesting.rules.StatementAdapter.evaluate(StatementAdapter.java:36)
	at com.carrotsearch.randomizedtesting.rules.StatementAdapter.evaluate(StatementAdapter.java:36)
	at org.apache.lucene.util.TestRuleAssertionsRequired$1.evaluate(TestRuleAssertionsRequired.java:53)
	at org.apache.lucene.util.TestRuleMarkFailure$1.evaluate(TestRuleMarkFailure.java:47)
	at org.apache.lucene.util.TestRuleIgnoreAfterMaxFailures$1.evaluate(TestRuleIgnoreAfterMaxFailures.java:64)
	at org.apache.lucene.util.TestRuleIgnoreTestSuites$1.evaluate(TestRuleIgnoreTestSuites.java:54)
	at com.carrotsearch.randomizedtesting.rules.StatementAdapter.evaluate(StatementAdapter.java:36)
	at com.carrotsearch.randomizedtesting.ThreadLeakControl$StatementRunner.run(ThreadLeakControl.java:367)
	at java.lang.Thread.run(java.base@9-ea/Thread.java:804)
Caused by: java.lang.RuntimeException: Exception during query
	at org.apache.solr.SolrTestCaseJ4.assertQ(SolrTestCaseJ4.java:786)
	at org.apache.solr.MinimalSchemaTest.testAllConfiguredHandlers(MinimalSchemaTest.java:121)
	... 39 more
Caused by: org.xml.sax.SAXParseException; lineNumber: 1; columnNumber: 1; Content is not allowed in prolog.
	at com.sun.org.apache.xerces.internal.parsers.DOMParser.parse(java.xml@9-ea/DOMParser.java:256)
	at com.sun.org.apache.xerces.internal.jaxp.DocumentBuilderImpl.parse(java.xml@9-ea/DocumentBuilderImpl.java:339)
	at javax.xml.parsers.DocumentBuilder.parse(java.xml@9-ea/DocumentBuilder.java:122)
	at org.apache.solr.util.BaseTestHarness.validateXPath(BaseTestHarness.java:84)
	at org.apache.solr.SolrTestCaseJ4.assertQ(SolrTestCaseJ4.java:771)
	... 40 more


FAILED:  org.apache.solr.core.SolrCoreTest.testImplicitPlugins

Error Message:
wrong number of implicit handlers expected:<21> but was:<22>

Stack Trace:
java.lang.AssertionError: wrong number of implicit handlers expected:<21> but was:<22>
	at __randomizedtesting.SeedInfo.seed([1042F6400624135D:D36FC7DB56ECDA1C]:0)
	at org.junit.Assert.fail(Assert.java:93)
	at org.junit.Assert.failNotEquals(Assert.java:647)
	at org.junit.Assert.assertEquals(Assert.java:128)
	at org.junit.Assert.assertEquals(Assert.java:472)
	at org.apache.solr.core.SolrCoreTest.testImplicitPlugins(SolrCoreTest.java:109)
	at jdk.internal.reflect.NativeMethodAccessorImpl.invoke0(java.base@9-ea/Native Method)
	at jdk.internal.reflect.NativeMethodAccessorImpl.invoke(java.base@9-ea/NativeMethodAccessorImpl.java:62)
	at jdk.internal.reflect.DelegatingMethodAccessorImpl.invoke(java.base@9-ea/DelegatingMethodAccessorImpl.java:43)
	at java.lang.reflect.Method.invoke(java.base@9-ea/Method.java:531)
	at com.carrotsearch.randomizedtesting.RandomizedRunner.invoke(RandomizedRunner.java:1764)
	at com.carrotsearch.randomizedtesting.RandomizedRunner$8.evaluate(RandomizedRunner.java:871)
	at com.carrotsearch.randomizedtesting.RandomizedRunner$9.evaluate(RandomizedRunner.java:907)
	at com.carrotsearch.randomizedtesting.RandomizedRunner$10.evaluate(RandomizedRunner.java:921)
	at com.carrotsearch.randomizedtesting.rules.SystemPropertiesRestoreRule$1.evaluate(SystemPropertiesRestoreRule.java:57)
	at org.apache.lucene.util.TestRuleSetupTeardownChained$1.evaluate(TestRuleSetupTeardownChained.java:49)
	at org.apache.lucene.util.AbstractBeforeAfterRule$1.evaluate(AbstractBeforeAfterRule.java:45)
	at org.apache.lucene.util.TestRuleThreadAndTestName$1.evaluate(TestRuleThreadAndTestName.java:48)
	at org.apache.lucene.util.TestRuleIgnoreAfterMaxFailures$1.evaluate(TestRuleIgnoreAfterMaxFailures.java:64)
	at org.apache.lucene.util.TestRuleMarkFailure$1.evaluate(TestRuleMarkFailure.java:47)
	at com.carrotsearch.randomizedtesting.rules.StatementAdapter.evaluate(StatementAdapter.java:36)
	at com.carrotsearch.randomizedtesting.ThreadLeakControl$StatementRunner.run(ThreadLeakControl.java:367)
	at com.carrotsearch.randomizedtesting.ThreadLeakControl.forkTimeoutingTask(ThreadLeakControl.java:809)
	at com.carrotsearch.randomizedtesting.ThreadLeakControl$3.evaluate(ThreadLeakControl.java:460)
	at com.carrotsearch.randomizedtesting.RandomizedRunner.runSingleTest(RandomizedRunner.java:880)
	at com.carrotsearch.randomizedtesting.RandomizedRunner$5.evaluate(RandomizedRunner.java:781)
	at com.carrotsearch.randomizedtesting.RandomizedRunner$6.evaluate(RandomizedRunner.java:816)
	at com.carrotsearch.randomizedtesting.RandomizedRunner$7.evaluate(RandomizedRunner.java:827)
	at com.carrotsearch.randomizedtesting.rules.StatementAdapter.evaluate(StatementAdapter.java:36)
	at com.carrotsearch.randomizedtesting.rules.SystemPropertiesRestoreRule$1.evaluate(SystemPropertiesRestoreRule.java:57)
	at org.apache.lucene.util.AbstractBeforeAfterRule$1.evaluate(AbstractBeforeAfterRule.java:45)
	at com.carrotsearch.randomizedtesting.rules.StatementAdapter.evaluate(StatementAdapter.java:36)
	at org.apache.lucene.util.TestRuleStoreClassName$1.evaluate(TestRuleStoreClassName.java:41)
	at com.carrotsearch.randomizedtesting.rules.NoShadowingOrOverridesOnMethodsRule$1.evaluate(NoShadowingOrOverridesOnMethodsRule.java:40)
	at com.carrotsearch.randomizedtesting.rules.NoShadowingOrOverridesOnMethodsRule$1.evaluate(NoShadowingOrOverridesOnMethodsRule.java:40)
	at com.carrotsearch.randomizedtesting.rules.StatementAdapter.evaluate(StatementAdapter.java:36)
	at com.carrotsearch.randomizedtesting.rules.StatementAdapter.evaluate(StatementAdapter.java:36)
	at com.carrotsearch.randomizedtesting.rules.StatementAdapter.evaluate(StatementAdapter.java:36)
	at org.apache.lucene.util.TestRuleAssertionsRequired$1.evaluate(TestRuleAssertionsRequired.java:53)
	at org.apache.lucene.util.TestRuleMarkFailure$1.evaluate(TestRuleMarkFailure.java:47)
	at org.apache.lucene.util.TestRuleIgnoreAfterMaxFailures$1.evaluate(TestRuleIgnoreAfterMaxFailures.java:64)
	at org.apache.lucene.util.TestRuleIgnoreTestSuites$1.evaluate(TestRuleIgnoreTestSuites.java:54)
	at com.carrotsearch.randomizedtesting.rules.StatementAdapter.evaluate(StatementAdapter.java:36)
	at com.carrotsearch.randomizedtesting.ThreadLeakControl$StatementRunner.run(ThreadLeakControl.java:367)
	at java.lang.Thread.run(java.base@9-ea/Thread.java:804)




Build Log:
[...truncated 11529 lines...]
   [junit4] Suite: org.apache.solr.core.SolrCoreTest
   [junit4]   2> Creating dataDir: /home/jenkins/workspace/Lucene-Solr-6.x-Linux/solr/build/solr-core/test/J1/temp/solr.core.SolrCoreTest_1042F6400624135D-001/init-core-data-001
   [junit4]   2> 1218326 INFO  (SUITE-SolrCoreTest-seed#[1042F6400624135D]-worker) [    ] o.a.s.SolrTestCaseJ4 Randomized ssl (false) and clientAuth (true)
   [junit4]   2> 1218328 INFO  (TEST-SolrCoreTest.testRefCount-seed#[1042F6400624135D]) [    ] o.a.s.SolrTestCaseJ4 ###Starting testRefCount
   [junit4]   2> 1218328 INFO  (TEST-SolrCoreTest.testRefCount-seed#[1042F6400624135D]) [    ] o.a.s.SolrTestCaseJ4 ####initCore
   [junit4]   2> 1218328 INFO  (TEST-SolrCoreTest.testRefCount-seed#[1042F6400624135D]) [    ] o.a.s.c.SolrResourceLoader new SolrResourceLoader for directory: '/home/jenkins/workspace/Lucene-Solr-6.x-Linux/solr/core/src/test-files/solr/collection1'
   [junit4]   2> 1218328 INFO  (TEST-SolrCoreTest.testRefCount-seed#[1042F6400624135D]) [    ] o.a.s.c.SolrResourceLoader JNDI not configured for solr (NoInitialContextEx)
   [junit4]   2> 1218328 INFO  (TEST-SolrCoreTest.testRefCount-seed#[1042F6400624135D]) [    ] o.a.s.c.SolrResourceLoader using system property solr.solr.home: /home/jenkins/workspace/Lucene-Solr-6.x-Linux/solr/core/src/test-files/solr
   [junit4]   2> 1218328 INFO  (TEST-SolrCoreTest.testRefCount-seed#[1042F6400624135D]) [    ] o.a.s.c.SolrResourceLoader Adding 'file:/home/jenkins/workspace/Lucene-Solr-6.x-Linux/solr/core/src/test-files/solr/collection1/lib/classes/' to classloader
   [junit4]   2> 1218328 INFO  (TEST-SolrCoreTest.testRefCount-seed#[1042F6400624135D]) [    ] o.a.s.c.SolrResourceLoader Adding 'file:/home/jenkins/workspace/Lucene-Solr-6.x-Linux/solr/core/src/test-files/solr/collection1/lib/README' to classloader
   [junit4]   2> 1218350 INFO  (TEST-SolrCoreTest.testRefCount-seed#[1042F6400624135D]) [    ] o.a.s.c.SolrConfig current version of requestparams : -1
   [junit4]   2> 1218364 INFO  (TEST-SolrCoreTest.testRefCount-seed#[1042F6400624135D]) [    ] o.a.s.c.SolrConfig Using Lucene MatchVersion: 6.1.0
   [junit4]   2> 1218386 INFO  (TEST-SolrCoreTest.testRefCount-seed#[1042F6400624135D]) [    ] o.a.s.c.SolrConfig Loaded SolrConfig: solrconfig.xml
   [junit4]   2> 1218389 INFO  (TEST-SolrCoreTest.testRefCount-seed#[1042F6400624135D]) [    ] o.a.s.s.IndexSchema [null] Schema name=test
   [junit4]   2> 1218461 INFO  (TEST-SolrCoreTest.testRefCount-seed#[1042F6400624135D]) [    ] o.a.s.s.OpenExchangeRatesOrgProvider Initialized with rates=open-exchange-rates.json, refreshInterval=1440.
   [junit4]   2> 1218466 INFO  (TEST-SolrCoreTest.testRefCount-seed#[1042F6400624135D]) [    ] o.a.s.s.IndexSchema default search field in schema is text
   [junit4]   2> 1218467 INFO  (TEST-SolrCoreTest.testRefCount-seed#[1042F6400624135D]) [    ] o.a.s.s.IndexSchema unique key field: id
   [junit4]   2> 1218470 INFO  (TEST-SolrCoreTest.testRefCount-seed#[1042F6400624135D]) [    ] o.a.s.s.FileExchangeRateProvider Reloading exchange rates from file currency.xml
   [junit4]   2> 1218472 INFO  (TEST-SolrCoreTest.testRefCount-seed#[1042F6400624135D]) [    ] o.a.s.s.FileExchangeRateProvider Reloading exchange rates from file currency.xml
   [junit4]   2> 1218473 INFO  (TEST-SolrCoreTest.testRefCount-seed#[1042F6400624135D]) [    ] o.a.s.s.OpenExchangeRatesOrgProvider Reloading exchange rates from open-exchange-rates.json
   [junit4]   2> 1218473 INFO  (TEST-SolrCoreTest.testRefCount-seed#[1042F6400624135D]) [    ] o.a.s.s.OpenExchangeRatesOrgProvider Reloading exchange rates from open-exchange-rates.json
   [junit4]   2> 1218474 INFO  (TEST-SolrCoreTest.testRefCount-seed#[1042F6400624135D]) [    ] o.a.s.c.SolrResourceLoader JNDI not configured for solr (NoInitialContextEx)
   [junit4]   2> 1218474 INFO  (TEST-SolrCoreTest.testRefCount-seed#[1042F6400624135D]) [    ] o.a.s.c.SolrResourceLoader using system property solr.solr.home: /home/jenkins/workspace/Lucene-Solr-6.x-Linux/solr/core/src/test-files/solr
   [junit4]   2> 1218474 INFO  (TEST-SolrCoreTest.testRefCount-seed#[1042F6400624135D]) [    ] o.a.s.c.SolrResourceLoader new SolrResourceLoader for directory: '/home/jenkins/workspace/Lucene-Solr-6.x-Linux/solr/core/src/test-files/solr'
   [junit4]   2> 1218474 INFO  (TEST-SolrCoreTest.testRefCount-seed#[1042F6400624135D]) [    ] o.a.s.c.SolrResourceLoader JNDI not configured for solr (NoInitialContextEx)
   [junit4]   2> 1218474 INFO  (TEST-SolrCoreTest.testRefCount-seed#[1042F6400624135D]) [    ] o.a.s.c.SolrResourceLoader using system property solr.solr.home: /home/jenkins/workspace/Lucene-Solr-6.x-Linux/solr/core/src/test-files/solr
   [junit4]   2> 1218474 INFO  (TEST-SolrCoreTest.testRefCount-seed#[1042F6400624135D]) [    ] o.a.s.c.CoreContainer New CoreContainer 1860558993
   [junit4]   2> 1218474 INFO  (TEST-SolrCoreTest.testRefCount-seed#[1042F6400624135D]) [    ] o.a.s.c.CoreContainer Loading cores into CoreContainer [instanceDir=/home/jenkins/workspace/Lucene-Solr-6.x-Linux/solr/core/src/test-files/solr]
   [junit4]   2> 1218474 WARN  (TEST-SolrCoreTest.testRefCount-seed#[1042F6400624135D]) [    ] o.a.s.c.CoreContainer Couldn't add files from /home/jenkins/workspace/Lucene-Solr-6.x-Linux/solr/core/src/test-files/solr/lib to classpath: /home/jenkins/workspace/Lucene-Solr-6.x-Linux/solr/core/src/test-files/solr/lib
   [junit4]   2> 1218475 INFO  (TEST-SolrCoreTest.testRefCount-seed#[1042F6400624135D]) [    ] o.a.s.h.c.HttpShardHandlerFactory created with socketTimeout : 600000,connTimeout : 60000,maxConnectionsPerHost : 20,maxConnections : 10000,corePoolSize : 0,maximumPoolSize : 2147483647,maxThreadIdleTime : 5,sizeOfQueue : -1,fairnessPolicy : false,useRetries : false,
   [junit4]   2> 1218477 INFO  (TEST-SolrCoreTest.testRefCount-seed#[1042F6400624135D]) [    ] o.a.s.u.UpdateShardHandler Creating UpdateShardHandler HTTP client with params: socketTimeout=30000&connTimeout=30000&retry=true
   [junit4]   2> 1218477 INFO  (TEST-SolrCoreTest.testRefCount-seed#[1042F6400624135D]) [    ] o.a.s.l.LogWatcher SLF4J impl is org.slf4j.impl.Log4jLoggerFactory
   [junit4]   2> 1218477 INFO  (TEST-SolrCoreTest.testRefCount-seed#[1042F6400624135D]) [    ] o.a.s.l.LogWatcher Registering Log Listener [Log4j (org.slf4j.impl.Log4jLoggerFactory)]
   [junit4]   2> 1218477 INFO  (TEST-SolrCoreTest.testRefCount-seed#[1042F6400624135D]) [    ] o.a.s.c.CoreContainer Security conf doesn't exist. Skipping setup for authorization module.
   [junit4]   2> 1218477 INFO  (TEST-SolrCoreTest.testRefCount-seed#[1042F6400624135D]) [    ] o.a.s.c.CoreContainer No authentication plugin used.
   [junit4]   2> 1218478 INFO  (TEST-SolrCoreTest.testRefCount-seed#[1042F6400624135D]) [    ] o.a.s.c.CoreDescriptor Created CoreDescriptor: {name=collection1, config=solrconfig.xml, transient=false, schema=schema.xml, loadOnStartup=true, configSetProperties=configsetprops.json, collection=collection1, dataDir=/home/jenkins/workspace/Lucene-Solr-6.x-Linux/solr/build/solr-core/test/J1/temp/solr.core.SolrCoreTest_1042F6400624135D-001/init-core-data-001, shard=shard1}
   [junit4]   2> 1218479 INFO  (coreLoadExecutor-3337-thread-1) [    ] o.a.s.c.SolrResourceLoader new SolrResourceLoader for directory: '/home/jenkins/workspace/Lucene-Solr-6.x-Linux/solr/core/src/test-files/solr/collection1'
   [junit4]   2> 1218479 INFO  (coreLoadExecutor-3337-thread-1) [    ] o.a.s.c.SolrResourceLoader JNDI not configured for solr (NoInitialContextEx)
   [junit4]   2> 1218479 INFO  (coreLoadExecutor-3337-thread-1) [    ] o.a.s.c.SolrResourceLoader using system property solr.solr.home: /home/jenkins/workspace/Lucene-Solr-6.x-Linux/solr/core/src/test-files/solr
   [junit4]   2> 1218479 INFO  (coreLoadExecutor-3337-thread-1) [    ] o.a.s.c.SolrResourceLoader Adding 'file:/home/jenkins/workspace/Lucene-Solr-6.x-Linux/solr/core/src/test-files/solr/collection1/lib/classes/' to classloader
   [junit4]   2> 1218479 INFO  (coreLoadExecutor-3337-thread-1) [    ] o.a.s.c.SolrResourceLoader Adding 'file:/home/jenkins/workspace/Lucene-Solr-6.x-Linux/solr/core/src/test-files/solr/collection1/lib/README' to classloader
   [junit4]   2> 1218495 INFO  (coreLoadExecutor-3337-thread-1) [    ] o.a.s.c.SolrConfig current version of requestparams : -1
   [junit4]   2> 1218506 INFO  (coreLoadExecutor-3337-thread-1) [    ] o.a.s.c.SolrConfig Using Lucene MatchVersion: 6.1.0
   [junit4]   2> 1218529 INFO  (coreLoadExecutor-3337-thread-1) [    ] o.a.s.c.SolrConfig Loaded SolrConfig: solrconfig.xml
   [junit4]   2> 1218533 INFO  (coreLoadExecutor-3337-thread-1) [    ] o.a.s.s.IndexSchema [collection1] Schema name=test
   [junit4]   2> 1218606 INFO  (coreLoadExecutor-3337-thread-1) [    ] o.a.s.s.OpenExchangeRatesOrgProvider Initialized with rates=open-exchange-rates.json, refreshInterval=1440.
   [junit4]   2> 1218609 INFO  (coreLoadExecutor-3337-thread-1) [    ] o.a.s.s.IndexSchema default search field in schema is text
   [junit4]   2> 1218610 INFO  (coreLoadExecutor-3337-thread-1) [    ] o.a.s.s.IndexSchema unique key field: id
   [junit4]   2> 1218613 INFO  (coreLoadExecutor-3337-thread-1) [    ] o.a.s.s.FileExchangeRateProvider Reloading exchange rates from file currency.xml
   [junit4]   2> 1218614 INFO  (coreLoadExecutor-3337-thread-1) [    ] o.a.s.s.FileExchangeRateProvider Reloading exchange rates from file currency.xml
   [junit4]   2> 1218615 INFO  (coreLoadExecutor-3337-thread-1) [    ] o.a.s.s.OpenExchangeRatesOrgProvider Reloading exchange rates from open-exchange-rates.json
   [junit4]   2> 1218615 INFO  (coreLoadExecutor-3337-thread-1) [    ] o.a.s.s.OpenExchangeRatesOrgProvider Reloading exchange rates from open-exchange-rates.json
   [junit4]   2> 1218617 INFO  (coreLoadExecutor-3337-thread-1) [    ] o.a.s.c.ConfigSetProperties Did not find ConfigSet properties, assuming default properties: Can't find resource 'configsetprops.json' in classpath or '/home/jenkins/workspace/Lucene-Solr-6.x-Linux/solr/core/src/test-files/solr/collection1'
   [junit4]   2> 1218617 INFO  (coreLoadExecutor-3337-thread-1) [    ] o.a.s.c.CoreContainer Creating SolrCore 'collection1' using configuration from instancedir /home/jenkins/workspace/Lucene-Solr-6.x-Linux/solr/core/src/test-files/solr/collection1
   [junit4]   2> 1218617 INFO  (coreLoadExecutor-3337-thread-1) [    ] o.a.s.c.SolrCore org.apache.solr.core.MockDirectoryFactory
   [junit4]   2> 1218617 INFO  (coreLoadExecutor-3337-thread-1) [    ] o.a.s.c.SolrCore [[collection1] ] Opening new SolrCore at [/home/jenkins/workspace/Lucene-Solr-6.x-Linux/solr/core/src/test-files/solr/collection1], dataDir=[/home/jenkins/workspace/Lucene-Solr-6.x-Linux/solr/build/solr-core/test/J1/temp/solr.core.SolrCoreTest_1042F6400624135D-001/init-core-data-001/]
   [junit4]   2> 1218617 INFO  (coreLoadExecutor-3337-thread-1) [    ] o.a.s.c.JmxMonitoredMap JMX monitoring is enabled. Adding Solr mbeans to JMX Server: com.sun.jmx.mbeanserver.JmxMBeanServer@1fa5f3ee
   [junit4]   2> 1218618 INFO  (coreLoadExecutor-3337-thread-1) [    ] o.a.s.c.CachingDirectoryFactory return new directory for /home/jenkins/workspace/Lucene-Solr-6.x-Linux/solr/build/solr-core/test/J1/temp/solr.core.SolrCoreTest_1042F6400624135D-001/init-core-data-001
   [junit4]   2> 1218618 INFO  (coreLoadExecutor-3337-thread-1) [    ] o.a.s.c.SolrCore New index directory detected: old=null new=/home/jenkins/workspace/Lucene-Solr-6.x-Linux/solr/build/solr-core/test/J1/temp/solr.core.SolrCoreTest_1042F6400624135D-001/init-core-data-001/index/
   [junit4]   2> 1218618 WARN  (coreLoadExecutor-3337-thread-1) [    ] o.a.s.c.SolrCore [collection1] Solr index directory '/home/jenkins/workspace/Lucene-Solr-6.x-Linux/solr/build/solr-core/test/J1/temp/solr.core.SolrCoreTest_1042F6400624135D-001/init-core-data-001/index' doesn't exist. Creating new index...
   [junit4]   2> 1218618 INFO  (coreLoadExecutor-3337-thread-1) [    ] o.a.s.c.CachingDirectoryFactory return new directory for /home/jenkins/workspace/Lucene-Solr-6.x-Linux/solr/build/solr-core/test/J1/temp/solr.core.SolrCoreTest_1042F6400624135D-001/init-core-data-001/index
   [junit4]   2> 1218618 INFO  (coreLoadExecutor-3337-thread-1) [    ] o.a.s.u.RandomMergePolicy RandomMergePolicy wrapping class org.apache.lucene.index.LogByteSizeMergePolicy: [LogByteSizeMergePolicy: minMergeSize=1677721, mergeFactor=10, maxMergeSize=2147483648, maxMergeSizeForForcedMerge=9223372036854775807, calibrateSizeByDeletes=false, maxMergeDocs=2147483647, maxCFSSegmentSizeMB=8.796093022207999E12, noCFSRatio=0.5032728945700398]
   [junit4]   2> 1218619 INFO  (coreLoadExecutor-3337-thread-1) [    ] o.a.s.c.SolrDeletionPolicy SolrDeletionPolicy.onCommit: commits: num=1
   [junit4]   2> 	commit{dir=MockDirectoryWrapper(RAMDirectory@512013ca lockFactory=org.apache.lucene.store.SingleInstanceLockFactory@8ad3762),segFN=segments_1,generation=1}
   [junit4]   2> 1218619 INFO  (coreLoadExecutor-3337-thread-1) [    ] o.a.s.c.SolrDeletionPolicy newest commit generation = 1
   [junit4]   2> 1218619 INFO  (OldIndexDirectoryCleanupThreadForCore-collection1) [    ] o.a.s.c.SolrCore Looking for old index directories to cleanup for core collection1 in /home/jenkins/workspace/Lucene-Solr-6.x-Linux/solr/build/solr-core/test/J1/temp/solr.core.SolrCoreTest_1042F6400624135D-001/init-core-data-001/
   [junit4]   2> 1218622 INFO  (coreLoadExecutor-3337-thread-1) [    ] o.a.s.u.p.UpdateRequestProcessorChain creating updateRequestProcessorChain "dedupe"
   [junit4]   2> 1218622 INFO  (coreLoadExecutor-3337-thread-1) [    ] o.a.s.u.p.UpdateRequestProcessorChain inserting DistributedUpdateProcessorFactory into updateRequestProcessorChain "dedupe"
   [junit4]   2> 1218622 INFO  (coreLoadExecutor-3337-thread-1) [    ] o.a.s.u.p.UpdateRequestProcessorChain creating updateRequestProcessorChain "dedupe-allfields"
   [junit4]   2> 1218622 INFO  (coreLoadExecutor-3337-thread-1) [    ] o.a.s.u.p.UpdateRequestProcessorChain inserting DistributedUpdateProcessorFactory into updateRequestProcessorChain "dedupe-allfields"
   [junit4]   2> 1218622 INFO  (coreLoadExecutor-3337-thread-1) [    ] o.a.s.u.p.UpdateRequestProcessorChain creating updateRequestProcessorChain "stored_sig"
   [junit4]   2> 1218623 INFO  (coreLoadExecutor-3337-thread-1) [    ] o.a.s.u.p.UpdateRequestProcessorChain inserting DistributedUpdateProcessorFactory into updateRequestProcessorChain "stored_sig"
   [junit4]   2> 1218623 INFO  (coreLoadExecutor-3337-thread-1) [    ] o.a.s.u.p.UpdateRequestProcessorChain creating updateRequestProcessorChain "uniq-fields"
   [junit4]   2> 1218623 INFO  (coreLoadExecutor-3337-thread-1) [    ] o.a.s.u.p.UpdateRequestProcessorChain inserting DistributedUpdateProcessorFactory into updateRequestProcessorChain "uniq-fields"
   [junit4]   2> 1218623 INFO  (coreLoadExecutor-3337-thread-1) [    ] o.a.s.u.p.UpdateRequestProcessorChain creating updateRequestProcessorChain "distrib-dup-test-chain-explicit"
   [junit4]   2> 1218623 INFO  (coreLoadExecutor-3337-thread-1) [    ] o.a.s.u.p.UpdateRequestProcessorChain creating updateRequestProcessorChain "distrib-dup-test-chain-implicit"
   [junit4]   2> 1218623 INFO  (coreLoadExecutor-3337-thread-1) [    ] o.a.s.u.p.UpdateRequestProcessorChain inserting DistributedUpdateProcessorFactory into updateRequestProcessorChain "distrib-dup-test-chain-implicit"
   [junit4]   2> 1218623 INFO  (coreLoadExecutor-3337-thread-1) [    ] o.a.s.c.SolrCore no updateRequestProcessorChain defined as default, creating implicit default
   [junit4]   2> 1218625 INFO  (coreLoadExecutor-3337-thread-1) [    ] o.a.s.h.l.XMLLoader xsltCacheLifetimeSeconds=60
   [junit4]   2> 1218626 INFO  (coreLoadExecutor-3337-thread-1) [    ] o.a.s.h.l.XMLLoader xsltCacheLifetimeSeconds=60
   [junit4]   2> 1218627 INFO  (coreLoadExecutor-3337-thread-1) [    ] o.a.s.h.l.XMLLoader xsltCacheLifetimeSeconds=60
   [junit4]   2> 1218627 INFO  (coreLoadExecutor-3337-thread-1) [    ] o.a.s.h.l.XMLLoader xsltCacheLifetimeSeconds=60
   [junit4]   2> 1218630 INFO  (coreLoadExecutor-3337-thread-1) [    ] o.a.s.c.PluginBag requestHandler : 'lazy' created with startup=lazy 
   [junit4]   2> 1218631 INFO  (coreLoadExecutor-3337-thread-1) [    ] o.a.s.c.RequestHandlers Registered paths: /admin/mbeans,standard,spellCheckCompRH,lazy,/update/json/docs,/admin/luke,/export,spellCheckWithWordbreak_Direct,tvrh,/get,/admin/properties,/update/json,mltrh,/admin/threads,/search-facet-def,/update/csv,/sql,/graph,/search-facet-invariants,/admin/segments,spellCheckCompRH1,/mlt,/admin/system,/replication,dismax,defaults,/config,/stream,/schema,/admin/plugins,/admin/logging,spellCheckWithWordbreak,mock,/admin/ping,/update,/admin/file,/terms,spellCheckCompRH_Direct,/debug/dump
   [junit4]   2> 1218631 INFO  (coreLoadExecutor-3337-thread-1) [    ] o.a.s.c.SolrCore Using default statsCache cache: org.apache.solr.search.stats.LocalStatsCache
   [junit4]   2> 1218631 INFO  (coreLoadExecutor-3337-thread-1) [    ] o.a.s.u.UpdateHandler Using UpdateLog implementation: org.apache.solr.update.UpdateLog
   [junit4]   2> 1218631 INFO  (coreLoadExecutor-3337-thread-1) [    ] o.a.s.u.UpdateLog Initializing UpdateLog: dataDir= defaultSyncLevel=FLUSH numRecordsToKeep=100 maxNumLogsToKeep=10 numVersionBuckets=65536
   [junit4]   2> 1218642 INFO  (coreLoadExecutor-3337-thread-1) [    ] o.a.s.u.CommitTracker Hard AutoCommit: disabled
   [junit4]   2> 1218642 INFO  (coreLoadExecutor-3337-thread-1) [    ] o.a.s.u.CommitTracker Soft AutoCommit: disabled
   [junit4]   2> 1218643 INFO  (coreLoadExecutor-3337-thread-1) [    ] o.a.s.u.RandomMergePolicy RandomMergePolicy wrapping class org.apache.lucene.index.LogDocMergePolicy: [LogDocMergePolicy: minMergeSize=1000, mergeFactor=35, maxMergeSize=9223372036854775807, maxMergeSizeForForcedMerge=9223372036854775807, calibrateSizeByDeletes=true, maxMergeDocs=2147483647, maxCFSSegmentSizeMB=8.796093022207999E12, noCFSRatio=0.8492164229387292]
   [junit4]   2> 1218643 INFO  (coreLoadExecutor-3337-thread-1) [    ] o.a.s.c.SolrDeletionPolicy SolrDeletionPolicy.onInit: commits: num=1
   [junit4]   2> 	commit{dir=MockDirectoryWrapper(RAMDirectory@512013ca lockFactory=org.apache.lucene.store.SingleInstanceLockFactory@8ad3762),segFN=segments_1,generation=1}
   [junit4]   2> 1218643 INFO  (coreLoadExecutor-3337-thread-1) [    ] o.a.s.c.SolrDeletionPolicy newest commit generation = 1
   [junit4]   2> 1218643 INFO  (coreLoadExecutor-3337-thread-1) [    ] o.a.s.s.SolrIndexSearcher Opening [Searcher@1ebe8678[collection1] main]
   [junit4]   2> 1218643 INFO  (coreLoadExecutor-3337-thread-1) [    ] o.a.s.r.RestManager Initializing RestManager with initArgs: {storageIO=org.apache.solr.rest.ManagedResourceStorage$InMemoryStorageIO}
   [junit4]   2> 1218643 INFO  (coreLoadExecutor-3337-thread-1) [    ] o.a.s.r.ManagedResourceStorage Reading _rest_managed.json using InMemoryStorage
   [junit4]   2> 1218643 INFO  (coreLoadExecutor-3337-thread-1) [    ] o.a.s.r.RestManager Initializing 0 registered ManagedResources
   [junit4]   2> 1218643 INFO  (coreLoadExecutor-3337-thread-1) [    ] o.a.s.h.c.SpellCheckComponent Initializing spell checkers
   [junit4]   2> 1218759 INFO  (coreLoadExecutor-3337-thread-1) [    ] o.a.s.s.DirectSolrSpellChecker init: {name=direct,classname=DirectSolrSpellChecker,field=lowerfilt,minQueryLength=3}
   [junit4]   2> 1219365 INFO  (coreLoadExecutor-3337-thread-1) [    ] o.a.s.h.ReplicationHandler Commits will be reserved for  10000
   [junit4]   2> 1219365 INFO  (searcherExecutor-3338-thread-1) [    ] o.a.s.h.c.SpellCheckComponent Loading spell index for spellchecker: default
   [junit4]   2> 1219365 INFO  (searcherExecutor-3338-thread-1) [    ] o.a.s.h.c.SpellCheckComponent Loading spell index for spellchecker: direct
   [junit4]   2> 1219365 INFO  (searcherExecutor-3338-thread-1) [    ] o.a.s.h.c.SpellCheckComponent Loading spell index for spellchecker: wordbreak
   [junit4]   2> 1219365 INFO  (coreLoadExecutor-3337-thread-1) [    ] o.a.s.u.UpdateLog Looking up max value of version field to seed version buckets
   [junit4]   2> 1219365 INFO  (searcherExecutor-3338-thread-1) [    ] o.a.s.h.c.SpellCheckComponent Loading spell index for spellchecker: multipleFields
   [junit4]   2> 1219365 INFO  (coreLoadExecutor-3337-thread-1) [    ] o.a.s.u.VersionInfo Refreshing highest value of _version_ for 65536 version buckets from index
   [junit4]   2> 1219365 INFO  (coreLoadExecutor-3337-thread-1) [    ] o.a.s.u.VersionInfo No terms found for _version_, cannot seed version bucket highest value from index
   [junit4]   2> 1219365 INFO  (coreLoadExecutor-3337-thread-1) [    ] o.a.s.u.UpdateLog Could not find max version in index or recent updates, using new clock 1533539997761667072
   [junit4]   2> 1219366 INFO  (searcherExecutor-3338-thread-1) [    ] o.a.s.h.c.SpellCheckComponent Loading spell index for spellchecker: jarowinkler
   [junit4]   2> 1219366 INFO  (searcherExecutor-3338-thread-1) [    ] o.a.s.h.c.SpellCheckComponent Loading spell index for spellchecker: external
   [junit4]   2> 1219366 INFO  (searcherExecutor-3338-thread-1) [    ] o.a.s.h.c.SpellCheckComponent Loading spell index for spellchecker: freq
   [junit4]   2> 1219367 INFO  (searcherExecutor-3338-thread-1) [    ] o.a.s.h.c.SpellCheckComponent Loading spell index for spellchecker: fqcn
   [junit4]   2> 1219367 INFO  (searcherExecutor-3338-thread-1) [    ] o.a.s.h.c.SpellCheckComponent Loading spell index for spellchecker: perDict
   [junit4]   2> 1219367 INFO  (searcherExecutor-3338-thread-1) [    ] o.a.s.c.SolrCore [collection1] Registered new searcher Searcher@1ebe8678[collection1] main{ExitableDirectoryReader(UninvertingDirectoryReader())}
   [junit4]   2> 1219368 INFO  (coreLoadExecutor-3337-thread-1) [    ] o.a.s.u.UpdateLog Took 2.0ms to seed version buckets with highest version 1533539997761667072
   [junit4]   2> 1219368 INFO  (coreLoadExecutor-3337-thread-1) [    ] o.a.s.c.CoreContainer registering core: collection1
   [junit4]   2> 1219369 INFO  (TEST-SolrCoreTest.testRefCount-seed#[1042F6400624135D]) [    ] o.a.s.SolrTestCaseJ4 ####initCore end
   [junit4]   2> 1219370 INFO  (TEST-SolrCoreTest.testRefCount-seed#[1042F6400624135D]) [    ] o.a.s.c.CoreContainer Shutting down CoreContainer instance=1860558993
   [junit4]   2> 1219370 INFO  (coreCloseExecutor-3343-thread-1) [    ] o.a.s.c.SolrCore [collection1]  CLOSING SolrCore org.apache.solr.core.SolrCore@343b840
   [junit4]   2> 1219370 INFO  (coreCloseExecutor-3343-thread-1) [    ] o.a.s.u.DirectUpdateHandler2 closing DirectUpdateHandler2{commits=0,autocommits=0,soft autocommits=0,optimizes=0,rollbacks=0,expungeDeletes=0,docsPending=0,adds=0,deletesById=0,deletesByQuery=0,errors=0,cumulative_adds=0,cumulative_deletesById=0,cumulative_deletesByQuery=0,cumulative_errors=0,transaction_logs_total_size=0,transaction_logs_total_number=0}
   [junit4]   2> 1219370 INFO  (coreCloseExecutor-3343-thread-1) [    ] o.a.s.u.SolrCoreState Closing SolrCoreState
   [junit4]   2> 1219370 INFO  (coreCloseExecutor-3343-thread-1) [    ] o.a.s.u.DefaultSolrCoreState SolrCoreState ref count has reached 0 - closing IndexWriter
   [junit4]   2> 1219371 INFO  (coreCloseExecutor-3343-thread-1) [    ] o.a.s.u.DefaultSolrCoreState closing IndexWriter with IndexWriterCloser
   [junit4]   2> 1219371 INFO  (coreCloseExecutor-3343-thread-1) [    ] o.a.s.c.SolrCore [collection1] Closing main searcher on request.
   [junit4]   2> 1219385 INFO  (coreCloseExecutor-3343-thread-1) [    ] o.a.s.c.CachingDirectoryFactory Closing MockDirectoryFactory - 2 directories currently being tracked
   [junit4]   2> 1219385 INFO  (coreCloseExecutor-3343-thread-1) [    ] o.a.s.c.CachingDirectoryFactory looking to close /home/jenkins/workspace/Lucene-Solr-6.x-Linux/solr/build/solr-core/test/J1/temp/solr.core.SolrCoreTest_1042F6400624135D-001/init-core-data-001/index [CachedDir<<refCount=0;path=/home/jenkins/workspace/Lucene-Solr-6.x-Linux/solr/build/solr-core/test/J1/temp/solr.core.SolrCoreTest_1042F6400624135D-001/init-core-data-001/index;done=false>>]
   [junit4]   2> 1219385 INFO  (coreCloseExecutor-3343-thread-1) [    ] o.a.s.c.CachingDirectoryFactory Closing directory, CoreContainer#isShutdown=true
   [junit4]   2> 1219385 INFO  (coreCloseExecutor-3343-thread-1) [    ] o.a.s.c.CachingDirectoryFactory Closing directory: /home/jenkins/workspace/Lucene-Solr-6.x-Linux/solr/build/solr-core/test/J1/temp/solr.core.SolrCoreTest_1042F6400624135D-001/init-core-data-001/index
   [junit4]   2> 1219385 INFO  (coreCloseExecutor-3343-thread-1) [    ] o.a.s.c.CachingDirectoryFactory looking to close /home/jenkins/workspace/Lucene-Solr-6.x-Linux/solr/build/solr-core/test/J1/temp/solr.core.SolrCoreTest_1042F6400624135D-001/init-core-data-001 [CachedDir<<refCount=0;path=/home/jenkins/workspace/Lucene-Solr-6.x-Linux/solr/build/solr-core/test/J1/temp/solr.core.SolrCoreTest_1042F6400624135D-001/init-core-data-001;done=false>>]
   [junit4]   2> 1219385 INFO  (coreCloseExecutor-3343-thread-1) [    ] o.a.s.c.CachingDirectoryFactory Closing directory, CoreContainer#isShutdown=true
   [junit4]   2> 1219385 INFO  (coreCloseExecutor-3343-thread-1) [    ] o.a.s.c.CachingDirectoryFactory Closing directory: /home/jenkins/workspace/Lucene-Solr-6.x-Linux/solr/build/solr-core/test/J1/temp/solr.core.SolrCoreTest_1042F6400624135D-001/init-core-data-001
   [junit4]   2> 1219386 INFO  (TEST-SolrCoreTest.testRefCount-seed#[1042F6400624135D]) [    ] o.a.s.SolrTestCaseJ4 ###deleteCore
   [junit4]   2> 1219386 INFO  (TEST-SolrCoreTest.testRefCount-seed#[1042F6400624135D]) [    ] o.a.s.c.CoreContainer Shutting down CoreContainer instance=1860558993
   [junit4]   2> 1219386 INFO  (TEST-SolrCoreTest.testRefCount-seed#[1042F6400624135D]) [    ] o.a.s.SolrTestCaseJ4 ###Ending testRefCount
   [junit4]   2> 1219388 INFO  (TEST-SolrCoreTest.testClose-seed#[1042F6400624135D]) [    ] o.a.s.SolrTestCaseJ4 ###Starting testClose
   [junit4]   2> 1219388 INFO  (TEST-SolrCoreTest.testClose-seed#[1042F6400624135D]) [    ] o.a.s.SolrTestCaseJ4 ####initCore
   [junit4]   2> 1219388 INFO  (TEST-SolrCoreTest.testClose-seed#[1042F6400624135D]) [    ] o.a.s.c.SolrResourceLoader new SolrResourceLoader for directory: '/home/jenkins/workspace/Lucene-Solr-6.x-Linux/solr/core/src/test-files/solr/collection1'
   [junit4]   2> 1219388 INFO  (TEST-SolrCoreTest.testClose-seed#[1042F6400624135D]) [    ] o.a.s.c.SolrResourceLoader JNDI not configured for solr (NoInitialContextEx)
   [junit4]   2> 1219388 INFO  (TEST-SolrCoreTest.testClose-seed#[1042F6400624135D]) [    ] o.a.s.c.SolrResourceLoader using system property solr.solr.home: /home/jenkins/workspace/Lucene-Solr-6.x-Linux/solr/core/src/test-files/solr
   [junit4]   2> 1219388 INFO  (TEST-SolrCoreTest.testClose-seed#[1042F6400624135D]) [    ] o.a.s.c.SolrResourceLoader Adding 'file:/home/jenkins/workspace/Lucene-Solr-6.x-Linux/solr/core/src/test-files/solr/collection1/lib/classes/' to classloader
   [junit4]   2> 1219388 INFO  (TEST-SolrCoreTest.testClose-seed#[1042F6400624135D]) [    ] o.a.s.c.SolrResourceLoader Adding 'file:/home/jenkins/workspace/Lucene-Solr-6.x-Linux/solr/core/src/test-files/solr/collection1/lib/README' to classloader
   [junit4]   2> 1219404 INFO  (TEST-SolrCoreTest.testClose-seed#[1042F6400624135D]) [    ] o.a.s.c.SolrConfig current version of requestparams : -1
   [junit4]   2> 1219410 INFO  (TEST-SolrCoreTest.testClose-seed#[1042F6400624135D]) [    ] o.a.s.c.SolrConfig Using Lucene MatchVersion: 6.1.0
   [junit4]   2> 1219424 INFO  (TEST-SolrCoreTest.testClose-seed#[1042F6400624135D]) [    ] o.a.s.c.SolrConfig Loaded SolrConfig: solrconfig.xml
   [junit4]   2> 1219429 INFO  (TEST-SolrCoreTest.testClose-seed#[1042F6400624135D]) [    ] o.a.s.s.IndexSchema [null] Schema name=test
   [junit4]   2> 1219529 INFO  (TEST-SolrCoreTest.testClose-seed#[1042F6400624135D]) [    ] o.a.s.s.OpenExchangeRatesOrgProvider Initialized with rates=open-exchange-rates.json, refreshInterval=1440.
   [junit4]   2> 1219534 INFO  (TEST-SolrCoreTest.testClose-seed#[1042F6400624135D]) [    ] o.a.s.s.IndexSchema default search field in schema is text
   [junit4]   2> 1219535 INFO  (TEST-SolrCoreTest.testClose-seed#[1042F6400624135D]) [    ] o.a.s.s.IndexSchema unique key field: id
   [junit4]   2> 1219539 INFO  (TEST-SolrCoreTest.testClose-seed#[1042F6400624135D]) [    ] o.a.s.s.FileExchangeRateProvider Reloading exchange rates from file currency.xml
   [junit4]   2> 1219540 INFO  (TEST-SolrCoreTest.testClose-seed#[1042F6400624135D]) [    ] o.a.s.s.FileExchangeRateProvider Reloading exchange rates from file currency.xml
   [junit4]   2> 1219541 INFO  (TEST-SolrCoreTest.testClose-seed#[1042F6400624135D]) [    ] o.a.s.s.OpenExchangeRatesOrgProvider Reloading exchange rates from open-exchange-rates.json
   [junit4]   2> 1219542 INFO  (TEST-SolrCoreTest.testClose-seed#[1042F6400624135D]) [    ] o.a.s.s.OpenExchangeRatesOrgProvider Reloading exchange rates from open-exchange-rates.json
   [junit4]   2> 1219542 INFO  (TEST-SolrCoreTest.testClose-seed#[1042F6400624135D]) [    ] o.a.s.c.SolrResourceLoader JNDI not configured for solr (NoInitialContextEx)
   [junit4]   2> 1219542 INFO  (TEST-SolrCoreTest.testClose-seed#[1042F6400624135D]) [    ] o.a.s.c.SolrResourceLoader using system property solr.solr.home: /home/jenkins/workspace/Lucene-Solr-6.x-Linux/solr/core/src/test-files/solr
   [junit4]   2> 1219542 INFO  (TEST-SolrCoreTest.testClose-seed#[1042F6400624135D]) [    ] o.a.s.c.SolrResourceLoader new SolrResourceLoader for directory: '/home/jenkins/workspace/Lucene-Solr-6.x-Linux/solr/core/src/test-files/solr'
   [junit4]   2> 1219542 INFO  (TEST-SolrCoreTest.testClose-seed#[1042F6400624135D]) [    ] o.a.s.c.SolrResourceLoader JNDI not configured for solr (NoInitialContextEx)
   [junit4]   2> 1219542 INFO  (TEST-SolrCoreTest.testClose-seed#[1042F6400624135D]) [    ] o.a.s.c.SolrResourceLoader using system property solr.solr.home: /home/jenkins/workspace/Lucene-Solr-6.x-Linux/solr/core/src/test-files/solr
   [junit4]   2> 1219542 INFO  (TEST-SolrCoreTest.testClose-seed#[1042F6400624135D]) [    ] o.a.s.c.CoreContainer New CoreContainer 984614927
   [junit4]   2> 1219542 INFO  (TEST-SolrCoreTest.testClose-seed#[1042F6400624135D]) [    ] o.a.s.c.CoreContainer Loading cores into CoreContainer [instanceDir=/home/jenkins/workspace/Lucene-Solr-6.x-Linux/solr/core/src/test-files/solr]
   [junit4]   2> 1219543 WARN  (TEST-SolrCoreTest.testClose-seed#[1042F6400624135D]) [    ] o.a.s.c.CoreContainer Couldn't add files from /home/jenkins/workspace/Lucene-Solr-6.x-Linux/solr/core/src/test-files/solr/lib to classpath: /home/jenkins/workspace/Lucene-Solr-6.x-Linux/solr/core/src/test-files/solr/lib
   [junit4]   2> 1219543 INFO  (TEST-SolrCoreTest.testClose-seed#[1042F6400624135D]) [    ] o.a.s.h.c.HttpShardHandlerFactory created with socketTimeout : 600000,connTimeout : 60000,maxConnectionsPerHost : 20,maxConnections : 10000,corePoolSize : 0,maximumPoolSize : 2147483647,maxThreadIdleTime : 5,sizeOfQueue : -1,fairnessPolicy : false,useRetries : false,
   [junit4]   2> 1219544 INFO  (TEST-SolrCoreTest.testClose-seed#[1042F6400624135D]) [    ] o.a.s.u.UpdateShardHandler Creating UpdateShardHandler HTTP client with params: socketTimeout=30000&connTimeout=30000&retry=true
   [junit4]   2> 1219544 INFO  (TEST-SolrCoreTest.testClose-seed#[1042F6400624135D]) [    ] o.a.s.l.LogWatcher SLF4J impl is org.slf4j.impl.Log4jLoggerFactory
   [junit4]   2> 1219544 INFO  (TEST-SolrCoreTest.testClose-seed#[1042F6400624135D]) [    ] o.a.s.l.LogWatcher Registering Log Listener [Log4j (org.slf4j.impl.Log4jLoggerFactory)]
   [junit4]   2> 1219544 INFO  (TEST-SolrCoreTest.testClose-seed#[1042F6400624135D]) [    ] o.a.s.c.CoreContainer Security conf doesn't exist. Skipping setup for authorization module.
   [junit4]   2> 1219544 INFO  (TEST-SolrCoreTest.testClose-seed#[1042F6400624135D]) [    ] o.a.s.c.CoreContainer No authentication plugin used.
   [junit4]   2> 1219545 INFO  (TEST-SolrCoreTest.testClose-seed#[1042F6400624135D]) [    ] o.a.s.c.CoreDescriptor Created CoreDescriptor: {name=collection1, config=solrconfig.xml, transient=false, schema=schema.xml, loadOnStartup=true, configSetProperties=configsetprops.json, collection=collection1, dataDir=/home/jenkins/workspace/Lucene-Solr-6.x-Linux/solr/build/solr-core/test/J1/temp/solr.core.SolrCoreTest_1042F6400624135D-001/init-core-data-001, shard=shard1}
   [junit4]   2> 1219545 INFO  (coreLoadExecutor-3351-thread-1) [    ] o.a.s.c.SolrResourceLoader new SolrResourceLoader for directory: '/home/jenkins/workspace/Lucene-Solr-6.x-Linux/solr/core/src/test-files/solr/collection1'
   [junit4]   2> 1219545 INFO  (coreLoadExecutor-3351-thread-1) [    ] o.a.s.c.SolrResourceLoader JNDI not configured for solr (NoInitialContextEx)
   [junit4]   2> 1219545 INFO  (coreLoadExecutor-3351-thread-1) [    ] o.a.s.c.SolrResourceLoader using system property solr.solr.home: /home/jenkins/workspace/Lucene-Solr-6.x-Linux/solr/core/src/test-files/solr
   [junit4]   2> 1219545 INFO  (coreLoadExecutor-3351-thread-1) [    ] o.a.s.c.SolrResourceLoader Adding 'file:/home/jenkins/workspace/Lucene-Solr-6.x-Linux/solr/core/src/test-files/solr/collection1/lib/classes/' to classloader
   [junit4]   2> 1219545 INFO  (coreLoadExecutor-3351-thread-1) [    ] o.a.s.c.SolrResourceLoader Adding 'file:/home/jenkins/workspace/Lucene-Solr-6.x-Linux/solr/core/src/test-files/solr/collection1/lib/README' to classloader
   [junit4]   2> 1219560 INFO  (coreLoadExecutor-3351-thread-1) [    ] o.a.s.c.SolrConfig current version of requestparams : -1
   [junit4]   2> 1219566 INFO  (coreLoadExecutor-3351-thread-1) [    ] o.a.s.c.SolrConfig Using Lucene MatchVersion: 6.1.0
   [junit4]   2> 1219579 INFO  (coreLoadExecutor-3351-thread-1) [    ] o.a.s.c.SolrConfig Loaded SolrConfig: solrconfig.xml
   [junit4]   2> 1219583 INFO  (coreLoadExecutor-3351-thread-1) [    ] o.a.s.s.IndexSchema [collection1] Schema name=test
   [junit4]   2> 1219676 INFO  (coreLoadExecutor-3351-thread-1) [    ] o.a.s.s.OpenExchangeRatesOrgProvider Initialized with rates=open-exchange-rates.json, refreshInterval=1440.
   [junit4]   2> 1219679 INFO  (coreLoadExecutor-3351-thread-1) [    ] o.a.s.s.IndexSchema default search field in schema is text
   [junit4]   2> 1219680 INFO  (coreLoadExecutor-3351-thread-1) [    ] o.a.s.s.IndexSchema unique key field: id
   [junit4]   2> 1219682 INFO  (coreLoadExecutor-3351-thread-1) [    ] o.a.s.s.FileExchangeRateProvider Reloading exchange rates from file currency.xml
   [junit4]   2> 1219683 INFO  (coreLoadExecutor-3351-thread-1) [    ] o.a.s.s.FileExchangeRateProvider Reloading exchange rates from file currency.xml
   [junit4]   2> 1219684 INFO  (coreLoadExecutor-3351-thread-1) [    ] o.a.s.s.OpenExchangeRatesOrgProvider Reloading exchange rates from open-exchange-rates.json
   [junit4]   2> 1219684 INFO  (coreLoadExecutor-3351-thread-1) [    ] o.a.s.s.OpenExchangeRatesOrgProvider Reloading exchange rates from open-exchange-rates.json
   [junit4]   2> 1219685 INFO  (coreLoadExecutor-3351-thread-1) [    ] o.a.s.c.ConfigSetProperties Did not find ConfigSet properties, assuming default properties: Can't find resource 'configsetprops.json' in classpath or '/home/jenkins/workspace/Lucene-Solr-6.x-Linux/solr/core/src/test-files/solr/collection1'
   [junit4]   2> 1219685 INFO  (coreLoadExecutor-3351-thread-1) [    ] o.a.s.c.CoreContainer Creating SolrCore 'collection1' using configuration from instancedir /home/jenkins/workspace/Lucene-Solr-6.x-Linux/solr/core/src/test-files/solr/collection1
   [junit4]   2> 1219685 INFO  (coreLoadExecutor-3351-thread-1) [    ] o.a.s.c.SolrCore org.apache.solr.core.MockDirectoryFactory
   [junit4]   2> 1219685 INFO  (coreLoadExecutor-3351-thread-1) [    ] o.a.s.c.SolrCore [[collection1] ] Opening new SolrCore at [/home/jenkins/workspace/Lucene-Solr-6.x-Linux/solr/core/src/test-files/solr/collection1], dataDir=[/home/jenkins/workspace/Lucene-Solr-6.x-Linux/solr/build/solr-core/test/J1/temp/solr.core.SolrCoreTest_1042F6400624135D-001/init-core-data-001/]
   [junit4]   2> 1219685 INFO  (coreLoadExecutor-3351-thread-1) [    ] o.a.s.c.JmxMonitoredMap JMX monitoring is enabled. Adding Solr mbeans to JMX Server: com.sun.jmx.mbeanserver.JmxMBeanServer@1fa5f3ee
   [junit4]   2> 1219685 INFO  (coreLoadExecutor-3351-thread-1) [    ] o.a.s.c.CachingDirectoryFactory return new directory for /home/jenkins/workspace/Lucene-Solr-6.x-Linux/solr/build/solr-core/test/J1/temp/solr.core.SolrCoreTest_1042F6400624135D-001/init-core-data-001
   [junit4]   2> 1219685 INFO  (coreLoadExecutor-3351-thread-1) [    ] o.a.s.c.SolrCore New index directory detected: old=null new=/home/jenkins/workspace/Lucene-Solr-6.x-Linux/solr/build/solr-core/test/J1/temp/solr.core.SolrCoreTest_1042F6400624135D-001/init-core-data-001/index/
   [junit4]   2> 1219685 WARN  (coreLoadExecutor-3351-thread-1) [    ] o.a.s.c.SolrCore [collection1] Solr index directory '/home/jenkins/workspace/Lucene-Solr-6.x-Linux/solr/build/solr-core/test/J1/temp/solr.core.SolrCoreTest_1042F6400624135D-001/init-core-data-001/index' doesn't exist. Creating new index...
   [junit4]   2> 1219686 INFO  (coreLoadExecutor-3351-thread-1) [    ] o.a.s.c.CachingDirectoryFactory return new directory for /home/jenkins/workspace/Lucene-Solr-6.x-Linux/solr/build/solr-core/test/J1/temp/solr.core.SolrCoreTest_1042F6400624135D-001/init-core-data-001/index
   [junit4]   2> 1219686 INFO  (coreLoadExecutor-3351-thread-1) [    ] o.a.s.u.RandomMergePolicy RandomMergePolicy wrapping class org.apache.lucene.index.LogByteSizeMergePolicy: [LogByteSizeMergePolicy: minMergeSize=1677721, mergeFactor=10, maxMergeSize=2147483648, maxMergeSizeForForcedMerge=9223372036854775807, calibrateSizeByDeletes=false, maxMergeDocs=2147483647, maxCFSSegmentSizeMB=8.796093022207999E12, noCFSRatio=0.5032728945700398]
   [junit4]   2> 1219686 INFO  (coreLoadExecutor-3351-thread-1) [    ] o.a.s.c.SolrDeletionPolicy SolrDeletionPolicy.onCommit: commits: num=1
   [junit4]   2> 	commit{dir=MockDirectoryWrapper(RAMDirectory@62a6b409 lockFactory=org.apache.lucene.store.SingleInstanceLockFactory@301fed50),segFN=segments_1,generation=1}
   [junit4]   2> 1219686 INFO  (coreLoadExecutor-3351-thread-1) [    ] o.a.s.c.SolrDeletionPolicy newest commit generation = 1
   [junit4]   2> 1219686 INFO  (OldIndexDirectoryCleanupThreadForCore-collection1) [    ] o.a.s.c.SolrCore Looking for old index directories to cleanup for core collection1 in /home/jenkins/workspace/Lucene-Solr-6.x-Linux/solr/build/solr-core/test/J1/temp/solr.core.SolrCoreTest_1042F6400624135D-001/init-core-data-001/
   [junit4]   2> 1219688 INFO  (coreLoadExecutor-3351-thread-1) [    ] o.a.s.u.p.UpdateRequestProcessorChain creating updateRequestProcessorChain "dedupe"
   [junit4]   2> 1219688 INFO  (coreLoadExecutor-3351-thread-1) [    ] o.a.s.u.p.UpdateRequestProcessorChain inserting DistributedUpdateProcessorFactory into updateRequestProcessorChain "dedupe"
   [junit4]   2> 1219688 INFO  (coreLoadExecutor-3351-thread-1) [    ] o.a.s.u.p.UpdateRequestProcessorChain creating updateRequestProcessorChain "dedupe-allfields"
   [junit4]   2> 1219688 INFO  (coreLoadExecutor-3351-thread-1) [    ] o.a.s.u.p.UpdateRequestProcessorChain inserting DistributedUpdateProcessorFactory into updateRequestProcessorChain "dedupe-allfields"
   [junit4]   2> 1219688 INFO  (coreLoadExecutor-3351-thread-1) [    ] o.a.s.u.p.UpdateRequestProcessorChain creating updateRequestProcessorChain "stored_sig"
   [junit4]   2> 1219688 INFO  (coreLoadExecutor-3351-thread-1) [    ] o.a.s.u.p.UpdateRequestProcessorChain inserting DistributedUpdateProcessorFactory into updateRequestProcessorChain "stored_sig"
   [junit4]   2> 1219688 INFO  (coreLoadExecutor-3351-thread-1) [    ] o.a.s.u.p.UpdateRequestProcessorChain creating updateRequestProcessorChain "uniq-fields"
   [junit4]   2> 1219688 INFO  (coreLoadExecutor-3351-thread-1) [    ] o.a.s.u.p.UpdateRequestProcessorChain inserting DistributedUpdateProcessorFactory into updateRequestProcessorChain "uniq-fields"
   [junit4]   2> 1219688 INFO  (coreLoadExecutor-3351-thread-1) [    ] o.a.s.u.p.UpdateRequestProcessorChain creating updateRequestProcessorChain "distrib-dup-test-chain-explicit"
   [junit4]   2> 1219689 INFO  (coreLoadExecutor-3351-thread-1) [    ] o.a.s.u.p.UpdateRequestProcessorChain creating updateRequestProcessorChain "distrib-dup-test-chain-implicit"
   [junit4]   2> 1219689 INFO  (coreLoadExecutor-3351-thread-1) [    ] o.a.s.u.p.UpdateRequestProcessorChain inserting DistributedUpdateProcessorFactory into updateRequestProcessorChain "distrib-dup-test-chain-implicit"
   [junit4]   2> 1219689 INFO  (coreLoadExecutor-3351-thread-1) [    ] o.a.s.c.SolrCore no updateRequestProcessorChain defined as default, creating implicit default
   [junit4]   2> 1219690 INFO  (coreLoadExecutor-3351-thread-1) [    ] o.a.s.h.l.XMLLoader xsltCacheLifetimeSeconds=60
   [junit4]   2> 1219691 INFO  (coreLoadExecutor-3351-thread-1) [    ] o.a.s.h.l.XMLLoader xsltCacheLifetimeSeconds=60
   [junit4]   2> 1219691 INFO  (coreLoadExecutor-3351-thread-1) [    ] o.a.s.h.l.XMLLoader xsltCacheLifetimeSeconds=60
   [junit4]   2> 1219692 INFO  (coreLoadExecutor-3351-thread-1) [    ] o.a.s.h.l.XMLLoader xsltCacheLifetimeSeconds=60
   [junit4]   2> 1219693 INFO  (coreLoadExecutor-3351-thread-1) [    ] o.a.s.c.PluginBag requestHandler : 'lazy' created with startup=lazy 
   [junit4]   2> 1219694 INFO  (coreLoadExecutor-3351-thread-1) [    ] o.a.s.c.RequestHandlers Registered paths: /admin/mbeans,standard,spellCheckCompRH,lazy,/update/json/docs,/admin/luke,/export,spellCheckWithWordbreak_Direct,tvrh,/get,/admin/properties,/update/json,mltrh,/admin/threads,/search-facet-def,/update/csv,/sql,/graph,/search-facet-invariants,/admin/segments,spellCheckCompRH1,/mlt,/admin/system,/replication,dismax,defaults,/config,/stream,/schema,/admin/plugins,/admin/logging,spellCheckWithWordbreak,mock,/admin/ping,/update,/admin/file,/terms,spellCheckCompRH_Direct,/debug/dump
   [junit4]   2> 1219694 INFO  (coreLoadExecutor-3351-thread-1) [    ] o.a.s.c.SolrCore Using default statsCache cache: org.apache.solr.search.stats.LocalStatsCache
   [junit4]   2> 1219694 INFO  (coreLoadExecutor-3351-thread-1) [    ] o.a.s.u.UpdateHandler Using UpdateLog implementation: org.apache.solr.update.UpdateLog
   [junit4]   2> 1219694 INFO  (coreLoadExecutor-3351-thread-1) [    ] o.a.s.u.UpdateLog Initializing UpdateLog: dataDir= defaultSyncLevel=FLUSH numRecordsToKeep=100 maxNumLogsToKeep=10 numVersionBuckets=65536
   [junit4]   2> 1219695 INFO  (coreLoadExecutor-3351-thread-1) [    ] o.a.s.u.CommitTracker Hard AutoCommit: disabled
   [junit4]   2> 1219695 INFO  (coreLoadExecutor-3351-thread-1) [    ] o.a.s.u.CommitTracker Soft AutoCommit: disabled
   [junit4]   2> 1219695 INFO  (coreLoadExecutor-3351-thread-1) [    ] o.a.s.u.RandomMergePolicy RandomMergePolicy wrapping class org.apache.lucene.index.LogDocMergePolicy: [LogDocMergePolicy: minMergeSize=1000, mergeFactor=35, maxMergeSize=9223372036854775807, maxMergeSizeForForcedMerge=9223372036854775807, calibrateSizeByDeletes=true, maxMergeDocs=2147483647, maxCFSSegmentSizeMB=8.796093022207999E12, noCFSRatio=0.8492164229387292]
   [junit4]   2> 1219695 INFO  (coreLoadExecutor-3351-thread-1) [    ] o.a.s.c.SolrDeletionPolicy SolrDeletionPolicy.onInit: commits: num=1
   [junit4]   2> 	commit{dir=MockDirectoryWrapper(RAMDirectory@62a6b409 lockFactory=org.apache.lucene.store.SingleInstanceLockFactory@301fed50),segFN=segments_1,generation=1}
   [junit4]   2> 1219695 INFO  (coreLoadExecutor-3351-thread-1) [    ] o.a.s.c.SolrDeletionPolicy newest commit generation = 1
   [junit4]   2> 1219695 INFO  (coreLoadExecutor-3351-thread-1) [    ] o.a.s.s.SolrIndexSearcher Opening [Searcher@1fd8fe61[collection1] main]
   [junit4]   2> 1219695 INFO  (coreLoadExecutor-3351-thread-1) [    ] o.a.s.r.RestManager Initializing RestManager with initArgs: {storageIO=org.apache.solr.rest.ManagedResourceStorage$InMemoryStorageIO}
   [junit4]   2> 1219695 INFO  (coreLoadExecutor-3351-thread-1) [    ] o.a.s.r.ManagedResourceStorage Reading _rest_managed.json using InMemoryStorage
   [junit4]   2> 1219695 INFO  (coreLoadExecutor-3351-thread-1) [    ] o.a.s.r.RestManager Initializing 0 registered ManagedResources
   [junit4]   2> 1219695 INFO  (coreLoadExecutor-3351-thread-1) [    ] o.a.s.h.c.SpellCheckComponent Initializing spell checkers
   [junit4]   2> 1219696 INFO  (coreLoadExecutor-3351-thread-1) [    ] o.a.s.s.DirectSolrSpellChecker init: {name=direct,classname=DirectSolrSpellChecker,field=lowerfilt,minQueryLength=3}
   [junit4]   2> 1219697 INFO  (coreLoadExecutor-3351-thread-1) [    ] o.a.s.h.ReplicationHandler Commits will be reserved for  10000
   [junit4]   2> 1219697 INFO  (searcherExecutor-3352-thread-1) [    ] o.a.s.h.c.SpellCheckComponent Loading spell index for spellchecker: default
   [junit4]   2> 1219698 INFO  (coreLoadExecutor-3351-thread-1) [    ] o.a.s.u.UpdateLog Looking up max value of version field to seed version buckets
   [junit4]   2> 1219698 INFO  (searcherExecutor-3352-thread-1) [    ] o.a.s.h.c.SpellCheckComponent Loading spell index for spellchecker: direct
   [junit4]   2> 1219698 INFO  (coreLoadExecutor-3351-thread-1) [    ] o.a.s.u.VersionInfo Refreshing highest value of _version_ for 65536 version buckets from index
   [junit4]   2> 1219698 INFO  (searcherExecutor-3352-thread-1) [    ] o.a.s.h.c.SpellCheckComponent Loading spell index for spellchecker: wordbreak
   [junit4]   2> 1219698 INFO  (coreLoadExecutor-3351-thread-1) [    ] o.a.s.u.VersionInfo No terms found for _version_, cannot seed version bucket highest value from index
   [junit4]   2> 1219698 INFO  (coreLoadExecutor-3351-thread-1) [    ] o.a.s.u.UpdateLog Could not find max version in index or recent updates, using new clock 1533539998110842880
   [junit4]   2> 1219698 INFO  (searcherExecutor-3352-thread-1) [    ] o.a.s.h.c.SpellCheckComponent Loading spell index for spellchecker: multipleFields
   [junit4]   2> 1219698 INFO  (searcherExecutor-3352-thread-1) [    ] o.a.s.h.c.SpellCheckComponent Loading spell index for spellchecker: jarowinkler
   [junit4]   2> 1219698 INFO  (searcherExecutor-3352-thread-1) [    ] o.a.s.h.c.SpellCheckComponent Loading spell index for spellchecker: external
   [junit4]   2> 1219699 INFO  (searcherExecutor-3352-thread-1) [    ] o.a.s.h.c.SpellCheckComponent Loading spell index for spellchecker: freq
   [junit4]   2> 1219699 INFO  (searcherExecutor-3352-thread-1) [    ] o.a.s.h.c.SpellCheckComponent Loading spell index for spellchecker: fqcn
   [junit4]   2> 1219699 INFO  (searcherExecutor-3352-thread-1) [    ] o.a.s.h.c.SpellCheckComponent Loading spell index for spellchecker: perDict
   [junit4]   2> 1219700 INFO  (searcherExecutor-3352-thread-1) [    ] o.a.s.c.SolrCore [collection1] Registered new searcher Searcher@1fd8fe61[collection1] main{ExitableDirectoryReader(UninvertingDirectoryReader())}
   [junit4]   2> 1219700 INFO  (coreLoadExecutor-3351-thread-1) [    ] o.a.s.u.UpdateLog Took 2.0ms to seed version buckets with highest version 1533539998110842880
   [junit4]   2> 1219700 INFO  (coreLoadExecutor-3351-thread-1) [    ] o.a.s.c.CoreContainer registering core: collection1
   [junit4]   2> 1219701 INFO  (TEST-SolrCoreTest.testClose-seed#[1042F6400624135D]) [    ] o.a.s.SolrTestCaseJ4 ####initCore end
   [junit4]   2> 1219701 INFO  (TEST-SolrCoreTest.testClose-seed#[1042F6400624135D]) [    ] o.a.s.c.CoreContainer Shutting down CoreContainer instance=984614927
   [junit4]   2> 1219701 INFO  (coreCloseExecutor-3357-thread-1) [    ] o.a.s.c.SolrCore [collection1]  CLOSING SolrCore org.apache.solr.core.SolrCore@4084d20b
   [junit4]   2> 1219701 INFO  (coreCloseExecutor-3357-thread-1) [    ] o.a.s.u.DirectUpdateHandler2 closing DirectUpdateHandler2{commits=0,autocommits=0,soft autocommits=0,optimizes=0,rollbacks=0,expungeDeletes=0,docsPending=0,adds=0,deletesById=0,deletesByQuery=0,errors=0,cumulative_adds=0,cumulative_deletesById=0,cumulative_deletesByQuery=0,cumulative_errors=0,transaction_logs_total_size=0,transaction_logs_total_number=0}
   [junit4]   2> 1219701 INFO  (coreCloseExecutor-3357-thread-1) [    ] o.a.s.u.SolrCoreState Closing SolrCoreState
   [junit4]   2> 1219701 INFO  (coreCloseExecutor-3357-thread-1) [    ] o.a.s.u.DefaultSolrCoreState SolrCoreState ref count has reached 0 - closing IndexWriter
   [junit4]   2> 1219701 INFO  (coreCloseExecutor-3357-thread-1) [    ] o.a.s.u.DefaultSolrCoreState closing IndexWriter with IndexWriterCloser
   [junit4]   2> 1219701 INFO  (coreCloseExecutor-3357-thread-1) [    ] o.a.s.c.SolrCore [collection1] Closing main searcher on request.
   [junit4]   2> 1219707 INFO  (coreCloseExecutor-3357-thread-1) [    ] o.a.s.c.CachingDirectoryFactory Closing MockDirectoryFactory - 2 directories currently being tracked
   [junit4]   2> 1219707 INFO  (coreCloseExecutor-3357-thread-1) [    ] o.a.s.c.CachingDirectoryFactory looking to close /home/jenkins/workspace/Lucene-Solr-6.x-Linux/solr/build/solr-core/test/J1/temp/solr.core.SolrCoreTest_1042F6400624135D-001/init-core-data-001 [CachedDir<<refCount=0;path=/home/jenkins/workspace/Lucene-Solr-6.x-Linux/solr/build/solr-core/test/J1/temp/solr.core.SolrCoreTest_1042F6400624135D-001/init-core-data-001;done=false>>]
   [junit4]   2> 1219707 INFO  (coreCloseExecutor-3357-thread-1) [    ] o.a.s.c.CachingDirectoryFactory Closing directory, CoreContainer#isShutdown=true
   [junit4]   2> 1219707 INFO  (coreCloseExecutor-3357-thread-1) [    ] o.a.s.c.CachingDirectoryFactory Closing directory: /home/jenkins/workspace/Lucene-Solr-6.x-Linux/solr/build/solr-core/test/J1/temp/solr.core.SolrCoreTest_1042F6400624135D-001/init-core-data-001
   [junit4]   2> 1219707 INFO  (coreCloseExecutor-3357-thread-1) [    ] o.a.s.c.CachingDirectoryFactory looking to close /home/jenkins/workspace/Lucene-Solr-6.x-Linux/solr/build/solr-core/test/J1/temp/solr.core.SolrCoreTest_1042F6400624135D-001/init-core-data-001/index [CachedDir<<refCount=0;path=/home/jenkins/workspace/Lucene-Solr-6.x-Linux/solr/build/solr-core/test/J1/temp/solr.core.SolrCoreTest_1042F6400624135D-001/init-core-data-001/index;done=false>>]
   [junit4]   2> 1219707 INFO  (coreCloseExecutor-3357-thread-1) [    ] o.a.s.c.CachingDirectoryFactory Closing directory, CoreContainer#isShutdown=true
   [junit4]   2> 1219707 INFO  (coreCloseExecutor-3357-thread-1) [    ] o.a.s.c.CachingDirectoryFactory Closing directory: /home/jenkins/workspace/Lucene-Solr-6.x-Linux/solr/build/solr-core/test/J1/temp/solr.core.SolrCoreTest_1042F6400624135D-001/init-core-data-001/index
   [junit4]   2> 1219708 INFO  (TEST-SolrCoreTest.testClose-seed#[1042F6400624135D]) [    ] o.a.s.SolrTestCaseJ4 ###deleteCore
   [junit4]   2> 1219708 INFO  (TEST-SolrCoreTest.testClose-seed#[1042F6400624135D]) [    ] o.a.s.c.CoreContainer Shutting down CoreContainer instance=984614927
   [junit4]   2> 1219708 INFO  (TEST-SolrCoreTest.testClose-seed#[1042F6400624135D]) [    ] o.a.s.SolrTestCaseJ4 ###Ending testClose
   [junit4]   2> 1219709 INFO  (TEST-SolrCoreTest.testRequestHandlerRegistry-seed#[1042F6400624135D]) [    ] o.a.s.SolrTestCaseJ4 ###Starting testRequestHandlerRegistry
   [junit4]   2> 1219710 INFO  (TEST-SolrCoreTest.testRequestHandlerRegistry-seed#[1042F6400624135D]) [    ] o.a.s.SolrTestCaseJ4 ####initCore
   [junit4]   2> 1219710 INFO  (TEST-SolrCoreTest.testRequestHandlerRegistry-seed#[1042F6400624135D]) [    ] o.a.s.c.SolrResourceLoader new SolrResourceLoader for directory: '/home/jenkins/workspace/Lucene-Solr-6.x-Linux/solr/core/src/test-files/solr/collection1'
   [junit4]   2> 1219710 INFO  (TEST-SolrCoreTest.testRequestHandlerRegistry-seed#[1042F6400624135D]) [    ] o.a.s.c.SolrResourceLoader JNDI not configured for solr (NoInitialContextEx)
   [junit4]   2> 1219710 INFO  (TEST-SolrCoreTest.testRequestHandlerRegistry-seed#[1042F6400624135D]) [    ] o.a.s.c.SolrResourceLoader using system property solr.solr.home: /home/jenkins/workspace/Lucene-Solr-6.x-Linux/solr/core/src/test-files/solr
   [junit4]   2> 1219710 INFO  (TEST-SolrCoreTest.testRequestHandlerRegistry-seed#[1042F6400624135D]) [    ] o.a.s.c.SolrResourceLoader Adding 'file:/home/jenkins/workspace/Lucene-Solr-6.x-Linux/solr/core/src/test-files/solr/collection1/lib/classes/' to classloader
   [junit4]   2> 1219710 INFO  (TEST-SolrCoreTest.testRequestHandlerRegistry-seed#[1042F6400624135D]) [    ] o.a.s.c.SolrResourceLoader Adding 'file:/home/jenkins/workspace/Lucene-Solr-6.x-Linux/solr/core/src/test-files/solr/collection1/lib/README' to classloader
   [junit4]   2> 1219725 INFO  (TEST-SolrCoreTest.testRequestHandlerRegistry-seed#[1042F6400624135D]) [    ] o.a.s.c.SolrConfig current version of requestparams : -1
   [junit4]   2> 1219732 INFO  (TEST-SolrCoreTest.testRequestHandlerRegistry-seed#[1042F6400624135D]) [    ] o.a.s.c.SolrConfig Using Lucene MatchVersion: 6.1.0
   [junit4]   2> 1219746 INFO  (TEST-SolrCoreTest.testRequestHandlerRegistry-seed#[1042F6400624135D]) [    ] o.a.s.c.SolrConfig Loaded SolrConfig: solrconfig.xml
   [junit4]   2> 1219749 INFO  (TEST-SolrCoreTest.testRequestHandlerRegistry-seed#[1042F6400624135D]) [    ] o.a.s.s.IndexSchema [null] Schema name=test
   [junit4]   2> 1219821 INFO  (TEST-SolrCoreTest.testRequestHandlerRegistry-seed#[1042F6400624135D]) [    ] o.a.s.s.OpenExchangeRatesOrgProvider Initialized with rates=open-exchange-rates.json, refreshInterval=1440.
   [junit4]   2> 1219824 INFO  (TEST-SolrCoreTest.testRequestHandlerRegistry-seed#[1042F6400624135D]) [    ] o.a.s.s.IndexSchema default search field in schema is text
   [junit4]   2> 1219825 INFO  (TEST-SolrCoreTest.testRequestHandlerRegistry-seed#[1042F6400624135D]) [    ] o.a.s.s.IndexSchema unique key field: id
   [junit4]   2> 1219828 INFO  (TEST-SolrCoreTest.testRequestHandlerRegistry-seed#[1042F6400624135D]) [    ] o.a.s.s.FileExchangeRateProvider Reloading exchange rates from file currency.xml
   [junit4]   2> 1219830 INFO  (TEST-SolrCoreTest.testRequestHandlerRegistry-seed#[1042F6400624135D]) [    ] o.a.s.s.FileExchangeRateProvider Reloading exchange rates from file currency.xml
   [junit4]   2> 1219831 INFO  (TEST-SolrCoreTest.testRequestHandlerRegistry-seed#[1042F6400624135D]) [    ] o.a.s.s.OpenExchangeRatesOrgProvider Reloading exchange rates from open-exchange-rates.json
   [junit4]   2> 1219831 INFO  (TEST-SolrCoreTest.testRequestHandlerRegistry-seed#[1042F6400624135D]) [    ] o.a.s.s.OpenExchangeRatesOrgProvider Reloading exchange rates from open-exchange-rates.json
   [junit4]   2> 1219831 INFO  (TEST-SolrCoreTest.testRequestHandlerRegistry-seed#[1042F6400624135D]) [    ] o.a.s.c.SolrResourceLoader JNDI not configured for solr (NoInitialContextEx)
   [junit4]   2> 1219832 INFO  (TEST-SolrCoreTest.testRequestHandlerRegistry-seed#[1042F6400624135D]) [    ] o.a.s.c.SolrResourceLoader using system property solr.solr.home: /home/jenkins/workspace/Lucene-Solr-6.x-Linux/solr/core/src/test-files/solr
   [junit4]   2> 1219832 INFO  (TEST-SolrCoreTest.testRequestHandlerRegistry-seed#[1042F6400624135D]) [    ] o.a.s.c.SolrResourceLoader new SolrResourceLoader for directory: '/home/jenkins/workspace/Lucene-Solr-6.x-Linux/solr/core/src/test-files/solr'
   [junit4]   2> 1219832 INFO  (TEST-SolrCoreTest.testRequestHandlerRegistry-seed#[1042F6400624135D]) [    ] o.a.s.c.SolrResourceLoader JNDI not configured for solr (NoInitialContextEx)
   [junit4]   2> 1219832 INFO  (TEST-SolrCoreTest.testRequestHandlerRegistry-seed#[1042F6400624135D]) [    ] o.a.s.c.SolrResourceLoader using system property solr.solr.home: /home/jenkins/workspace/Lucene-Solr-6.x-Linux/solr/core/src/test-files/solr
   [junit4]   2> 1219832 INFO  (TEST-SolrCoreTest.testRequestHandlerRegistry-seed#[1042F6400624135D]) [    ] o.a.s.c.CoreContainer New CoreContainer 1992310130
   [junit4]   2> 1219832 INFO  (TEST-SolrCoreTest.testRequestHandlerRegistry-seed#[1042F6400624135D]) [    ] o.a.s.c.CoreContainer Loading cores into CoreContainer [instanceDir=/home/jenkins/workspace/Lucene-Solr-6.x-Linux/solr/core/src/test-files/solr]
   [junit4]   2> 1219832 WARN  (TEST-SolrCoreTest.testRequestHandlerRegistry-seed#[1042F6400624135D]) [    ] o.a.s.c.CoreContainer Couldn't add files from /home/jenkins/workspace/Lucene-Solr-6.x-Linux/solr/core/src/test-files/solr/lib to classpath: /home/jenkins/workspace/Lucene-Solr-6.x-Linux/solr/core/src/test-files/solr/lib
   [junit4]   2> 1219832 INFO  (TEST-SolrCoreTest.testRequestHandlerRegistry-seed#[1042F6400624135D]) [    ] o.a.s.h.c.HttpShardHandlerFactory created with socketTimeout : 600000,connTimeout : 60000,maxConnectionsPerHost : 20,maxConnections : 10000,corePoolSize : 0,maximumPoolSize : 2147483647,maxThreadIdleTime : 5,sizeOfQueue : -1,fairnessPolicy : false,useRetries : false,
   [junit4]   2> 1219833 INFO  (TEST-SolrCoreTest.testRequestHandlerRegistry-seed#[1042F6400624135D]) [    ] o.a.s.u.UpdateShardHandler Creating UpdateShardHandler HTTP client with params: socketTimeout=30000&connTimeout=30000&retry=true
   [junit4]   2> 1219834 INFO  (TEST-SolrCoreTest.testRequestHandlerRegistry-seed#[1042F6400624135D]) [    ] o.a.s.l.LogWatcher SLF4J impl is org.slf4j.impl.Log4jLoggerFactory
   [junit4]   2> 1219835 INFO  (TEST-SolrCoreTest.testRequestHandlerRegistry-seed#[1042F6400624135D]) [    ] o.a.s.l.LogWatcher Registering Log Listener [Log4j (org.slf4j.impl.Log4jLoggerFactory)]
   [junit4]   2> 1219835 INFO  (TEST-SolrCoreTest.testRequestHandlerRegistry-seed#[1042F6400624135D]) [    ] o.a.s.c.CoreContainer Security conf doesn't exist. Skipping setup for authorization module.
   [junit4]   2> 1219835 INFO  (TEST-SolrCoreTest.testRequestHandlerRegistry-seed#[1042F6400624135D]) [    ] o.a.s.c.CoreContainer No authentication plugin used.
   [junit4]   2> 1219835 INFO  (TEST-SolrCoreTest.testRequestHandlerRegistry-seed#[1042F6400624135D]) [    ] o.a.s.c.CoreDescriptor Created CoreDescriptor: {name=collection1, config=solrconfig.xml, transient=false, schema=schema.xml, loadOnStartup=true, configSetProperties=configsetprops.json, collection=collection1, dataDir=/home/jenkins/workspace/Lucene-Solr-6.x-Linux/solr/build/solr-core/test/J1/temp/solr.core.SolrCoreTest_1042F6400624135D-001/init-core-data-001, shard=shard1}
   [junit4]   2> 1219835 INFO  (coreLoadExecutor-3365-thread-1) [    ] o.a.s.c.SolrResourceLoader new SolrResourceLoader for directory: '/home/jenkins/workspace/Lucene-Solr-6.x-Linux/solr/core/src/test-files/solr/collection1'
   [junit4]   2> 1219836 INFO  (coreLoadExecutor-3365-thread-1) [    ] o.a.s.c.SolrResourceLoader JNDI not configured for solr (NoInitialContextEx)
   [junit4]   2> 1219836 INFO  (coreLoadExecutor-3365-thread-1) [    ] o.a.s.c.SolrResourceLoader using system property solr.solr.home: /home/jenkins/workspace/Lucene-Solr-6.x-Linux/solr/core/src/test-files/solr
   [junit4]   2> 1219836 INFO  (coreLoadExecutor-3365-thread-1) [    ] o.a.s.c.SolrResourceLoader Adding 'file:/home/jenkins/workspace/Lucene-Solr-6.x-Linux/solr/core/src/test-files/solr/collection1/lib/classes/' to classloader
   [junit4]   2> 1219836 INFO  (coreLoadExecutor-3365-thread-1) [    ] o.a.s.c.SolrResourceLoader Adding 'file:/home/jenkins/workspace/Lucene-Solr-6.x-Linux/solr/core/src/test-files/solr/collection1/lib/README' to classloader
   [junit4]   2> 1219851 INFO  (coreLoadExecutor-3365-thread-1) [    ] o.a.s.c.SolrConfig current version of requestparams : -1
   [junit4]   2> 1219877 INFO  (coreLoadExecutor-3365-thread-1) [    ] o.a.s.c.SolrConfig Using Lucene MatchVersion: 6.1.0
   [junit4]   2> 1219894 INFO  (coreLoadExecutor-3365-thread-1) [    ] o.a.s.c.SolrConfig Loaded SolrConfig: solrconfig.xml
   [junit4]   2> 1219897 INFO  (coreLoadExecutor-3365-thread-1) [    ] o.a.s.s.IndexSchema [collection1] Schema name=test
   [junit4]   2> 1219965 INFO  (coreLoadExecutor-3365-thread-1) [    ] o.a.s.s.OpenExchangeRatesOrgProvider Initialized with rates=open-exchange-rates.json, refreshInterval=1440.
   [junit4]   2> 1219969 INFO  (coreLoadExecutor-3365-thread-1) [    ] o.a.s.s.IndexSchema default search field in schema is text
   [junit4]   2> 1219970 INFO  (coreLoadExecutor-3365-thread-1) [    ] o.a.s.s.IndexSchema unique key field: id
   [junit4]   2> 1219972 INFO  (coreLoadExecutor-3365-thread-1) [    ] o.a.s.s.FileExchangeRateProvider Reloading exchange rates from file currency.xml
   [junit4]   2> 1219973 INFO  (coreLoadExecutor-3365-thread-1) [    ] o.a.s.s.FileExchangeRateProvider Reloading exchange rates from file currency.xml
   [junit4]   2> 1219973 INFO  (coreLoadExecutor-3365-thread-1) [    ] o.a.s.s.OpenExchangeRatesOrgProvider Reloading exchange rates from open-exchange-rates.json
   [junit4]   2> 1219973 INFO  (coreLoadExecutor-3365-thread-1) [    ] o.a.s.s.OpenExchangeRatesOrgProvider Reloading exchange rates from open-exchange-rates.json
   [junit4]   2> 1219974 INFO  (coreLoadExecutor-3365-thread-1) [    ] o.a.s.c.ConfigSetProperties Did not find ConfigSet properties, assuming default properties: Can't find resource 'configsetprops.json' in classpath or '/home/jenkins/workspace/Lucene-Solr-6.x-Linux/solr/core/src/test-files/solr/collection1'
   [junit4]   2> 1219974 INFO  (coreLoadExecutor-3365-thread-1) [    ] o.a.s.c.CoreContainer Creating SolrCore 'collection1' using configuration from instancedir /home/jenkins/workspace/Lucene-Solr-6.x-Linux/solr/core/src/test-files/solr/collection1
   [junit4]   2> 1219974 INFO  (coreLoadExecutor-3365-thread-1) [    ] o.a.s.c.SolrCore org.apache.solr.core.MockDirectoryFactory
   [junit4]   2> 1219974 INFO  (coreLoadExecutor-3365-thread-1) [    ] o.a.s.c.SolrCore [[collection1] ] Opening new SolrCore at [/home/jenkins/workspace/Lucene-Solr-6.x-Linux/solr/core/src/test-files/solr/collection1], dataDir=[/home/jenkins/workspace/Lucene-Solr-6.x-Linux/solr/build/solr-core/test/J1/temp/solr.core.SolrCoreTest_1042F6400624135D-001/init-core-data-001/]
   [junit4]   2> 1219974 INFO  (coreLoadExecutor-3365-thread-1) [    ] o.a.s.c.JmxMonitoredMap JMX monitoring is enabled. Adding Solr mbeans to JMX Server: com.sun.jmx.mbeanserver.JmxMBeanServer@1fa5f3ee
   [junit4]   2> 1219975 INFO  (coreLoadExecutor-3365-thread-1) [    ] o.a.s.c.CachingDirectoryFactory return new directory for /home/jenkins/workspace/Lucene-Solr-6.x-Linux/solr/build/solr-core/test/J1/temp/solr.core.SolrCoreTest_1042F6400624135D-001/init-core-data-001
   [junit4]   2> 1219975 INFO  (coreLoadExecutor-3365-thread-1) [    ] o.a.s.c.SolrCore New index directory detected: old=null new=/home/jenkins/workspace/Lucene-Solr-6.x-Linux/solr/build/solr-core/test/J1/temp/solr.core.SolrCoreTest_1042F6400624135D-001/init-core-data-001/index/
   [junit4]   2> 1219975 WARN  (coreLoadExecutor-3365-thread-1) [    ] o.a.s.c.SolrCore [collection1] Solr index directory '/home/jenkins/workspace/Lucene-Solr-6.x-Linux/solr/build/solr-core/test/J1/temp/solr.core.SolrCoreTest_1042F6400624135D-001/init-core-data-001/index' doesn't exist. Creating new index...
   [junit4]   2> 1219975 INFO  (coreLoadExecutor-3365-thread-1) [    ] o.a.s.c.CachingDirectoryFactory return new directory for /home/jenkins/workspace/Lucene-Solr-6.x-Linux/solr/build/solr-core/test/J1/temp/solr.core.SolrCoreTest_1042F6400624135D-001/init-core-data-001/index
   [junit4]   2> 1219975 INFO  (coreLoadExecutor-3365-thread-1) [    ] o.a.s.u.RandomMergePolicy RandomMergePolicy wrapping class org.apache.lucene.index.LogByteSizeMergePolicy: [LogByteSizeMergePolicy: minMergeSize=1677721, mergeFactor=10, maxMergeSize=2147483648, maxMergeSizeForForcedMerge=9223372036854775807, calibrateSizeByDeletes=false, maxMergeDocs=2147483647, maxCFSSegmentSizeMB=8.796093022207999E12, noCFSRatio=0.5032728945700398]
   [junit4]   2> 1219975 INFO  (coreLoadExecutor-3365-thread-1) [    ] o.a.s.c.SolrDeletionPolicy SolrDeletionPolicy.onCommit: commits: num=1
   [junit4]   2> 	commit{dir=MockDirectoryWrapper(RAMDirectory@4d4ee565 lockFactory=org.apache.lucene.store.SingleInstanceLockFactory@50f126c6),segFN=segments_1,generation=1}
   [junit4]   2> 1219975 INFO  (coreLoadExecutor-3365-thread-1) [    ] o.a.s.c.SolrDeletionPolicy newest commit generation = 1
   [junit4]   2> 1219979 INFO  (OldIndexDirectoryCleanupThreadForCore-collection1) [    ] o.a.s.c.SolrCore Looking for old index directories to cleanup for core collection1 in /home/jenkins/workspace/Lucene-Solr-6.x-Linux/solr/build/solr-core/test/J1/temp/solr.core.SolrCoreTest_1042F6400624135D-001/init-core-data-001/
   [junit4]   2> 1219981 INFO  (coreLoadExecutor-3365-thread-1) [    ] o.a.s.u.p.UpdateRequestProcessorChain creating updateRequestProcessorChain "dedupe"
   [junit4]   2> 1219981 INFO  (coreLoadExecutor-3365-thread-1) [    ] o.a.s.u.p.UpdateRequestProcessorChain inserting DistributedUpdateProcessorFactory into updateRequestProcessorChain "dedupe"
   [junit4]   2> 1219981 INFO  (coreLoadExecutor-3365-thread-1) [    ] o.a.s.u.p.UpdateRequestProcessorChain creating updateRequestProcessorChain "dedupe-allfields"
   [junit4]   2> 1219981 INFO  (coreLoadExecutor-3365-thread-1) [    ] o.a.s.u.p.UpdateRequestProcessorChain inserting DistributedUpdateProcessorFactory into updateRequestProcessorChain "dedupe-allfields"
   [junit4]   2> 1219981 INFO  (coreLoadExecutor-3365-thread-1) [    ] o.a.s.u.p.UpdateRequestProcessorChain creating updateRequestProcessorChain "stored_sig"
   [junit4]   2> 1219982 INFO  (coreLoadExecutor-3365-thread-1) [    ] o.a.s.u.p.UpdateRequestProcessorChain inserting DistributedUpdateProcessorFactory into updateRequestProcessorChain "stored_sig"
   [junit4]   2> 1219982 INFO  (coreLoadExecutor-3365-thread-1) [    ] o.a.s.u.p.UpdateRequestProcessorChain creating updateRequestProcessorChain "uniq-fields"
   [junit4]   2> 1219982 INFO  (coreLoadExecutor-3365-thread-1) [    ] o.a.s.u.p.UpdateRequestProcessorChain inserting DistributedUpdateProcessorFactory into updateRequestProcessorChain "uniq-fields"
   [junit4]   2> 1219982 INFO  (coreLoadExecutor-3365-thread-1) [    ] o.a.s.u.p.UpdateRequestProcessorChain creating updateRequestProcessorChain "distrib-dup-test-chain-explicit"
   [junit4]   2> 1219982 INFO  (coreLoadExecutor-3365-thread-1) [    ] o.a.s.u.p.UpdateRequestProcessorChain creating updateRequestProcessorChain "distrib-dup-test-chain-implicit"
   [junit4]   2> 1219982 INFO  (coreLoadExecutor-3365-thread-1) [    ] o.a.s.u.p.UpdateRequestProcessorChain inserting DistributedUpdateProcessorFactory into updateRequestProcessorChain "distrib-dup-test-chain-implicit"
   [junit4]   2> 1219982 INFO  (coreLoadExecutor-3365-thread-1) [    ] o.a.s.c.SolrCore no updateRequestProcessorChain defined as default, creating implicit default
   [junit4]   2> 1219984 INFO  (coreLoadExecutor-3365-thread-1) [    ] o.a.s.h.l.XMLLoader xsltCacheLifetimeSeconds=60
   [junit4]   2> 1219984 INFO  (coreLoadExecutor-3365-thread-1) [    ] o.a.s.h.l.XMLLoader xsltCacheLifetimeSeconds=60
   [junit4]   2> 1219984 INFO  (coreLoadExecutor-3365-thread-1) [    ] o.a.s.h.l.XMLLoader xsltCacheLifetimeSeconds=60
   [junit4]   2> 1219985 INFO  (coreLoadExecutor-3365-thread-1) [    ] o.a.s.h.l.XMLLoader xsltCacheLifetimeSeconds=60
   [junit4]   2> 1219987 INFO  (coreLoadExecutor-3365-thread-1) [    ] o.a.s.c.PluginBag requestHandler : 'lazy' created with startup=lazy 
   [junit4]   2> 1219988 INFO  (coreLoadExecutor-3365-thread-1) [    ] o.a.s.c.RequestHandlers Registered paths: /admin/mbeans,standard,spellCheckCompRH,lazy,/update/json/docs,/admin/luke,/export,spellCheckWithWordbreak_Direct,tvrh,/get,/admin/properties,/update/json,mltrh,/admin/threads,/search-facet-def,/update/csv,/sql,/graph,/search-facet-invariants,/admin/segments,spellCheckCompRH1,/mlt,/admin/system,/replication,dismax,defaults,/config,/stream,/schema,/admin/plugins,/admin/logging,spellCheckWithWordbreak,mock,/admin/ping,/update,/admin/file,/terms,spellCheckCompRH_Direct,/debug/dump
   [junit4]   2> 1219988 INFO  (coreLoadExecutor-3365-thread-1) [    ] o.a.s.c.SolrCore Using default statsCache cache: org.apache.solr.search.stats.LocalStatsCache
   [junit4]   2> 1219989 INFO  (coreLoadExecutor-3365-thread-1) [    ] o.a.s.u.UpdateHandler Using UpdateLog implementation: org.apache.solr.update.UpdateLog
   [junit4]   2> 1219989 INFO  (coreLoadExecutor-3365-thread-1) [    ] o.a.s.u.UpdateLog Initializing UpdateLog: dataDir= defaultSyncLevel=FLUSH numRecordsToKeep=100 maxNumLogsToKeep=10 numVersionBuckets=65536
   [junit4]   2> 1219989 INFO  (coreLoadExecutor-3365-thread-1) [    ] o.a.s.u.CommitTracker Hard AutoCommit: disabled
   [junit4]   2> 1219989 INFO  (coreLoadExecutor-3365-thread-1) [    ] o.a.s.u.CommitTracker Soft AutoCommit: disabled
   [junit4]   2> 1219989 INFO  (coreLoadExecutor-3365-thread-1) [    ] o.a.s.u.RandomMergePolicy RandomMergePolicy wrapping class org.apache.lucene.index.LogDocMergePolicy: [LogDocMergePolicy: minMergeSize=1000, mergeFactor=35, maxMergeSize=9223372036854775807, maxMergeSizeForForcedMerge=9223372036854775807, calibrateSizeByDeletes=true, maxMergeDocs=2147483647, maxCFSSegmentSizeMB=8.796093022207999E12, noCFSRatio=0.8492164229387292]
   [junit4]   2> 1219990 INFO  (coreLoadExecutor-3365-thread-1) [    ] o.a.s.c.SolrDeletionPolicy SolrDeletionPolicy.onInit: commits: num=1
   [junit4]   2> 	commit{dir=MockDirectoryWrapper(RAMDirectory@4d4ee565 lockFactory=org.apache.lucene.store.SingleInstanceLockFactory@50f126c6),segFN=segments_1,generation=1}
   [junit4]   2> 1219991 INFO  (coreLoadExecutor-3365-thread-1) [    ] o.a.s.c.SolrDeletionPolicy newest commit generation = 1
   [junit4]   2> 1219991 INFO  (coreLoadExecutor-3365-thread-1) [    ] o.a.s.s.SolrIndexSearcher Opening [Searcher@49bcd9f6[collection1] main]
   [junit4]   2> 1219991 INFO  (coreLoadExecutor-3365-thread-1) [    ] o.a.s.r.RestManager Initializing RestManager with initArgs: {storageIO=org.apache.solr.rest.ManagedResourceStorage$InMemoryStorageIO}
   [junit4]   2> 1219991 INFO  (coreLoadExecutor-3365-thread-1) [    ] o.a.s.r.ManagedResourceStorage Reading _rest_managed.json using InMemoryStorage
   [junit4]   2> 1219991 INFO  (coreLoadExecutor-3365-thread-1) [    ] o.a.s.r.RestManager Initializing 0 registered ManagedResources
   [junit4]   2> 1219992 INFO  (coreLoadExecutor-3365-thread-1) [    ] o.a.s.h.c.SpellCheckComponent Initializing spell checkers
   [junit4]   2> 1219992 INFO  (coreLoadExecutor-3365-thread-1) [    ] o.a.s.s.DirectSolrSpellChecker init: {name=direct,classname=DirectSolrSpellChecker,field=lowerfilt,minQueryLength=3}
   [junit4]   2> 1219994 INFO  (coreLoadExecutor-3365-thread-1) [    ] o.a.s.h.ReplicationHandler Commits will be reserved for  10000
   [junit4]   2> 1219995 INFO  (coreLoadExecutor-3365-thread-1) [    ] o.a.s.u.UpdateLog Looking up max value of version field to seed version buckets
   [junit4]   2> 1219995 INFO  (coreLoadExecutor-3365-thread-1) [    ] o.a.s.u.VersionInfo Refreshing highest value of _version_ for 65536 version buckets from index
   [junit4]   2> 1219995 INFO  (coreLoadExecutor-3365-thread-1) [    ] o.a.s.u.VersionInfo No terms found for _version_, cannot seed version bucket highest value from index
   [junit4]   2> 1219995 INFO  (coreLoadExecutor-3365-thread-1) [    ] o.a.s.u.UpdateLog Could not find max version in index or recent updates, using new clock 1533539998422269952
   [junit4]   2> 1219997 INFO  (coreLoadExecutor-3365-thread-1) [    ] o.a.s.u.UpdateLog Took 1.0ms to seed version buckets with highest version 1533539998422269952
   [junit4]   2> 1219997 INFO  (coreLoadExecutor-3365-thread-1) [    ] o.a.s.c.CoreContainer registering core: collection1
   [junit4]   2> 1219997 INFO  (searcherExecutor-3366-thread-1) [    ] o.a.s.h.c.SpellCheckComponent Loading spell index for spellchecker: default
   [junit4]   2> 1219997 INFO  (searcherExecutor-3366-thread-1) [    ] o.a.s.h.c.SpellCheckComponent Loading spell index for spellchecker: direct
   [junit4]   2> 1219997 INFO  (searcherExecutor-3366-thread-1) [    ] o.a.s.h.c.SpellCheckComponent Loading spell index for spellchecker: wordbreak
   [junit4]   2> 1219998 INFO  (searcherExecutor-3366-thread-1) [    ] o.a.s.h.c.SpellCheckComponent Loading spell index for spellchecker: multipleFields
   [junit4]   2> 1219998 INFO  (searcherExecutor-3366-thread-1) [    ] o.a.s.h.c.SpellCheckComponent Loading spell index for spellchecker: jarowinkler
   [junit4]   2> 1219998 INFO  (searcherExecutor-3366-thread-1) [    ] o.a.s.h.c.SpellCheckComponent Loading spell index for spellchecker: external
   [junit4]   2> 1219998 INFO  (TEST-SolrCoreTest.testRequestHandlerRegistry-seed#[1042F6400624135D]) [    ] o.a.s.SolrTestCaseJ4 ####initCore end
   [junit4]   2> 1219998 INFO  (searcherExecutor-3366-thread-1) [    ] o.a.s.h.c.SpellCheckComponent Loading spell index for spellchecker: freq
   [junit4]   2> 1219998 INFO  (TEST-SolrCoreTest.testRequestHandlerRegistry-seed#[1042F6400624135D]) [    ] o.a.s.SolrTestCaseJ4 ###deleteCore
   [junit4]   2> 1219998 INFO  (searcherExecutor-3366-thread-1) [    ] o.a.s.h.c.SpellCheckComponent Loading spell index for spellchecker: fqcn
   [junit4]   2> 1219998 INFO  (TEST-SolrCoreTest.testRequestHandlerRegistry-seed#[1042F6400624135D]) [    ] o.a.s.c.CoreContainer Shutting down CoreContainer instance=1992310130
   [junit4]   2> 1219999 INFO  (searcherExecutor-3366-thread-1) [    ] o.a.s.h.c.SpellCheckComponent Loading spell index for spellchecker: perDict
   [junit4]   2> 1219999 INFO  (coreCloseExecutor-3371-thread-1) [    ] o.a.s.c.SolrCore [collection1]  CLOSING SolrCore org.apache.solr.core.SolrCore@21fd915d
   [junit4]   2> 1219999 INFO  (coreCloseExecutor-3371-thread-1) [    ] o.a.s.u.DirectUpdateHandler2 closing DirectUpdateHandler2{commits=0,autocommits=0,soft autocommits=0,optimizes=0,rollbacks=0,expungeDeletes=0,docsPending=0,adds=0,deletesById=0,deletesByQuery=0,errors=0,cumulative_adds=0,cumulative_deletesById=0,cumulative_deletesByQuery=0,cumulative_errors=0,transaction_logs_total_size=0,transaction_logs_total_number=0}
   [junit4]   2> 1220000 INFO  (coreCloseExecutor-3371-thread-1) [    ] o.a.s.u.SolrCoreState Closing SolrCoreState
   [junit4]   2> 1220000 INFO  (coreCloseExecutor-3371-thread-1) [    ] o.a.s.u.DefaultSolrCoreState SolrCoreState ref count has reached 0 - closing IndexWriter
   [junit4]   2> 1220000 INFO  (coreCloseExecutor-3371-thread-1) [    ] o.a.s.u.DefaultSolrCoreState closing IndexWriter with IndexWriterCloser
   [junit4]   2> 1220000 INFO  (searcherExecutor-3366-thread-1) [    ] o.a.s.c.SolrCore [collection1] Registered new searcher Searcher@49bcd9f6[collection1] main{ExitableDirectoryReader(UninvertingDirectoryReader())}
   [junit4]   2> 1220000 INFO  (coreCloseExecutor-3371-thread-1) [    ] o.a.s.c.SolrCore [collection1] Closing main searcher on request.
   [junit4]   2> 1220008 INFO  (coreCloseExecutor-3371-thread-1) [    ] o.a.s.c.CachingDirectoryFactory Closing MockDirectoryFactory - 2 directories currently being tracked
   [junit4]   2> 1220008 INFO  (coreCloseExecutor-3371-thread-1) [    ] o.a.s.c.CachingDirectoryFactory looking to close /home/jenkins/workspace/Lucene-Solr-6.x-Linux/solr/build/solr-core/test/J1/temp/solr.core.SolrCoreTest_1042F6400624135D-001/init-core-data-001 [CachedDir<<refCount=0;path=/home/jenkins/workspace/Lucene-Solr-6.x-Linux/solr/build/solr-core/test/J1/temp/solr.core.SolrCoreTest_1042F6400624135D-001/init-core-data-001;done=false>>]
   [junit4]   2> 1220008 INFO  (coreCloseExecutor-3371-thread-1) [    ] o.a.s.c.CachingDirectoryFactory Closing directory, CoreContainer#isShutdown=true
   [junit4]   2> 1220008 INFO  (coreCloseExecutor-3371-thread-1) [    ] o.a.s.c.CachingDirectoryFactory Closing directory: /home/jenkins/workspace/Lucene-Solr-6.x-Linux/solr/build/solr-core/test/J1/temp/solr.core.SolrCoreTest_1042F6400624135D-001/init-core-data-001
   [junit4]   2> 1220008 INFO  (coreCloseExecutor-3371-thread-1) [    ] o.a.s.c.CachingDirectoryFactory looking to close /home/jenkins/workspace/Lucene-Solr-6.x-Linux/solr/build/solr-core/test/J1/temp/solr.core.SolrCoreTest_1042F6400624135D-001/init-core-data-001/index [CachedDir<<refCount=0;path=/home/jenkins/workspace/Lucene-Solr-6.x-Linux/solr/build/solr-core/test/J1/temp/solr.core.SolrCoreTest_1042F6400624135D-001/init-core-data-001/index;done=false>>]
   [junit4]   2> 1220008 INFO  (coreCloseExecutor-3371-thread-1) [    ] o.a.s.c.CachingDirectoryFactory Closing directory, CoreContainer#isShutdown=true
   [junit4]   2> 1220008 INFO  (coreCloseExecutor-3371-thread-1) [    ] o.a.s.c.CachingDirectoryFactory Closing directory: /home/jenkins/workspace/Lucene-Solr-6.x-Linux/solr/build/solr-core/test/J1/temp/solr.core.SolrCoreTest_1042F6400624135D-001/init-core-data-001/index
   [junit4]   2> 1220009 INFO  (TEST-SolrCoreTest.testRequestHandlerRegistry-seed#[1042F6400624135D]) [    ] o.a.s.SolrTestCaseJ4 ###Ending testRequestHandlerRegistry
   [junit4]   2> 1220011 INFO  (TEST-SolrCoreTest.testImplicitPlugins-seed#[1042F6400624135D]) [    ] o.a.s.SolrTestCaseJ4 ###Starting testImplicitPlugins
   [junit4]   2> 1220012 INFO  (TEST-SolrCoreTest.testImplicitPlugins-seed#[1042F6400624135D]) [    ] o.a.s.SolrTestCaseJ4 ####initCore
   [junit4]   2> 1220012 INFO  (TEST-SolrCoreTest.testImplicitPlugins-seed#[1042F6400624135D]) [    ] o.a.s.c.SolrResourceLoader new SolrResourceLoader for directory: '/home/jenkins/workspace/Lucene-Solr-6.x-Linux/solr/core/src/test-files/solr/collection1'
   [junit4]   2> 1220012 INFO  (TEST-SolrCoreTest.testImplicitPlugins-seed#[1042F6400624135D]) [    ] o.a.s.c.SolrResourceLoader JNDI not configured for solr (NoInitialContextEx)
   [junit4]   2> 1220012 INFO  (TEST-SolrCoreTest.testImplicitPlugins-seed#[1042F6400624135D]) [    ] o.a.s.c.SolrResourceLoader using system property solr.solr.home: /home/jenkins/workspace/Lucene-Solr-6.x-Linux/solr/core/src/test-files/solr
   [junit4]   2> 1220012 INFO  (TEST-SolrCoreTest.testImplicitPlugins-seed#[1042F6400624135D]) [    ] o.a.s.c.SolrResourceLoader Adding 'file:/home/jenkins/workspace/Lucene-Solr-6.x-Linux/solr/core/src/test-files/solr/collection1/lib/classes/' to classloader
   [junit4]   2> 1220012 INFO  (TEST-SolrCoreTest.testImplicitPlugins-seed#[1042F6400624135D]) [    ] o.a.s.c.SolrResourceLoader Adding 'file:/home/jenkins/workspace/Lucene-Solr-6.x-Linux/solr/core/src/test-files/solr/collection1/lib/README' to classloader
   [junit4]   2> 1220028 INFO  (TEST-SolrCoreTest.testImplicitPlugins-seed#[1042F6400624135D]) [    ] o.a.s.c.SolrConfig current version of requestparams : -1
   [junit4]   2> 1220035 INFO  (TEST-SolrCoreTest.testImplicitPlugins-seed#[1042F6400624135D]) [    ] o.a.s.c.SolrConfig Using Lucene MatchVersion: 6.1.0
   [junit4]   2> 1220048 INFO  (TEST-SolrCoreTest.testImplicitPlugins-seed#[1042F6400624135D]) [    ] o.a.s.c.SolrConfig Loaded SolrConfig: solrconfig.xml
   [junit4]   2> 1220052 INFO  (TEST-SolrCoreTest.testImplicitPlugins-seed#[1042F6400624135D]) [    ] o.a.s.s.IndexSchema [null] Schema name=test
   [junit4]   2> 1220176 INFO  (TEST-SolrCoreTest.testImplicitPlugins-seed#[1042F6400624135D]) [    ] o.a.s.s.OpenExchangeRatesOrgProvider Initialized with rates=open-exchange-rates.json, refreshInterval=1440.
   [junit4]   2> 1220182 INFO  (TEST-SolrCoreTest.testImplicitPlugins-seed#[1042F6400624135D]) [    ] o.a.s.s.IndexSchema default search field in schema is text
   [junit4]   2> 1220183 INFO  (TEST-SolrCoreTest.testImplicitPlugins-seed#[1042F6400624135D]) [    ] o.a.s.s.IndexSchema unique key field: id
   [junit4]   2> 1220187 INFO  (TEST-SolrCoreTest.testImplicitPlugins-seed#[1042F6400624135D]) [    ] o.a.s.s.FileExchangeRateProvider Reloading exchange rates from file currency.xml
   [junit4]   2> 1220189 INFO  (TEST-SolrCoreTest.testImplicitPlugins-seed#[1042F6400624135D]) [    ] o.a.s.s.FileExchangeRateProvider Reloading exchange rates from file currency.xml
   [junit4]   2> 1220190 INFO  (TEST-SolrCoreTest.testImplicitPlugins-seed#[1042F6400624135D]) [    ] o.a.s.s.OpenExchangeRatesOrgProvider Reloading exchange rates from open-exchange-rates.json
   [junit4]   2> 1220190 INFO  (TEST-SolrCoreTest.testImplicitPlugins-seed#[1042F6400624135D]) [    ] o.a.s.s.OpenExchangeRatesOrgProvider Reloading exchange rates from open-exchange-rates.json
   [junit4]   2> 1220190 INFO  (TEST-SolrCoreTest.testImplicitPlugins-seed#[1042F6400624135D]) [    ] o.a.s.c.SolrResourceLoader JNDI not configured for solr (NoInitialContextEx)
   [junit4

[...truncated too long message...]

randomizedtesting.SeedInfo.seed([1042F6400624135D:FD5C4D7A8D2912D9]:0)
   [junit4]    > 	at org.apache.solr.MinimalSchemaTest.testAllConfiguredHandlers(MinimalSchemaTest.java:130)
   [junit4]    > 	at jdk.internal.reflect.NativeMethodAccessorImpl.invoke0(java.base@9-ea/Native Method)
   [junit4]    > 	at jdk.internal.reflect.NativeMethodAccessorImpl.invoke(java.base@9-ea/NativeMethodAccessorImpl.java:62)
   [junit4]    > 	at jdk.internal.reflect.DelegatingMethodAccessorImpl.invoke(java.base@9-ea/DelegatingMethodAccessorImpl.java:43)
   [junit4]    > 	at java.lang.Thread.run(java.base@9-ea/Thread.java:804)
   [junit4]    > Caused by: java.lang.RuntimeException: Exception during query
   [junit4]    > 	at org.apache.solr.SolrTestCaseJ4.assertQ(SolrTestCaseJ4.java:786)
   [junit4]    > 	at org.apache.solr.MinimalSchemaTest.testAllConfiguredHandlers(MinimalSchemaTest.java:121)
   [junit4]    > 	... 39 more
   [junit4]    > Caused by: org.xml.sax.SAXParseException; lineNumber: 1; columnNumber: 1; Content is not allowed in prolog.
   [junit4]    > 	at com.sun.org.apache.xerces.internal.parsers.DOMParser.parse(java.xml@9-ea/DOMParser.java:256)
   [junit4]    > 	at com.sun.org.apache.xerces.internal.jaxp.DocumentBuilderImpl.parse(java.xml@9-ea/DocumentBuilderImpl.java:339)
   [junit4]    > 	at javax.xml.parsers.DocumentBuilder.parse(java.xml@9-ea/DocumentBuilder.java:122)
   [junit4]    > 	at org.apache.solr.util.BaseTestHarness.validateXPath(BaseTestHarness.java:84)
   [junit4]    > 	at org.apache.solr.SolrTestCaseJ4.assertQ(SolrTestCaseJ4.java:771)
   [junit4]    > 	... 40 more
   [junit4]   2> 1282323 INFO  (SUITE-MinimalSchemaTest-seed#[1042F6400624135D]-worker) [    ] o.a.s.SolrTestCaseJ4 ###deleteCore
   [junit4]   2> 1282323 INFO  (SUITE-MinimalSchemaTest-seed#[1042F6400624135D]-worker) [    ] o.a.s.c.CoreContainer Shutting down CoreContainer instance=18439449
   [junit4]   2> 1282323 INFO  (coreCloseExecutor-5128-thread-1) [    ] o.a.s.c.SolrCore [collection1]  CLOSING SolrCore org.apache.solr.core.SolrCore@3a343fa5
   [junit4]   2> 1282324 INFO  (coreCloseExecutor-5128-thread-1) [    ] o.a.s.u.DirectUpdateHandler2 closing DirectUpdateHandler2{commits=1,autocommits=0,soft autocommits=0,optimizes=1,rollbacks=0,expungeDeletes=0,docsPending=0,adds=0,deletesById=0,deletesByQuery=0,errors=0,cumulative_adds=2,cumulative_deletesById=0,cumulative_deletesByQuery=0,cumulative_errors=0,transaction_logs_total_size=132,transaction_logs_total_number=1}
   [junit4]   2> 1282324 INFO  (coreCloseExecutor-5128-thread-1) [    ] o.a.s.u.SolrCoreState Closing SolrCoreState
   [junit4]   2> 1282324 INFO  (coreCloseExecutor-5128-thread-1) [    ] o.a.s.u.DefaultSolrCoreState SolrCoreState ref count has reached 0 - closing IndexWriter
   [junit4]   2> 1282325 INFO  (coreCloseExecutor-5128-thread-1) [    ] o.a.s.u.DefaultSolrCoreState closing IndexWriter with IndexWriterCloser
   [junit4]   2> 1282325 INFO  (coreCloseExecutor-5128-thread-1) [    ] o.a.s.c.SolrCore [collection1] Closing main searcher on request.
   [junit4]   2> 1282332 INFO  (coreCloseExecutor-5128-thread-1) [    ] o.a.s.c.CachingDirectoryFactory Closing MockDirectoryFactory - 2 directories currently being tracked
   [junit4]   2> 1282332 INFO  (coreCloseExecutor-5128-thread-1) [    ] o.a.s.c.CachingDirectoryFactory looking to close /home/jenkins/workspace/Lucene-Solr-6.x-Linux/solr/build/solr-core/test/J2/temp/solr.MinimalSchemaTest_1042F6400624135D-001/init-core-data-001/index [CachedDir<<refCount=0;path=/home/jenkins/workspace/Lucene-Solr-6.x-Linux/solr/build/solr-core/test/J2/temp/solr.MinimalSchemaTest_1042F6400624135D-001/init-core-data-001/index;done=false>>]
   [junit4]   2> 1282332 INFO  (coreCloseExecutor-5128-thread-1) [    ] o.a.s.c.CachingDirectoryFactory Closing directory, CoreContainer#isShutdown=true
   [junit4]   2> 1282332 INFO  (coreCloseExecutor-5128-thread-1) [    ] o.a.s.c.CachingDirectoryFactory Closing directory: /home/jenkins/workspace/Lucene-Solr-6.x-Linux/solr/build/solr-core/test/J2/temp/solr.MinimalSchemaTest_1042F6400624135D-001/init-core-data-001/index
   [junit4]   2> 1282332 INFO  (coreCloseExecutor-5128-thread-1) [    ] o.a.s.c.CachingDirectoryFactory looking to close /home/jenkins/workspace/Lucene-Solr-6.x-Linux/solr/build/solr-core/test/J2/temp/solr.MinimalSchemaTest_1042F6400624135D-001/init-core-data-001 [CachedDir<<refCount=0;path=/home/jenkins/workspace/Lucene-Solr-6.x-Linux/solr/build/solr-core/test/J2/temp/solr.MinimalSchemaTest_1042F6400624135D-001/init-core-data-001;done=false>>]
   [junit4]   2> 1282332 INFO  (coreCloseExecutor-5128-thread-1) [    ] o.a.s.c.CachingDirectoryFactory Closing directory, CoreContainer#isShutdown=true
   [junit4]   2> 1282332 INFO  (coreCloseExecutor-5128-thread-1) [    ] o.a.s.c.CachingDirectoryFactory Closing directory: /home/jenkins/workspace/Lucene-Solr-6.x-Linux/solr/build/solr-core/test/J2/temp/solr.MinimalSchemaTest_1042F6400624135D-001/init-core-data-001
   [junit4]   2> NOTE: leaving temporary files on disk at: /home/jenkins/workspace/Lucene-Solr-6.x-Linux/solr/build/solr-core/test/J2/temp/solr.MinimalSchemaTest_1042F6400624135D-001
   [junit4]   2> NOTE: test params are: codec=Asserting(Lucene60): {subject=FSTOrd50, project=PostingsFormat(name=Direct), id=FST50}, docValues:{}, maxPointsInLeafNode=990, maxMBSortInHeap=5.266367916369596, sim=RandomSimilarity(queryNorm=true,coord=crazy): {}, locale=chr, timezone=PRC
   [junit4]   2> NOTE: Linux 4.4.0-21-generic amd64/Oracle Corporation 9-ea (64-bit)/cpus=12,threads=1,free=262662096,total=524812288
   [junit4]   2> NOTE: All tests run in this JVM: [ScriptEngineTest, StatelessScriptUpdateProcessorFactoryTest, TestHdfsUpdateLog, DirectSolrConnectionTest, OverseerTest, TestBlobHandler, TestMiniSolrCloudClusterSSL, TestConfigSets, StatsComponentTest, TestFilteredDocIdSet, TestDefaultSearchFieldResource, TestXIncludeConfig, TestElisionMultitermQuery, RuleEngineTest, TestJmxIntegration, TestExactSharedStatsCache, AssignTest, SolrTestCaseJ4Test, TestGeoJSONResponseWriter, DistributedQueryComponentCustomSortTest, TestCSVResponseWriter, TestSweetSpotSimilarityFactory, DocValuesMultiTest, TestRequestStatusCollectionAPI, DebugComponentTest, SecurityConfHandlerTest, ResponseHeaderTest, DeleteShardTest, TestRandomCollapseQParserPlugin, TestSimpleQParserPlugin, DistribDocExpirationUpdateProcessorTest, FieldMutatingUpdateProcessorTest, TestConfigSetsAPI, DocExpirationUpdateProcessorFactoryTest, BufferStoreTest, ZkStateReaderTest, SampleTest, SimpleCollectionCreateDeleteTest, DistributedExpandComponentTest, UnloadDistributedZkTest, TestReqParamsAPI, CoreAdminHandlerTest, PreAnalyzedUpdateProcessorTest, TestJettySolrRunner, CircularListTest, TestInfoStreamLogging, TestMinMaxOnMultiValuedField, SolrCoreCheckLockOnStartupTest, LeaderFailoverAfterPartitionTest, TriLevelCompositeIdRoutingTest, RollingRestartTest, TestAuthenticationFramework, TestCloudManagedSchema, TestInitQParser, TestAddFieldRealTimeGet, RecoveryZkTest, BigEndianAscendingWordDeserializerTest, TestExtendedDismaxParser, TestWriterPerf, CurrencyFieldXmlFileTest, TestManagedStopFilterFactory, TestPerFieldSimilarity, DirectUpdateHandlerTest, TestNonDefinedSimilarityFactory, CdcrRequestHandlerTest, TestFieldCollectionResource, HdfsWriteToMultipleCollectionsTest, TestScoreJoinQPScore, HighlighterMaxOffsetTest, TestConfigOverlay, HdfsThreadLeakTest, TestSolrDeletionPolicy1, TestPostingsSolrHighlighter, FullSolrCloudDistribCmdsTest, TestBulkSchemaAPI, TestSolrQueryParser, DateMathParserTest, TestHighFrequencyDictionaryFactory, DeleteInactiveReplicaTest, TermVectorComponentDistributedTest, BinaryUpdateRequestHandlerTest, TestSchemaManager, TestFastWriter, BasicDistributedZk2Test, HdfsRecoveryZkTest, CleanupOldIndexTest, EnumFieldTest, TestNoOpRegenerator, ClusterStateTest, ConnectionManagerTest, PluginInfoTest, BaseCdcrDistributedZkTest, DirectUpdateHandlerOptimizeTest, BasicZkTest, TestReplicationHandler, AutoCommitTest, TestRecovery, TestJoin, DistributedTermsComponentTest, TestSolr4Spatial, TestGroupingSearch, TestIndexSearcher, ShowFileRequestHandlerTest, CurrencyFieldOpenExchangeTest, SolrIndexSplitterTest, TestCoreDiscovery, SuggesterFSTTest, DocValuesTest, WordBreakSolrSpellCheckerTest, QueryEqualityTest, TestRemoteStreaming, IndexBasedSpellCheckerTest, TestQueryUtils, PrimitiveFieldTypeTest, FileBasedSpellCheckerTest, RequestHandlersTest, TestValueSourceCache, FieldAnalysisRequestHandlerTest, RegexBoostProcessorTest, TestCollationField, JSONWriterTest, QueryParsingTest, TestPHPSerializedResponseWriter, UpdateParamsTest, CopyFieldTest, TestDocSet, TestSearchPerf, MinimalSchemaTest]
   [junit4] Completed [382/595 (2!)] on J2 in 0.88s, 3 tests, 1 error <<< FAILURES!

[...truncated 734 lines...]
BUILD FAILED
/home/jenkins/workspace/Lucene-Solr-6.x-Linux/build.xml:740: The following error occurred while executing this line:
/home/jenkins/workspace/Lucene-Solr-6.x-Linux/build.xml:684: The following error occurred while executing this line:
/home/jenkins/workspace/Lucene-Solr-6.x-Linux/build.xml:59: The following error occurred while executing this line:
/home/jenkins/workspace/Lucene-Solr-6.x-Linux/solr/build.xml:233: The following error occurred while executing this line:
/home/jenkins/workspace/Lucene-Solr-6.x-Linux/solr/common-build.xml:529: The following error occurred while executing this line:
/home/jenkins/workspace/Lucene-Solr-6.x-Linux/lucene/common-build.xml:1457: The following error occurred while executing this line:
/home/jenkins/workspace/Lucene-Solr-6.x-Linux/lucene/common-build.xml:1014: There were test failures: 595 suites (10 ignored), 2404 tests, 1 error, 1 failure, 117 ignored (71 assumptions) [seed: 1042F6400624135D]

Total time: 61 minutes 55 seconds
Build step 'Invoke Ant' marked build as failure
Archiving artifacts
[WARNINGS] Skipping publisher since build result is FAILURE
Recording test results
Email was triggered for: Failure - Any
Sending email for trigger: Failure - Any



Mime
View raw message