lucene-dev mailing list archives

Site index · List index
Message view « Date » · « Thread »
Top « Date » · « Thread »
From Alan Woodward <a...@flax.co.uk>
Subject Re: [JENKINS] Lucene-Solr-master-Linux (64bit/jdk1.8.0_92) - Build # 16742 - Failure!
Date Sat, 14 May 2016 17:28:23 GMT
This is SOLR-8323 as well, looking into it.

Alan Woodward
www.flax.co.uk


On 14 May 2016, at 16:33, Policeman Jenkins Server wrote:

> Build: http://jenkins.thetaphi.de/job/Lucene-Solr-master-Linux/16742/
> Java: 64bit/jdk1.8.0_92 -XX:-UseCompressedOops -XX:+UseParallelGC
> 
> 3 tests failed.
> FAILED:  org.apache.solr.cloud.overseer.ZkStateReaderTest.testStateFormatUpdateWithExplicitRefresh
> 
> Error Message:
> 
> 
> Stack Trace:
> java.lang.NullPointerException
> 	at __randomizedtesting.SeedInfo.seed([61FC3022AB6A74EF:7E4641D57B0AB22A]:0)
> 	at org.apache.solr.common.cloud.ZkStateReader.refreshLegacyClusterState(ZkStateReader.java:522)
> 	at org.apache.solr.common.cloud.ZkStateReader.forceUpdateCollection(ZkStateReader.java:296)
> 	at org.apache.solr.cloud.overseer.ZkStateReaderTest.testStateFormatUpdate(ZkStateReaderTest.java:126)
> 	at org.apache.solr.cloud.overseer.ZkStateReaderTest.testStateFormatUpdateWithExplicitRefresh(ZkStateReaderTest.java:41)
> 	at sun.reflect.NativeMethodAccessorImpl.invoke0(Native Method)
> 	at sun.reflect.NativeMethodAccessorImpl.invoke(NativeMethodAccessorImpl.java:62)
> 	at sun.reflect.DelegatingMethodAccessorImpl.invoke(DelegatingMethodAccessorImpl.java:43)
> 	at java.lang.reflect.Method.invoke(Method.java:498)
> 	at com.carrotsearch.randomizedtesting.RandomizedRunner.invoke(RandomizedRunner.java:1764)
> 	at com.carrotsearch.randomizedtesting.RandomizedRunner$8.evaluate(RandomizedRunner.java:871)
> 	at com.carrotsearch.randomizedtesting.RandomizedRunner$9.evaluate(RandomizedRunner.java:907)
> 	at com.carrotsearch.randomizedtesting.RandomizedRunner$10.evaluate(RandomizedRunner.java:921)
> 	at com.carrotsearch.randomizedtesting.rules.SystemPropertiesRestoreRule$1.evaluate(SystemPropertiesRestoreRule.java:57)
> 	at org.apache.lucene.util.TestRuleSetupTeardownChained$1.evaluate(TestRuleSetupTeardownChained.java:49)
> 	at org.apache.lucene.util.AbstractBeforeAfterRule$1.evaluate(AbstractBeforeAfterRule.java:45)
> 	at org.apache.lucene.util.TestRuleThreadAndTestName$1.evaluate(TestRuleThreadAndTestName.java:48)
> 	at org.apache.lucene.util.TestRuleIgnoreAfterMaxFailures$1.evaluate(TestRuleIgnoreAfterMaxFailures.java:64)
> 	at org.apache.lucene.util.TestRuleMarkFailure$1.evaluate(TestRuleMarkFailure.java:47)
> 	at com.carrotsearch.randomizedtesting.rules.StatementAdapter.evaluate(StatementAdapter.java:36)
> 	at com.carrotsearch.randomizedtesting.ThreadLeakControl$StatementRunner.run(ThreadLeakControl.java:367)
> 	at com.carrotsearch.randomizedtesting.ThreadLeakControl.forkTimeoutingTask(ThreadLeakControl.java:809)
> 	at com.carrotsearch.randomizedtesting.ThreadLeakControl$3.evaluate(ThreadLeakControl.java:460)
> 	at com.carrotsearch.randomizedtesting.RandomizedRunner.runSingleTest(RandomizedRunner.java:880)
> 	at com.carrotsearch.randomizedtesting.RandomizedRunner$5.evaluate(RandomizedRunner.java:781)
> 	at com.carrotsearch.randomizedtesting.RandomizedRunner$6.evaluate(RandomizedRunner.java:816)
> 	at com.carrotsearch.randomizedtesting.RandomizedRunner$7.evaluate(RandomizedRunner.java:827)
> 	at com.carrotsearch.randomizedtesting.rules.StatementAdapter.evaluate(StatementAdapter.java:36)
> 	at com.carrotsearch.randomizedtesting.rules.SystemPropertiesRestoreRule$1.evaluate(SystemPropertiesRestoreRule.java:57)
> 	at org.apache.lucene.util.AbstractBeforeAfterRule$1.evaluate(AbstractBeforeAfterRule.java:45)
> 	at com.carrotsearch.randomizedtesting.rules.StatementAdapter.evaluate(StatementAdapter.java:36)
> 	at org.apache.lucene.util.TestRuleStoreClassName$1.evaluate(TestRuleStoreClassName.java:41)
> 	at com.carrotsearch.randomizedtesting.rules.NoShadowingOrOverridesOnMethodsRule$1.evaluate(NoShadowingOrOverridesOnMethodsRule.java:40)
> 	at com.carrotsearch.randomizedtesting.rules.NoShadowingOrOverridesOnMethodsRule$1.evaluate(NoShadowingOrOverridesOnMethodsRule.java:40)
> 	at com.carrotsearch.randomizedtesting.rules.StatementAdapter.evaluate(StatementAdapter.java:36)
> 	at com.carrotsearch.randomizedtesting.rules.StatementAdapter.evaluate(StatementAdapter.java:36)
> 	at com.carrotsearch.randomizedtesting.rules.StatementAdapter.evaluate(StatementAdapter.java:36)
> 	at org.apache.lucene.util.TestRuleAssertionsRequired$1.evaluate(TestRuleAssertionsRequired.java:53)
> 	at org.apache.lucene.util.TestRuleMarkFailure$1.evaluate(TestRuleMarkFailure.java:47)
> 	at org.apache.lucene.util.TestRuleIgnoreAfterMaxFailures$1.evaluate(TestRuleIgnoreAfterMaxFailures.java:64)
> 	at org.apache.lucene.util.TestRuleIgnoreTestSuites$1.evaluate(TestRuleIgnoreTestSuites.java:54)
> 	at com.carrotsearch.randomizedtesting.rules.StatementAdapter.evaluate(StatementAdapter.java:36)
> 	at com.carrotsearch.randomizedtesting.ThreadLeakControl$StatementRunner.run(ThreadLeakControl.java:367)
> 	at java.lang.Thread.run(Thread.java:745)
> 
> 
> FAILED:  org.apache.solr.cloud.overseer.ZkStateReaderTest.testStateFormatUpdateWithTimeDelay
> 
> Error Message:
> expected:<2> but was:<1>
> 
> Stack Trace:
> java.lang.AssertionError: expected:<2> but was:<1>
> 	at __randomizedtesting.SeedInfo.seed([61FC3022AB6A74EF:1E6287A7C2085965]:0)
> 	at org.junit.Assert.fail(Assert.java:93)
> 	at org.junit.Assert.failNotEquals(Assert.java:647)
> 	at org.junit.Assert.assertEquals(Assert.java:128)
> 	at org.junit.Assert.assertEquals(Assert.java:472)
> 	at org.junit.Assert.assertEquals(Assert.java:456)
> 	at org.apache.solr.cloud.overseer.ZkStateReaderTest.testStateFormatUpdate(ZkStateReaderTest.java:137)
> 	at org.apache.solr.cloud.overseer.ZkStateReaderTest.testStateFormatUpdateWithTimeDelay(ZkStateReaderTest.java:51)
> 	at sun.reflect.NativeMethodAccessorImpl.invoke0(Native Method)
> 	at sun.reflect.NativeMethodAccessorImpl.invoke(NativeMethodAccessorImpl.java:62)
> 	at sun.reflect.DelegatingMethodAccessorImpl.invoke(DelegatingMethodAccessorImpl.java:43)
> 	at java.lang.reflect.Method.invoke(Method.java:498)
> 	at com.carrotsearch.randomizedtesting.RandomizedRunner.invoke(RandomizedRunner.java:1764)
> 	at com.carrotsearch.randomizedtesting.RandomizedRunner$8.evaluate(RandomizedRunner.java:871)
> 	at com.carrotsearch.randomizedtesting.RandomizedRunner$9.evaluate(RandomizedRunner.java:907)
> 	at com.carrotsearch.randomizedtesting.RandomizedRunner$10.evaluate(RandomizedRunner.java:921)
> 	at com.carrotsearch.randomizedtesting.rules.SystemPropertiesRestoreRule$1.evaluate(SystemPropertiesRestoreRule.java:57)
> 	at org.apache.lucene.util.TestRuleSetupTeardownChained$1.evaluate(TestRuleSetupTeardownChained.java:49)
> 	at org.apache.lucene.util.AbstractBeforeAfterRule$1.evaluate(AbstractBeforeAfterRule.java:45)
> 	at org.apache.lucene.util.TestRuleThreadAndTestName$1.evaluate(TestRuleThreadAndTestName.java:48)
> 	at org.apache.lucene.util.TestRuleIgnoreAfterMaxFailures$1.evaluate(TestRuleIgnoreAfterMaxFailures.java:64)
> 	at org.apache.lucene.util.TestRuleMarkFailure$1.evaluate(TestRuleMarkFailure.java:47)
> 	at com.carrotsearch.randomizedtesting.rules.StatementAdapter.evaluate(StatementAdapter.java:36)
> 	at com.carrotsearch.randomizedtesting.ThreadLeakControl$StatementRunner.run(ThreadLeakControl.java:367)
> 	at com.carrotsearch.randomizedtesting.ThreadLeakControl.forkTimeoutingTask(ThreadLeakControl.java:809)
> 	at com.carrotsearch.randomizedtesting.ThreadLeakControl$3.evaluate(ThreadLeakControl.java:460)
> 	at com.carrotsearch.randomizedtesting.RandomizedRunner.runSingleTest(RandomizedRunner.java:880)
> 	at com.carrotsearch.randomizedtesting.RandomizedRunner$5.evaluate(RandomizedRunner.java:781)
> 	at com.carrotsearch.randomizedtesting.RandomizedRunner$6.evaluate(RandomizedRunner.java:816)
> 	at com.carrotsearch.randomizedtesting.RandomizedRunner$7.evaluate(RandomizedRunner.java:827)
> 	at com.carrotsearch.randomizedtesting.rules.StatementAdapter.evaluate(StatementAdapter.java:36)
> 	at com.carrotsearch.randomizedtesting.rules.SystemPropertiesRestoreRule$1.evaluate(SystemPropertiesRestoreRule.java:57)
> 	at org.apache.lucene.util.AbstractBeforeAfterRule$1.evaluate(AbstractBeforeAfterRule.java:45)
> 	at com.carrotsearch.randomizedtesting.rules.StatementAdapter.evaluate(StatementAdapter.java:36)
> 	at org.apache.lucene.util.TestRuleStoreClassName$1.evaluate(TestRuleStoreClassName.java:41)
> 	at com.carrotsearch.randomizedtesting.rules.NoShadowingOrOverridesOnMethodsRule$1.evaluate(NoShadowingOrOverridesOnMethodsRule.java:40)
> 	at com.carrotsearch.randomizedtesting.rules.NoShadowingOrOverridesOnMethodsRule$1.evaluate(NoShadowingOrOverridesOnMethodsRule.java:40)
> 	at com.carrotsearch.randomizedtesting.rules.StatementAdapter.evaluate(StatementAdapter.java:36)
> 	at com.carrotsearch.randomizedtesting.rules.StatementAdapter.evaluate(StatementAdapter.java:36)
> 	at com.carrotsearch.randomizedtesting.rules.StatementAdapter.evaluate(StatementAdapter.java:36)
> 	at org.apache.lucene.util.TestRuleAssertionsRequired$1.evaluate(TestRuleAssertionsRequired.java:53)
> 	at org.apache.lucene.util.TestRuleMarkFailure$1.evaluate(TestRuleMarkFailure.java:47)
> 	at org.apache.lucene.util.TestRuleIgnoreAfterMaxFailures$1.evaluate(TestRuleIgnoreAfterMaxFailures.java:64)
> 	at org.apache.lucene.util.TestRuleIgnoreTestSuites$1.evaluate(TestRuleIgnoreTestSuites.java:54)
> 	at com.carrotsearch.randomizedtesting.rules.StatementAdapter.evaluate(StatementAdapter.java:36)
> 	at com.carrotsearch.randomizedtesting.ThreadLeakControl$StatementRunner.run(ThreadLeakControl.java:367)
> 	at java.lang.Thread.run(Thread.java:745)
> 
> 
> FAILED:  org.apache.solr.schema.TestManagedSchemaAPI.test
> 
> Error Message:
> Error from server at http://127.0.0.1:34881/solr/testschemaapi_shard1_replica2: ERROR: [doc=2] unknown field 'myNewField1'
> 
> Stack Trace:
> org.apache.solr.client.solrj.impl.CloudSolrClient$RouteException: Error from server at http://127.0.0.1:34881/solr/testschemaapi_shard1_replica2: ERROR: [doc=2] unknown field 'myNewField1'
> 	at __randomizedtesting.SeedInfo.seed([61FC3022AB6A74EF:E9A80FF805961917]:0)
> 	at org.apache.solr.client.solrj.impl.CloudSolrClient.directUpdate(CloudSolrClient.java:697)
> 	at org.apache.solr.client.solrj.impl.CloudSolrClient.sendRequest(CloudSolrClient.java:1109)
> 	at org.apache.solr.client.solrj.impl.CloudSolrClient.requestWithRetryOnStaleState(CloudSolrClient.java:998)
> 	at org.apache.solr.client.solrj.impl.CloudSolrClient.request(CloudSolrClient.java:934)
> 	at org.apache.solr.schema.TestManagedSchemaAPI.testAddFieldAndDocument(TestManagedSchemaAPI.java:86)
> 	at org.apache.solr.schema.TestManagedSchemaAPI.test(TestManagedSchemaAPI.java:55)
> 	at sun.reflect.NativeMethodAccessorImpl.invoke0(Native Method)
> 	at sun.reflect.NativeMethodAccessorImpl.invoke(NativeMethodAccessorImpl.java:62)
> 	at sun.reflect.DelegatingMethodAccessorImpl.invoke(DelegatingMethodAccessorImpl.java:43)
> 	at java.lang.reflect.Method.invoke(Method.java:498)
> 	at com.carrotsearch.randomizedtesting.RandomizedRunner.invoke(RandomizedRunner.java:1764)
> 	at com.carrotsearch.randomizedtesting.RandomizedRunner$8.evaluate(RandomizedRunner.java:871)
> 	at com.carrotsearch.randomizedtesting.RandomizedRunner$9.evaluate(RandomizedRunner.java:907)
> 	at com.carrotsearch.randomizedtesting.RandomizedRunner$10.evaluate(RandomizedRunner.java:921)
> 	at com.carrotsearch.randomizedtesting.rules.SystemPropertiesRestoreRule$1.evaluate(SystemPropertiesRestoreRule.java:57)
> 	at org.apache.lucene.util.TestRuleSetupTeardownChained$1.evaluate(TestRuleSetupTeardownChained.java:49)
> 	at org.apache.lucene.util.AbstractBeforeAfterRule$1.evaluate(AbstractBeforeAfterRule.java:45)
> 	at org.apache.lucene.util.TestRuleThreadAndTestName$1.evaluate(TestRuleThreadAndTestName.java:48)
> 	at org.apache.lucene.util.TestRuleIgnoreAfterMaxFailures$1.evaluate(TestRuleIgnoreAfterMaxFailures.java:64)
> 	at org.apache.lucene.util.TestRuleMarkFailure$1.evaluate(TestRuleMarkFailure.java:47)
> 	at com.carrotsearch.randomizedtesting.rules.StatementAdapter.evaluate(StatementAdapter.java:36)
> 	at com.carrotsearch.randomizedtesting.ThreadLeakControl$StatementRunner.run(ThreadLeakControl.java:367)
> 	at com.carrotsearch.randomizedtesting.ThreadLeakControl.forkTimeoutingTask(ThreadLeakControl.java:809)
> 	at com.carrotsearch.randomizedtesting.ThreadLeakControl$3.evaluate(ThreadLeakControl.java:460)
> 	at com.carrotsearch.randomizedtesting.RandomizedRunner.runSingleTest(RandomizedRunner.java:880)
> 	at com.carrotsearch.randomizedtesting.RandomizedRunner$5.evaluate(RandomizedRunner.java:781)
> 	at com.carrotsearch.randomizedtesting.RandomizedRunner$6.evaluate(RandomizedRunner.java:816)
> 	at com.carrotsearch.randomizedtesting.RandomizedRunner$7.evaluate(RandomizedRunner.java:827)
> 	at com.carrotsearch.randomizedtesting.rules.StatementAdapter.evaluate(StatementAdapter.java:36)
> 	at com.carrotsearch.randomizedtesting.rules.SystemPropertiesRestoreRule$1.evaluate(SystemPropertiesRestoreRule.java:57)
> 	at org.apache.lucene.util.AbstractBeforeAfterRule$1.evaluate(AbstractBeforeAfterRule.java:45)
> 	at com.carrotsearch.randomizedtesting.rules.StatementAdapter.evaluate(StatementAdapter.java:36)
> 	at org.apache.lucene.util.TestRuleStoreClassName$1.evaluate(TestRuleStoreClassName.java:41)
> 	at com.carrotsearch.randomizedtesting.rules.NoShadowingOrOverridesOnMethodsRule$1.evaluate(NoShadowingOrOverridesOnMethodsRule.java:40)
> 	at com.carrotsearch.randomizedtesting.rules.NoShadowingOrOverridesOnMethodsRule$1.evaluate(NoShadowingOrOverridesOnMethodsRule.java:40)
> 	at com.carrotsearch.randomizedtesting.rules.StatementAdapter.evaluate(StatementAdapter.java:36)
> 	at com.carrotsearch.randomizedtesting.rules.StatementAdapter.evaluate(StatementAdapter.java:36)
> 	at com.carrotsearch.randomizedtesting.rules.StatementAdapter.evaluate(StatementAdapter.java:36)
> 	at org.apache.lucene.util.TestRuleAssertionsRequired$1.evaluate(TestRuleAssertionsRequired.java:53)
> 	at org.apache.lucene.util.TestRuleMarkFailure$1.evaluate(TestRuleMarkFailure.java:47)
> 	at org.apache.lucene.util.TestRuleIgnoreAfterMaxFailures$1.evaluate(TestRuleIgnoreAfterMaxFailures.java:64)
> 	at org.apache.lucene.util.TestRuleIgnoreTestSuites$1.evaluate(TestRuleIgnoreTestSuites.java:54)
> 	at com.carrotsearch.randomizedtesting.rules.StatementAdapter.evaluate(StatementAdapter.java:36)
> 	at com.carrotsearch.randomizedtesting.ThreadLeakControl$StatementRunner.run(ThreadLeakControl.java:367)
> 	at java.lang.Thread.run(Thread.java:745)
> Caused by: org.apache.solr.client.solrj.impl.HttpSolrClient$RemoteSolrException: Error from server at http://127.0.0.1:34881/solr/testschemaapi_shard1_replica2: ERROR: [doc=2] unknown field 'myNewField1'
> 	at org.apache.solr.client.solrj.impl.HttpSolrClient.executeMethod(HttpSolrClient.java:606)
> 	at org.apache.solr.client.solrj.impl.HttpSolrClient.request(HttpSolrClient.java:259)
> 	at org.apache.solr.client.solrj.impl.HttpSolrClient.request(HttpSolrClient.java:248)
> 	at org.apache.solr.client.solrj.impl.LBHttpSolrClient.doRequest(LBHttpSolrClient.java:413)
> 	at org.apache.solr.client.solrj.impl.LBHttpSolrClient.request(LBHttpSolrClient.java:366)
> 	at org.apache.solr.client.solrj.impl.CloudSolrClient.lambda$directUpdate$0(CloudSolrClient.java:674)
> 	at java.util.concurrent.FutureTask.run(FutureTask.java:266)
> 	at org.apache.solr.common.util.ExecutorUtil$MDCAwareThreadPoolExecutor.lambda$execute$0(ExecutorUtil.java:229)
> 	at java.util.concurrent.ThreadPoolExecutor.runWorker(ThreadPoolExecutor.java:1142)
> 	at java.util.concurrent.ThreadPoolExecutor$Worker.run(ThreadPoolExecutor.java:617)
> 	... 1 more
> 
> 
> 
> 
> Build Log:
> [...truncated 10950 lines...]
>   [junit4] Suite: org.apache.solr.schema.TestManagedSchemaAPI
>   [junit4]   2> Creating dataDir: /home/jenkins/workspace/Lucene-Solr-master-Linux/solr/build/solr-core/test/J1/temp/solr.schema.TestManagedSchemaAPI_61FC3022AB6A74EF-001/init-core-data-001
>   [junit4]   2> 363393 INFO  (SUITE-TestManagedSchemaAPI-seed#[61FC3022AB6A74EF]-worker) [    ] o.a.s.SolrTestCaseJ4 Randomized ssl (false) and clientAuth (false)
>   [junit4]   2> 363395 INFO  (SUITE-TestManagedSchemaAPI-seed#[61FC3022AB6A74EF]-worker) [    ] o.a.s.c.ZkTestServer STARTING ZK TEST SERVER
>   [junit4]   2> 363395 INFO  (Thread-953) [    ] o.a.s.c.ZkTestServer client port:0.0.0.0/0.0.0.0:0
>   [junit4]   2> 363395 INFO  (Thread-953) [    ] o.a.s.c.ZkTestServer Starting server
>   [junit4]   2> 363495 INFO  (SUITE-TestManagedSchemaAPI-seed#[61FC3022AB6A74EF]-worker) [    ] o.a.s.c.ZkTestServer start zk server on port:34798
>   [junit4]   2> 363495 INFO  (SUITE-TestManagedSchemaAPI-seed#[61FC3022AB6A74EF]-worker) [    ] o.a.s.c.c.SolrZkClient Using default ZkCredentialsProvider
>   [junit4]   2> 363495 INFO  (SUITE-TestManagedSchemaAPI-seed#[61FC3022AB6A74EF]-worker) [    ] o.a.s.c.c.ConnectionManager Waiting for client to connect to ZooKeeper
>   [junit4]   2> 363498 INFO  (zkCallback-378-thread-1) [    ] o.a.s.c.c.ConnectionManager Watcher org.apache.solr.common.cloud.ConnectionManager@75f279a5 name:ZooKeeperConnection Watcher:127.0.0.1:34798 got event WatchedEvent state:SyncConnected type:None path:null path:null type:None
>   [junit4]   2> 363498 INFO  (SUITE-TestManagedSchemaAPI-seed#[61FC3022AB6A74EF]-worker) [    ] o.a.s.c.c.ConnectionManager Client is connected to ZooKeeper
>   [junit4]   2> 363498 INFO  (SUITE-TestManagedSchemaAPI-seed#[61FC3022AB6A74EF]-worker) [    ] o.a.s.c.c.SolrZkClient Using default ZkACLProvider
>   [junit4]   2> 363498 INFO  (SUITE-TestManagedSchemaAPI-seed#[61FC3022AB6A74EF]-worker) [    ] o.a.s.c.c.SolrZkClient makePath: /solr/solr.xml
>   [junit4]   2> 363501 INFO  (jetty-launcher-377-thread-1) [    ] o.e.j.s.Server jetty-9.3.8.v20160314
>   [junit4]   2> 363502 INFO  (jetty-launcher-377-thread-1) [    ] o.e.j.s.h.ContextHandler Started o.e.j.s.ServletContextHandler@b1f405e{/solr,null,AVAILABLE}
>   [junit4]   2> 363503 INFO  (jetty-launcher-377-thread-2) [    ] o.e.j.s.Server jetty-9.3.8.v20160314
>   [junit4]   2> 363504 INFO  (jetty-launcher-377-thread-2) [    ] o.e.j.s.h.ContextHandler Started o.e.j.s.ServletContextHandler@323a5cab{/solr,null,AVAILABLE}
>   [junit4]   2> 363504 INFO  (jetty-launcher-377-thread-2) [    ] o.e.j.s.ServerConnector Started ServerConnector@42b260bc{HTTP/1.1,[http/1.1]}{127.0.0.1:34881}
>   [junit4]   2> 363504 INFO  (jetty-launcher-377-thread-2) [    ] o.e.j.s.Server Started @365247ms
>   [junit4]   2> 363504 INFO  (jetty-launcher-377-thread-2) [    ] o.a.s.c.s.e.JettySolrRunner Jetty properties: {hostContext=/solr, hostPort=34881}
>   [junit4]   2> 363505 INFO  (jetty-launcher-377-thread-2) [    ] o.a.s.s.SolrDispatchFilter SolrDispatchFilter.init(): sun.misc.Launcher$AppClassLoader@73d16e93
>   [junit4]   2> 363505 INFO  (jetty-launcher-377-thread-2) [    ] o.a.s.c.SolrResourceLoader new SolrResourceLoader for directory: '/home/jenkins/workspace/Lucene-Solr-master-Linux/solr/build/solr-core/test/J1/temp/solr.schema.TestManagedSchemaAPI_61FC3022AB6A74EF-001/tempDir-001/node2'
>   [junit4]   2> 363505 INFO  (jetty-launcher-377-thread-2) [    ] o.a.s.c.SolrResourceLoader JNDI not configured for solr (NoInitialContextEx)
>   [junit4]   2> 363505 INFO  (jetty-launcher-377-thread-2) [    ] o.a.s.c.SolrResourceLoader solr home defaulted to 'solr/' (could not find system property or JNDI)
>   [junit4]   2> 363505 INFO  (jetty-launcher-377-thread-2) [    ] o.a.s.c.c.SolrZkClient Using default ZkCredentialsProvider
>   [junit4]   2> 363505 INFO  (jetty-launcher-377-thread-1) [    ] o.e.j.s.ServerConnector Started ServerConnector@77da1602{HTTP/1.1,[http/1.1]}{127.0.0.1:38182}
>   [junit4]   2> 363505 INFO  (jetty-launcher-377-thread-1) [    ] o.e.j.s.Server Started @365248ms
>   [junit4]   2> 363505 INFO  (jetty-launcher-377-thread-1) [    ] o.a.s.c.s.e.JettySolrRunner Jetty properties: {hostContext=/solr, hostPort=38182}
>   [junit4]   2> 363505 INFO  (jetty-launcher-377-thread-1) [    ] o.a.s.s.SolrDispatchFilter SolrDispatchFilter.init(): sun.misc.Launcher$AppClassLoader@73d16e93
>   [junit4]   2> 363505 INFO  (jetty-launcher-377-thread-1) [    ] o.a.s.c.SolrResourceLoader new SolrResourceLoader for directory: '/home/jenkins/workspace/Lucene-Solr-master-Linux/solr/build/solr-core/test/J1/temp/solr.schema.TestManagedSchemaAPI_61FC3022AB6A74EF-001/tempDir-001/node1'
>   [junit4]   2> 363506 INFO  (jetty-launcher-377-thread-1) [    ] o.a.s.c.SolrResourceLoader JNDI not configured for solr (NoInitialContextEx)
>   [junit4]   2> 363506 INFO  (jetty-launcher-377-thread-1) [    ] o.a.s.c.SolrResourceLoader solr home defaulted to 'solr/' (could not find system property or JNDI)
>   [junit4]   2> 363506 INFO  (jetty-launcher-377-thread-1) [    ] o.a.s.c.c.SolrZkClient Using default ZkCredentialsProvider
>   [junit4]   2> 363506 INFO  (jetty-launcher-377-thread-1) [    ] o.a.s.c.c.ConnectionManager Waiting for client to connect to ZooKeeper
>   [junit4]   2> 363506 INFO  (jetty-launcher-377-thread-2) [    ] o.a.s.c.c.ConnectionManager Waiting for client to connect to ZooKeeper
>   [junit4]   2> 363508 INFO  (zkCallback-379-thread-1) [    ] o.a.s.c.c.ConnectionManager Watcher org.apache.solr.common.cloud.ConnectionManager@df974ac name:ZooKeeperConnection Watcher:127.0.0.1:34798/solr got event WatchedEvent state:SyncConnected type:None path:null path:null type:None
>   [junit4]   2> 363508 INFO  (jetty-launcher-377-thread-2) [    ] o.a.s.c.c.ConnectionManager Client is connected to ZooKeeper
>   [junit4]   2> 363508 INFO  (jetty-launcher-377-thread-2) [    ] o.a.s.c.c.SolrZkClient Using default ZkACLProvider
>   [junit4]   2> 363508 INFO  (zkCallback-380-thread-1) [    ] o.a.s.c.c.ConnectionManager Watcher org.apache.solr.common.cloud.ConnectionManager@3b34c5f8 name:ZooKeeperConnection Watcher:127.0.0.1:34798/solr got event WatchedEvent state:SyncConnected type:None path:null path:null type:None
>   [junit4]   2> 363508 INFO  (jetty-launcher-377-thread-1) [    ] o.a.s.c.c.ConnectionManager Client is connected to ZooKeeper
>   [junit4]   2> 363508 INFO  (jetty-launcher-377-thread-2) [    ] o.a.s.s.SolrDispatchFilter solr.xml found in ZooKeeper. Loading...
>   [junit4]   2> 363508 INFO  (jetty-launcher-377-thread-1) [    ] o.a.s.c.c.SolrZkClient Using default ZkACLProvider
>   [junit4]   2> 363509 INFO  (jetty-launcher-377-thread-1) [    ] o.a.s.s.SolrDispatchFilter solr.xml found in ZooKeeper. Loading...
>   [junit4]   2> 363516 INFO  (jetty-launcher-377-thread-1) [    ] o.a.s.c.CorePropertiesLocator Config-defined core root directory: /home/jenkins/workspace/Lucene-Solr-master-Linux/solr/build/solr-core/test/J1/temp/solr.schema.TestManagedSchemaAPI_61FC3022AB6A74EF-001/tempDir-001/node1/.
>   [junit4]   2> 363516 INFO  (jetty-launcher-377-thread-1) [    ] o.a.s.c.CoreContainer New CoreContainer 413381683
>   [junit4]   2> 363516 INFO  (jetty-launcher-377-thread-1) [    ] o.a.s.c.CoreContainer Loading cores into CoreContainer [instanceDir=/home/jenkins/workspace/Lucene-Solr-master-Linux/solr/build/solr-core/test/J1/temp/solr.schema.TestManagedSchemaAPI_61FC3022AB6A74EF-001/tempDir-001/node1]
>   [junit4]   2> 363517 WARN  (jetty-launcher-377-thread-1) [    ] o.a.s.c.CoreContainer Couldn't add files from /home/jenkins/workspace/Lucene-Solr-master-Linux/solr/build/solr-core/test/J1/temp/solr.schema.TestManagedSchemaAPI_61FC3022AB6A74EF-001/tempDir-001/node1/lib to classpath: /home/jenkins/workspace/Lucene-Solr-master-Linux/solr/build/solr-core/test/J1/temp/solr.schema.TestManagedSchemaAPI_61FC3022AB6A74EF-001/tempDir-001/node1/lib
>   [junit4]   2> 363517 INFO  (jetty-launcher-377-thread-1) [    ] o.a.s.h.c.HttpShardHandlerFactory created with socketTimeout : 90000,urlScheme : ,connTimeout : 15000,maxConnectionsPerHost : 20,maxConnections : 10000,corePoolSize : 0,maximumPoolSize : 2147483647,maxThreadIdleTime : 5,sizeOfQueue : -1,fairnessPolicy : false,
>   [junit4]   2> 363518 INFO  (jetty-launcher-377-thread-2) [    ] o.a.s.c.CorePropertiesLocator Config-defined core root directory: /home/jenkins/workspace/Lucene-Solr-master-Linux/solr/build/solr-core/test/J1/temp/solr.schema.TestManagedSchemaAPI_61FC3022AB6A74EF-001/tempDir-001/node2/.
>   [junit4]   2> 363518 INFO  (jetty-launcher-377-thread-2) [    ] o.a.s.c.CoreContainer New CoreContainer 1031623606
>   [junit4]   2> 363518 INFO  (jetty-launcher-377-thread-2) [    ] o.a.s.c.CoreContainer Loading cores into CoreContainer [instanceDir=/home/jenkins/workspace/Lucene-Solr-master-Linux/solr/build/solr-core/test/J1/temp/solr.schema.TestManagedSchemaAPI_61FC3022AB6A74EF-001/tempDir-001/node2]
>   [junit4]   2> 363518 WARN  (jetty-launcher-377-thread-2) [    ] o.a.s.c.CoreContainer Couldn't add files from /home/jenkins/workspace/Lucene-Solr-master-Linux/solr/build/solr-core/test/J1/temp/solr.schema.TestManagedSchemaAPI_61FC3022AB6A74EF-001/tempDir-001/node2/lib to classpath: /home/jenkins/workspace/Lucene-Solr-master-Linux/solr/build/solr-core/test/J1/temp/solr.schema.TestManagedSchemaAPI_61FC3022AB6A74EF-001/tempDir-001/node2/lib
>   [junit4]   2> 363518 INFO  (jetty-launcher-377-thread-2) [    ] o.a.s.h.c.HttpShardHandlerFactory created with socketTimeout : 90000,urlScheme : ,connTimeout : 15000,maxConnectionsPerHost : 20,maxConnections : 10000,corePoolSize : 0,maximumPoolSize : 2147483647,maxThreadIdleTime : 5,sizeOfQueue : -1,fairnessPolicy : false,
>   [junit4]   2> 363519 INFO  (jetty-launcher-377-thread-1) [    ] o.a.s.u.UpdateShardHandler Creating UpdateShardHandler HTTP client with params: 
>   [junit4]   2> 363519 INFO  (jetty-launcher-377-thread-2) [    ] o.a.s.u.UpdateShardHandler Creating UpdateShardHandler HTTP client with params: 
>   [junit4]   2> 363519 INFO  (jetty-launcher-377-thread-1) [    ] o.a.s.l.LogWatcher SLF4J impl is org.slf4j.impl.Log4jLoggerFactory
>   [junit4]   2> 363519 INFO  (jetty-launcher-377-thread-1) [    ] o.a.s.l.LogWatcher Registering Log Listener [Log4j (org.slf4j.impl.Log4jLoggerFactory)]
>   [junit4]   2> 363519 INFO  (jetty-launcher-377-thread-2) [    ] o.a.s.l.LogWatcher SLF4J impl is org.slf4j.impl.Log4jLoggerFactory
>   [junit4]   2> 363519 INFO  (jetty-launcher-377-thread-1) [    ] o.a.s.c.ZkContainer Zookeeper client=127.0.0.1:34798/solr
>   [junit4]   2> 363520 INFO  (jetty-launcher-377-thread-2) [    ] o.a.s.l.LogWatcher Registering Log Listener [Log4j (org.slf4j.impl.Log4jLoggerFactory)]
>   [junit4]   2> 363520 INFO  (jetty-launcher-377-thread-1) [    ] o.a.s.c.ZkController zkHost includes chroot
>   [junit4]   2> 363520 INFO  (jetty-launcher-377-thread-1) [    ] o.a.s.c.c.SolrZkClient Using default ZkCredentialsProvider
>   [junit4]   2> 363520 INFO  (jetty-launcher-377-thread-2) [    ] o.a.s.c.ZkContainer Zookeeper client=127.0.0.1:34798/solr
>   [junit4]   2> 363520 INFO  (jetty-launcher-377-thread-2) [    ] o.a.s.c.ZkController zkHost includes chroot
>   [junit4]   2> 363520 INFO  (jetty-launcher-377-thread-2) [    ] o.a.s.c.c.SolrZkClient Using default ZkCredentialsProvider
>   [junit4]   2> 363520 INFO  (jetty-launcher-377-thread-1) [    ] o.a.s.c.c.ConnectionManager Waiting for client to connect to ZooKeeper
>   [junit4]   2> 363521 INFO  (jetty-launcher-377-thread-2) [    ] o.a.s.c.c.ConnectionManager Waiting for client to connect to ZooKeeper
>   [junit4]   2> 363524 INFO  (zkCallback-386-thread-1) [    ] o.a.s.c.c.ConnectionManager Watcher org.apache.solr.common.cloud.ConnectionManager@3ef8a20b name:ZooKeeperConnection Watcher:127.0.0.1:34798 got event WatchedEvent state:SyncConnected type:None path:null path:null type:None
>   [junit4]   2> 363524 INFO  (jetty-launcher-377-thread-2) [    ] o.a.s.c.c.ConnectionManager Client is connected to ZooKeeper
>   [junit4]   2> 363525 INFO  (jetty-launcher-377-thread-2) [    ] o.a.s.c.c.SolrZkClient Using default ZkACLProvider
>   [junit4]   2> 363526 INFO  (zkCallback-385-thread-1) [    ] o.a.s.c.c.ConnectionManager Watcher org.apache.solr.common.cloud.ConnectionManager@afbef3e name:ZooKeeperConnection Watcher:127.0.0.1:34798 got event WatchedEvent state:SyncConnected type:None path:null path:null type:None
>   [junit4]   2> 363526 INFO  (jetty-launcher-377-thread-1) [    ] o.a.s.c.c.ConnectionManager Client is connected to ZooKeeper
>   [junit4]   2> 363531 INFO  (jetty-launcher-377-thread-1) [    ] o.a.s.c.c.SolrZkClient Using default ZkACLProvider
>   [junit4]   2> 363531 INFO  (jetty-launcher-377-thread-2) [n:127.0.0.1:34881_solr    ] o.a.s.c.ZkController Added new OnReconnect listener org.apache.solr.cloud.ZkController$$Lambda$58/2058029219@5368efa9
>   [junit4]   2> 363532 INFO  (jetty-launcher-377-thread-2) [n:127.0.0.1:34881_solr    ] o.a.s.c.c.ConnectionManager Waiting for client to connect to ZooKeeper
>   [junit4]   2> 363533 INFO  (jetty-launcher-377-thread-1) [n:127.0.0.1:38182_solr    ] o.a.s.c.ZkController Added new OnReconnect listener org.apache.solr.cloud.ZkController$$Lambda$58/2058029219@1ec66b3
>   [junit4]   2> 363544 INFO  (jetty-launcher-377-thread-1) [n:127.0.0.1:38182_solr    ] o.a.s.c.c.ConnectionManager Waiting for client to connect to ZooKeeper
>   [junit4]   2> 363544 INFO  (zkCallback-387-thread-1-processing-n:127.0.0.1:34881_solr) [n:127.0.0.1:34881_solr    ] o.a.s.c.c.ConnectionManager Watcher org.apache.solr.common.cloud.ConnectionManager@46e71668 name:ZooKeeperConnection Watcher:127.0.0.1:34798/solr got event WatchedEvent state:SyncConnected type:None path:null path:null type:None
>   [junit4]   2> 363544 INFO  (jetty-launcher-377-thread-2) [n:127.0.0.1:34881_solr    ] o.a.s.c.c.ConnectionManager Client is connected to ZooKeeper
>   [junit4]   2> 363557 INFO  (zkCallback-388-thread-1-processing-n:127.0.0.1:38182_solr) [n:127.0.0.1:38182_solr    ] o.a.s.c.c.ConnectionManager Watcher org.apache.solr.common.cloud.ConnectionManager@98c1f24 name:ZooKeeperConnection Watcher:127.0.0.1:34798/solr got event WatchedEvent state:SyncConnected type:None path:null path:null type:None
>   [junit4]   2> 363557 INFO  (jetty-launcher-377-thread-1) [n:127.0.0.1:38182_solr    ] o.a.s.c.c.ConnectionManager Client is connected to ZooKeeper
>   [junit4]   2> 363558 INFO  (jetty-launcher-377-thread-2) [n:127.0.0.1:34881_solr    ] o.a.s.c.c.SolrZkClient makePath: /overseer/queue
>   [junit4]   2> 363559 INFO  (jetty-launcher-377-thread-1) [n:127.0.0.1:38182_solr    ] o.a.s.c.c.SolrZkClient makePath: /overseer/queue
>   [junit4]   2> 363559 INFO  (jetty-launcher-377-thread-2) [n:127.0.0.1:34881_solr    ] o.a.s.c.c.SolrZkClient makePath: /overseer/collection-queue-work
>   [junit4]   2> 363559 INFO  (jetty-launcher-377-thread-1) [n:127.0.0.1:38182_solr    ] o.a.s.c.c.SolrZkClient makePath: /overseer/collection-queue-work
>   [junit4]   2> 363561 INFO  (jetty-launcher-377-thread-1) [n:127.0.0.1:38182_solr    ] o.a.s.c.c.SolrZkClient makePath: /overseer/collection-map-running
>   [junit4]   2> 363561 INFO  (jetty-launcher-377-thread-2) [n:127.0.0.1:34881_solr    ] o.a.s.c.c.SolrZkClient makePath: /overseer/collection-map-running
>   [junit4]   2> 363562 INFO  (jetty-launcher-377-thread-1) [n:127.0.0.1:38182_solr    ] o.a.s.c.c.SolrZkClient makePath: /overseer/collection-map-completed
>   [junit4]   2> 363563 INFO  (jetty-launcher-377-thread-1) [n:127.0.0.1:38182_solr    ] o.a.s.c.c.SolrZkClient makePath: /overseer/collection-map-failure
>   [junit4]   2> 363564 INFO  (jetty-launcher-377-thread-2) [n:127.0.0.1:34881_solr    ] o.a.s.c.c.SolrZkClient makePath: /overseer/collection-map-failure
>   [junit4]   2> 363564 INFO  (jetty-launcher-377-thread-1) [n:127.0.0.1:38182_solr    ] o.a.s.c.c.SolrZkClient makePath: /live_nodes
>   [junit4]   2> 363564 INFO  (jetty-launcher-377-thread-2) [n:127.0.0.1:34881_solr    ] o.a.s.c.c.SolrZkClient makePath: /live_nodes
>   [junit4]   2> 363565 INFO  (jetty-launcher-377-thread-1) [n:127.0.0.1:38182_solr    ] o.a.s.c.c.SolrZkClient makePath: /collections
>   [junit4]   2> 363565 INFO  (jetty-launcher-377-thread-2) [n:127.0.0.1:34881_solr    ] o.a.s.c.c.SolrZkClient makePath: /collections
>   [junit4]   2> 363565 INFO  (jetty-launcher-377-thread-1) [n:127.0.0.1:38182_solr    ] o.a.s.c.c.SolrZkClient makePath: /aliases.json
>   [junit4]   2> 363566 INFO  (jetty-launcher-377-thread-2) [n:127.0.0.1:34881_solr    ] o.a.s.c.c.SolrZkClient makePath: /aliases.json
>   [junit4]   2> 363566 INFO  (jetty-launcher-377-thread-2) [n:127.0.0.1:34881_solr    ] o.a.s.c.c.SolrZkClient makePath: /clusterstate.json
>   [junit4]   2> 363566 INFO  (jetty-launcher-377-thread-1) [n:127.0.0.1:38182_solr    ] o.a.s.c.c.SolrZkClient makePath: /clusterstate.json
>   [junit4]   2> 363567 INFO  (jetty-launcher-377-thread-1) [n:127.0.0.1:38182_solr    ] o.a.s.c.c.SolrZkClient makePath: /security.json
>   [junit4]   2> 363567 INFO  (jetty-launcher-377-thread-2) [n:127.0.0.1:34881_solr    ] o.a.s.c.c.SolrZkClient makePath: /security.json
>   [junit4]   2> 363567 INFO  (jetty-launcher-377-thread-2) [n:127.0.0.1:34881_solr    ] o.a.s.c.c.ZkStateReader Updating cluster state from ZooKeeper... 
>   [junit4]   2> 363567 INFO  (jetty-launcher-377-thread-1) [n:127.0.0.1:38182_solr    ] o.a.s.c.c.ZkStateReader Updating cluster state from ZooKeeper... 
>   [junit4]   2> 363567 INFO  (jetty-launcher-377-thread-2) [n:127.0.0.1:34881_solr    ] o.a.s.c.c.ZkStateReader Loaded empty cluster properties
>   [junit4]   2> 363568 INFO  (jetty-launcher-377-thread-1) [n:127.0.0.1:38182_solr    ] o.a.s.c.c.ZkStateReader Loaded empty cluster properties
>   [junit4]   2> 363568 INFO  (jetty-launcher-377-thread-2) [n:127.0.0.1:34881_solr    ] o.a.s.c.c.ZkStateReader Updated live nodes from ZooKeeper... (0) -> (0)
>   [junit4]   2> 363568 INFO  (jetty-launcher-377-thread-1) [n:127.0.0.1:38182_solr    ] o.a.s.c.c.ZkStateReader Updated live nodes from ZooKeeper... (0) -> (0)
>   [junit4]   2> 363569 INFO  (jetty-launcher-377-thread-2) [n:127.0.0.1:34881_solr    ] o.a.s.c.c.SolrZkClient makePath: /overseer_elect
>   [junit4]   2> 363571 INFO  (jetty-launcher-377-thread-2) [n:127.0.0.1:34881_solr    ] o.a.s.c.c.SolrZkClient makePath: /overseer_elect/election
>   [junit4]   2> 363577 INFO  (jetty-launcher-377-thread-1) [n:127.0.0.1:38182_solr    ] o.a.s.c.c.SolrZkClient makePath: /overseer_elect/election
>   [junit4]   2> 363578 INFO  (jetty-launcher-377-thread-2) [n:127.0.0.1:34881_solr    ] o.a.s.c.Overseer Overseer (id=null) closing
>   [junit4]   2> 363578 INFO  (jetty-launcher-377-thread-1) [n:127.0.0.1:38182_solr    ] o.a.s.c.Overseer Overseer (id=null) closing
>   [junit4]   2> 363579 INFO  (jetty-launcher-377-thread-1) [n:127.0.0.1:38182_solr    ] o.a.s.c.LeaderElector Joined leadership election with path: /overseer_elect/election/95894757949177862-127.0.0.1:38182_solr-n_0000000001
>   [junit4]   2> 363579 INFO  (jetty-launcher-377-thread-2) [n:127.0.0.1:34881_solr    ] o.a.s.c.LeaderElector Joined leadership election with path: /overseer_elect/election/95894757949177861-127.0.0.1:34881_solr-n_0000000000
>   [junit4]   2> 363582 INFO  (jetty-launcher-377-thread-1) [n:127.0.0.1:38182_solr    ] o.a.s.c.LeaderElector Watching path /overseer_elect/election/95894757949177861-127.0.0.1:34881_solr-n_0000000000 to know if I could be the leader
>   [junit4]   2> 363582 INFO  (jetty-launcher-377-thread-1) [n:127.0.0.1:38182_solr    ] o.a.s.c.ZkController Register node as live in ZooKeeper:/live_nodes/127.0.0.1:38182_solr
>   [junit4]   2> 363583 INFO  (jetty-launcher-377-thread-2) [n:127.0.0.1:34881_solr    ] o.a.s.c.OverseerElectionContext I am going to be the leader 127.0.0.1:34881_solr
>   [junit4]   2> 363583 INFO  (jetty-launcher-377-thread-2) [n:127.0.0.1:34881_solr    ] o.a.s.c.c.SolrZkClient makePath: /overseer_elect/leader
>   [junit4]   2> 363584 INFO  (jetty-launcher-377-thread-1) [n:127.0.0.1:38182_solr    ] o.a.s.c.c.SolrZkClient makePath: /live_nodes/127.0.0.1:38182_solr
>   [junit4]   2> 363584 INFO  (zkCallback-388-thread-1-processing-n:127.0.0.1:38182_solr) [n:127.0.0.1:38182_solr    ] o.a.s.c.c.ZkStateReader A live node change: [WatchedEvent state:SyncConnected type:NodeChildrenChanged path:/live_nodes], has occurred - updating... (live nodes size: [0])
>   [junit4]   2> 363588 INFO  (zkCallback-388-thread-1-processing-n:127.0.0.1:38182_solr) [n:127.0.0.1:38182_solr    ] o.a.s.c.c.ZkStateReader Updated live nodes from ZooKeeper... (0) -> (1)
>   [junit4]   2> 363589 INFO  (zkCallback-387-thread-1-processing-n:127.0.0.1:34881_solr) [n:127.0.0.1:34881_solr    ] o.a.s.c.c.ZkStateReader A live node change: [WatchedEvent state:SyncConnected type:NodeChildrenChanged path:/live_nodes], has occurred - updating... (live nodes size: [0])
>   [junit4]   2> 363589 INFO  (jetty-launcher-377-thread-2) [n:127.0.0.1:34881_solr    ] o.a.s.c.Overseer Overseer (id=95894757949177861-127.0.0.1:34881_solr-n_0000000000) starting
>   [junit4]   2> 363591 INFO  (zkCallback-387-thread-1-processing-n:127.0.0.1:34881_solr) [n:127.0.0.1:34881_solr    ] o.a.s.c.c.ZkStateReader Updated live nodes from ZooKeeper... (0) -> (1)
>   [junit4]   2> 363595 INFO  (jetty-launcher-377-thread-2) [n:127.0.0.1:34881_solr    ] o.a.s.c.c.SolrZkClient makePath: /overseer/queue-work
>   [junit4]   2> 363597 INFO  (jetty-launcher-377-thread-1) [n:127.0.0.1:38182_solr    ] o.a.s.c.CoreContainer Security conf doesn't exist. Skipping setup for authorization module.
>   [junit4]   2> 363597 INFO  (jetty-launcher-377-thread-1) [n:127.0.0.1:38182_solr    ] o.a.s.c.CoreContainer No authentication plugin used.
>   [junit4]   2> 363598 INFO  (jetty-launcher-377-thread-1) [n:127.0.0.1:38182_solr    ] o.a.s.c.CorePropertiesLocator Looking for core definitions underneath /home/jenkins/workspace/Lucene-Solr-master-Linux/solr/build/solr-core/test/J1/temp/solr.schema.TestManagedSchemaAPI_61FC3022AB6A74EF-001/tempDir-001/node1/.
>   [junit4]   2> 363598 INFO  (jetty-launcher-377-thread-1) [n:127.0.0.1:38182_solr    ] o.a.s.c.CorePropertiesLocator Found 0 core definitions
>   [junit4]   2> 363599 INFO  (jetty-launcher-377-thread-1) [n:127.0.0.1:38182_solr    ] o.a.s.s.SolrDispatchFilter user.dir=/home/jenkins/workspace/Lucene-Solr-master-Linux/solr/build/solr-core/test/J1
>   [junit4]   2> 363599 INFO  (jetty-launcher-377-thread-1) [n:127.0.0.1:38182_solr    ] o.a.s.s.SolrDispatchFilter SolrDispatchFilter.init() done
>   [junit4]   2> 363600 INFO  (jetty-launcher-377-thread-2) [n:127.0.0.1:34881_solr    ] o.a.s.c.OverseerAutoReplicaFailoverThread Starting OverseerAutoReplicaFailoverThread autoReplicaFailoverWorkLoopDelay=10000 autoReplicaFailoverWaitAfterExpiration=30000 autoReplicaFailoverBadNodeExpiration=60000
>   [junit4]   2> 363601 INFO  (OverseerCollectionConfigSetProcessor-95894757949177861-127.0.0.1:34881_solr-n_0000000000) [n:127.0.0.1:34881_solr    ] o.a.s.c.OverseerTaskProcessor Process current queue of overseer operations
>   [junit4]   2> 363601 INFO  (OverseerStateUpdate-95894757949177861-127.0.0.1:34881_solr-n_0000000000) [n:127.0.0.1:34881_solr    ] o.a.s.c.Overseer Starting to work on the main queue
>   [junit4]   2> 363601 INFO  (jetty-launcher-377-thread-2) [n:127.0.0.1:34881_solr    ] o.a.s.c.ZkController Publish node=127.0.0.1:34881_solr as DOWN
>   [junit4]   2> 363602 INFO  (OverseerStateUpdate-95894757949177861-127.0.0.1:34881_solr-n_0000000000) [n:127.0.0.1:34881_solr    ] o.a.s.c.c.ZkStateReader Updated live nodes from ZooKeeper... (1) -> (1)
>   [junit4]   2> 363602 INFO  (OverseerStateUpdate-95894757949177861-127.0.0.1:34881_solr-n_0000000000) [n:127.0.0.1:34881_solr    ] o.a.s.c.Overseer processMessage: queueSize: 1, message = {
>   [junit4]   2>   "operation":"downnode",
>   [junit4]   2>   "node_name":"127.0.0.1:34881_solr"} current state version: 0
>   [junit4]   2> 363602 INFO  (OverseerStateUpdate-95894757949177861-127.0.0.1:34881_solr-n_0000000000) [n:127.0.0.1:34881_solr    ] o.a.s.c.o.NodeMutator DownNode state invoked for node: 127.0.0.1:34881_solr
>   [junit4]   2> 364602 INFO  (jetty-launcher-377-thread-2) [n:127.0.0.1:34881_solr    ] o.a.s.c.ZkController Register node as live in ZooKeeper:/live_nodes/127.0.0.1:34881_solr
>   [junit4]   2> 364602 INFO  (jetty-launcher-377-thread-2) [n:127.0.0.1:34881_solr    ] o.a.s.c.c.SolrZkClient makePath: /live_nodes/127.0.0.1:34881_solr
>   [junit4]   2> 364603 INFO  (zkCallback-387-thread-1-processing-n:127.0.0.1:34881_solr) [n:127.0.0.1:34881_solr    ] o.a.s.c.c.ZkStateReader A live node change: [WatchedEvent state:SyncConnected type:NodeChildrenChanged path:/live_nodes], has occurred - updating... (live nodes size: [1])
>   [junit4]   2> 364603 INFO  (zkCallback-388-thread-1-processing-n:127.0.0.1:38182_solr) [n:127.0.0.1:38182_solr    ] o.a.s.c.c.ZkStateReader A live node change: [WatchedEvent state:SyncConnected type:NodeChildrenChanged path:/live_nodes], has occurred - updating... (live nodes size: [1])
>   [junit4]   2> 364603 INFO  (zkCallback-387-thread-1-processing-n:127.0.0.1:34881_solr) [n:127.0.0.1:34881_solr    ] o.a.s.c.c.ZkStateReader Updated live nodes from ZooKeeper... (1) -> (2)
>   [junit4]   2> 364603 INFO  (zkCallback-388-thread-1-processing-n:127.0.0.1:38182_solr) [n:127.0.0.1:38182_solr    ] o.a.s.c.c.ZkStateReader Updated live nodes from ZooKeeper... (1) -> (2)
>   [junit4]   2> 364613 INFO  (jetty-launcher-377-thread-2) [n:127.0.0.1:34881_solr    ] o.a.s.c.CoreContainer Security conf doesn't exist. Skipping setup for authorization module.
>   [junit4]   2> 364613 INFO  (jetty-launcher-377-thread-2) [n:127.0.0.1:34881_solr    ] o.a.s.c.CoreContainer No authentication plugin used.
>   [junit4]   2> 364613 INFO  (jetty-launcher-377-thread-2) [n:127.0.0.1:34881_solr    ] o.a.s.c.CorePropertiesLocator Looking for core definitions underneath /home/jenkins/workspace/Lucene-Solr-master-Linux/solr/build/solr-core/test/J1/temp/solr.schema.TestManagedSchemaAPI_61FC3022AB6A74EF-001/tempDir-001/node2/.
>   [junit4]   2> 364614 INFO  (jetty-launcher-377-thread-2) [n:127.0.0.1:34881_solr    ] o.a.s.c.CorePropertiesLocator Found 0 core definitions
>   [junit4]   2> 364614 INFO  (jetty-launcher-377-thread-2) [n:127.0.0.1:34881_solr    ] o.a.s.s.SolrDispatchFilter user.dir=/home/jenkins/workspace/Lucene-Solr-master-Linux/solr/build/solr-core/test/J1
>   [junit4]   2> 364614 INFO  (jetty-launcher-377-thread-2) [n:127.0.0.1:34881_solr    ] o.a.s.s.SolrDispatchFilter SolrDispatchFilter.init() done
>   [junit4]   2> 364614 INFO  (SUITE-TestManagedSchemaAPI-seed#[61FC3022AB6A74EF]-worker) [    ] o.a.s.c.c.SolrZkClient Using default ZkCredentialsProvider
>   [junit4]   2> 364615 INFO  (SUITE-TestManagedSchemaAPI-seed#[61FC3022AB6A74EF]-worker) [    ] o.a.s.c.c.ConnectionManager Waiting for client to connect to ZooKeeper
>   [junit4]   2> 364616 INFO  (zkCallback-391-thread-1) [    ] o.a.s.c.c.ConnectionManager Watcher org.apache.solr.common.cloud.ConnectionManager@49d010b name:ZooKeeperConnection Watcher:127.0.0.1:34798 got event WatchedEvent state:SyncConnected type:None path:null path:null type:None
>   [junit4]   2> 364616 INFO  (SUITE-TestManagedSchemaAPI-seed#[61FC3022AB6A74EF]-worker) [    ] o.a.s.c.c.ConnectionManager Client is connected to ZooKeeper
>   [junit4]   2> 364616 INFO  (SUITE-TestManagedSchemaAPI-seed#[61FC3022AB6A74EF]-worker) [    ] o.a.s.c.c.SolrZkClient Using default ZkACLProvider
>   [junit4]   2> 364617 INFO  (SUITE-TestManagedSchemaAPI-seed#[61FC3022AB6A74EF]-worker) [    ] o.a.s.c.s.i.CloudSolrClient Final constructed zkHost string: 127.0.0.1:34798/solr
>   [junit4]   2> 364618 INFO  (SUITE-TestManagedSchemaAPI-seed#[61FC3022AB6A74EF]-worker) [    ] o.a.s.c.c.SolrZkClient Using default ZkCredentialsProvider
>   [junit4]   2> 364618 INFO  (SUITE-TestManagedSchemaAPI-seed#[61FC3022AB6A74EF]-worker) [    ] o.a.s.c.c.ConnectionManager Waiting for client to connect to ZooKeeper
>   [junit4]   2> 364619 INFO  (zkCallback-394-thread-1) [    ] o.a.s.c.c.ConnectionManager Watcher org.apache.solr.common.cloud.ConnectionManager@6f2a27cf name:ZooKeeperConnection Watcher:127.0.0.1:34798/solr got event WatchedEvent state:SyncConnected type:None path:null path:null type:None
>   [junit4]   2> 364619 INFO  (SUITE-TestManagedSchemaAPI-seed#[61FC3022AB6A74EF]-worker) [    ] o.a.s.c.c.ConnectionManager Client is connected to ZooKeeper
>   [junit4]   2> 364619 INFO  (SUITE-TestManagedSchemaAPI-seed#[61FC3022AB6A74EF]-worker) [    ] o.a.s.c.c.SolrZkClient Using default ZkACLProvider
>   [junit4]   2> 364619 INFO  (SUITE-TestManagedSchemaAPI-seed#[61FC3022AB6A74EF]-worker) [    ] o.a.s.c.c.ZkStateReader Updating cluster state from ZooKeeper... 
>   [junit4]   2> 364619 INFO  (SUITE-TestManagedSchemaAPI-seed#[61FC3022AB6A74EF]-worker) [    ] o.a.s.c.c.ZkStateReader Loaded empty cluster properties
>   [junit4]   2> 364620 INFO  (SUITE-TestManagedSchemaAPI-seed#[61FC3022AB6A74EF]-worker) [    ] o.a.s.c.c.ZkStateReader Updated live nodes from ZooKeeper... (0) -> (2)
>   [junit4]   2> 364620 INFO  (SUITE-TestManagedSchemaAPI-seed#[61FC3022AB6A74EF]-worker) [    ] o.a.s.c.c.SolrZkClient makePath: /configs/conf1/solrconfig.xml
>   [junit4]   2> 364621 INFO  (SUITE-TestManagedSchemaAPI-seed#[61FC3022AB6A74EF]-worker) [    ] o.a.s.c.c.SolrZkClient makePath: /configs/conf1/managed-schema
>   [junit4]   2> 364632 INFO  (TEST-TestManagedSchemaAPI.test-seed#[61FC3022AB6A74EF]) [    ] o.a.s.SolrTestCaseJ4 ###Starting test
>   [junit4]   2> 364634 INFO  (qtp270975907-2566) [n:127.0.0.1:38182_solr    ] o.a.s.h.a.CollectionsHandler Invoked Collection Action :create with params replicationFactor=2&collection.configName=conf1&name=testschemaapi&action=CREATE&numShards=1&wt=javabin&version=2 and sendToOCPQueue=true
>   [junit4]   2> 364635 INFO  (OverseerCollectionConfigSetProcessor-95894757949177861-127.0.0.1:34881_solr-n_0000000000) [n:127.0.0.1:34881_solr    ] o.a.s.c.OverseerTaskProcessor Overseer Collection Message Handler: Get the message id:/overseer/collection-queue-work/qn-0000000000 message:{
>   [junit4]   2>   "name":"testschemaapi",
>   [junit4]   2>   "fromApi":"true",
>   [junit4]   2>   "replicationFactor":"2",
>   [junit4]   2>   "collection.configName":"conf1",
>   [junit4]   2>   "numShards":"1",
>   [junit4]   2>   "stateFormat":"2",
>   [junit4]   2>   "operation":"create"}
>   [junit4]   2> 364635 INFO  (OverseerThreadFactory-1384-thread-1-processing-n:127.0.0.1:34881_solr) [n:127.0.0.1:34881_solr    ] o.a.s.c.OverseerCollectionMessageHandler OverseerCollectionMessageHandler.processMessage : create , {
>   [junit4]   2>   "name":"testschemaapi",
>   [junit4]   2>   "fromApi":"true",
>   [junit4]   2>   "replicationFactor":"2",
>   [junit4]   2>   "collection.configName":"conf1",
>   [junit4]   2>   "numShards":"1",
>   [junit4]   2>   "stateFormat":"2",
>   [junit4]   2>   "operation":"create"}
>   [junit4]   2> 364635 INFO  (OverseerThreadFactory-1384-thread-1-processing-n:127.0.0.1:34881_solr) [n:127.0.0.1:34881_solr    ] o.a.s.c.OverseerCollectionMessageHandler Create collection testschemaapi
>   [junit4]   2> 364635 INFO  (OverseerThreadFactory-1384-thread-1-processing-n:127.0.0.1:34881_solr) [n:127.0.0.1:34881_solr    ] o.a.s.c.OverseerCollectionMessageHandler creating collections conf node /collections/testschemaapi 
>   [junit4]   2> 364636 INFO  (OverseerThreadFactory-1384-thread-1-processing-n:127.0.0.1:34881_solr) [n:127.0.0.1:34881_solr    ] o.a.s.c.c.SolrZkClient makePath: /collections/testschemaapi
>   [junit4]   2> 364636 INFO  (zkCallback-387-thread-1-processing-n:127.0.0.1:34881_solr) [n:127.0.0.1:34881_solr    ] o.a.s.c.c.ZkStateReader A collections change: [WatchedEvent state:SyncConnected type:NodeChildrenChanged path:/collections], has occurred - updating...
>   [junit4]   2> 364636 INFO  (zkCallback-394-thread-1) [    ] o.a.s.c.c.ZkStateReader A collections change: [WatchedEvent state:SyncConnected type:NodeChildrenChanged path:/collections], has occurred - updating...
>   [junit4]   2> 364636 INFO  (zkCallback-388-thread-1-processing-n:127.0.0.1:38182_solr) [n:127.0.0.1:38182_solr    ] o.a.s.c.c.ZkStateReader A collections change: [WatchedEvent state:SyncConnected type:NodeChildrenChanged path:/collections], has occurred - updating...
>   [junit4]   2> 364637 INFO  (OverseerStateUpdate-95894757949177861-127.0.0.1:34881_solr-n_0000000000) [n:127.0.0.1:34881_solr    ] o.a.s.c.Overseer processMessage: queueSize: 1, message = {
>   [junit4]   2>   "name":"testschemaapi",
>   [junit4]   2>   "fromApi":"true",
>   [junit4]   2>   "replicationFactor":"2",
>   [junit4]   2>   "collection.configName":"conf1",
>   [junit4]   2>   "numShards":"1",
>   [junit4]   2>   "stateFormat":"2",
>   [junit4]   2>   "operation":"create"} current state version: 0
>   [junit4]   2> 364637 INFO  (OverseerStateUpdate-95894757949177861-127.0.0.1:34881_solr-n_0000000000) [n:127.0.0.1:34881_solr    ] o.a.s.c.o.ClusterStateMutator building a new cName: testschemaapi
>   [junit4]   2> 364638 INFO  (OverseerStateUpdate-95894757949177861-127.0.0.1:34881_solr-n_0000000000) [n:127.0.0.1:34881_solr    ] o.a.s.c.o.ZkStateWriter going to create_collection /collections/testschemaapi/state.json
>   [junit4]   2> 364737 INFO  (OverseerThreadFactory-1384-thread-1-processing-n:127.0.0.1:34881_solr) [n:127.0.0.1:34881_solr    ] o.a.s.c.OverseerCollectionMessageHandler Creating SolrCores for new collection testschemaapi, shardNames [shard1] , replicationFactor : 2
>   [junit4]   2> 364737 INFO  (OverseerThreadFactory-1384-thread-1-processing-n:127.0.0.1:34881_solr) [n:127.0.0.1:34881_solr    ] o.a.s.c.OverseerCollectionMessageHandler Creating core testschemaapi_shard1_replica1 as part of shard shard1 of collection testschemaapi on 127.0.0.1:38182_solr
>   [junit4]   2> 364738 INFO  (OverseerThreadFactory-1384-thread-1-processing-n:127.0.0.1:34881_solr) [n:127.0.0.1:34881_solr    ] o.a.s.c.OverseerCollectionMessageHandler Creating core testschemaapi_shard1_replica2 as part of shard shard1 of collection testschemaapi on 127.0.0.1:34881_solr
>   [junit4]   2> 364739 INFO  (qtp270975907-2568) [n:127.0.0.1:38182_solr    ] o.a.s.h.a.CoreAdminOperation core create command qt=/admin/cores&collection.configName=conf1&name=testschemaapi_shard1_replica1&action=CREATE&numShards=1&collection=testschemaapi&shard=shard1&wt=javabin&version=2
>   [junit4]   2> 364740 INFO  (qtp270975907-2568) [n:127.0.0.1:38182_solr    ] o.a.s.c.CoreDescriptor Created CoreDescriptor: {name=testschemaapi_shard1_replica1, collection.configName=conf1, config=solrconfig.xml, transient=false, schema=schema.xml, loadOnStartup=true, configSetProperties=configsetprops.json, collection=testschemaapi, numShards=1, dataDir=data/, shard=shard1}
>   [junit4]   2> 364743 INFO  (qtp270975907-2568) [n:127.0.0.1:38182_solr c:testschemaapi s:shard1  x:testschemaapi_shard1_replica1] o.a.s.c.ZkController publishing state=down
>   [junit4]   2> 364743 INFO  (qtp1664628695-2574) [n:127.0.0.1:34881_solr    ] o.a.s.h.a.CoreAdminOperation core create command qt=/admin/cores&collection.configName=conf1&name=testschemaapi_shard1_replica2&action=CREATE&numShards=1&collection=testschemaapi&shard=shard1&wt=javabin&version=2
>   [junit4]   2> 364743 INFO  (qtp1664628695-2574) [n:127.0.0.1:34881_solr    ] o.a.s.c.CoreDescriptor Created CoreDescriptor: {name=testschemaapi_shard1_replica2, collection.configName=conf1, config=solrconfig.xml, transient=false, schema=schema.xml, loadOnStartup=true, configSetProperties=configsetprops.json, collection=testschemaapi, numShards=1, dataDir=data/, shard=shard1}
>   [junit4]   2> 364743 INFO  (qtp270975907-2568) [n:127.0.0.1:38182_solr c:testschemaapi s:shard1  x:testschemaapi_shard1_replica1] o.a.s.c.ZkController Registering watch for collection testschemaapi
>   [junit4]   2> 364744 INFO  (qtp1664628695-2574) [n:127.0.0.1:34881_solr c:testschemaapi s:shard1  x:testschemaapi_shard1_replica2] o.a.s.c.ZkController publishing state=down
>   [junit4]   2> 364744 INFO  (OverseerStateUpdate-95894757949177861-127.0.0.1:34881_solr-n_0000000000) [n:127.0.0.1:34881_solr    ] o.a.s.c.Overseer processMessage: queueSize: 1, message = {
>   [junit4]   2>   "core":"testschemaapi_shard1_replica1",
>   [junit4]   2>   "roles":null,
>   [junit4]   2>   "base_url":"http://127.0.0.1:38182/solr",
>   [junit4]   2>   "node_name":"127.0.0.1:38182_solr",
>   [junit4]   2>   "numShards":"1",
>   [junit4]   2>   "state":"down",
>   [junit4]   2>   "shard":"shard1",
>   [junit4]   2>   "collection":"testschemaapi",
>   [junit4]   2>   "operation":"state"} current state version: 0
>   [junit4]   2> 364744 INFO  (qtp270975907-2568) [n:127.0.0.1:38182_solr c:testschemaapi s:shard1  x:testschemaapi_shard1_replica1] o.a.s.c.c.ZkStateReader Add data for [testschemaapi] ver [0]
>   [junit4]   2> 364744 INFO  (OverseerStateUpdate-95894757949177861-127.0.0.1:34881_solr-n_0000000000) [n:127.0.0.1:34881_solr    ] o.a.s.c.o.ReplicaMutator Update state numShards=1 message={
>   [junit4]   2>   "core":"testschemaapi_shard1_replica1",
>   [junit4]   2>   "roles":null,
>   [junit4]   2>   "base_url":"http://127.0.0.1:38182/solr",
>   [junit4]   2>   "node_name":"127.0.0.1:38182_solr",
>   [junit4]   2>   "numShards":"1",
>   [junit4]   2>   "state":"down",
>   [junit4]   2>   "shard":"shard1",
>   [junit4]   2>   "collection":"testschemaapi",
>   [junit4]   2>   "operation":"state"}
>   [junit4]   2> 364744 INFO  (qtp270975907-2568) [n:127.0.0.1:38182_solr c:testschemaapi s:shard1  x:testschemaapi_shard1_replica1] o.a.s.c.ZkController look for our core node name
>   [junit4]   2> 364744 INFO  (qtp1664628695-2574) [n:127.0.0.1:34881_solr c:testschemaapi s:shard1  x:testschemaapi_shard1_replica2] o.a.s.c.ZkController Registering watch for collection testschemaapi
>   [junit4]   2> 364744 INFO  (qtp1664628695-2574) [n:127.0.0.1:34881_solr c:testschemaapi s:shard1  x:testschemaapi_shard1_replica2] o.a.s.c.c.ZkStateReader Add data for [testschemaapi] ver [0]
>   [junit4]   2> 364744 INFO  (qtp1664628695-2574) [n:127.0.0.1:34881_solr c:testschemaapi s:shard1  x:testschemaapi_shard1_replica2] o.a.s.c.ZkController look for our core node name
>   [junit4]   2> 364745 INFO  (OverseerStateUpdate-95894757949177861-127.0.0.1:34881_solr-n_0000000000) [n:127.0.0.1:34881_solr    ] o.a.s.c.Overseer processMessage: queueSize: 1, message = {
>   [junit4]   2>   "core":"testschemaapi_shard1_replica2",
>   [junit4]   2>   "roles":null,
>   [junit4]   2>   "base_url":"http://127.0.0.1:34881/solr",
>   [junit4]   2>   "node_name":"127.0.0.1:34881_solr",
>   [junit4]   2>   "numShards":"1",
>   [junit4]   2>   "state":"down",
>   [junit4]   2>   "shard":"shard1",
>   [junit4]   2>   "collection":"testschemaapi",
>   [junit4]   2>   "operation":"state"} current state version: 0
>   [junit4]   2> 364745 INFO  (OverseerStateUpdate-95894757949177861-127.0.0.1:34881_solr-n_0000000000) [n:127.0.0.1:34881_solr    ] o.a.s.c.o.ReplicaMutator Update state numShards=1 message={
>   [junit4]   2>   "core":"testschemaapi_shard1_replica2",
>   [junit4]   2>   "roles":null,
>   [junit4]   2>   "base_url":"http://127.0.0.1:34881/solr",
>   [junit4]   2>   "node_name":"127.0.0.1:34881_solr",
>   [junit4]   2>   "numShards":"1",
>   [junit4]   2>   "state":"down",
>   [junit4]   2>   "shard":"shard1",
>   [junit4]   2>   "collection":"testschemaapi",
>   [junit4]   2>   "operation":"state"}
>   [junit4]   2> 364846 INFO  (OverseerStateUpdate-95894757949177861-127.0.0.1:34881_solr-n_0000000000) [n:127.0.0.1:34881_solr    ] o.a.s.c.o.ZkStateWriter going to update_collection /collections/testschemaapi/state.json version: 0
>   [junit4]   2> 364847 INFO  (zkCallback-387-thread-1-processing-n:127.0.0.1:34881_solr) [n:127.0.0.1:34881_solr    ] o.a.s.c.c.ZkStateReader A cluster state change: [WatchedEvent state:SyncConnected type:NodeDataChanged path:/collections/testschemaapi/state.json] for collection [testschemaapi] has occurred - updating... (live nodes size: [2])
>   [junit4]   2> 364847 INFO  (zkCallback-388-thread-1-processing-n:127.0.0.1:38182_solr) [n:127.0.0.1:38182_solr    ] o.a.s.c.c.ZkStateReader A cluster state change: [WatchedEvent state:SyncConnected type:NodeDataChanged path:/collections/testschemaapi/state.json] for collection [testschemaapi] has occurred - updating... (live nodes size: [2])
>   [junit4]   2> 364847 INFO  (zkCallback-387-thread-1-processing-n:127.0.0.1:34881_solr) [n:127.0.0.1:34881_solr    ] o.a.s.c.c.ZkStateReader Updating data for [testschemaapi] from [0] to [1]
>   [junit4]   2> 364847 INFO  (zkCallback-388-thread-1-processing-n:127.0.0.1:38182_solr) [n:127.0.0.1:38182_solr    ] o.a.s.c.c.ZkStateReader Updating data for [testschemaapi] from [0] to [1]
>   [junit4]   2> 365744 INFO  (qtp270975907-2568) [n:127.0.0.1:38182_solr c:testschemaapi s:shard1  x:testschemaapi_shard1_replica1] o.a.s.c.ZkController waiting to find shard id in clusterstate for testschemaapi_shard1_replica1
>   [junit4]   2> 365744 INFO  (qtp270975907-2568) [n:127.0.0.1:38182_solr c:testschemaapi s:shard1  x:testschemaapi_shard1_replica1] o.a.s.c.ZkController Check for collection zkNode:testschemaapi
>   [junit4]   2> 365744 INFO  (qtp270975907-2568) [n:127.0.0.1:38182_solr c:testschemaapi s:shard1  x:testschemaapi_shard1_replica1] o.a.s.c.ZkController Collection zkNode exists
>   [junit4]   2> 365744 INFO  (qtp270975907-2568) [n:127.0.0.1:38182_solr c:testschemaapi s:shard1  x:testschemaapi_shard1_replica1] o.a.s.c.c.ZkStateReader Load collection config from: [/collections/testschemaapi]
>   [junit4]   2> 365744 INFO  (qtp1664628695-2574) [n:127.0.0.1:34881_solr c:testschemaapi s:shard1  x:testschemaapi_shard1_replica2] o.a.s.c.ZkController waiting to find shard id in clusterstate for testschemaapi_shard1_replica2
>   [junit4]   2> 365744 INFO  (qtp270975907-2568) [n:127.0.0.1:38182_solr c:testschemaapi s:shard1  x:testschemaapi_shard1_replica1] o.a.s.c.c.ZkStateReader path=[/collections/testschemaapi] [configName]=[conf1] specified config exists in ZooKeeper
>   [junit4]   2> 365744 INFO  (qtp1664628695-2574) [n:127.0.0.1:34881_solr c:testschemaapi s:shard1  x:testschemaapi_shard1_replica2] o.a.s.c.ZkController Check for collection zkNode:testschemaapi
>   [junit4]   2> 365744 INFO  (qtp270975907-2568) [n:127.0.0.1:38182_solr c:testschemaapi s:shard1  x:testschemaapi_shard1_replica1] o.a.s.c.SolrResourceLoader new SolrResourceLoader for directory: '/home/jenkins/workspace/Lucene-Solr-master-Linux/solr/build/solr-core/test/J1/temp/solr.schema.TestManagedSchemaAPI_61FC3022AB6A74EF-001/tempDir-001/node1/testschemaapi_shard1_replica1'
>   [junit4]   2> 365745 INFO  (qtp1664628695-2574) [n:127.0.0.1:34881_solr c:testschemaapi s:shard1  x:testschemaapi_shard1_replica2] o.a.s.c.ZkController Collection zkNode exists
>   [junit4]   2> 365745 INFO  (qtp1664628695-2574) [n:127.0.0.1:34881_solr c:testschemaapi s:shard1  x:testschemaapi_shard1_replica2] o.a.s.c.c.ZkStateReader Load collection config from: [/collections/testschemaapi]
>   [junit4]   2> 365745 INFO  (qtp270975907-2568) [n:127.0.0.1:38182_solr c:testschemaapi s:shard1  x:testschemaapi_shard1_replica1] o.a.s.c.SolrResourceLoader JNDI not configured for solr (NoInitialContextEx)
>   [junit4]   2> 365745 INFO  (qtp270975907-2568) [n:127.0.0.1:38182_solr c:testschemaapi s:shard1  x:testschemaapi_shard1_replica1] o.a.s.c.SolrResourceLoader solr home defaulted to 'solr/' (could not find system property or JNDI)
>   [junit4]   2> 365745 INFO  (qtp1664628695-2574) [n:127.0.0.1:34881_solr c:testschemaapi s:shard1  x:testschemaapi_shard1_replica2] o.a.s.c.c.ZkStateReader path=[/collections/testschemaapi] [configName]=[conf1] specified config exists in ZooKeeper
>   [junit4]   2> 365745 INFO  (qtp1664628695-2574) [n:127.0.0.1:34881_solr c:testschemaapi s:shard1  x:testschemaapi_shard1_replica2] o.a.s.c.SolrResourceLoader new SolrResourceLoader for directory: '/home/jenkins/workspace/Lucene-Solr-master-Linux/solr/build/solr-core/test/J1/temp/solr.schema.TestManagedSchemaAPI_61FC3022AB6A74EF-001/tempDir-001/node2/testschemaapi_shard1_replica2'
>   [junit4]   2> 365745 INFO  (qtp1664628695-2574) [n:127.0.0.1:34881_solr c:testschemaapi s:shard1  x:testschemaapi_shard1_replica2] o.a.s.c.SolrResourceLoader JNDI not configured for solr (NoInitialContextEx)
>   [junit4]   2> 365745 INFO  (qtp1664628695-2574) [n:127.0.0.1:34881_solr c:testschemaapi s:shard1  x:testschemaapi_shard1_replica2] o.a.s.c.SolrResourceLoader solr home defaulted to 'solr/' (could not find system property or JNDI)
>   [junit4]   2> 365746 INFO  (qtp270975907-2568) [n:127.0.0.1:38182_solr c:testschemaapi s:shard1  x:testschemaapi_shard1_replica1] o.a.s.c.Config loaded config solrconfig.xml with version 0 
>   [junit4]   2> 365746 INFO  (qtp1664628695-2574) [n:127.0.0.1:34881_solr c:testschemaapi s:shard1  x:testschemaapi_shard1_replica2] o.a.s.c.Config loaded config solrconfig.xml with version 0 
>   [junit4]   2> 365749 INFO  (qtp1664628695-2574) [n:127.0.0.1:34881_solr c:testschemaapi s:shard1  x:testschemaapi_shard1_replica2] o.a.s.c.SolrConfig current version of requestparams : -1
>   [junit4]   2> 365749 INFO  (qtp270975907-2568) [n:127.0.0.1:38182_solr c:testschemaapi s:shard1  x:testschemaapi_shard1_replica1] o.a.s.c.SolrConfig current version of requestparams : -1
>   [junit4]   2> 365751 INFO  (qtp1664628695-2574) [n:127.0.0.1:34881_solr c:testschemaapi s:shard1  x:testschemaapi_shard1_replica2] o.a.s.c.SolrConfig Using Lucene MatchVersion: 7.0.0
>   [junit4]   2> 365751 INFO  (qtp270975907-2568) [n:127.0.0.1:38182_solr c:testschemaapi s:shard1  x:testschemaapi_shard1_replica1] o.a.s.c.SolrConfig Using Lucene MatchVersion: 7.0.0
>   [junit4]   2> 365756 INFO  (qtp1664628695-2574) [n:127.0.0.1:34881_solr c:testschemaapi s:shard1  x:testschemaapi_shard1_replica2] o.a.s.c.SolrConfig Loaded SolrConfig: solrconfig.xml
>   [junit4]   2> 365756 INFO  (qtp270975907-2568) [n:127.0.0.1:38182_solr c:testschemaapi s:shard1  x:testschemaapi_shard1_replica1] o.a.s.c.SolrConfig Loaded SolrConfig: solrconfig.xml
>   [junit4]   2> 365758 INFO  (qtp1664628695-2574) [n:127.0.0.1:34881_solr c:testschemaapi s:shard1  x:testschemaapi_shard1_replica2] o.a.s.s.IndexSchema [testschemaapi_shard1_replica2] Schema name=minimal
>   [junit4]   2> 365758 INFO  (qtp270975907-2568) [n:127.0.0.1:38182_solr c:testschemaapi s:shard1  x:testschemaapi_shard1_replica1] o.a.s.s.IndexSchema [testschemaapi_shard1_replica1] Schema name=minimal
>   [junit4]   2> 365760 INFO  (qtp270975907-2568) [n:127.0.0.1:38182_solr c:testschemaapi s:shard1  x:testschemaapi_shard1_replica1] o.a.s.s.IndexSchema unique key field: id
>   [junit4]   2> 365760 INFO  (qtp1664628695-2574) [n:127.0.0.1:34881_solr c:testschemaapi s:shard1  x:testschemaapi_shard1_replica2] o.a.s.s.IndexSchema unique key field: id
>   [junit4]   2> 365761 INFO  (qtp270975907-2568) [n:127.0.0.1:38182_solr c:testschemaapi s:shard1  x:testschemaapi_shard1_replica1] o.a.s.c.ConfigSetProperties Did not find ConfigSet properties, assuming default properties: Can't find resource 'configsetprops.json' in classpath or '/configs/conf1', cwd=/home/jenkins/workspace/Lucene-Solr-master-Linux/solr/build/solr-core/test/J1
>   [junit4]   2> 365761 INFO  (qtp1664628695-2574) [n:127.0.0.1:34881_solr c:testschemaapi s:shard1  x:testschemaapi_shard1_replica2] o.a.s.c.ConfigSetProperties Did not find ConfigSet properties, assuming default properties: Can't find resource 'configsetprops.json' in classpath or '/configs/conf1', cwd=/home/jenkins/workspace/Lucene-Solr-master-Linux/solr/build/solr-core/test/J1
>   [junit4]   2> 365761 INFO  (qtp270975907-2568) [n:127.0.0.1:38182_solr c:testschemaapi s:shard1  x:testschemaapi_shard1_replica1] o.a.s.c.CoreContainer Creating SolrCore 'testschemaapi_shard1_replica1' using configuration from collection testschemaapi
>   [junit4]   2> 365761 INFO  (qtp1664628695-2574) [n:127.0.0.1:34881_solr c:testschemaapi s:shard1  x:testschemaapi_shard1_replica2] o.a.s.c.CoreContainer Creating SolrCore 'testschemaapi_shard1_replica2' using configuration from collection testschemaapi
>   [junit4]   2> 365761 INFO  (qtp1664628695-2574) [n:127.0.0.1:34881_solr c:testschemaapi s:shard1 r:core_node2 x:testschemaapi_shard1_replica2] o.a.s.c.SolrCore org.apache.solr.core.MockDirectoryFactory
>   [junit4]   2> 365761 INFO  (qtp270975907-2568) [n:127.0.0.1:38182_solr c:testschemaapi s:shard1 r:core_node1 x:testschemaapi_shard1_replica1] o.a.s.c.SolrCore org.apache.solr.core.MockDirectoryFactory
>   [junit4]   2> 365762 INFO  (qtp270975907-2568) [n:127.0.0.1:38182_solr c:testschemaapi s:shard1 r:core_node1 x:testschemaapi_shard1_replica1] o.a.s.c.SolrCore [[testschemaapi_shard1_replica1] ] Opening new SolrCore at [/home/jenkins/workspace/Lucene-Solr-master-Linux/solr/build/solr-core/test/J1/temp/solr.schema.TestManagedSchemaAPI_61FC3022AB6A74EF-001/tempDir-001/node1/testschemaapi_shard1_replica1], dataDir=[/home/jenkins/workspace/Lucene-Solr-master-Linux/solr/build/solr-core/test/J1/temp/solr.schema.TestManagedSchemaAPI_61FC3022AB6A74EF-001/tempDir-001/node1/./testschemaapi_shard1_replica1/data/]
>   [junit4]   2> 365762 INFO  (qtp1664628695-2574) [n:127.0.0.1:34881_solr c:testschemaapi s:shard1 r:core_node2 x:testschemaapi_shard1_replica2] o.a.s.c.SolrCore [[testschemaapi_shard1_replica2] ] Opening new SolrCore at [/home/jenkins/workspace/Lucene-Solr-master-Linux/solr/build/solr-core/test/J1/temp/solr.schema.TestManagedSchemaAPI_61FC3022AB6A74EF-001/tempDir-001/node2/testschemaapi_shard1_replica2], dataDir=[/home/jenkins/workspace/Lucene-Solr-master-Linux/solr/build/solr-core/test/J1/temp/solr.schema.TestManagedSchemaAPI_61FC3022AB6A74EF-001/tempDir-001/node2/./testschemaapi_shard1_replica2/data/]
>   [junit4]   2> 365762 INFO  (qtp270975907-2568) [n:127.0.0.1:38182_solr c:testschemaapi s:shard1 r:core_node1 x:testschemaapi_shard1_replica1] o.a.s.c.SolrCore JMX monitoring not detected for core: testschemaapi_shard1_replica1
>   [junit4]   2> 365762 INFO  (qtp1664628695-2574) [n:127.0.0.1:34881_solr c:testschemaapi s:shard1 r:core_node2 x:testschemaapi_shard1_replica2] o.a.s.c.SolrCore JMX monitoring not detected for core: testschemaapi_shard1_replica2
>   [junit4]   2> 365762 INFO  (qtp270975907-2568) [n:127.0.0.1:38182_solr c:testschemaapi s:shard1 r:core_node1 x:testschemaapi_shard1_replica1] o.a.s.c.CachingDirectoryFactory return new directory for /home/jenkins/workspace/Lucene-Solr-master-Linux/solr/build/solr-core/test/J1/temp/solr.schema.TestManagedSchemaAPI_61FC3022AB6A74EF-001/tempDir-001/node1/./testschemaapi_shard1_replica1/data
>   [junit4]   2> 365762 INFO  (qtp270975907-2568) [n:127.0.0.1:38182_solr c:testschemaapi s:shard1 r:core_node1 x:testschemaapi_shard1_replica1] o.a.s.c.SolrCore New index directory detected: old=null new=/home/jenkins/workspace/Lucene-Solr-master-Linux/solr/build/solr-core/test/J1/temp/solr.schema.TestManagedSchemaAPI_61FC3022AB6A74EF-001/tempDir-001/node1/./testschemaapi_shard1_replica1/data/index/
>   [junit4]   2> 365762 INFO  (qtp1664628695-2574) [n:127.0.0.1:34881_solr c:testschemaapi s:shard1 r:core_node2 x:testschemaapi_shard1_replica2] o.a.s.c.CachingDirectoryFactory return new directory for /home/jenkins/workspace/Lucene-Solr-master-Linux/solr/build/solr-core/test/J1/temp/solr.schema.TestManagedSchemaAPI_61FC3022AB6A74EF-001/tempDir-001/node2/./testschemaapi_shard1_replica2/data
>   [junit4]   2> 365762 WARN  (qtp270975907-2568) [n:127.0.0.1:38182_solr c:testschemaapi s:shard1 r:core_node1 x:testschemaapi_shard1_replica1] o.a.s.c.SolrCore [testschemaapi_shard1_replica1] Solr index directory '/home/jenkins/workspace/Lucene-Solr-master-Linux/solr/build/solr-core/test/J1/temp/solr.schema.TestManagedSchemaAPI_61FC3022AB6A74EF-001/tempDir-001/node1/./testschemaapi_shard1_replica1/data/index' doesn't exist. Creating new index...
>   [junit4]   2> 365762 INFO  (qtp1664628695-2574) [n:127.0.0.1:34881_solr c:testschemaapi s:shard1 r:core_node2 x:testschemaapi_shard1_replica2] o.a.s.c.SolrCore New index directory detected: old=null new=/home/jenkins/workspace/Lucene-Solr-master-Linux/solr/build/solr-core/test/J1/temp/solr.schema.TestManagedSchemaAPI_61FC3022AB6A74EF-001/tempDir-001/node2/./testschemaapi_shard1_replica2/data/index/
>   [junit4]   2> 365762 WARN  (qtp1664628695-2574) [n:127.0.0.1:34881_solr c:testschemaapi s:shard1 r:core_node2 x:testschemaapi_shard1_replica2] o.a.s.c.SolrCore [testschemaapi_shard1_replica2] Solr index directory '/home/jenkins/workspace/Lucene-Solr-master-Linux/solr/build/solr-core/test/J1/temp/solr.schema.TestManagedSchemaAPI_61FC3022AB6A74EF-001/tempDir-001/node2/./testschemaapi_shard1_replica2/data/index' doesn't exist. Creating new index...
>   [junit4]   2> 365763 INFO  (qtp270975907-2568) [n:127.0.0.1:38182_solr c:testschemaapi s:shard1 r:core_node1 x:testschemaapi_shard1_replica1] o.a.s.c.CachingDirectoryFactory return new directory for /home/jenkins/workspace/Lucene-Solr-master-Linux/solr/build/solr-core/test/J1/temp/solr.schema.TestManagedSchemaAPI_61FC3022AB6A74EF-001/tempDir-001/node1/./testschemaapi_shard1_replica1/data/index
>   [junit4]   2> 365763 INFO  (qtp1664628695-2574) [n:127.0.0.1:34881_solr c:testschemaapi s:shard1 r:core_node2 x:testschemaapi_shard1_replica2] o.a.s.c.CachingDirectoryFactory return new directory for /home/jenkins/workspace/Lucene-Solr-master-Linux/solr/build/solr-core/test/J1/temp/solr.schema.TestManagedSchemaAPI_61FC3022AB6A74EF-001/tempDir-001/node2/./testschemaapi_shard1_replica2/data/index
>   [junit4]   2> 365764 INFO  (qtp270975907-2568) [n:127.0.0.1:38182_solr c:testschemaapi s:shard1 r:core_node1 x:testschemaapi_shard1_replica1] o.a.s.c.SolrDeletionPolicy SolrDeletionPolicy.onCommit: commits: num=1
>   [junit4]   2> 	commit{dir=MockDirectoryWrapper(RAMDirectory@48853b70 lockFactory=org.apache.lucene.store.SingleInstanceLockFactory@976812),segFN=segments_1,generation=1}
>   [junit4]   2> 365764 INFO  (qtp1664628695-2574) [n:127.0.0.1:34881_solr c:testschemaapi s:shard1 r:core_node2 x:testschemaapi_shard1_replica2] o.a.s.c.SolrDeletionPolicy SolrDeletionPolicy.onCommit: commits: num=1
>   [junit4]   2> 	commit{dir=MockDirectoryWrapper(RAMDirectory@6d8edd3f lockFactory=org.apache.lucene.store.SingleInstanceLockFactory@3b43697c),segFN=segments_1,generation=1}
>   [junit4]   2> 365764 INFO  (qtp1664628695-2574) [n:127.0.0.1:34881_solr c:testschemaapi s:shard1 r:core_node2 x:testschemaapi_shard1_replica2] o.a.s.c.SolrDeletionPolicy newest commit generation = 1
>   [junit4]   2> 365764 INFO  (qtp270975907-2568) [n:127.0.0.1:38182_solr c:testschemaapi s:shard1 r:core_node1 x:testschemaapi_shard1_replica1] o.a.s.c.SolrDeletionPolicy newest commit generation = 1
>   [junit4]   2> 365764 INFO  (OldIndexDirectoryCleanupThreadForCore-testschemaapi_shard1_replica2) [n:127.0.0.1:34881_solr c:testschemaapi s:shard1 r:core_node2 x:testschemaapi_shard1_replica2] o.a.s.c.SolrCore Looking for old index directories to cleanup for core testschemaapi_shard1_replica2 in /home/jenkins/workspace/Lucene-Solr-master-Linux/solr/build/solr-core/test/J1/temp/solr.schema.TestManagedSchemaAPI_61FC3022AB6A74EF-001/tempDir-001/node2/./testschemaapi_shard1_replica2/data/
>   [junit4]   2> 365764 INFO  (OldIndexDirectoryCleanupThreadForCore-testschemaapi_shard1_replica1) [n:127.0.0.1:38182_solr c:testschemaapi s:shard1 r:core_node1 x:testschemaapi_shard1_replica1] o.a.s.c.SolrCore Looking for old index directories to cleanup for core testschemaapi_shard1_replica1 in /home/jenkins/workspace/Lucene-Solr-master-Linux/solr/build/solr-core/test/J1/temp/solr.schema.TestManagedSchemaAPI_61FC3022AB6A74EF-001/tempDir-001/node1/./testschemaapi_shard1_replica1/data/
>   [junit4]   2> 365764 WARN  (OldIndexDirectoryCleanupThreadForCore-testschemaapi_shard1_replica2) [n:127.0.0.1:34881_solr c:testschemaapi s:shard1 r:core_node2 x:testschemaapi_shard1_replica2] o.a.s.c.DirectoryFactory /home/jenkins/workspace/Lucene-Solr-master-Linux/solr/build/solr-core/test/J1/temp/solr.schema.TestManagedSchemaAPI_61FC3022AB6A74EF-001/tempDir-001/node2/./testschemaapi_shard1_replica2/data/ does not point to a valid data directory; skipping clean-up of old index directories.
>   [junit4]   2> 365764 WARN  (OldIndexDirectoryCleanupThreadForCore-testschemaapi_shard1_replica1) [n:127.0.0.1:38182_solr c:testschemaapi s:shard1 r:core_node1 x:testschemaapi_shard1_replica1] o.a.s.c.DirectoryFactory /home/jenkins/workspace/Lucene-Solr-master-Linux/solr/build/solr-core/test/J1/temp/solr.schema.TestManagedSchemaAPI_61FC3022AB6A74EF-001/tempDir-001/node1/./testschemaapi_shard1_replica1/data/ does not point to a valid data directory; skipping clean-up of old index directories.
>   [junit4]   2> 365765 INFO  (qtp270975907-2568) [n:127.0.0.1:38182_solr c:testschemaapi s:shard1 r:core_node1 x:testschemaapi_shard1_replica1] o.a.s.c.SolrCore no updateRequestProcessorChain defined as default, creating implicit default
>   [junit4]   2> 365765 INFO  (qtp1664628695-2574) [n:127.0.0.1:34881_solr c:testschemaapi s:shard1 r:core_node2 x:testschemaapi_shard1_replica2] o.a.s.c.SolrCore no updateRequestProcessorChain defined as default, creating implicit default
>   [junit4]   2> 365767 INFO  (qtp270975907-2568) [n:127.0.0.1:38182_solr c:testschemaapi s:shard1 r:core_node1 x:testschemaapi_shard1_replica1] o.a.s.h.l.XMLLoader xsltCacheLifetimeSeconds=60
>   [junit4]   2> 365767 INFO  (qtp1664628695-2574) [n:127.0.0.1:34881_solr c:testschemaapi s:shard1 r:core_node2 x:testschemaapi_shard1_replica2] o.a.s.h.l.XMLLoader xsltCacheLifetimeSeconds=60
>   [junit4]   2> 365767 INFO  (qtp270975907-2568) [n:127.0.0.1:38182_solr c:testschemaapi s:shard1 r:core_node1 x:testschemaapi_shard1_replica1] o.a.s.h.l.XMLLoader xsltCacheLifetimeSeconds=60
>   [junit4]   2> 365767 INFO  (qtp1664628695-2574) [n:127.0.0.1:34881_solr c:testschemaapi s:shard1 r:core_node2 x:testschemaapi_shard1_replica2] o.a.s.h.l.XMLLoader xsltCacheLifetimeSeconds=60
>   [junit4]   2> 365768 INFO  (qtp270975907-2568) [n:127.0.0.1:38182_solr c:testschemaapi s:shard1 r:core_node1 x:testschemaapi_shard1_replica1] o.a.s.h.l.XMLLoader xsltCacheLifetimeSeconds=60
>   [junit4]   2> 365768 INFO  (qtp1664628695-2574) [n:127.0.0.1:34881_solr c:testschemaapi s:shard1 r:core_node2 x:testschemaapi_shard1_replica2] o.a.s.h.l.XMLLoader xsltCacheLifetimeSeconds=60
>   [junit4]   2> 365768 INFO  (qtp270975907-2568) [n:127.0.0.1:38182_solr c:testschemaapi s:shard1 r:core_node1 x:testschemaapi_shard1_replica1] o.a.s.h.l.XMLLoader xsltCacheLifetimeSeconds=60
>   [junit4]   2> 365768 INFO  (qtp1664628695-2574) [n:127.0.0.1:34881_solr c:testschemaapi s:shard1 r:core_node2 x:testschemaapi_shard1_replica2] o.a.s.h.l.XMLLoader xsltCacheLifetimeSeconds=60
>   [junit4]   2> 365769 INFO  (qtp270975907-2568) [n:127.0.0.1:38182_solr c:testschemaapi s:shard1 r:core_node1 x:testschemaapi_shard1_replica1] o.a.s.c.RequestHandlers Registered paths: /admin/mbeans,/update/csv,/sql,/update/json/docs,/admin/luke,/graph,/export,/select,/admin/segments,/get,/admin/system,/replication,/admin/properties,/config,/stream,/schema,/admin/plugins,/admin/logging,/update/json,/admin/ping,/admin/threads,/update,/admin/file
>   [junit4]   2> 365769 INFO  (qtp270975907-2568) [n:127.0.0.1:38182_solr c:testschemaapi s:shard1 r:core_node1 x:testschemaapi_shard1_replica1] o.a.s.c.SolrCore Using default statsCache cache: org.apache.solr.search.stats.LocalStatsCache
>   [junit4]   2> 365769 INFO  (qtp1664628695-2574) [n:127.0.0.1:34881_solr c:testschemaapi s:shard1 r:core_node2 x:testschemaapi_shard1_replica2] o.a.s.c.RequestHandlers Registered paths: /admin/mbeans,/update/csv,/sql,/update/json/docs,/admin/luke,/graph,/export,/select,/admin/segments,/get,/admin/system,/replication,/admin/properties,/config,/stream,/schema,/admin/plugins,/admin/logging,/update/json,/admin/ping,/admin/threads,/update,/admin/file
>   [junit4]   2> 365769 INFO  (qtp1664628695-2574) [n:127.0.0.1:34881_solr c:testschemaapi s:shard1 r:core_node2 x:testschemaapi_shard1_replica2] o.a.s.c.SolrCore Using default statsCache cache: org.apache.solr.search.stats.LocalStatsCache
>   [junit4]   2> 365769 INFO  (qtp270975907-2568) [n:127.0.0.1:38182_solr c:testschemaapi s:shard1 r:core_node1 x:testschemaapi_shard1_replica1] o.a.s.u.UpdateHandler Using UpdateLog implementation: org.apache.solr.update.UpdateLog
>   [junit4]   2> 365769 INFO  (qtp270975907-2568) [n:127.0.0.1:38182_solr c:testschemaapi s:shard1 r:core_node1 x:testschemaapi_shard1_replica1] o.a.s.u.UpdateLog Initializing UpdateLog: dataDir=null defaultSyncLevel=FLUSH numRecordsToKeep=100 maxNumLogsToKeep=10 numVersionBuckets=65536
>   [junit4]   2> 365769 INFO  (qtp1664628695-2574) [n:127.0.0.1:34881_solr c:testschemaapi s:shard1 r:core_node2 x:testschemaapi_shard1_replica2] o.a.s.u.UpdateHandler Using UpdateLog implementation: org.apache.solr.update.UpdateLog
>   [junit4]   2> 365770 INFO  (qtp1664628695-2574) [n:127.0.0.1:34881_solr c:testschemaapi s:shard1 r:core_node2 x:testschemaapi_shard1_replica2] o.a.s.u.UpdateLog Initializing UpdateLog: dataDir=null defaultSyncLevel=FLUSH numRecordsToKeep=100 maxNumLogsToKeep=10 numVersionBuckets=65536
>   [junit4]   2> 365770 INFO  (qtp270975907-2568) [n:127.0.0.1:38182_solr c:testschemaapi s:shard1 r:core_node1 x:testschemaapi_shard1_replica1] o.a.s.u.CommitTracker Hard AutoCommit: disabled
>   [junit4]   2> 365770 INFO  (qtp270975907-2568) [n:127.0.0.1:38182_solr c:testschemaapi s:shard1 r:core_node1 x:testschemaapi_shard1_replica1] o.a.s.u.CommitTracker Soft AutoCommit: disabled
>   [junit4]   2> 365770 INFO  (qtp1664628695-2574) [n:127.0.0.1:34881_solr c:testschemaapi s:shard1 r:core_node2 x:testschemaapi_shard1_replica2] o.a.s.u.CommitTracker Hard AutoCommit: disabled
>   [junit4]   2> 365770 INFO  (qtp270975907-2568) [n:127.0.0.1:38182_solr c:testschemaapi s:shard1 r:core_node1 x:testschemaapi_shard1_replica1] o.a.s.c.SolrDeletionPolicy SolrDeletionPolicy.onInit: commits: num=1
>   [junit4]   2> 	commit{dir=MockDirectoryWrapper(RAMDirectory@48853b70 lockFactory=org.apache.lucene.store.SingleInstanceLockFactory@976812),segFN=segments_1,generation=1}
>   [junit4]   2> 365770 INFO  (qtp270975907-2568) [n:127.0.0.1:38182_solr c:testschemaapi s:shard1 r:core_node1 x:testschemaapi_shard1_replica1] o.a.s.c.SolrDeletionPolicy newest commit generation = 1
>   [junit4]   2> 365770 INFO  (qtp1664628695-2574) [n:127.0.0.1:34881_solr c:testschemaapi s:shard1 r:core_node2 x:testschemaapi_shard1_replica2] o.a.s.u.CommitTracker Soft AutoCommit: disabled
>   [junit4]   2> 365770 INFO  (qtp270975907-2568) [n:127.0.0.1:38182_solr c:testschemaapi s:shard1 r:core_node1 x:testschemaapi_shard1_replica1] o.a.s.s.SolrIndexSearcher Opening [Searcher@354a36b7[testschemaapi_shard1_replica1] main]
>   [junit4]   2> 365771 INFO  (qtp270975907-2568) [n:127.0.0.1:38182_solr c:testschemaapi s:shard1 r:core_node1 x:testschemaapi_shard1_replica1] o.a.s.c.c.ZkStateReader Load collection config from: [/collections/testschemaapi]
>   [junit4]   2> 365771 INFO  (qtp1664628695-2574) [n:127.0.0.1:34881_solr c:testschemaapi s:shard1 r:core_node2 x:testschemaapi_shard1_replica2] o.a.s.c.SolrDeletionPolicy SolrDeletionPolicy.onInit: commits: num=1
>   [junit4]   2> 	commit{dir=MockDirectoryWrapper(RAMDirectory@6d8edd3f lockFactory=org.apache.lucene.store.SingleInstanceLockFactory@3b43697c),segFN=segments_1,generation=1}
>   [junit4]   2> 365771 INFO  (qtp1664628695-2574) [n:127.0.0.1:34881_solr c:testschemaapi s:shard1 r:core_node2 x:testschemaapi_shard1_replica2] o.a.s.c.SolrDeletionPolicy newest commit generation = 1
>   [junit4]   2> 365771 INFO  (qtp1664628695-2574) [n:127.0.0.1:34881_solr c:testschemaapi s:shard1 r:core_node2 x:testschemaapi_shard1_replica2] o.a.s.s.SolrIndexSearcher Opening [Searcher@395865df[testschemaapi_shard1_replica2] main]
>   [junit4]   2> 365771 INFO  (qtp270975907-2568) [n:127.0.0.1:38182_solr c:testschemaapi s:shard1 r:core_node1 x:testschemaapi_shard1_replica1] o.a.s.c.c.ZkStateReader path=[/collections/testschemaapi] [configName]=[conf1] specified config exists in ZooKeeper
>   [junit4]   2> 365771 INFO  (qtp1664628695-2574) [n:127.0.0.1:34881_solr c:testschemaapi s:shard1 r:core_node2 x:testschemaapi_shard1_replica2] o.a.s.c.c.ZkStateReader Load collection config from: [/collections/testschemaapi]
>   [junit4]   2> 365771 INFO  (qtp270975907-2568) [n:127.0.0.1:38182_solr c:testschemaapi s:shard1 r:core_node1 x:testschemaapi_shard1_replica1] o.a.s.r.ManagedResourceStorage Setting up ZooKeeper-based storage for the RestManager with znodeBase: /configs/conf1
>   [junit4]   2> 365771 INFO  (qtp270975907-2568) [n:127.0.0.1:38182_solr c:testschemaapi s:shard1 r:core_node1 x:testschemaapi_shard1_replica1] o.a.s.r.ManagedResourceStorage Configured ZooKeeperStorageIO with znodeBase: /configs/conf1
>   [junit4]   2> 365771 INFO  (qtp270975907-2568) [n:127.0.0.1:38182_solr c:testschemaapi s:shard1 r:core_node1 x:testschemaapi_shard1_replica1] o.a.s.r.RestManager Initializing RestManager with initArgs: {}
>   [junit4]   2> 365771 INFO  (qtp270975907-2568) [n:127.0.0.1:38182_solr c:testschemaapi s:shard1 r:core_node1 x:testschemaapi_shard1_replica1] o.a.s.r.ManagedResourceStorage Reading _rest_managed.json using ZooKeeperStorageIO:path=/configs/conf1
>   [junit4]   2> 365771 INFO  (qtp1664628695-2574) [n:127.0.0.1:34881_solr c:testschemaapi s:shard1 r:core_node2 x:testschemaapi_shard1_replica2] o.a.s.c.c.ZkStateReader path=[/collections/testschemaapi] [configName]=[conf1] specified config exists in ZooKeeper
>   [junit4]   2> 365771 INFO  (qtp1664628695-2574) [n:127.0.0.1:34881_solr c:testschemaapi s:shard1 r:core_node2 x:testschemaapi_shard1_replica2] o.a.s.r.ManagedResourceStorage Setting up ZooKeeper-based storage for the RestManager with znodeBase: /configs/conf1
>   [junit4]   2> 365771 INFO  (qtp270975907-2568) [n:127.0.0.1:38182_solr c:testschemaapi s:shard1 r:core_node1 x:testschemaapi_shard1_replica1] o.a.s.r.ManagedResourceStorage No data found for znode /configs/conf1/_rest_managed.json
>   [junit4]   2> 365771 INFO  (qtp1664628695-2574) [n:127.0.0.1:34881_solr c:testschemaapi s:shard1 r:core_node2 x:testschemaapi_shard1_replica2] o.a.s.r.ManagedResourceStorage Configured ZooKeeperStorageIO with znodeBase: /configs/conf1
>   [junit4]   2> 365771 INFO  (qtp270975907-2568) [n:127.0.0.1:38182_solr c:testschemaapi s:shard1 r:core_node1 x:testschemaapi_shard1_replica1] o.a.s.r.ManagedResourceStorage Loaded null at path _rest_managed.json using ZooKeeperStorageIO:path=/configs/conf1
>   [junit4]   2> 365771 INFO  (qtp1664628695-2574) [n:127.0.0.1:34881_solr c:testschemaapi s:shard1 r:core_node2 x:testschemaapi_shard1_replica2] o.a.s.r.RestManager Initializing RestManager with initArgs: {}
>   [junit4]   2> 365771 INFO  (qtp270975907-2568) [n:127.0.0.1:38182_solr c:testschemaapi s:shard1 r:core_node1 x:testschemaapi_shard1_replica1] o.a.s.r.RestManager Initializing 0 registered ManagedResources
>   [junit4]   2> 365771 INFO  (qtp1664628695-2574) [n:127.0.0.1:34881_solr c:testschemaapi s:shard1 r:core_node2 x:testschemaapi_shard1_replica2] o.a.s.r.ManagedResourceStorage Reading _rest_managed.json using ZooKeeperStorageIO:path=/configs/conf1
>   [junit4]   2> 365771 INFO  (qtp270975907-2568) [n:127.0.0.1:38182_solr c:testschemaapi s:shard1 r:core_node1 x:testschemaapi_shard1_replica1] o.a.s.s.ZkIndexSchemaReader Creating ZooKeeper watch for the managed schema at /configs/conf1/managed-schema
>   [junit4]   2> 365771 INFO  (qtp1664628695-2574) [n:127.0.0.1:34881_solr c:testschemaapi s:shard1 r:core_node2 x:testschemaapi_shard1_replica2] o.a.s.r.ManagedResourceStorage No data found for znode /configs/conf1/_rest_managed.json
>   [junit4]   2> 365772 INFO  (qtp1664628695-2574) [n:127.0.0.1:34881_solr c:testschemaapi s:shard1 r:core_node2 x:testschemaapi_shard1_replica2] o.a.s.r.ManagedResourceStorage Loaded null at path _rest_managed.json using ZooKeeperStorageIO:path=/configs/conf1
>   [junit4]   2> 365772 INFO  (qtp270975907-2568) [n:127.0.0.1:38182_solr c:testschemaapi s:shard1 r:core_node1 x:testschemaapi_shard1_replica1] o.a.s.c.ZkController Added new OnReconnect listener ZkIndexSchemaReader: /configs/conf1/managed-schema, uniqueCoreId: testschemaapi_shard1_replica1:696046079936974
>   [junit4]   2> 365772 INFO  (qtp1664628695-2574) [n:127.0.0.1:34881_solr c:testschemaapi s:shard1 r:core_node2 x:testschemaapi_shard1_replica2] o.a.s.r.RestManager Initializing 0 registered ManagedResources
>   [junit4]   2> 365772 INFO  (qtp1664628695-2574) [n:127.0.0.1:34881_solr c:testschemaapi s:shard1 r:core_node2 x:testschemaapi_shard1_replica2] o.a.s.s.ZkIndexSchemaReader Creating ZooKeeper watch for the managed schema at /configs/conf1/managed-schema
>   [junit4]   2> 365772 INFO  (qtp270975907-2568) [n:127.0.0.1:38182_solr c:testschemaapi s:shard1 r:core_node1 x:testschemaapi_shard1_replica1] o.a.s.h.ReplicationHandler Commits will be reserved for  10000
>   [junit4]   2> 365772 INFO  (qtp1664628695-2574) [n:127.0.0.1:34881_solr c:testschemaapi s:shard1 r:core_node2 x:testschemaapi_shard1_replica2] o.a.s.c.ZkController Added new OnReconnect listener ZkIndexSchemaReader: /configs/conf1/managed-schema, uniqueCoreId: testschemaapi_shard1_replica2:696046079962560
>   [junit4]   2> 365772 INFO  (searcherExecutor-1387-thread-1-processing-n:127.0.0.1:38182_solr x:testschemaapi_shard1_replica1 s:shard1 c:testschemaapi r:core_node1) [n:127.0.0.1:38182_solr c:testschemaapi s:shard1 r:core_node1 x:testschemaapi_shard1_replica1] o.a.s.c.SolrCore [testschemaapi_shard1_replica1] Registered new searcher Searcher@354a36b7[testschemaapi_shard1_replica1] main{ExitableDirectoryReader(UninvertingDirectoryReader())}
>   [junit4]   2> 365772 INFO  (qtp1664628695-2574) [n:127.0.0.1:34881_solr c:testschemaapi s:shard1 r:core_node2 x:testschemaapi_shard1_replica2] o.a.s.h.ReplicationHandler Commits will be reserved for  10000
>   [junit4]   2> 365772 INFO  (qtp270975907-2568) [n:127.0.0.1:38182_solr c:testschemaapi s:shard1 r:core_node1 x:testschemaapi_shard1_replica1] o.a.s.u.UpdateLog Looking up max value of version field to seed version buckets
>   [junit4]   2> 365772 INFO  (qtp270975907-2568) [n:127.0.0.1:38182_solr c:testschemaapi s:shard1 r:core_node1 x:testschemaapi_shard1_replica1] o.a.s.u.VersionInfo Refreshing highest value of _version_ for 65536 version buckets from index
>   [junit4]   2> 365772 INFO  (searcherExecutor-1388-thread-1-processing-n:127.0.0.1:34881_solr x:testschemaapi_shard1_replica2 s:shard1 c:testschemaapi r:core_node2) [n:127.0.0.1:34881_solr c:testschemaapi s:shard1 r:core_node2 x:testschemaapi_shard1_replica2] o.a.s.c.SolrCore [testschemaapi_shard1_replica2] Registered new searcher Searcher@395865df[testschemaapi_shard1_replica2] main{ExitableDirectoryReader(UninvertingDirectoryReader())}
>   [junit4]   2> 365772 INFO  (qtp270975907-2568) [n:127.0.0.1:38182_solr c:testschemaapi s:shard1 r:core_node1 x:testschemaapi_shard1_replica1] o.a.s.u.VersionInfo No terms found for _version_, cannot seed version bucket highest value from index
>   [junit4]   2> 365772 INFO  (qtp1664628695-2574) [n:127.0.0.1:34881_solr c:testschemaapi s:shard1 r:core_node2 x:testschemaapi_shard1_replica2] o.a.s.u.UpdateLog Looking up max value of version field to seed version buckets
>   [junit4]   2> 365772 INFO  (qtp270975907-2568) [n:127.0.0.1:38182_solr c:testschemaapi s:shard1 r:core_node1 x:testschemaapi_shard1_replica1] o.a.s.u.UpdateLog Could not find max version in index or recent updates, using new clock 1534316129678262272
>   [junit4]   2> 365772 INFO  (qtp1664628695-2574) [n:127.0.0.1:34881_solr c:testschemaapi s:shard1 r:core_node2 x:testschemaapi_shard1_replica2] o.a.s.u.VersionInfo Refreshing highest value of _version_ for 65536 version buckets from index
>   [junit4]   2> 365772 INFO  (qtp1664628695-2574) [n:127.0.0.1:34881_solr c:testschemaapi s:shard1 r:core_node2 x:testschemaapi_shard1_replica2] o.a.s.u.VersionInfo No terms found for _version_, cannot seed version bucket highest value from index
>   [junit4]   2> 365772 INFO  (qtp1664628695-2574) [n:127.0.0.1:34881_solr c:testschemaapi s:shard1 r:core_node2 x:testschemaapi_shard1_replica2] o.a.s.u.UpdateLog Could not find max version in index or recent updates, using new clock 1534316129678262272
>   [junit4]   2> 365774 INFO  (qtp270975907-2568) [n:127.0.0.1:38182_solr c:testschemaapi s:shard1 r:core_node1 x:testschemaapi_shard1_replica1] o.a.s.u.UpdateLog Took 2.0ms to seed version buckets with highest version 1534316129678262272
>   [junit4]   2> 365774 INFO  (qtp1664628695-2574) [n:127.0.0.1:34881_solr c:testschemaapi s:shard1 r:core_node2 x:testschemaapi_shard1_replica2] o.a.s.u.UpdateLog Took 2.0ms to seed version buckets with highest version 1534316129678262272
>   [junit4]   2> 365774 INFO  (qtp270975907-2568) [n:127.0.0.1:38182_solr c:testschemaapi s:shard1 r:core_node1 x:testschemaapi_shard1_replica1] o.a.s.c.ZkController watch zkdir /configs/conf1
>   [junit4]   2> 365774 INFO  (qtp1664628695-2574) [n:127.0.0.1:34881_solr c:testschemaapi s:shard1 r:core_node2 x:testschemaapi_shard1_replica2] o.a.s.c.ZkController watch zkdir /configs/conf1
>   [junit4]   2> 365775 INFO  (qtp270975907-2568) [n:127.0.0.1:38182_solr c:testschemaapi s:shard1 r:core_node1 x:testschemaapi_shard1_replica1] o.a.s.c.CoreContainer registering core: testschemaapi_shard1_replica1
>   [junit4]   2> 365775 INFO  (qtp1664628695-2574) [n:127.0.0.1:34881_solr c:testschemaapi s:shard1 r:core_node2 x:testschemaapi_shard1_replica2] o.a.s.c.CoreContainer registering core: testschemaapi_shard1_replica2
>   [junit4]   2> 365775 INFO  (qtp270975907-2568) [n:127.0.0.1:38182_solr c:testschemaapi s:shard1 r:core_node1 x:testschemaapi_shard1_replica1] o.a.s.c.ZkController Register replica - core:testschemaapi_shard1_replica1 address:http://127.0.0.1:38182/solr collection:testschemaapi shard:shard1
>   [junit4]   2> 365775 INFO  (qtp1664628695-2574) [n:127.0.0.1:34881_solr c:testschemaapi s:shard1 r:core_node2 x:testschemaapi_shard1_replica2] o.a.s.c.ZkController Register replica - core:testschemaapi_shard1_replica2 address:http://127.0.0.1:34881/solr collection:testschemaapi shard:shard1
>   [junit4]   2> 365775 INFO  (qtp1664628695-2574) [n:127.0.0.1:34881_solr c:testschemaapi s:shard1 r:core_node2 x:testschemaapi_shard1_replica2] o.a.s.c.c.SolrZkClient makePath: /collections/testschemaapi/leader_elect/shard1/election
>   [junit4]   2> 365775 INFO  (qtp270975907-2568) [n:127.0.0.1:38182_solr c:testschemaapi s:shard1 r:core_node1 x:testschemaapi_shard1_replica1] o.a.s.c.c.SolrZkClient makePath: /collections/testschemaapi/leader_elect/shard1/election
>   [junit4]   2> 365776 INFO  (qtp1664628695-2574) [n:127.0.0.1:34881_solr c:testschemaapi s:shard1 r:core_node2 x:testschemaapi_shard1_replica2] o.a.s.c.LeaderElector Joined leadership election with path: /collections/testschemaapi/leader_elect/shard1/election/95894757949177861-core_node2-n_0000000000
>   [junit4]   2> 365776 INFO  (qtp270975907-2568) [n:127.0.0.1:38182_solr c:testschemaapi s:shard1 r:core_node1 x:testschemaapi_shard1_replica1] o.a.s.c.LeaderElector Joined leadership election with path: /collections/testschemaapi/leader_elect/shard1/election/95894757
> 
> [...truncated too long message...]
> 
> ] o.a.s.c.c.ConnectionManager Waiting for client to connect to ZooKeeper
>   [junit4]   2> 642545 INFO  (zkCallback-966-thread-1) [    ] o.a.s.c.c.ConnectionManager Watcher org.apache.solr.common.cloud.ConnectionManager@2d161f82 name:ZooKeeperConnection Watcher:127.0.0.1:34571 got event WatchedEvent state:SyncConnected type:None path:null path:null type:None
>   [junit4]   2> 642546 INFO  (TEST-ZkStateReaderTest.testStateFormatUpdateWithTimeDelayLazy-seed#[61FC3022AB6A74EF]) [    ] o.a.s.c.c.ConnectionManager Client is connected to ZooKeeper
>   [junit4]   2> 642546 INFO  (TEST-ZkStateReaderTest.testStateFormatUpdateWithTimeDelayLazy-seed#[61FC3022AB6A74EF]) [    ] o.a.s.c.c.SolrZkClient Using default ZkACLProvider
>   [junit4]   2> 642556 INFO  (TEST-ZkStateReaderTest.testStateFormatUpdateWithTimeDelayLazy-seed#[61FC3022AB6A74EF]) [    ] o.a.s.c.c.SolrZkClient Using default ZkCredentialsProvider
>   [junit4]   2> 642557 INFO  (TEST-ZkStateReaderTest.testStateFormatUpdateWithTimeDelayLazy-seed#[61FC3022AB6A74EF]) [    ] o.a.s.c.c.ConnectionManager Waiting for client to connect to ZooKeeper
>   [junit4]   2> 642557 INFO  (zkCallback-967-thread-1) [    ] o.a.s.c.c.ConnectionManager Watcher org.apache.solr.common.cloud.ConnectionManager@d6d6cc name:ZooKeeperConnection Watcher:127.0.0.1:34571 got event WatchedEvent state:SyncConnected type:None path:null path:null type:None
>   [junit4]   2> 642558 INFO  (TEST-ZkStateReaderTest.testStateFormatUpdateWithTimeDelayLazy-seed#[61FC3022AB6A74EF]) [    ] o.a.s.c.c.ConnectionManager Client is connected to ZooKeeper
>   [junit4]   2> 642558 INFO  (TEST-ZkStateReaderTest.testStateFormatUpdateWithTimeDelayLazy-seed#[61FC3022AB6A74EF]) [    ] o.a.s.c.c.SolrZkClient Using default ZkACLProvider
>   [junit4]   2> 642558 INFO  (TEST-ZkStateReaderTest.testStateFormatUpdateWithTimeDelayLazy-seed#[61FC3022AB6A74EF]) [    ] o.a.s.c.c.SolrZkClient makePath: /solr
>   [junit4]   2> 642560 INFO  (TEST-ZkStateReaderTest.testStateFormatUpdateWithTimeDelayLazy-seed#[61FC3022AB6A74EF]) [    ] o.a.s.c.c.SolrZkClient Using default ZkCredentialsProvider
>   [junit4]   2> 642560 INFO  (TEST-ZkStateReaderTest.testStateFormatUpdateWithTimeDelayLazy-seed#[61FC3022AB6A74EF]) [    ] o.a.s.c.c.ConnectionManager Waiting for client to connect to ZooKeeper
>   [junit4]   2> 642562 INFO  (zkCallback-968-thread-1) [    ] o.a.s.c.c.ConnectionManager Watcher org.apache.solr.common.cloud.ConnectionManager@36337c47 name:ZooKeeperConnection Watcher:127.0.0.1:34571/solr got event WatchedEvent state:SyncConnected type:None path:null path:null type:None
>   [junit4]   2> 642562 INFO  (TEST-ZkStateReaderTest.testStateFormatUpdateWithTimeDelayLazy-seed#[61FC3022AB6A74EF]) [    ] o.a.s.c.c.ConnectionManager Client is connected to ZooKeeper
>   [junit4]   2> 642562 INFO  (TEST-ZkStateReaderTest.testStateFormatUpdateWithTimeDelayLazy-seed#[61FC3022AB6A74EF]) [    ] o.a.s.c.c.SolrZkClient Using default ZkACLProvider
>   [junit4]   2> 642563 INFO  (TEST-ZkStateReaderTest.testStateFormatUpdateWithTimeDelayLazy-seed#[61FC3022AB6A74EF]) [    ] o.a.s.c.c.SolrZkClient makePath: /live_nodes
>   [junit4]   2> 642563 INFO  (TEST-ZkStateReaderTest.testStateFormatUpdateWithTimeDelayLazy-seed#[61FC3022AB6A74EF]) [    ] o.a.s.c.c.SolrZkClient makePath: /collections
>   [junit4]   2> 642564 INFO  (TEST-ZkStateReaderTest.testStateFormatUpdateWithTimeDelayLazy-seed#[61FC3022AB6A74EF]) [    ] o.a.s.c.c.SolrZkClient makePath: /aliases.json
>   [junit4]   2> 642564 INFO  (TEST-ZkStateReaderTest.testStateFormatUpdateWithTimeDelayLazy-seed#[61FC3022AB6A74EF]) [    ] o.a.s.c.c.SolrZkClient makePath: /clusterstate.json
>   [junit4]   2> 642565 INFO  (TEST-ZkStateReaderTest.testStateFormatUpdateWithTimeDelayLazy-seed#[61FC3022AB6A74EF]) [    ] o.a.s.c.c.SolrZkClient makePath: /security.json
>   [junit4]   2> 642566 INFO  (TEST-ZkStateReaderTest.testStateFormatUpdateWithTimeDelayLazy-seed#[61FC3022AB6A74EF]) [    ] o.a.s.c.c.ZkStateReader Updating cluster state from ZooKeeper... 
>   [junit4]   2> 642566 INFO  (TEST-ZkStateReaderTest.testStateFormatUpdateWithTimeDelayLazy-seed#[61FC3022AB6A74EF]) [    ] o.a.s.c.c.ZkStateReader Loaded empty cluster properties
>   [junit4]   2> 642566 INFO  (TEST-ZkStateReaderTest.testStateFormatUpdateWithTimeDelayLazy-seed#[61FC3022AB6A74EF]) [    ] o.a.s.c.c.ZkStateReader Updated live nodes from ZooKeeper... (0) -> (0)
>   [junit4]   2> 642567 INFO  (TEST-ZkStateReaderTest.testStateFormatUpdateWithTimeDelayLazy-seed#[61FC3022AB6A74EF]) [    ] o.a.s.c.c.SolrZkClient makePath: /collections/c1
>   [junit4]   2> 642568 INFO  (zkCallback-968-thread-2) [    ] o.a.s.c.c.ZkStateReader A collections change: [WatchedEvent state:SyncConnected type:NodeChildrenChanged path:/collections], has occurred - updating...
>   [junit4]   2> 642568 INFO  (zkCallback-968-thread-3) [    ] o.a.s.c.c.ZkStateReader A cluster state change: [WatchedEvent state:SyncConnected type:NodeDataChanged path:/clusterstate.json], has occurred - updating... (live nodes size: [0])
>   [junit4]   2> 642569 INFO  (TEST-ZkStateReaderTest.testStateFormatUpdateWithTimeDelayLazy-seed#[61FC3022AB6A74EF]) [    ] o.a.s.c.o.ZkStateWriter going to create_collection /collections/c1/state.json
>   [junit4]   2> 642569 INFO  (zkCallback-968-thread-3) [    ] o.a.s.c.c.ZkStateReader A cluster state change: [WatchedEvent state:SyncConnected type:NodeDataChanged path:/clusterstate.json], has occurred - updating... (live nodes size: [0])
>   [junit4]   2> 642572 INFO  (TEST-ZkStateReaderTest.testStateFormatUpdateWithTimeDelayLazy-seed#[61FC3022AB6A74EF]) [    ] o.a.s.c.ZkTestServer connecting to 127.0.0.1:34571 34571
>   [junit4]   2> 642677 INFO  (Thread-1657) [    ] o.a.s.c.ZkTestServer connecting to 127.0.0.1:34571 34571
>   [junit4]   2> 642678 INFO  (TEST-ZkStateReaderTest.testStateFormatUpdateWithTimeDelayLazy-seed#[61FC3022AB6A74EF]) [    ] o.a.s.SolrTestCaseJ4 ###Ending testStateFormatUpdateWithTimeDelayLazy
>   [junit4]   2> 642679 INFO  (SUITE-ZkStateReaderTest-seed#[61FC3022AB6A74EF]-worker) [    ] o.a.s.SolrTestCaseJ4 ###deleteCore
>   [junit4]   2> NOTE: leaving temporary files on disk at: /home/jenkins/workspace/Lucene-Solr-master-Linux/solr/build/solr-core/test/J2/temp/solr.cloud.overseer.ZkStateReaderTest_61FC3022AB6A74EF-001
>   [junit4]   2> May 14, 2016 3:02:43 PM com.carrotsearch.randomizedtesting.ThreadLeakControl checkThreadLeaks
>   [junit4]   2> WARNING: Will linger awaiting termination of 1 leaked thread(s).
>   [junit4]   2> NOTE: test params are: codec=Asserting(Lucene62): {}, docValues:{}, maxPointsInLeafNode=55, maxMBSortInHeap=6.817830535980633, sim=RandomSimilarity(queryNorm=false,coord=yes): {}, locale=nn-NO, timezone=Indian/Chagos
>   [junit4]   2> NOTE: Linux 4.4.0-21-generic amd64/Oracle Corporation 1.8.0_92 (64-bit)/cpus=12,threads=1,free=46123280,total=527433728
>   [junit4]   2> NOTE: All tests run in this JVM: [DebugComponentTest, PluginInfoTest, DirectSolrConnectionTest, FacetPivotSmallTest, TestInitQParser, SearchHandlerTest, TestGraphMLResponseWriter, ScriptEngineTest, TestPHPSerializedResponseWriter, TestSolrIndexConfig, TestUtils, TestWriterPerf, TestBulkSchemaAPI, TestPerFieldSimilarity, RemoteQueryErrorTest, DirectUpdateHandlerOptimizeTest, TestExactStatsCache, DocValuesMultiTest, TestTolerantUpdateProcessorCloud, TestFieldCollectionResource, TestCollationField, CdcrRequestHandlerTest, TestIndexSearcher, CollectionsAPISolrJTest, SuggesterWFSTTest, TestSolrQueryResponse, RuleEngineTest, TestPostingsSolrHighlighter, TestSizeLimitedDistributedMap, TestStressRecovery, TestSubQueryTransformer, TestMinMaxOnMultiValuedField, AutoCommitTest, UnloadDistributedZkTest, RequestHandlersTest, TestConfigOverlay, SecurityConfHandlerTest, ChangedSchemaMergeTest, FieldAnalysisRequestHandlerTest, TestComplexPhraseQParserPlugin, TestStressReorder, UpdateParamsTest, TestExclusionRuleCollectionAccess, SampleTest, NoCacheHeaderTest, FullHLLTest, HdfsBasicDistributedZkTest, DistributedQueryComponentCustomSortTest, TestXIncludeConfig, TestCharFilters, PKIAuthenticationIntegrationTest, TestRuleBasedAuthorizationPlugin, TestRebalanceLeaders, DistributedFacetPivotSmallAdvancedTest, TestSchemaManager, BadComponentTest, TestSweetSpotSimilarityFactory, SolrTestCaseJ4Test, TestDocBasedVersionConstraints, TestInfoStreamLogging, TestCollationFieldDocValues, VersionInfoTest, BaseCdcrDistributedZkTest, TestGroupingSearch, TestSolrConfigHandlerCloud, HdfsCollectionsAPIDistributedZkTest, TestFilteredDocIdSet, SuggesterTSTTest, AnalyticsMergeStrategyTest, TestAddFieldRealTimeGet, CollectionStateFormat2Test, TestCSVResponseWriter, ZkStateReaderTest]
>   [junit4] Completed [216/597 (2!)] on J2 in 87.41s, 6 tests, 1 failure, 1 error <<< FAILURES!
> 
> [...truncated 1230 lines...]
> BUILD FAILED
> /home/jenkins/workspace/Lucene-Solr-master-Linux/build.xml:740: The following error occurred while executing this line:
> /home/jenkins/workspace/Lucene-Solr-master-Linux/build.xml:684: The following error occurred while executing this line:
> /home/jenkins/workspace/Lucene-Solr-master-Linux/build.xml:59: The following error occurred while executing this line:
> /home/jenkins/workspace/Lucene-Solr-master-Linux/solr/build.xml:233: The following error occurred while executing this line:
> /home/jenkins/workspace/Lucene-Solr-master-Linux/solr/common-build.xml:529: The following error occurred while executing this line:
> /home/jenkins/workspace/Lucene-Solr-master-Linux/lucene/common-build.xml:1457: The following error occurred while executing this line:
> /home/jenkins/workspace/Lucene-Solr-master-Linux/lucene/common-build.xml:1014: There were test failures: 597 suites (10 ignored), 2413 tests, 2 errors, 1 failure, 115 ignored (71 assumptions) [seed: 61FC3022AB6A74EF]
> 
> Total time: 62 minutes 26 seconds
> Build step 'Invoke Ant' marked build as failure
> Archiving artifacts
> [WARNINGS] Skipping publisher since build result is FAILURE
> Recording test results
> Email was triggered for: Failure - Any
> Sending email for trigger: Failure - Any
> 
> 
> 
> ---------------------------------------------------------------------
> To unsubscribe, e-mail: dev-unsubscribe@lucene.apache.org
> For additional commands, e-mail: dev-help@lucene.apache.org


Mime
View raw message