lucene-dev mailing list archives

Site index · List index
Message view « Date » · « Thread »
Top « Date » · « Thread »
From "Uwe Schindler" <...@thetaphi.de>
Subject RE: [JENKINS] Lucene-Solr-6.x-Windows (32bit/jdk1.8.0_92) - Build # 239 - Still Failing!
Date Fri, 10 Jun 2016 20:33:57 GMT
https://issues.apache.org/jira/browse/LUCENE-7333

-----
Uwe Schindler
H.-H.-Meier-Allee 63, D-28213 Bremen
http://www.thetaphi.de
eMail: uwe@thetaphi.de

> -----Original Message-----
> From: Uwe Schindler [mailto:uwe@thetaphi.de]
> Sent: Friday, June 10, 2016 10:28 PM
> To: dev@lucene.apache.org
> Subject: Re: [JENKINS] Lucene-Solr-6.x-Windows (32bit/jdk1.8.0_92) - Build #
> 239 - Still Failing!
> 
> OK. Will do and work on a solution!
> 
> I will also check for similar issues with Linux or Mäc.
> 
> Uwe
> 
> Am 10. Juni 2016 22:23:28 MESZ, schrieb Michael McCandless
> <lucene@mikemccandless.com>:
> >Let's open an issue?  It's a confusing failure :)  I had no clue "con"
> >was
> >not allowed on windows.
> >
> >Mike McCandless
> >
> >http://blog.mikemccandless.com
> >
> >On Fri, Jun 10, 2016 at 1:28 PM, Uwe Schindler <uwe@thetaphi.de> wrote:
> >
> >> Here is the documentation:
> >>
> >>
> >>
> >> https://msdn.microsoft.com/en-us/library/aa365247.aspx
> >>
> >>
> >>
> >> We could either fix the issue by adding the list of illegal names to
> >the
> >> random name generator, or we just let it be an let it fail sometimes
> >J
> >>
> >> Should we open issue?
> >>
> >>
> >>
> >> Uwe
> >>
> >>
> >>
> >> -----
> >>
> >> Uwe Schindler
> >>
> >> H.-H.-Meier-Allee 63, D-28213 Bremen
> >>
> >> http://www.thetaphi.de
> >>
> >> eMail: uwe@thetaphi.de
> >>
> >>
> >>
> >> *From:* Uwe Schindler [mailto:uwe@thetaphi.de]
> >> *Sent:* Friday, June 10, 2016 7:26 PM
> >>
> >> *To:* dev@lucene.apache.org
> >> *Subject:* RE: [JENKINS] Lucene-Solr-6.x-Windows (32bit/jdk1.8.0_92)
> >-
> >> Build # 239 - Still Failing!
> >>
> >>
> >>
> >> Hi,
> >>
> >>
> >>
> >> Of course!
> >>
> >>
> >>
> >> It is only strange that this error comes from the AccessController
> >and not
> >> the operating system… So either the FilePermission code “knows” about
> >this
> >> special names on windows, or it is a side effect while calculating
> >canonic
> >> name of the file.
> >>
> >>
> >>
> >> Uwe
> >>
> >>
> >>
> >> -----
> >>
> >> Uwe Schindler
> >>
> >> H.-H.-Meier-Allee 63, D-28213 Bremen
> >>
> >> http://www.thetaphi.de
> >>
> >> eMail: uwe@thetaphi.de
> >>
> >>
> >>
> >> *From:* Dawid Weiss [mailto:dawid.weiss@gmail.com
> ><dawid.weiss@gmail.com>]
> >>
> >> *Sent:* Friday, June 10, 2016 6:59 PM
> >> *To:* dev@lucene.apache.org
> >> *Subject:* RE: [JENKINS] Lucene-Solr-6.x-Windows (32bit/jdk1.8.0_92)
> >-
> >> Build # 239 - Still Failing!
> >>
> >>
> >>
> >>
> >> I think I do. Con is a special filename. You cannot use it on
> >windows.
> >>
> >> On Jun 10, 2016 5:50 PM, "Uwe Schindler" <uwe@thetaphi.de> wrote:
> >>
> >> Hi,
> >>
> >>
> >>
> >> This is indeed very strange. I have no idea!
> >>
> >>
> >>
> >> Uwe
> >>
> >>
> >>
> >> -----
> >>
> >> Uwe Schindler
> >>
> >> H.-H.-Meier-Allee 63, D-28213 Bremen
> >>
> >> http://www.thetaphi.de
> >>
> >> eMail: uwe@thetaphi.de
> >>
> >>
> >>
> >> *From:* Michael McCandless [mailto:lucene@mikemccandless.com]
> >> *Sent:* Friday, June 10, 2016 5:45 PM
> >> *To:* Policeman Jenkins Server <jenkins@thetaphi.de>
> >> *Cc:* Adrien Grand <jpountz@gmail.com>; Gregory Chanan <
> >> gchanan@cloudera.com>; dragonsinth@apache.org; Lucene/Solr dev <
> >> dev@lucene.apache.org>
> >> *Subject:* Re: [JENKINS] Lucene-Solr-6.x-Windows (32bit/jdk1.8.0_92)
> >-
> >> Build # 239 - Still Failing!
> >>
> >>
> >>
> >> Hmm, why was access denied here?
> >>
> >>
> >> Mike McCandless
> >>
> >> http://blog.mikemccandless.com
> >>
> >>
> >>
> >> On Thu, Jun 9, 2016 at 5:51 PM, Policeman Jenkins Server <
> >> jenkins@thetaphi.de> wrote:
> >>
> >> Build: http://jenkins.thetaphi.de/job/Lucene-Solr-6.x-Windows/239/
> >> Java: 32bit/jdk1.8.0_92 -client -XX:+UseConcMarkSweepGC
> >>
> >> 2 tests failed.
> >> FAILED:
> >org.apache.lucene.store.TestMmapDirectory.testPendingDeletions
> >>
> >> Error Message:
> >> access denied ("java.io.FilePermission"
> >>
> >"C:\Users\jenkins\workspace\Lucene-Solr-6.x-
> Windows\lucene\build\core\test\J0\temp\lucene.store.TestMmapDirectory
> _96FC6F2D45B76809-001\tempDir-007\con"
> >> "write")
> >>
> >> Stack Trace:
> >> java.security.AccessControlException: access denied
> >> ("java.io.FilePermission"
> >>
> >"C:\Users\jenkins\workspace\Lucene-Solr-6.x-
> Windows\lucene\build\core\test\J0\temp\lucene.store.TestMmapDirectory
> _96FC6F2D45B76809-001\tempDir-007\con"
> >> "write")
> >>         at
> >>
> >__randomizedtesting.SeedInfo.seed([96FC6F2D45B76809:DE018553DD164A
> B]:0)
> >>         at
> >>
> >java.security.AccessControlContext.checkPermission(AccessControlContext
> .java:472)
> >>         at
> >>
> >java.security.AccessController.checkPermission(AccessController.java:884)
> >>         at
> >> java.lang.SecurityManager.checkPermission(SecurityManager.java:549)
> >>         at
> >java.lang.SecurityManager.checkWrite(SecurityManager.java:979)
> >>         at
> >>
> sun.nio.fs.WindowsChannelFactory.open(WindowsChannelFactory.java:295)
> >>         at
> >>
> >sun.nio.fs.WindowsChannelFactory.newFileChannel(WindowsChannelFact
> ory.java:162)
> >>         at
> >>
> >sun.nio.fs.WindowsFileSystemProvider.newByteChannel(WindowsFileSyst
> emProvider.java:225)
> >>         at
> >>
> >java.nio.file.spi.FileSystemProvider.newOutputStream(FileSystemProvider.
> java:434)
> >>         at
> >>
> >org.apache.lucene.mockfile.FilterFileSystemProvider.newOutputStream(Fil
> terFileSystemProvider.java:197)
> >>         at
> >>
> >org.apache.lucene.mockfile.FilterFileSystemProvider.newOutputStream(Fil
> terFileSystemProvider.java:197)
> >>         at
> >>
> >org.apache.lucene.mockfile.HandleTrackingFS.newOutputStream(HandleTr
> ackingFS.java:129)
> >>         at
> >>
> >org.apache.lucene.mockfile.HandleTrackingFS.newOutputStream(HandleTr
> ackingFS.java:129)
> >>         at
> >>
> >org.apache.lucene.mockfile.FilterFileSystemProvider.newOutputStream(Fil
> terFileSystemProvider.java:197)
> >>         at
> >>
> >org.apache.lucene.mockfile.FilterFileSystemProvider.newOutputStream(Fil
> terFileSystemProvider.java:197)
> >>         at java.nio.file.Files.newOutputStream(Files.java:216)
> >>         at
> >>
> >org.apache.lucene.store.FSDirectory$FSIndexOutput.<init>(FSDirectory.jav
> a:408)
> >>         at
> >>
> >org.apache.lucene.store.FSDirectory$FSIndexOutput.<init>(FSDirectory.jav
> a:404)
> >>         at
> >>
> >org.apache.lucene.store.FSDirectory.createOutput(FSDirectory.java:253)
> >>         at
> >>
> >org.apache.lucene.store.BaseDirectoryTestCase.testPendingDeletions(Bas
> eDirectoryTestCase.java:1215)
> >>         at sun.reflect.NativeMethodAccessorImpl.invoke0(Native
> >Method)
> >>         at
> >>
> >sun.reflect.NativeMethodAccessorImpl.invoke(NativeMethodAccessorImpl
> .java:62)
> >>         at
> >>
> >sun.reflect.DelegatingMethodAccessorImpl.invoke(DelegatingMethodAcce
> ssorImpl.java:43)
> >>         at java.lang.reflect.Method.invoke(Method.java:498)
> >>         at
> >>
> >com.carrotsearch.randomizedtesting.RandomizedRunner.invoke(Randomiz
> edRunner.java:1764)
> >>         at
> >>
> >com.carrotsearch.randomizedtesting.RandomizedRunner$8.evaluate(Rand
> omizedRunner.java:871)
> >>         at
> >>
> >com.carrotsearch.randomizedtesting.RandomizedRunner$9.evaluate(Rand
> omizedRunner.java:907)
> >>         at
> >>
> >com.carrotsearch.randomizedtesting.RandomizedRunner$10.evaluate(Ran
> domizedRunner.java:921)
> >>         at
> >>
> >org.apache.lucene.util.TestRuleSetupTeardownChained$1.evaluate(TestRul
> eSetupTeardownChained.java:49)
> >>         at
> >>
> >org.apache.lucene.util.AbstractBeforeAfterRule$1.evaluate(AbstractBefore
> AfterRule.java:45)
> >>         at
> >>
> >org.apache.lucene.util.TestRuleThreadAndTestName$1.evaluate(TestRuleT
> hreadAndTestName.java:48)
> >>         at
> >>
> >org.apache.lucene.util.TestRuleIgnoreAfterMaxFailures$1.evaluate(TestRul
> eIgnoreAfterMaxFailures.java:64)
> >>         at
> >>
> >org.apache.lucene.util.TestRuleMarkFailure$1.evaluate(TestRuleMarkFailur
> e.java:47)
> >>         at
> >>
> >com.carrotsearch.randomizedtesting.rules.StatementAdapter.evaluate(Sta
> tementAdapter.java:36)
> >>         at
> >>
> >com.carrotsearch.randomizedtesting.ThreadLeakControl$StatementRunner
> .run(ThreadLeakControl.java:367)
> >>         at
> >>
> >com.carrotsearch.randomizedtesting.ThreadLeakControl.forkTimeoutingTa
> sk(ThreadLeakControl.java:809)
> >>         at
> >>
> >com.carrotsearch.randomizedtesting.ThreadLeakControl$3.evaluate(Threa
> dLeakControl.java:460)
> >>         at
> >>
> >com.carrotsearch.randomizedtesting.RandomizedRunner.runSingleTest(Ra
> ndomizedRunner.java:880)
> >>         at
> >>
> >com.carrotsearch.randomizedtesting.RandomizedRunner$5.evaluate(Rand
> omizedRunner.java:781)
> >>         at
> >>
> >com.carrotsearch.randomizedtesting.RandomizedRunner$6.evaluate(Rand
> omizedRunner.java:816)
> >>         at
> >>
> >com.carrotsearch.randomizedtesting.RandomizedRunner$7.evaluate(Rand
> omizedRunner.java:827)
> >>         at
> >>
> >org.apache.lucene.util.AbstractBeforeAfterRule$1.evaluate(AbstractBefore
> AfterRule.java:45)
> >>         at
> >>
> >com.carrotsearch.randomizedtesting.rules.StatementAdapter.evaluate(Sta
> tementAdapter.java:36)
> >>         at
> >>
> >org.apache.lucene.util.TestRuleStoreClassName$1.evaluate(TestRuleStore
> ClassName.java:41)
> >>         at
> >>
> >com.carrotsearch.randomizedtesting.rules.NoShadowingOrOverridesOnMe
> thodsRule$1.evaluate(NoShadowingOrOverridesOnMethodsRule.java:40)
> >>         at
> >>
> >com.carrotsearch.randomizedtesting.rules.NoShadowingOrOverridesOnMe
> thodsRule$1.evaluate(NoShadowingOrOverridesOnMethodsRule.java:40)
> >>         at
> >>
> >com.carrotsearch.randomizedtesting.rules.StatementAdapter.evaluate(Sta
> tementAdapter.java:36)
> >>         at
> >>
> >com.carrotsearch.randomizedtesting.rules.StatementAdapter.evaluate(Sta
> tementAdapter.java:36)
> >>         at
> >>
> >com.carrotsearch.randomizedtesting.rules.StatementAdapter.evaluate(Sta
> tementAdapter.java:36)
> >>         at
> >>
> >org.apache.lucene.util.TestRuleAssertionsRequired$1.evaluate(TestRuleAs
> sertionsRequired.java:53)
> >>         at
> >>
> >org.apache.lucene.util.TestRuleMarkFailure$1.evaluate(TestRuleMarkFailur
> e.java:47)
> >>         at
> >>
> >org.apache.lucene.util.TestRuleIgnoreAfterMaxFailures$1.evaluate(TestRul
> eIgnoreAfterMaxFailures.java:64)
> >>         at
> >>
> >org.apache.lucene.util.TestRuleIgnoreTestSuites$1.evaluate(TestRuleIgnor
> eTestSuites.java:54)
> >>         at
> >>
> >com.carrotsearch.randomizedtesting.rules.StatementAdapter.evaluate(Sta
> tementAdapter.java:36)
> >>         at
> >>
> >com.carrotsearch.randomizedtesting.ThreadLeakControl$StatementRunner
> .run(ThreadLeakControl.java:367)
> >>         at java.lang.Thread.run(Thread.java:745)
> >>
> >>
> >> FAILED:  org.apache.lucene.store.TestMultiMMap.testPendingDeletions
> >>
> >> Error Message:
> >> access denied ("java.io.FilePermission"
> >>
> >"C:\Users\jenkins\workspace\Lucene-Solr-6.x-
> Windows\lucene\build\core\test\J1\temp\lucene.store.TestMultiMMap_96
> FC6F2D45B76809-001\tempDir-004\con"
> >> "write")
> >>
> >> Stack Trace:
> >> java.security.AccessControlException: access denied
> >> ("java.io.FilePermission"
> >>
> >"C:\Users\jenkins\workspace\Lucene-Solr-6.x-
> Windows\lucene\build\core\test\J1\temp\lucene.store.TestMultiMMap_96
> FC6F2D45B76809-001\tempDir-004\con"
> >> "write")
> >>         at
> >>
> >__randomizedtesting.SeedInfo.seed([96FC6F2D45B76809:DE018553DD164A
> B]:0)
> >>         at
> >>
> >java.security.AccessControlContext.checkPermission(AccessControlContext
> .java:472)
> >>         at
> >>
> >java.security.AccessController.checkPermission(AccessController.java:884)
> >>         at
> >> java.lang.SecurityManager.checkPermission(SecurityManager.java:549)
> >>         at
> >java.lang.SecurityManager.checkWrite(SecurityManager.java:979)
> >>         at
> >>
> sun.nio.fs.WindowsChannelFactory.open(WindowsChannelFactory.java:295)
> >>         at
> >>
> >sun.nio.fs.WindowsChannelFactory.newFileChannel(WindowsChannelFact
> ory.java:162)
> >>         at
> >>
> >sun.nio.fs.WindowsFileSystemProvider.newByteChannel(WindowsFileSyst
> emProvider.java:225)
> >>         at
> >>
> >java.nio.file.spi.FileSystemProvider.newOutputStream(FileSystemProvider.
> java:434)
> >>         at
> >>
> >org.apache.lucene.mockfile.FilterFileSystemProvider.newOutputStream(Fil
> terFileSystemProvider.java:197)
> >>         at
> >>
> >org.apache.lucene.mockfile.FilterFileSystemProvider.newOutputStream(Fil
> terFileSystemProvider.java:197)
> >>         at
> >>
> >org.apache.lucene.mockfile.HandleTrackingFS.newOutputStream(HandleTr
> ackingFS.java:129)
> >>         at
> >>
> >org.apache.lucene.mockfile.HandleTrackingFS.newOutputStream(HandleTr
> ackingFS.java:129)
> >>         at
> >>
> >org.apache.lucene.mockfile.FilterFileSystemProvider.newOutputStream(Fil
> terFileSystemProvider.java:197)
> >>         at
> >>
> >org.apache.lucene.mockfile.FilterFileSystemProvider.newOutputStream(Fil
> terFileSystemProvider.java:197)
> >>         at java.nio.file.Files.newOutputStream(Files.java:216)
> >>         at
> >>
> >org.apache.lucene.store.FSDirectory$FSIndexOutput.<init>(FSDirectory.jav
> a:408)
> >>         at
> >>
> >org.apache.lucene.store.FSDirectory$FSIndexOutput.<init>(FSDirectory.jav
> a:404)
> >>         at
> >>
> >org.apache.lucene.store.FSDirectory.createOutput(FSDirectory.java:253)
> >>         at
> >>
> >org.apache.lucene.store.BaseDirectoryTestCase.testPendingDeletions(Bas
> eDirectoryTestCase.java:1215)
> >>         at sun.reflect.NativeMethodAccessorImpl.invoke0(Native
> >Method)
> >>         at
> >>
> >sun.reflect.NativeMethodAccessorImpl.invoke(NativeMethodAccessorImpl
> .java:62)
> >>         at
> >>
> >sun.reflect.DelegatingMethodAccessorImpl.invoke(DelegatingMethodAcce
> ssorImpl.java:43)
> >>         at java.lang.reflect.Method.invoke(Method.java:498)
> >>         at
> >>
> >com.carrotsearch.randomizedtesting.RandomizedRunner.invoke(Randomiz
> edRunner.java:1764)
> >>         at
> >>
> >com.carrotsearch.randomizedtesting.RandomizedRunner$8.evaluate(Rand
> omizedRunner.java:871)
> >>         at
> >>
> >com.carrotsearch.randomizedtesting.RandomizedRunner$9.evaluate(Rand
> omizedRunner.java:907)
> >>         at
> >>
> >com.carrotsearch.randomizedtesting.RandomizedRunner$10.evaluate(Ran
> domizedRunner.java:921)
> >>         at
> >>
> >org.apache.lucene.util.TestRuleSetupTeardownChained$1.evaluate(TestRul
> eSetupTeardownChained.java:49)
> >>         at
> >>
> >org.apache.lucene.util.AbstractBeforeAfterRule$1.evaluate(AbstractBefore
> AfterRule.java:45)
> >>         at
> >>
> >org.apache.lucene.util.TestRuleThreadAndTestName$1.evaluate(TestRuleT
> hreadAndTestName.java:48)
> >>         at
> >>
> >org.apache.lucene.util.TestRuleIgnoreAfterMaxFailures$1.evaluate(TestRul
> eIgnoreAfterMaxFailures.java:64)
> >>         at
> >>
> >org.apache.lucene.util.TestRuleMarkFailure$1.evaluate(TestRuleMarkFailur
> e.java:47)
> >>         at
> >>
> >com.carrotsearch.randomizedtesting.rules.StatementAdapter.evaluate(Sta
> tementAdapter.java:36)
> >>         at
> >>
> >com.carrotsearch.randomizedtesting.ThreadLeakControl$StatementRunner
> .run(ThreadLeakControl.java:367)
> >>         at
> >>
> >com.carrotsearch.randomizedtesting.ThreadLeakControl.forkTimeoutingTa
> sk(ThreadLeakControl.java:809)
> >>         at
> >>
> >com.carrotsearch.randomizedtesting.ThreadLeakControl$3.evaluate(Threa
> dLeakControl.java:460)
> >>         at
> >>
> >com.carrotsearch.randomizedtesting.RandomizedRunner.runSingleTest(Ra
> ndomizedRunner.java:880)
> >>         at
> >>
> >com.carrotsearch.randomizedtesting.RandomizedRunner$5.evaluate(Rand
> omizedRunner.java:781)
> >>         at
> >>
> >com.carrotsearch.randomizedtesting.RandomizedRunner$6.evaluate(Rand
> omizedRunner.java:816)
> >>         at
> >>
> >com.carrotsearch.randomizedtesting.RandomizedRunner$7.evaluate(Rand
> omizedRunner.java:827)
> >>         at
> >>
> >org.apache.lucene.util.AbstractBeforeAfterRule$1.evaluate(AbstractBefore
> AfterRule.java:45)
> >>         at
> >>
> >com.carrotsearch.randomizedtesting.rules.StatementAdapter.evaluate(Sta
> tementAdapter.java:36)
> >>         at
> >>
> >org.apache.lucene.util.TestRuleStoreClassName$1.evaluate(TestRuleStore
> ClassName.java:41)
> >>         at
> >>
> >com.carrotsearch.randomizedtesting.rules.NoShadowingOrOverridesOnMe
> thodsRule$1.evaluate(NoShadowingOrOverridesOnMethodsRule.java:40)
> >>         at
> >>
> >com.carrotsearch.randomizedtesting.rules.NoShadowingOrOverridesOnMe
> thodsRule$1.evaluate(NoShadowingOrOverridesOnMethodsRule.java:40)
> >>         at
> >>
> >com.carrotsearch.randomizedtesting.rules.StatementAdapter.evaluate(Sta
> tementAdapter.java:36)
> >>         at
> >>
> >com.carrotsearch.randomizedtesting.rules.StatementAdapter.evaluate(Sta
> tementAdapter.java:36)
> >>         at
> >>
> >com.carrotsearch.randomizedtesting.rules.StatementAdapter.evaluate(Sta
> tementAdapter.java:36)
> >>         at
> >>
> >org.apache.lucene.util.TestRuleAssertionsRequired$1.evaluate(TestRuleAs
> sertionsRequired.java:53)
> >>         at
> >>
> >org.apache.lucene.util.TestRuleMarkFailure$1.evaluate(TestRuleMarkFailur
> e.java:47)
> >>         at
> >>
> >org.apache.lucene.util.TestRuleIgnoreAfterMaxFailures$1.evaluate(TestRul
> eIgnoreAfterMaxFailures.java:64)
> >>         at
> >>
> >org.apache.lucene.util.TestRuleIgnoreTestSuites$1.evaluate(TestRuleIgnor
> eTestSuites.java:54)
> >>         at
> >>
> >com.carrotsearch.randomizedtesting.rules.StatementAdapter.evaluate(Sta
> tementAdapter.java:36)
> >>         at
> >>
> >com.carrotsearch.randomizedtesting.ThreadLeakControl$StatementRunner
> .run(ThreadLeakControl.java:367)
> >>         at java.lang.Thread.run(Thread.java:745)
> >>
> >>
> >>
> >>
> >> Build Log:
> >> [...truncated 289 lines...]
> >>    [junit4] Suite: org.apache.lucene.store.TestMmapDirectory
> >>    [junit4]   2> NOTE: reproduce with: ant test
> >> -Dtestcase=TestMmapDirectory -Dtests.method=testPendingDeletions
> >> -Dtests.seed=96FC6F2D45B76809 -Dtests.slow=true -Dtests.locale=de-GR
> >> -Dtests.timezone=Atlantic/Faeroe -Dtests.asserts=true
> >> -Dtests.file.encoding=UTF-8
> >>    [junit4] ERROR   0.05s J0 | TestMmapDirectory.testPendingDeletions
> ><<<
> >>    [junit4]    > Throwable #1: java.security.AccessControlException:
> >> access denied ("java.io.FilePermission"
> >>
> >"C:\Users\jenkins\workspace\Lucene-Solr-6.x-
> Windows\lucene\build\core\test\J0\temp\lucene.store.TestMmapDirectory
> _96FC6F2D45B76809-001\tempDir-007\con"
> >> "write")
> >>    [junit4]    >        at
> >>
> >__randomizedtesting.SeedInfo.seed([96FC6F2D45B76809:DE018553DD164A
> B]:0)
> >>    [junit4]    >        at
> >>
> >java.security.AccessControlContext.checkPermission(AccessControlContext
> .java:472)
> >>    [junit4]    >        at
> >>
> >java.security.AccessController.checkPermission(AccessController.java:884)
> >>    [junit4]    >        at
> >> java.lang.SecurityManager.checkPermission(SecurityManager.java:549)
> >>    [junit4]    >        at
> >> java.lang.SecurityManager.checkWrite(SecurityManager.java:979)
> >>    [junit4]    >        at
> >>
> sun.nio.fs.WindowsChannelFactory.open(WindowsChannelFactory.java:295)
> >>    [junit4]    >        at
> >>
> >sun.nio.fs.WindowsChannelFactory.newFileChannel(WindowsChannelFact
> ory.java:162)
> >>    [junit4]    >        at
> >>
> >sun.nio.fs.WindowsFileSystemProvider.newByteChannel(WindowsFileSyst
> emProvider.java:225)
> >>    [junit4]    >        at
> >>
> >java.nio.file.spi.FileSystemProvider.newOutputStream(FileSystemProvider.
> java:434)
> >>    [junit4]    >        at
> >>
> >org.apache.lucene.mockfile.FilterFileSystemProvider.newOutputStream(Fil
> terFileSystemProvider.java:197)
> >>    [junit4]    >        at
> >>
> >org.apache.lucene.mockfile.FilterFileSystemProvider.newOutputStream(Fil
> terFileSystemProvider.java:197)
> >>    [junit4]    >        at
> >>
> >org.apache.lucene.mockfile.HandleTrackingFS.newOutputStream(HandleTr
> ackingFS.java:129)
> >>    [junit4]    >        at
> >>
> >org.apache.lucene.mockfile.HandleTrackingFS.newOutputStream(HandleTr
> ackingFS.java:129)
> >>    [junit4]    >        at
> >>
> >org.apache.lucene.mockfile.FilterFileSystemProvider.newOutputStream(Fil
> terFileSystemProvider.java:197)
> >>    [junit4]    >        at
> >>
> >org.apache.lucene.mockfile.FilterFileSystemProvider.newOutputStream(Fil
> terFileSystemProvider.java:197)
> >>    [junit4]    >        at
> >> java.nio.file.Files.newOutputStream(Files.java:216)
> >>    [junit4]    >        at
> >>
> >org.apache.lucene.store.FSDirectory$FSIndexOutput.<init>(FSDirectory.jav
> a:408)
> >>    [junit4]    >        at
> >>
> >org.apache.lucene.store.FSDirectory$FSIndexOutput.<init>(FSDirectory.jav
> a:404)
> >>    [junit4]    >        at
> >>
> >org.apache.lucene.store.FSDirectory.createOutput(FSDirectory.java:253)
> >>    [junit4]    >        at
> >>
> >org.apache.lucene.store.BaseDirectoryTestCase.testPendingDeletions(Bas
> eDirectoryTestCase.java:1215)
> >>    [junit4]    >        at java.lang.Thread.run(Thread.java:745)
> >>    [junit4]   2> NOTE: leaving temporary files on disk at:
> >>
> >C:\Users\jenkins\workspace\Lucene-Solr-6.x-
> Windows\lucene\build\core\test\J0\temp\lucene.store.TestMmapDirectory
> _96FC6F2D45B76809-001
> >>    [junit4]   2> NOTE: test params are: codec=Asserting(Lucene60):
> >{},
> >> docValues:{}, maxPointsInLeafNode=529,
> >maxMBSortInHeap=5.144385087286883,
> >> sim=ClassicSimilarity, locale=de-GR, timezone=Atlantic/Faeroe
> >>    [junit4]   2> NOTE: Windows 10 10.0 x86/Oracle Corporation
> >1.8.0_92
> >> (32-bit)/cpus=3,threads=1,free=3518888,total=20287488
> >>    [junit4]   2> NOTE: All tests run in this JVM: [TestBooleanQuery,
> >> TestTimSorter, TestMaxPosition, TestConstantScoreQuery,
> >> TestDuelingCodecsAtNight, TestSpanExplanationsOfNonMatches,
> TestDoc,
> >> TestRegexpQuery, TestSimpleExplanations, TestRegexpRandom,
> >> TestMultiDocValues, TestSimilarityBase, TestByteArrayDataInput,
> >> TestMatchAllDocsQuery, TestPriorityQueue, TestAutomaton,
> >> TestExitableDirectoryReader, TestMmapDirectory]
> >>    [junit4] Completed [19/422 (1!)] on J0 in 2.10s, 45 tests, 1 error
> ><<<
> >> FAILURES!
> >>
> >> [...truncated 87 lines...]
> >>    [junit4] Suite: org.apache.lucene.store.TestMultiMMap
> >>    [junit4]   2> NOTE: reproduce with: ant test
> >-Dtestcase=TestMultiMMap
> >> -Dtests.method=testPendingDeletions -Dtests.seed=96FC6F2D45B76809
> >> -Dtests.slow=true -Dtests.locale=sk -Dtests.timezone=Africa/Tunis
> >> -Dtests.asserts=true -Dtests.file.encoding=UTF-8
> >>    [junit4] ERROR   0.04s J1 | TestMultiMMap.testPendingDeletions <<<
> >>    [junit4]    > Throwable #1: java.security.AccessControlException:
> >> access denied ("java.io.FilePermission"
> >>
> >"C:\Users\jenkins\workspace\Lucene-Solr-6.x-
> Windows\lucene\build\core\test\J1\temp\lucene.store.TestMultiMMap_96
> FC6F2D45B76809-001\tempDir-004\con"
> >> "write")
> >>    [junit4]    >        at
> >>
> >__randomizedtesting.SeedInfo.seed([96FC6F2D45B76809:DE018553DD164A
> B]:0)
> >>    [junit4]    >        at
> >>
> >java.security.AccessControlContext.checkPermission(AccessControlContext
> .java:472)
> >>    [junit4]    >        at
> >>
> >java.security.AccessController.checkPermission(AccessController.java:884)
> >>    [junit4]    >        at
> >> java.lang.SecurityManager.checkPermission(SecurityManager.java:549)
> >>    [junit4]    >        at
> >> java.lang.SecurityManager.checkWrite(SecurityManager.java:979)
> >>    [junit4]    >        at
> >>
> sun.nio.fs.WindowsChannelFactory.open(WindowsChannelFactory.java:295)
> >>    [junit4]    >        at
> >>
> >sun.nio.fs.WindowsChannelFactory.newFileChannel(WindowsChannelFact
> ory.java:162)
> >>    [junit4]    >        at
> >>
> >sun.nio.fs.WindowsFileSystemProvider.newByteChannel(WindowsFileSyst
> emProvider.java:225)
> >>    [junit4]    >        at
> >>
> >java.nio.file.spi.FileSystemProvider.newOutputStream(FileSystemProvider.
> java:434)
> >>    [junit4]    >        at
> >>
> >org.apache.lucene.mockfile.FilterFileSystemProvider.newOutputStream(Fil
> terFileSystemProvider.java:197)
> >>    [junit4]    >        at
> >>
> >org.apache.lucene.mockfile.FilterFileSystemProvider.newOutputStream(Fil
> terFileSystemProvider.java:197)
> >>    [junit4]    >        at
> >>
> >org.apache.lucene.mockfile.HandleTrackingFS.newOutputStream(HandleTr
> ackingFS.java:129)
> >>    [junit4]    >        at
> >>
> >org.apache.lucene.mockfile.HandleTrackingFS.newOutputStream(HandleTr
> ackingFS.java:129)
> >>    [junit4]    >        at
> >>
> >org.apache.lucene.mockfile.FilterFileSystemProvider.newOutputStream(Fil
> terFileSystemProvider.java:197)
> >>    [junit4]    >        at
> >>
> >org.apache.lucene.mockfile.FilterFileSystemProvider.newOutputStream(Fil
> terFileSystemProvider.java:197)
> >>    [junit4]    >        at
> >> java.nio.file.Files.newOutputStream(Files.java:216)
> >>    [junit4]    >        at
> >>
> >org.apache.lucene.store.FSDirectory$FSIndexOutput.<init>(FSDirectory.jav
> a:408)
> >>    [junit4]    >        at
> >>
> >org.apache.lucene.store.FSDirectory$FSIndexOutput.<init>(FSDirectory.jav
> a:404)
> >>    [junit4]    >        at
> >>
> >org.apache.lucene.store.FSDirectory.createOutput(FSDirectory.java:253)
> >>    [junit4]    >        at
> >>
> >org.apache.lucene.store.BaseDirectoryTestCase.testPendingDeletions(Bas
> eDirectoryTestCase.java:1215)
> >>    [junit4]    >        at java.lang.Thread.run(Thread.java:745)
> >>    [junit4]   2> NOTE: leaving temporary files on disk at:
> >>
> >C:\Users\jenkins\workspace\Lucene-Solr-6.x-
> Windows\lucene\build\core\test\J1\temp\lucene.store.TestMultiMMap_96
> FC6F2D45B76809-001
> >>    [junit4]   2> NOTE: test params are: codec=Asserting(Lucene60):
> >> {docid=Lucene50(blocksize=128),
> >>
> >junk=TestBloomFilteredLucenePostings(BloomFilteringPostingsFormat(Luc
> ene50(blocksize=128)))},
> >> docValues:{}, maxPointsInLeafNode=862,
> >maxMBSortInHeap=5.292154829690764,
> >> sim=RandomSimilarity(queryNorm=true,coord=crazy): {}, locale=sk,
> >> timezone=Africa/Tunis
> >>    [junit4]   2> NOTE: Windows 10 10.0 x86/Oracle Corporation
> >1.8.0_92
> >> (32-bit)/cpus=3,threads=1,free=7155272,total=22945792
> >>    [junit4]   2> NOTE: All tests run in this JVM: [Test2BBKDPoints,
> >> TestSleepingLockWrapper, TestPointQueries, TestSynonymQuery,
> >> TestLongBitSet, TestPositiveScoresOnlyCollector, Test2BPostings,
> >> TestMultiMMap]
> >>    [junit4] Completed [46/422 (2!)] on J1 in 4.06s, 57 tests, 1 error
> ><<<
> >> FAILURES!
> >>
> >> [...truncated 1261 lines...]
> >> BUILD FAILED
> >> C:\Users\jenkins\workspace\Lucene-Solr-6.x-Windows\build.xml:740:
> The
> >> following error occurred while executing this line:
> >> C:\Users\jenkins\workspace\Lucene-Solr-6.x-Windows\build.xml:684:
> The
> >> following error occurred while executing this line:
> >> C:\Users\jenkins\workspace\Lucene-Solr-6.x-Windows\build.xml:59: The
> >> following error occurred while executing this line:
> >>
> >C:\Users\jenkins\workspace\Lucene-Solr-6.x-
> Windows\lucene\build.xml:50:
> >> The following error occurred while executing this line:
> >>
> >C:\Users\jenkins\workspace\Lucene-Solr-6.x-Windows\lucene\common-
> build.xml:1427:
> >> The following error occurred while executing this line:
> >>
> >C:\Users\jenkins\workspace\Lucene-Solr-6.x-Windows\lucene\common-
> build.xml:984:
> >> There were test failures: 422 suites (1 ignored), 3598 tests, 2
> >errors, 75
> >> ignored (71 assumptions) [seed: 96FC6F2D45B76809]
> >>
> >> Total time: 7 minutes 39 seconds
> >> Build step 'Invoke Ant' marked build as failure
> >> Archiving artifacts
> >> [WARNINGS] Skipping publisher since build result is FAILURE
> >> Recording test results
> >> Email was triggered for: Failure - Any
> >> Sending email for trigger: Failure - Any
> >>
> >>
> >>
> >>
> 
> --
> Uwe Schindler
> H.-H.-Meier-Allee 63, 28213 Bremen
> http://www.thetaphi.de
> 
> ---------------------------------------------------------------------
> To unsubscribe, e-mail: dev-unsubscribe@lucene.apache.org
> For additional commands, e-mail: dev-help@lucene.apache.org


---------------------------------------------------------------------
To unsubscribe, e-mail: dev-unsubscribe@lucene.apache.org
For additional commands, e-mail: dev-help@lucene.apache.org


Mime
View raw message