lucene-dev mailing list archives

Site index · List index
Message view « Date » · « Thread »
Top « Date » · « Thread »
From Apache Jenkins Server <jenk...@builds.apache.org>
Subject [JENKINS] Lucene-Solr-NightlyTests-6.x - Build # 93 - Still Failing
Date Thu, 16 Jun 2016 15:58:18 GMT
Build: https://builds.apache.org/job/Lucene-Solr-NightlyTests-6.x/93/

2 tests failed.
FAILED:  org.apache.solr.cloud.hdfs.HdfsCollectionsAPIDistributedZkTest.test

Error Message:
Timeout occured while waiting response from server at: https://127.0.0.1:42413/tot

Stack Trace:
org.apache.solr.client.solrj.SolrServerException: Timeout occured while waiting response from server at: https://127.0.0.1:42413/tot
	at org.apache.solr.client.solrj.impl.HttpSolrClient.executeMethod(HttpSolrClient.java:601)
	at org.apache.solr.client.solrj.impl.HttpSolrClient.request(HttpSolrClient.java:259)
	at org.apache.solr.client.solrj.impl.HttpSolrClient.request(HttpSolrClient.java:248)
	at org.apache.solr.client.solrj.SolrClient.request(SolrClient.java:1219)
	at org.apache.solr.cloud.CollectionsAPIDistributedZkTest.makeRequest(CollectionsAPIDistributedZkTest.java:399)
	at org.apache.solr.cloud.CollectionsAPIDistributedZkTest.testErrorHandling(CollectionsAPIDistributedZkTest.java:515)
	at org.apache.solr.cloud.CollectionsAPIDistributedZkTest.test(CollectionsAPIDistributedZkTest.java:179)
	at sun.reflect.NativeMethodAccessorImpl.invoke0(Native Method)
	at sun.reflect.NativeMethodAccessorImpl.invoke(NativeMethodAccessorImpl.java:62)
	at sun.reflect.DelegatingMethodAccessorImpl.invoke(DelegatingMethodAccessorImpl.java:43)
	at java.lang.reflect.Method.invoke(Method.java:498)
	at com.carrotsearch.randomizedtesting.RandomizedRunner.invoke(RandomizedRunner.java:1764)
	at com.carrotsearch.randomizedtesting.RandomizedRunner$8.evaluate(RandomizedRunner.java:871)
	at com.carrotsearch.randomizedtesting.RandomizedRunner$9.evaluate(RandomizedRunner.java:907)
	at com.carrotsearch.randomizedtesting.RandomizedRunner$10.evaluate(RandomizedRunner.java:921)
	at org.apache.solr.BaseDistributedSearchTestCase$ShardsRepeatRule$ShardsFixedStatement.callStatement(BaseDistributedSearchTestCase.java:992)
	at org.apache.solr.BaseDistributedSearchTestCase$ShardsRepeatRule$ShardsStatement.evaluate(BaseDistributedSearchTestCase.java:967)
	at com.carrotsearch.randomizedtesting.rules.SystemPropertiesRestoreRule$1.evaluate(SystemPropertiesRestoreRule.java:57)
	at org.apache.lucene.util.TestRuleSetupTeardownChained$1.evaluate(TestRuleSetupTeardownChained.java:49)
	at org.apache.lucene.util.AbstractBeforeAfterRule$1.evaluate(AbstractBeforeAfterRule.java:45)
	at org.apache.lucene.util.TestRuleThreadAndTestName$1.evaluate(TestRuleThreadAndTestName.java:48)
	at org.apache.lucene.util.TestRuleIgnoreAfterMaxFailures$1.evaluate(TestRuleIgnoreAfterMaxFailures.java:64)
	at org.apache.lucene.util.TestRuleMarkFailure$1.evaluate(TestRuleMarkFailure.java:47)
	at com.carrotsearch.randomizedtesting.rules.StatementAdapter.evaluate(StatementAdapter.java:36)
	at com.carrotsearch.randomizedtesting.ThreadLeakControl$StatementRunner.run(ThreadLeakControl.java:367)
	at com.carrotsearch.randomizedtesting.ThreadLeakControl.forkTimeoutingTask(ThreadLeakControl.java:809)
	at com.carrotsearch.randomizedtesting.ThreadLeakControl$3.evaluate(ThreadLeakControl.java:460)
	at com.carrotsearch.randomizedtesting.RandomizedRunner.runSingleTest(RandomizedRunner.java:880)
	at com.carrotsearch.randomizedtesting.RandomizedRunner$5.evaluate(RandomizedRunner.java:781)
	at com.carrotsearch.randomizedtesting.RandomizedRunner$6.evaluate(RandomizedRunner.java:816)
	at com.carrotsearch.randomizedtesting.RandomizedRunner$7.evaluate(RandomizedRunner.java:827)
	at com.carrotsearch.randomizedtesting.rules.StatementAdapter.evaluate(StatementAdapter.java:36)
	at com.carrotsearch.randomizedtesting.rules.SystemPropertiesRestoreRule$1.evaluate(SystemPropertiesRestoreRule.java:57)
	at org.apache.lucene.util.AbstractBeforeAfterRule$1.evaluate(AbstractBeforeAfterRule.java:45)
	at com.carrotsearch.randomizedtesting.rules.StatementAdapter.evaluate(StatementAdapter.java:36)
	at org.apache.lucene.util.TestRuleStoreClassName$1.evaluate(TestRuleStoreClassName.java:41)
	at com.carrotsearch.randomizedtesting.rules.NoShadowingOrOverridesOnMethodsRule$1.evaluate(NoShadowingOrOverridesOnMethodsRule.java:40)
	at com.carrotsearch.randomizedtesting.rules.NoShadowingOrOverridesOnMethodsRule$1.evaluate(NoShadowingOrOverridesOnMethodsRule.java:40)
	at com.carrotsearch.randomizedtesting.rules.StatementAdapter.evaluate(StatementAdapter.java:36)
	at com.carrotsearch.randomizedtesting.rules.StatementAdapter.evaluate(StatementAdapter.java:36)
	at com.carrotsearch.randomizedtesting.rules.StatementAdapter.evaluate(StatementAdapter.java:36)
	at org.apache.lucene.util.TestRuleAssertionsRequired$1.evaluate(TestRuleAssertionsRequired.java:53)
	at org.apache.lucene.util.TestRuleMarkFailure$1.evaluate(TestRuleMarkFailure.java:47)
	at org.apache.lucene.util.TestRuleIgnoreAfterMaxFailures$1.evaluate(TestRuleIgnoreAfterMaxFailures.java:64)
	at org.apache.lucene.util.TestRuleIgnoreTestSuites$1.evaluate(TestRuleIgnoreTestSuites.java:54)
	at com.carrotsearch.randomizedtesting.rules.StatementAdapter.evaluate(StatementAdapter.java:36)
	at com.carrotsearch.randomizedtesting.ThreadLeakControl$StatementRunner.run(ThreadLeakControl.java:367)
	at java.lang.Thread.run(Thread.java:745)
Caused by: java.net.SocketTimeoutException: Read timed out
	at java.net.SocketInputStream.socketRead0(Native Method)
	at java.net.SocketInputStream.socketRead(SocketInputStream.java:116)
	at java.net.SocketInputStream.read(SocketInputStream.java:170)
	at java.net.SocketInputStream.read(SocketInputStream.java:141)
	at sun.security.ssl.InputRecord.readFully(InputRecord.java:465)
	at sun.security.ssl.InputRecord.read(InputRecord.java:503)
	at sun.security.ssl.SSLSocketImpl.readRecord(SSLSocketImpl.java:973)
	at sun.security.ssl.SSLSocketImpl.readDataRecord(SSLSocketImpl.java:930)
	at sun.security.ssl.AppInputStream.read(AppInputStream.java:105)
	at org.apache.http.impl.io.AbstractSessionInputBuffer.fillBuffer(AbstractSessionInputBuffer.java:160)
	at org.apache.http.impl.io.SocketInputBuffer.fillBuffer(SocketInputBuffer.java:84)
	at org.apache.http.impl.io.AbstractSessionInputBuffer.readLine(AbstractSessionInputBuffer.java:273)
	at org.apache.http.impl.conn.DefaultHttpResponseParser.parseHead(DefaultHttpResponseParser.java:140)
	at org.apache.http.impl.conn.DefaultHttpResponseParser.parseHead(DefaultHttpResponseParser.java:57)
	at org.apache.http.impl.io.AbstractMessageParser.parse(AbstractMessageParser.java:261)
	at org.apache.http.impl.AbstractHttpClientConnection.receiveResponseHeader(AbstractHttpClientConnection.java:283)
	at org.apache.http.impl.conn.DefaultClientConnection.receiveResponseHeader(DefaultClientConnection.java:251)
	at org.apache.http.impl.conn.ManagedClientConnectionImpl.receiveResponseHeader(ManagedClientConnectionImpl.java:197)
	at org.apache.http.protocol.HttpRequestExecutor.doReceiveResponse(HttpRequestExecutor.java:272)
	at org.apache.http.protocol.HttpRequestExecutor.execute(HttpRequestExecutor.java:124)
	at org.apache.http.impl.client.DefaultRequestDirector.tryExecute(DefaultRequestDirector.java:685)
	at org.apache.http.impl.client.DefaultRequestDirector.execute(DefaultRequestDirector.java:487)
	at org.apache.http.impl.client.AbstractHttpClient.doExecute(AbstractHttpClient.java:882)
	at org.apache.http.impl.client.CloseableHttpClient.execute(CloseableHttpClient.java:82)
	at org.apache.http.impl.client.CloseableHttpClient.execute(CloseableHttpClient.java:107)
	at org.apache.http.impl.client.CloseableHttpClient.execute(CloseableHttpClient.java:55)
	at org.apache.solr.client.solrj.impl.HttpSolrClient.executeMethod(HttpSolrClient.java:495)
	... 47 more


FAILED:  org.apache.solr.cloud.CollectionsAPIDistributedZkTest.test

Error Message:
Captured an uncaught exception in thread: Thread[id=5245, name=collection0, state=RUNNABLE, group=TGRP-CollectionsAPIDistributedZkTest]

Stack Trace:
com.carrotsearch.randomizedtesting.UncaughtExceptionError: Captured an uncaught exception in thread: Thread[id=5245, name=collection0, state=RUNNABLE, group=TGRP-CollectionsAPIDistributedZkTest]
Caused by: org.apache.solr.client.solrj.impl.HttpSolrClient$RemoteSolrException: Error from server at http://127.0.0.1:34086: collection already exists: awholynewstresscollection_collection0_3
	at __randomizedtesting.SeedInfo.seed([DC689BC529B9A8D1]:0)
	at org.apache.solr.client.solrj.impl.HttpSolrClient.executeMethod(HttpSolrClient.java:590)
	at org.apache.solr.client.solrj.impl.HttpSolrClient.request(HttpSolrClient.java:259)
	at org.apache.solr.client.solrj.impl.HttpSolrClient.request(HttpSolrClient.java:248)
	at org.apache.solr.client.solrj.impl.LBHttpSolrClient.doRequest(LBHttpSolrClient.java:403)
	at org.apache.solr.client.solrj.impl.LBHttpSolrClient.request(LBHttpSolrClient.java:356)
	at org.apache.solr.client.solrj.impl.CloudSolrClient.sendRequest(CloudSolrClient.java:1228)
	at org.apache.solr.client.solrj.impl.CloudSolrClient.requestWithRetryOnStaleState(CloudSolrClient.java:998)
	at org.apache.solr.client.solrj.impl.CloudSolrClient.request(CloudSolrClient.java:934)
	at org.apache.solr.client.solrj.SolrClient.request(SolrClient.java:1219)
	at org.apache.solr.cloud.AbstractFullDistribZkTestBase.createCollection(AbstractFullDistribZkTestBase.java:1599)
	at org.apache.solr.cloud.AbstractFullDistribZkTestBase.createCollection(AbstractFullDistribZkTestBase.java:1620)
	at org.apache.solr.cloud.CollectionsAPIDistributedZkTest$1CollectionThread.run(CollectionsAPIDistributedZkTest.java:987)




Build Log:
[...truncated 11447 lines...]
   [junit4] Suite: org.apache.solr.cloud.CollectionsAPIDistributedZkTest
   [junit4]   2> Creating dataDir: /x1/jenkins/jenkins-slave/workspace/Lucene-Solr-NightlyTests-6.x/solr/build/solr-core/test/J1/temp/solr.cloud.CollectionsAPIDistributedZkTest_DC689BC529B9A8D1-001/init-core-data-001
   [junit4]   2> 653958 INFO  (SUITE-CollectionsAPIDistributedZkTest-seed#[DC689BC529B9A8D1]-worker) [    ] o.a.s.SolrTestCaseJ4 Randomized ssl (false) and clientAuth (true) via: @org.apache.solr.util.RandomizeSSL(reason=, ssl=NaN, value=NaN, clientAuth=NaN)
   [junit4]   2> 653958 INFO  (SUITE-CollectionsAPIDistributedZkTest-seed#[DC689BC529B9A8D1]-worker) [    ] o.a.s.BaseDistributedSearchTestCase Setting hostContext system property: /
   [junit4]   2> 653976 INFO  (TEST-CollectionsAPIDistributedZkTest.test-seed#[DC689BC529B9A8D1]) [    ] o.a.s.c.ZkTestServer STARTING ZK TEST SERVER
   [junit4]   2> 653978 INFO  (Thread-2747) [    ] o.a.s.c.ZkTestServer client port:0.0.0.0/0.0.0.0:0
   [junit4]   2> 653978 INFO  (Thread-2747) [    ] o.a.s.c.ZkTestServer Starting server
   [junit4]   2> 654078 INFO  (TEST-CollectionsAPIDistributedZkTest.test-seed#[DC689BC529B9A8D1]) [    ] o.a.s.c.ZkTestServer start zk server on port:51265
   [junit4]   2> 654078 INFO  (TEST-CollectionsAPIDistributedZkTest.test-seed#[DC689BC529B9A8D1]) [    ] o.a.s.c.c.SolrZkClient Using default ZkCredentialsProvider
   [junit4]   2> 654080 INFO  (TEST-CollectionsAPIDistributedZkTest.test-seed#[DC689BC529B9A8D1]) [    ] o.a.s.c.c.ConnectionManager Waiting for client to connect to ZooKeeper
   [junit4]   2> 654085 INFO  (zkCallback-531-thread-1) [    ] o.a.s.c.c.ConnectionManager Watcher org.apache.solr.common.cloud.ConnectionManager@c658004 name:ZooKeeperConnection Watcher:127.0.0.1:51265 got event WatchedEvent state:SyncConnected type:None path:null path:null type:None
   [junit4]   2> 654085 INFO  (TEST-CollectionsAPIDistributedZkTest.test-seed#[DC689BC529B9A8D1]) [    ] o.a.s.c.c.ConnectionManager Client is connected to ZooKeeper
   [junit4]   2> 654086 INFO  (TEST-CollectionsAPIDistributedZkTest.test-seed#[DC689BC529B9A8D1]) [    ] o.a.s.c.c.SolrZkClient Using default ZkACLProvider
   [junit4]   2> 654086 INFO  (TEST-CollectionsAPIDistributedZkTest.test-seed#[DC689BC529B9A8D1]) [    ] o.a.s.c.c.SolrZkClient makePath: /solr
   [junit4]   2> 654094 INFO  (TEST-CollectionsAPIDistributedZkTest.test-seed#[DC689BC529B9A8D1]) [    ] o.a.s.c.c.SolrZkClient Using default ZkCredentialsProvider
   [junit4]   2> 654103 INFO  (TEST-CollectionsAPIDistributedZkTest.test-seed#[DC689BC529B9A8D1]) [    ] o.a.s.c.c.ConnectionManager Waiting for client to connect to ZooKeeper
   [junit4]   2> 654103 INFO  (zkCallback-532-thread-1) [    ] o.a.s.c.c.ConnectionManager Watcher org.apache.solr.common.cloud.ConnectionManager@496eeec7 name:ZooKeeperConnection Watcher:127.0.0.1:51265/solr got event WatchedEvent state:SyncConnected type:None path:null path:null type:None
   [junit4]   2> 654103 INFO  (TEST-CollectionsAPIDistributedZkTest.test-seed#[DC689BC529B9A8D1]) [    ] o.a.s.c.c.ConnectionManager Client is connected to ZooKeeper
   [junit4]   2> 654103 INFO  (TEST-CollectionsAPIDistributedZkTest.test-seed#[DC689BC529B9A8D1]) [    ] o.a.s.c.c.SolrZkClient Using default ZkACLProvider
   [junit4]   2> 654103 INFO  (TEST-CollectionsAPIDistributedZkTest.test-seed#[DC689BC529B9A8D1]) [    ] o.a.s.c.c.SolrZkClient makePath: /collections/collection1
   [junit4]   2> 654104 INFO  (TEST-CollectionsAPIDistributedZkTest.test-seed#[DC689BC529B9A8D1]) [    ] o.a.s.c.c.SolrZkClient makePath: /collections/collection1/shards
   [junit4]   2> 654105 INFO  (TEST-CollectionsAPIDistributedZkTest.test-seed#[DC689BC529B9A8D1]) [    ] o.a.s.c.c.SolrZkClient makePath: /collections/control_collection
   [junit4]   2> 654105 INFO  (TEST-CollectionsAPIDistributedZkTest.test-seed#[DC689BC529B9A8D1]) [    ] o.a.s.c.c.SolrZkClient makePath: /collections/control_collection/shards
   [junit4]   2> 654106 INFO  (TEST-CollectionsAPIDistributedZkTest.test-seed#[DC689BC529B9A8D1]) [    ] o.a.s.c.AbstractZkTestCase put /x1/jenkins/jenkins-slave/workspace/Lucene-Solr-NightlyTests-6.x/solr/core/src/test-files/solr/collection1/conf/solrconfig-tlog.xml to /configs/conf1/solrconfig.xml
   [junit4]   2> 654106 INFO  (TEST-CollectionsAPIDistributedZkTest.test-seed#[DC689BC529B9A8D1]) [    ] o.a.s.c.c.SolrZkClient makePath: /configs/conf1/solrconfig.xml
   [junit4]   2> 654107 INFO  (TEST-CollectionsAPIDistributedZkTest.test-seed#[DC689BC529B9A8D1]) [    ] o.a.s.c.AbstractZkTestCase put /x1/jenkins/jenkins-slave/workspace/Lucene-Solr-NightlyTests-6.x/solr/core/src/test-files/solr/collection1/conf/schema.xml to /configs/conf1/schema.xml
   [junit4]   2> 654107 INFO  (TEST-CollectionsAPIDistributedZkTest.test-seed#[DC689BC529B9A8D1]) [    ] o.a.s.c.c.SolrZkClient makePath: /configs/conf1/schema.xml
   [junit4]   2> 654107 INFO  (TEST-CollectionsAPIDistributedZkTest.test-seed#[DC689BC529B9A8D1]) [    ] o.a.s.c.AbstractZkTestCase put /x1/jenkins/jenkins-slave/workspace/Lucene-Solr-NightlyTests-6.x/solr/core/src/test-files/solr/collection1/conf/solrconfig.snippet.randomindexconfig.xml to /configs/conf1/solrconfig.snippet.randomindexconfig.xml
   [junit4]   2> 654108 INFO  (TEST-CollectionsAPIDistributedZkTest.test-seed#[DC689BC529B9A8D1]) [    ] o.a.s.c.c.SolrZkClient makePath: /configs/conf1/solrconfig.snippet.randomindexconfig.xml
   [junit4]   2> 654108 INFO  (TEST-CollectionsAPIDistributedZkTest.test-seed#[DC689BC529B9A8D1]) [    ] o.a.s.c.AbstractZkTestCase put /x1/jenkins/jenkins-slave/workspace/Lucene-Solr-NightlyTests-6.x/solr/core/src/test-files/solr/collection1/conf/stopwords.txt to /configs/conf1/stopwords.txt
   [junit4]   2> 654108 INFO  (TEST-CollectionsAPIDistributedZkTest.test-seed#[DC689BC529B9A8D1]) [    ] o.a.s.c.c.SolrZkClient makePath: /configs/conf1/stopwords.txt
   [junit4]   2> 654109 INFO  (TEST-CollectionsAPIDistributedZkTest.test-seed#[DC689BC529B9A8D1]) [    ] o.a.s.c.AbstractZkTestCase put /x1/jenkins/jenkins-slave/workspace/Lucene-Solr-NightlyTests-6.x/solr/core/src/test-files/solr/collection1/conf/protwords.txt to /configs/conf1/protwords.txt
   [junit4]   2> 654109 INFO  (TEST-CollectionsAPIDistributedZkTest.test-seed#[DC689BC529B9A8D1]) [    ] o.a.s.c.c.SolrZkClient makePath: /configs/conf1/protwords.txt
   [junit4]   2> 654118 INFO  (TEST-CollectionsAPIDistributedZkTest.test-seed#[DC689BC529B9A8D1]) [    ] o.a.s.c.AbstractZkTestCase put /x1/jenkins/jenkins-slave/workspace/Lucene-Solr-NightlyTests-6.x/solr/core/src/test-files/solr/collection1/conf/currency.xml to /configs/conf1/currency.xml
   [junit4]   2> 654118 INFO  (TEST-CollectionsAPIDistributedZkTest.test-seed#[DC689BC529B9A8D1]) [    ] o.a.s.c.c.SolrZkClient makePath: /configs/conf1/currency.xml
   [junit4]   2> 654118 INFO  (TEST-CollectionsAPIDistributedZkTest.test-seed#[DC689BC529B9A8D1]) [    ] o.a.s.c.AbstractZkTestCase put /x1/jenkins/jenkins-slave/workspace/Lucene-Solr-NightlyTests-6.x/solr/core/src/test-files/solr/collection1/conf/enumsConfig.xml to /configs/conf1/enumsConfig.xml
   [junit4]   2> 654118 INFO  (TEST-CollectionsAPIDistributedZkTest.test-seed#[DC689BC529B9A8D1]) [    ] o.a.s.c.c.SolrZkClient makePath: /configs/conf1/enumsConfig.xml
   [junit4]   2> 654119 INFO  (TEST-CollectionsAPIDistributedZkTest.test-seed#[DC689BC529B9A8D1]) [    ] o.a.s.c.AbstractZkTestCase put /x1/jenkins/jenkins-slave/workspace/Lucene-Solr-NightlyTests-6.x/solr/core/src/test-files/solr/collection1/conf/open-exchange-rates.json to /configs/conf1/open-exchange-rates.json
   [junit4]   2> 654119 INFO  (TEST-CollectionsAPIDistributedZkTest.test-seed#[DC689BC529B9A8D1]) [    ] o.a.s.c.c.SolrZkClient makePath: /configs/conf1/open-exchange-rates.json
   [junit4]   2> 654120 INFO  (TEST-CollectionsAPIDistributedZkTest.test-seed#[DC689BC529B9A8D1]) [    ] o.a.s.c.AbstractZkTestCase put /x1/jenkins/jenkins-slave/workspace/Lucene-Solr-NightlyTests-6.x/solr/core/src/test-files/solr/collection1/conf/mapping-ISOLatin1Accent.txt to /configs/conf1/mapping-ISOLatin1Accent.txt
   [junit4]   2> 654120 INFO  (TEST-CollectionsAPIDistributedZkTest.test-seed#[DC689BC529B9A8D1]) [    ] o.a.s.c.c.SolrZkClient makePath: /configs/conf1/mapping-ISOLatin1Accent.txt
   [junit4]   2> 654120 INFO  (TEST-CollectionsAPIDistributedZkTest.test-seed#[DC689BC529B9A8D1]) [    ] o.a.s.c.AbstractZkTestCase put /x1/jenkins/jenkins-slave/workspace/Lucene-Solr-NightlyTests-6.x/solr/core/src/test-files/solr/collection1/conf/old_synonyms.txt to /configs/conf1/old_synonyms.txt
   [junit4]   2> 654120 INFO  (TEST-CollectionsAPIDistributedZkTest.test-seed#[DC689BC529B9A8D1]) [    ] o.a.s.c.c.SolrZkClient makePath: /configs/conf1/old_synonyms.txt
   [junit4]   2> 654121 INFO  (TEST-CollectionsAPIDistributedZkTest.test-seed#[DC689BC529B9A8D1]) [    ] o.a.s.c.AbstractZkTestCase put /x1/jenkins/jenkins-slave/workspace/Lucene-Solr-NightlyTests-6.x/solr/core/src/test-files/solr/collection1/conf/synonyms.txt to /configs/conf1/synonyms.txt
   [junit4]   2> 654121 INFO  (TEST-CollectionsAPIDistributedZkTest.test-seed#[DC689BC529B9A8D1]) [    ] o.a.s.c.c.SolrZkClient makePath: /configs/conf1/synonyms.txt
   [junit4]   2> 654130 INFO  (TEST-CollectionsAPIDistributedZkTest.test-seed#[DC689BC529B9A8D1]) [    ] o.a.s.c.c.SolrZkClient Using default ZkCredentialsProvider
   [junit4]   2> 654131 INFO  (TEST-CollectionsAPIDistributedZkTest.test-seed#[DC689BC529B9A8D1]) [    ] o.a.s.c.c.ConnectionManager Waiting for client to connect to ZooKeeper
   [junit4]   2> 654131 INFO  (zkCallback-533-thread-1) [    ] o.a.s.c.c.ConnectionManager Watcher org.apache.solr.common.cloud.ConnectionManager@1b0c3ba6 name:ZooKeeperConnection Watcher:127.0.0.1:51265 got event WatchedEvent state:SyncConnected type:None path:null path:null type:None
   [junit4]   2> 654131 INFO  (TEST-CollectionsAPIDistributedZkTest.test-seed#[DC689BC529B9A8D1]) [    ] o.a.s.c.c.ConnectionManager Client is connected to ZooKeeper
   [junit4]   2> 654131 INFO  (TEST-CollectionsAPIDistributedZkTest.test-seed#[DC689BC529B9A8D1]) [    ] o.a.s.c.c.SolrZkClient Using default ZkACLProvider
   [junit4]   2> 654131 INFO  (TEST-CollectionsAPIDistributedZkTest.test-seed#[DC689BC529B9A8D1]) [    ] o.a.s.c.c.SolrZkClient makePath: /solr
   [junit4]   2> 654142 INFO  (TEST-CollectionsAPIDistributedZkTest.test-seed#[DC689BC529B9A8D1]) [    ] o.a.s.c.c.SolrZkClient Using default ZkCredentialsProvider
   [junit4]   2> 654151 INFO  (TEST-CollectionsAPIDistributedZkTest.test-seed#[DC689BC529B9A8D1]) [    ] o.a.s.c.c.ConnectionManager Waiting for client to connect to ZooKeeper
   [junit4]   2> 654163 INFO  (zkCallback-534-thread-1) [    ] o.a.s.c.c.ConnectionManager Watcher org.apache.solr.common.cloud.ConnectionManager@5a0abb9b name:ZooKeeperConnection Watcher:127.0.0.1:51265/solr got event WatchedEvent state:SyncConnected type:None path:null path:null type:None
   [junit4]   2> 654163 INFO  (TEST-CollectionsAPIDistributedZkTest.test-seed#[DC689BC529B9A8D1]) [    ] o.a.s.c.c.ConnectionManager Client is connected to ZooKeeper
   [junit4]   2> 654163 INFO  (TEST-CollectionsAPIDistributedZkTest.test-seed#[DC689BC529B9A8D1]) [    ] o.a.s.c.c.SolrZkClient Using default ZkACLProvider
   [junit4]   2> 654163 INFO  (TEST-CollectionsAPIDistributedZkTest.test-seed#[DC689BC529B9A8D1]) [    ] o.a.s.c.AbstractZkTestCase put /x1/jenkins/jenkins-slave/workspace/Lucene-Solr-NightlyTests-6.x/solr/core/src/test-files/solr/collection1/conf/solrconfig-tlog.xml to /configs/conf2/solrconfig.xml
   [junit4]   2> 654163 INFO  (TEST-CollectionsAPIDistributedZkTest.test-seed#[DC689BC529B9A8D1]) [    ] o.a.s.c.c.SolrZkClient makePath: /configs/conf2/solrconfig.xml
   [junit4]   2> 654164 INFO  (TEST-CollectionsAPIDistributedZkTest.test-seed#[DC689BC529B9A8D1]) [    ] o.a.s.c.AbstractZkTestCase put /x1/jenkins/jenkins-slave/workspace/Lucene-Solr-NightlyTests-6.x/solr/core/src/test-files/solr/collection1/conf/schema.xml to /configs/conf2/schema.xml
   [junit4]   2> 654164 INFO  (TEST-CollectionsAPIDistributedZkTest.test-seed#[DC689BC529B9A8D1]) [    ] o.a.s.c.c.SolrZkClient makePath: /configs/conf2/schema.xml
   [junit4]   2> 654165 INFO  (TEST-CollectionsAPIDistributedZkTest.test-seed#[DC689BC529B9A8D1]) [    ] o.a.s.c.AbstractZkTestCase put /x1/jenkins/jenkins-slave/workspace/Lucene-Solr-NightlyTests-6.x/solr/core/src/test-files/solr/collection1/conf/enumsConfig.xml to /configs/conf2/enumsConfig.xml
   [junit4]   2> 654165 INFO  (TEST-CollectionsAPIDistributedZkTest.test-seed#[DC689BC529B9A8D1]) [    ] o.a.s.c.c.SolrZkClient makePath: /configs/conf2/enumsConfig.xml
   [junit4]   2> 654166 INFO  (TEST-CollectionsAPIDistributedZkTest.test-seed#[DC689BC529B9A8D1]) [    ] o.a.s.c.AbstractZkTestCase put /x1/jenkins/jenkins-slave/workspace/Lucene-Solr-NightlyTests-6.x/solr/core/src/test-files/solr/collection1/conf/solrconfig.snippet.randomindexconfig.xml to /configs/conf2/solrconfig.snippet.randomindexconfig.xml
   [junit4]   2> 654166 INFO  (TEST-CollectionsAPIDistributedZkTest.test-seed#[DC689BC529B9A8D1]) [    ] o.a.s.c.c.SolrZkClient makePath: /configs/conf2/solrconfig.snippet.randomindexconfig.xml
   [junit4]   2> 654166 INFO  (TEST-CollectionsAPIDistributedZkTest.test-seed#[DC689BC529B9A8D1]) [    ] o.a.s.c.AbstractZkTestCase put /x1/jenkins/jenkins-slave/workspace/Lucene-Solr-NightlyTests-6.x/solr/core/src/test-files/solr/collection1/conf/stopwords.txt to /configs/conf2/stopwords.txt
   [junit4]   2> 654166 INFO  (TEST-CollectionsAPIDistributedZkTest.test-seed#[DC689BC529B9A8D1]) [    ] o.a.s.c.c.SolrZkClient makePath: /configs/conf2/stopwords.txt
   [junit4]   2> 654167 INFO  (TEST-CollectionsAPIDistributedZkTest.test-seed#[DC689BC529B9A8D1]) [    ] o.a.s.c.AbstractZkTestCase put /x1/jenkins/jenkins-slave/workspace/Lucene-Solr-NightlyTests-6.x/solr/core/src/test-files/solr/collection1/conf/protwords.txt to /configs/conf2/protwords.txt
   [junit4]   2> 654167 INFO  (TEST-CollectionsAPIDistributedZkTest.test-seed#[DC689BC529B9A8D1]) [    ] o.a.s.c.c.SolrZkClient makePath: /configs/conf2/protwords.txt
   [junit4]   2> 654168 INFO  (TEST-CollectionsAPIDistributedZkTest.test-seed#[DC689BC529B9A8D1]) [    ] o.a.s.c.AbstractZkTestCase put /x1/jenkins/jenkins-slave/workspace/Lucene-Solr-NightlyTests-6.x/solr/core/src/test-files/solr/collection1/conf/currency.xml to /configs/conf2/currency.xml
   [junit4]   2> 654168 INFO  (TEST-CollectionsAPIDistributedZkTest.test-seed#[DC689BC529B9A8D1]) [    ] o.a.s.c.c.SolrZkClient makePath: /configs/conf2/currency.xml
   [junit4]   2> 654168 INFO  (TEST-CollectionsAPIDistributedZkTest.test-seed#[DC689BC529B9A8D1]) [    ] o.a.s.c.AbstractZkTestCase put /x1/jenkins/jenkins-slave/workspace/Lucene-Solr-NightlyTests-6.x/solr/core/src/test-files/solr/collection1/conf/open-exchange-rates.json to /configs/conf2/open-exchange-rates.json
   [junit4]   2> 654168 INFO  (TEST-CollectionsAPIDistributedZkTest.test-seed#[DC689BC529B9A8D1]) [    ] o.a.s.c.c.SolrZkClient makePath: /configs/conf2/open-exchange-rates.json
   [junit4]   2> 654169 INFO  (TEST-CollectionsAPIDistributedZkTest.test-seed#[DC689BC529B9A8D1]) [    ] o.a.s.c.AbstractZkTestCase put /x1/jenkins/jenkins-slave/workspace/Lucene-Solr-NightlyTests-6.x/solr/core/src/test-files/solr/collection1/conf/mapping-ISOLatin1Accent.txt to /configs/conf2/mapping-ISOLatin1Accent.txt
   [junit4]   2> 654169 INFO  (TEST-CollectionsAPIDistributedZkTest.test-seed#[DC689BC529B9A8D1]) [    ] o.a.s.c.c.SolrZkClient makePath: /configs/conf2/mapping-ISOLatin1Accent.txt
   [junit4]   2> 654169 INFO  (TEST-CollectionsAPIDistributedZkTest.test-seed#[DC689BC529B9A8D1]) [    ] o.a.s.c.AbstractZkTestCase put /x1/jenkins/jenkins-slave/workspace/Lucene-Solr-NightlyTests-6.x/solr/core/src/test-files/solr/collection1/conf/old_synonyms.txt to /configs/conf2/old_synonyms.txt
   [junit4]   2> 654170 INFO  (TEST-CollectionsAPIDistributedZkTest.test-seed#[DC689BC529B9A8D1]) [    ] o.a.s.c.c.SolrZkClient makePath: /configs/conf2/old_synonyms.txt
   [junit4]   2> 654170 INFO  (TEST-CollectionsAPIDistributedZkTest.test-seed#[DC689BC529B9A8D1]) [    ] o.a.s.c.AbstractZkTestCase put /x1/jenkins/jenkins-slave/workspace/Lucene-Solr-NightlyTests-6.x/solr/core/src/test-files/solr/collection1/conf/synonyms.txt to /configs/conf2/synonyms.txt
   [junit4]   2> 654170 INFO  (TEST-CollectionsAPIDistributedZkTest.test-seed#[DC689BC529B9A8D1]) [    ] o.a.s.c.c.SolrZkClient makePath: /configs/conf2/synonyms.txt
   [junit4]   2> 654171 INFO  (TEST-CollectionsAPIDistributedZkTest.test-seed#[DC689BC529B9A8D1]) [    ] o.a.s.c.AbstractZkTestCase put /x1/jenkins/jenkins-slave/workspace/Lucene-Solr-NightlyTests-6.x/solr/core/src/test-files/solr/collection1/conf/elevate.xml to /configs/conf2/elevate.xml
   [junit4]   2> 654171 INFO  (TEST-CollectionsAPIDistributedZkTest.test-seed#[DC689BC529B9A8D1]) [    ] o.a.s.c.c.SolrZkClient makePath: /configs/conf2/elevate.xml
   [junit4]   2> 654283 INFO  (TEST-CollectionsAPIDistributedZkTest.test-seed#[DC689BC529B9A8D1]) [    ] o.a.s.SolrTestCaseJ4 Writing core.properties file to /x1/jenkins/jenkins-slave/workspace/Lucene-Solr-NightlyTests-6.x/solr/build/solr-core/test/J1/temp/solr.cloud.CollectionsAPIDistributedZkTest_DC689BC529B9A8D1-001/control-001/cores/collection1
   [junit4]   2> 654284 INFO  (TEST-CollectionsAPIDistributedZkTest.test-seed#[DC689BC529B9A8D1]) [    ] o.e.j.s.Server jetty-9.3.8.v20160314
   [junit4]   2> 654376 INFO  (TEST-CollectionsAPIDistributedZkTest.test-seed#[DC689BC529B9A8D1]) [    ] o.e.j.s.h.ContextHandler Started o.e.j.s.ServletContextHandler@3e554ee1{/,null,AVAILABLE}
   [junit4]   2> 654376 INFO  (TEST-CollectionsAPIDistributedZkTest.test-seed#[DC689BC529B9A8D1]) [    ] o.e.j.s.ServerConnector Started ServerConnector@2eae5ff1{HTTP/1.1,[http/1.1]}{127.0.0.1:37752}
   [junit4]   2> 654376 INFO  (TEST-CollectionsAPIDistributedZkTest.test-seed#[DC689BC529B9A8D1]) [    ] o.e.j.s.Server Started @657523ms
   [junit4]   2> 654376 INFO  (TEST-CollectionsAPIDistributedZkTest.test-seed#[DC689BC529B9A8D1]) [    ] o.a.s.c.s.e.JettySolrRunner Jetty properties: {solr.data.dir=/x1/jenkins/jenkins-slave/workspace/Lucene-Solr-NightlyTests-6.x/solr/build/solr-core/test/J1/temp/solr.cloud.CollectionsAPIDistributedZkTest_DC689BC529B9A8D1-001/tempDir-001/control/data, hostContext=/, hostPort=37752, coreRootDirectory=/x1/jenkins/jenkins-slave/workspace/Lucene-Solr-NightlyTests-6.x/solr/build/solr-core/test/J1/../../../../../../../../../../x1/jenkins/jenkins-slave/workspace/Lucene-Solr-NightlyTests-6.x/solr/build/solr-core/test/J1/temp/solr.cloud.CollectionsAPIDistributedZkTest_DC689BC529B9A8D1-001/control-001/cores}
   [junit4]   2> 654377 INFO  (TEST-CollectionsAPIDistributedZkTest.test-seed#[DC689BC529B9A8D1]) [    ] o.a.s.s.SolrDispatchFilter SolrDispatchFilter.init(): sun.misc.Launcher$AppClassLoader@73d16e93
   [junit4]   2> 654377 INFO  (TEST-CollectionsAPIDistributedZkTest.test-seed#[DC689BC529B9A8D1]) [    ] o.a.s.c.SolrResourceLoader new SolrResourceLoader for directory: '/x1/jenkins/jenkins-slave/workspace/Lucene-Solr-NightlyTests-6.x/solr/build/solr-core/test/J1/temp/solr.cloud.CollectionsAPIDistributedZkTest_DC689BC529B9A8D1-001/control-001'
   [junit4]   2> 654377 INFO  (TEST-CollectionsAPIDistributedZkTest.test-seed#[DC689BC529B9A8D1]) [    ] o.a.s.c.SolrResourceLoader JNDI not configured for solr (NoInitialContextEx)
   [junit4]   2> 654377 INFO  (TEST-CollectionsAPIDistributedZkTest.test-seed#[DC689BC529B9A8D1]) [    ] o.a.s.c.SolrResourceLoader solr home defaulted to 'solr/' (could not find system property or JNDI)
   [junit4]   2> 654377 INFO  (TEST-CollectionsAPIDistributedZkTest.test-seed#[DC689BC529B9A8D1]) [    ] o.a.s.c.c.SolrZkClient Using default ZkCredentialsProvider
   [junit4]   2> 654395 INFO  (TEST-CollectionsAPIDistributedZkTest.test-seed#[DC689BC529B9A8D1]) [    ] o.a.s.c.c.ConnectionManager Waiting for client to connect to ZooKeeper
   [junit4]   2> 654418 INFO  (zkCallback-535-thread-1) [    ] o.a.s.c.c.ConnectionManager Watcher org.apache.solr.common.cloud.ConnectionManager@3d6adcc9 name:ZooKeeperConnection Watcher:127.0.0.1:51265/solr got event WatchedEvent state:SyncConnected type:None path:null path:null type:None
   [junit4]   2> 654418 INFO  (TEST-CollectionsAPIDistributedZkTest.test-seed#[DC689BC529B9A8D1]) [    ] o.a.s.c.c.ConnectionManager Client is connected to ZooKeeper
   [junit4]   2> 654418 INFO  (TEST-CollectionsAPIDistributedZkTest.test-seed#[DC689BC529B9A8D1]) [    ] o.a.s.c.c.SolrZkClient Using default ZkACLProvider
   [junit4]   2> 654419 INFO  (TEST-CollectionsAPIDistributedZkTest.test-seed#[DC689BC529B9A8D1]) [    ] o.a.s.s.SolrDispatchFilter Loading solr.xml from SolrHome (not found in ZooKeeper)
   [junit4]   2> 654419 INFO  (TEST-CollectionsAPIDistributedZkTest.test-seed#[DC689BC529B9A8D1]) [    ] o.a.s.c.SolrXmlConfig Loading container configuration from /x1/jenkins/jenkins-slave/workspace/Lucene-Solr-NightlyTests-6.x/solr/build/solr-core/test/J1/temp/solr.cloud.CollectionsAPIDistributedZkTest_DC689BC529B9A8D1-001/control-001/solr.xml
   [junit4]   2> 654423 INFO  (TEST-CollectionsAPIDistributedZkTest.test-seed#[DC689BC529B9A8D1]) [    ] o.a.s.c.CorePropertiesLocator Config-defined core root directory: /x1/jenkins/jenkins-slave/workspace/Lucene-Solr-NightlyTests-6.x/solr/build/solr-core/test/J1/../../../../../../../../../../x1/jenkins/jenkins-slave/workspace/Lucene-Solr-NightlyTests-6.x/solr/build/solr-core/test/J1/temp/solr.cloud.CollectionsAPIDistributedZkTest_DC689BC529B9A8D1-001/control-001/cores
   [junit4]   2> 654423 INFO  (TEST-CollectionsAPIDistributedZkTest.test-seed#[DC689BC529B9A8D1]) [    ] o.a.s.c.CoreContainer New CoreContainer 207313509
   [junit4]   2> 654423 INFO  (TEST-CollectionsAPIDistributedZkTest.test-seed#[DC689BC529B9A8D1]) [    ] o.a.s.c.CoreContainer Loading cores into CoreContainer [instanceDir=/x1/jenkins/jenkins-slave/workspace/Lucene-Solr-NightlyTests-6.x/solr/build/solr-core/test/J1/temp/solr.cloud.CollectionsAPIDistributedZkTest_DC689BC529B9A8D1-001/control-001]
   [junit4]   2> 654423 WARN  (TEST-CollectionsAPIDistributedZkTest.test-seed#[DC689BC529B9A8D1]) [    ] o.a.s.c.CoreContainer Couldn't add files from /x1/jenkins/jenkins-slave/workspace/Lucene-Solr-NightlyTests-6.x/solr/build/solr-core/test/J1/temp/solr.cloud.CollectionsAPIDistributedZkTest_DC689BC529B9A8D1-001/control-001/lib to classpath: /x1/jenkins/jenkins-slave/workspace/Lucene-Solr-NightlyTests-6.x/solr/build/solr-core/test/J1/temp/solr.cloud.CollectionsAPIDistributedZkTest_DC689BC529B9A8D1-001/control-001/lib
   [junit4]   2> 654423 INFO  (TEST-CollectionsAPIDistributedZkTest.test-seed#[DC689BC529B9A8D1]) [    ] o.a.s.h.c.HttpShardHandlerFactory created with socketTimeout : 90000,urlScheme : ,connTimeout : 15000,maxConnectionsPerHost : 20,maxConnections : 10000,corePoolSize : 0,maximumPoolSize : 2147483647,maxThreadIdleTime : 5,sizeOfQueue : -1,fairnessPolicy : false,useRetries : false,
   [junit4]   2> 654424 INFO  (TEST-CollectionsAPIDistributedZkTest.test-seed#[DC689BC529B9A8D1]) [    ] o.a.s.u.UpdateShardHandler Creating UpdateShardHandler HTTP client with params: socketTimeout=340000&connTimeout=45000&retry=true
   [junit4]   2> 654424 INFO  (TEST-CollectionsAPIDistributedZkTest.test-seed#[DC689BC529B9A8D1]) [    ] o.a.s.l.LogWatcher SLF4J impl is org.slf4j.impl.Log4jLoggerFactory
   [junit4]   2> 654424 INFO  (TEST-CollectionsAPIDistributedZkTest.test-seed#[DC689BC529B9A8D1]) [    ] o.a.s.l.LogWatcher Registering Log Listener [Log4j (org.slf4j.impl.Log4jLoggerFactory)]
   [junit4]   2> 654424 INFO  (TEST-CollectionsAPIDistributedZkTest.test-seed#[DC689BC529B9A8D1]) [    ] o.a.s.c.ZkContainer Zookeeper client=127.0.0.1:51265/solr
   [junit4]   2> 654424 INFO  (TEST-CollectionsAPIDistributedZkTest.test-seed#[DC689BC529B9A8D1]) [    ] o.a.s.c.ZkController zkHost includes chroot
   [junit4]   2> 654424 INFO  (TEST-CollectionsAPIDistributedZkTest.test-seed#[DC689BC529B9A8D1]) [    ] o.a.s.c.c.SolrZkClient Using default ZkCredentialsProvider
   [junit4]   2> 654441 INFO  (TEST-CollectionsAPIDistributedZkTest.test-seed#[DC689BC529B9A8D1]) [    ] o.a.s.c.c.ConnectionManager Waiting for client to connect to ZooKeeper
   [junit4]   2> 654463 INFO  (zkCallback-538-thread-1) [    ] o.a.s.c.c.ConnectionManager Watcher org.apache.solr.common.cloud.ConnectionManager@6d4025a8 name:ZooKeeperConnection Watcher:127.0.0.1:51265 got event WatchedEvent state:SyncConnected type:None path:null path:null type:None
   [junit4]   2> 654463 INFO  (TEST-CollectionsAPIDistributedZkTest.test-seed#[DC689BC529B9A8D1]) [    ] o.a.s.c.c.ConnectionManager Client is connected to ZooKeeper
   [junit4]   2> 654464 INFO  (TEST-CollectionsAPIDistributedZkTest.test-seed#[DC689BC529B9A8D1]) [    ] o.a.s.c.c.SolrZkClient Using default ZkACLProvider
   [junit4]   2> 654465 INFO  (TEST-CollectionsAPIDistributedZkTest.test-seed#[DC689BC529B9A8D1]) [n:127.0.0.1:37752_    ] o.a.s.c.ZkController Added new OnReconnect listener org.apache.solr.cloud.ZkController$$Lambda$74/1731504286@7476a3c8
   [junit4]   2> 654477 INFO  (TEST-CollectionsAPIDistributedZkTest.test-seed#[DC689BC529B9A8D1]) [n:127.0.0.1:37752_    ] o.a.s.c.c.ConnectionManager Waiting for client to connect to ZooKeeper
   [junit4]   2> 654500 INFO  (zkCallback-539-thread-1-processing-n:127.0.0.1:37752_) [n:127.0.0.1:37752_    ] o.a.s.c.c.ConnectionManager Watcher org.apache.solr.common.cloud.ConnectionManager@3e6246a2 name:ZooKeeperConnection Watcher:127.0.0.1:51265/solr got event WatchedEvent state:SyncConnected type:None path:null path:null type:None
   [junit4]   2> 654500 INFO  (TEST-CollectionsAPIDistributedZkTest.test-seed#[DC689BC529B9A8D1]) [n:127.0.0.1:37752_    ] o.a.s.c.c.ConnectionManager Client is connected to ZooKeeper
   [junit4]   2> 654501 INFO  (TEST-CollectionsAPIDistributedZkTest.test-seed#[DC689BC529B9A8D1]) [n:127.0.0.1:37752_    ] o.a.s.c.c.SolrZkClient makePath: /overseer/queue
   [junit4]   2> 654503 INFO  (TEST-CollectionsAPIDistributedZkTest.test-seed#[DC689BC529B9A8D1]) [n:127.0.0.1:37752_    ] o.a.s.c.c.SolrZkClient makePath: /overseer/collection-queue-work
   [junit4]   2> 654504 INFO  (TEST-CollectionsAPIDistributedZkTest.test-seed#[DC689BC529B9A8D1]) [n:127.0.0.1:37752_    ] o.a.s.c.c.SolrZkClient makePath: /overseer/collection-map-running
   [junit4]   2> 654505 INFO  (TEST-CollectionsAPIDistributedZkTest.test-seed#[DC689BC529B9A8D1]) [n:127.0.0.1:37752_    ] o.a.s.c.c.SolrZkClient makePath: /overseer/collection-map-completed
   [junit4]   2> 654506 INFO  (TEST-CollectionsAPIDistributedZkTest.test-seed#[DC689BC529B9A8D1]) [n:127.0.0.1:37752_    ] o.a.s.c.c.SolrZkClient makePath: /overseer/collection-map-failure
   [junit4]   2> 654506 INFO  (TEST-CollectionsAPIDistributedZkTest.test-seed#[DC689BC529B9A8D1]) [n:127.0.0.1:37752_    ] o.a.s.c.c.SolrZkClient makePath: /live_nodes
   [junit4]   2> 654507 INFO  (TEST-CollectionsAPIDistributedZkTest.test-seed#[DC689BC529B9A8D1]) [n:127.0.0.1:37752_    ] o.a.s.c.c.SolrZkClient makePath: /aliases.json
   [junit4]   2> 654507 INFO  (TEST-CollectionsAPIDistributedZkTest.test-seed#[DC689BC529B9A8D1]) [n:127.0.0.1:37752_    ] o.a.s.c.c.SolrZkClient makePath: /clusterstate.json
   [junit4]   2> 654508 INFO  (TEST-CollectionsAPIDistributedZkTest.test-seed#[DC689BC529B9A8D1]) [n:127.0.0.1:37752_    ] o.a.s.c.c.SolrZkClient makePath: /security.json
   [junit4]   2> 654508 INFO  (TEST-CollectionsAPIDistributedZkTest.test-seed#[DC689BC529B9A8D1]) [n:127.0.0.1:37752_    ] o.a.s.c.c.ZkStateReader Updating cluster state from ZooKeeper... 
   [junit4]   2> 654509 INFO  (TEST-CollectionsAPIDistributedZkTest.test-seed#[DC689BC529B9A8D1]) [n:127.0.0.1:37752_    ] o.a.s.c.c.ZkStateReader Loaded empty cluster properties
   [junit4]   2> 654510 INFO  (TEST-CollectionsAPIDistributedZkTest.test-seed#[DC689BC529B9A8D1]) [n:127.0.0.1:37752_    ] o.a.s.c.c.ZkStateReader Updated live nodes from ZooKeeper... (0) -> (0)
   [junit4]   2> 654511 INFO  (TEST-CollectionsAPIDistributedZkTest.test-seed#[DC689BC529B9A8D1]) [n:127.0.0.1:37752_    ] o.a.s.c.c.SolrZkClient makePath: /overseer_elect
   [junit4]   2> 654511 INFO  (TEST-CollectionsAPIDistributedZkTest.test-seed#[DC689BC529B9A8D1]) [n:127.0.0.1:37752_    ] o.a.s.c.c.SolrZkClient makePath: /overseer_elect/election
   [junit4]   2> 654512 INFO  (TEST-CollectionsAPIDistributedZkTest.test-seed#[DC689BC529B9A8D1]) [n:127.0.0.1:37752_    ] o.a.s.c.Overseer Overseer (id=null) closing
   [junit4]   2> 654512 INFO  (TEST-CollectionsAPIDistributedZkTest.test-seed#[DC689BC529B9A8D1]) [n:127.0.0.1:37752_    ] o.a.s.c.LeaderElector Joined leadership election with path: /overseer_elect/election/96081528742281222-127.0.0.1:37752_-n_0000000000
   [junit4]   2> 654512 INFO  (TEST-CollectionsAPIDistributedZkTest.test-seed#[DC689BC529B9A8D1]) [n:127.0.0.1:37752_    ] o.a.s.c.OverseerElectionContext I am going to be the leader 127.0.0.1:37752_
   [junit4]   2> 654512 INFO  (TEST-CollectionsAPIDistributedZkTest.test-seed#[DC689BC529B9A8D1]) [n:127.0.0.1:37752_    ] o.a.s.c.c.SolrZkClient makePath: /overseer_elect/leader
   [junit4]   2> 654512 INFO  (TEST-CollectionsAPIDistributedZkTest.test-seed#[DC689BC529B9A8D1]) [n:127.0.0.1:37752_    ] o.a.s.c.Overseer Overseer (id=96081528742281222-127.0.0.1:37752_-n_0000000000) starting
   [junit4]   2> 654513 INFO  (TEST-CollectionsAPIDistributedZkTest.test-seed#[DC689BC529B9A8D1]) [n:127.0.0.1:37752_    ] o.a.s.c.c.SolrZkClient makePath: /overseer/queue-work
   [junit4]   2> 654515 INFO  (TEST-CollectionsAPIDistributedZkTest.test-seed#[DC689BC529B9A8D1]) [n:127.0.0.1:37752_    ] o.a.s.c.OverseerAutoReplicaFailoverThread Starting OverseerAutoReplicaFailoverThread autoReplicaFailoverWorkLoopDelay=10000 autoReplicaFailoverWaitAfterExpiration=10000 autoReplicaFailoverBadNodeExpiration=60000
   [junit4]   2> 654516 INFO  (OverseerStateUpdate-96081528742281222-127.0.0.1:37752_-n_0000000000) [n:127.0.0.1:37752_    ] o.a.s.c.Overseer Starting to work on the main queue
   [junit4]   2> 654516 INFO  (OverseerCollectionConfigSetProcessor-96081528742281222-127.0.0.1:37752_-n_0000000000) [n:127.0.0.1:37752_    ] o.a.s.c.OverseerTaskProcessor Process current queue of overseer operations
   [junit4]   2> 654519 INFO  (TEST-CollectionsAPIDistributedZkTest.test-seed#[DC689BC529B9A8D1]) [n:127.0.0.1:37752_    ] o.a.s.c.ZkController Register node as live in ZooKeeper:/live_nodes/127.0.0.1:37752_
   [junit4]   2> 654519 INFO  (TEST-CollectionsAPIDistributedZkTest.test-seed#[DC689BC529B9A8D1]) [n:127.0.0.1:37752_    ] o.a.s.c.c.SolrZkClient makePath: /live_nodes/127.0.0.1:37752_
   [junit4]   2> 654519 INFO  (OverseerStateUpdate-96081528742281222-127.0.0.1:37752_-n_0000000000) [n:127.0.0.1:37752_    ] o.a.s.c.c.ZkStateReader Updated live nodes from ZooKeeper... (0) -> (0)
   [junit4]   2> 654520 INFO  (zkCallback-539-thread-1-processing-n:127.0.0.1:37752_) [n:127.0.0.1:37752_    ] o.a.s.c.c.ZkStateReader A live node change: [WatchedEvent state:SyncConnected type:NodeChildrenChanged path:/live_nodes], has occurred - updating... (live nodes size: [0])
   [junit4]   2> 654523 INFO  (zkCallback-539-thread-1-processing-n:127.0.0.1:37752_) [n:127.0.0.1:37752_    ] o.a.s.c.c.ZkStateReader Updated live nodes from ZooKeeper... (0) -> (1)
   [junit4]   2> 654528 INFO  (TEST-CollectionsAPIDistributedZkTest.test-seed#[DC689BC529B9A8D1]) [n:127.0.0.1:37752_    ] o.a.s.c.CoreContainer Security conf doesn't exist. Skipping setup for authorization module.
   [junit4]   2> 654528 INFO  (TEST-CollectionsAPIDistributedZkTest.test-seed#[DC689BC529B9A8D1]) [n:127.0.0.1:37752_    ] o.a.s.c.CoreContainer No authentication plugin used.
   [junit4]   2> 654531 INFO  (TEST-CollectionsAPIDistributedZkTest.test-seed#[DC689BC529B9A8D1]) [n:127.0.0.1:37752_    ] o.a.s.c.CorePropertiesLocator Looking for core definitions underneath /x1/jenkins/jenkins-slave/workspace/Lucene-Solr-NightlyTests-6.x/solr/build/solr-core/test/J1/../../../../../../../../../../x1/jenkins/jenkins-slave/workspace/Lucene-Solr-NightlyTests-6.x/solr/build/solr-core/test/J1/temp/solr.cloud.CollectionsAPIDistributedZkTest_DC689BC529B9A8D1-001/control-001/cores
   [junit4]   2> 654532 INFO  (TEST-CollectionsAPIDistributedZkTest.test-seed#[DC689BC529B9A8D1]) [n:127.0.0.1:37752_    ] o.a.s.c.CoreDescriptor Created CoreDescriptor: {name=collection1, config=solrconfig.xml, transient=false, schema=schema.xml, loadOnStartup=true, configSetProperties=configsetprops.json, collection=control_collection, coreNodeName=, dataDir=data/, shard=}
   [junit4]   2> 654532 INFO  (TEST-CollectionsAPIDistributedZkTest.test-seed#[DC689BC529B9A8D1]) [n:127.0.0.1:37752_    ] o.a.s.c.CorePropertiesLocator Found core collection1 in /x1/jenkins/jenkins-slave/workspace/Lucene-Solr-NightlyTests-6.x/solr/build/solr-core/test/J1/../../../../../../../../../../x1/jenkins/jenkins-slave/workspace/Lucene-Solr-NightlyTests-6.x/solr/build/solr-core/test/J1/temp/solr.cloud.CollectionsAPIDistributedZkTest_DC689BC529B9A8D1-001/control-001/cores/collection1
   [junit4]   2> 654532 INFO  (TEST-CollectionsAPIDistributedZkTest.test-seed#[DC689BC529B9A8D1]) [n:127.0.0.1:37752_    ] o.a.s.c.CorePropertiesLocator Found 1 core definitions
   [junit4]   2> 654537 INFO  (coreLoadExecutor-1150-thread-1-processing-n:127.0.0.1:37752_) [n:127.0.0.1:37752_ c:control_collection   x:collection1] o.a.s.c.ZkController publishing state=down
   [junit4]   2> 654537 INFO  (coreLoadExecutor-1150-thread-1-processing-n:127.0.0.1:37752_) [n:127.0.0.1:37752_ c:control_collection   x:collection1] o.a.s.c.ZkController numShards not found on descriptor - reading it from system property
   [junit4]   2> 654538 INFO  (coreLoadExecutor-1150-thread-1-processing-n:127.0.0.1:37752_) [n:127.0.0.1:37752_ c:control_collection   x:collection1] o.a.s.c.ZkController Collection control_collection not visible yet, but flagging it so a watch is registered when it becomes visible
   [junit4]   2> 654538 INFO  (coreLoadExecutor-1150-thread-1-processing-n:127.0.0.1:37752_) [n:127.0.0.1:37752_ c:control_collection   x:collection1] o.a.s.c.c.ZkStateReader Deleting data for [control_collection]
   [junit4]   2> 654551 INFO  (TEST-CollectionsAPIDistributedZkTest.test-seed#[DC689BC529B9A8D1]) [n:127.0.0.1:37752_    ] o.a.s.s.SolrDispatchFilter user.dir=/x1/jenkins/jenkins-slave/workspace/Lucene-Solr-NightlyTests-6.x/solr/build/solr-core/test/J1
   [junit4]   2> 654551 INFO  (TEST-CollectionsAPIDistributedZkTest.test-seed#[DC689BC529B9A8D1]) [n:127.0.0.1:37752_    ] o.a.s.s.SolrDispatchFilter SolrDispatchFilter.init() done
   [junit4]   2> 654551 INFO  (coreLoadExecutor-1150-thread-1-processing-n:127.0.0.1:37752_) [n:127.0.0.1:37752_ c:control_collection   x:collection1] o.a.s.c.ZkController look for our core node name
   [junit4]   2> 654551 INFO  (OverseerStateUpdate-96081528742281222-127.0.0.1:37752_-n_0000000000) [n:127.0.0.1:37752_    ] o.a.s.c.Overseer processMessage: queueSize: 1, message = {
   [junit4]   2>   "core":"collection1",
   [junit4]   2>   "roles":null,
   [junit4]   2>   "base_url":"http://127.0.0.1:37752",
   [junit4]   2>   "node_name":"127.0.0.1:37752_",
   [junit4]   2>   "numShards":"1",
   [junit4]   2>   "state":"down",
   [junit4]   2>   "shard":null,
   [junit4]   2>   "collection":"control_collection",
   [junit4]   2>   "operation":"state"} current state version: 0
   [junit4]   2> 654551 INFO  (OverseerStateUpdate-96081528742281222-127.0.0.1:37752_-n_0000000000) [n:127.0.0.1:37752_    ] o.a.s.c.o.ReplicaMutator Update state numShards=1 message={
   [junit4]   2>   "core":"collection1",
   [junit4]   2>   "roles":null,
   [junit4]   2>   "base_url":"http://127.0.0.1:37752",
   [junit4]   2>   "node_name":"127.0.0.1:37752_",
   [junit4]   2>   "numShards":"1",
   [junit4]   2>   "state":"down",
   [junit4]   2>   "shard":null,
   [junit4]   2>   "collection":"control_collection",
   [junit4]   2>   "operation":"state"}
   [junit4]   2> 654551 INFO  (OverseerStateUpdate-96081528742281222-127.0.0.1:37752_-n_0000000000) [n:127.0.0.1:37752_    ] o.a.s.c.o.ClusterStateMutator building a new cName: control_collection
   [junit4]   2> 654552 INFO  (OverseerStateUpdate-96081528742281222-127.0.0.1:37752_-n_0000000000) [n:127.0.0.1:37752_    ] o.a.s.c.o.ReplicaMutator Assigning new node to shard shard=shard1
   [junit4]   2> 654556 INFO  (zkCallback-539-thread-1-processing-n:127.0.0.1:37752_) [n:127.0.0.1:37752_    ] o.a.s.c.c.ZkStateReader A cluster state change: [WatchedEvent state:SyncConnected type:NodeDataChanged path:/clusterstate.json], has occurred - updating... (live nodes size: [1])
   [junit4]   2> 655556 INFO  (coreLoadExecutor-1150-thread-1-processing-n:127.0.0.1:37752_) [n:127.0.0.1:37752_ c:control_collection   x:collection1] o.a.s.c.ZkController waiting to find shard id in clusterstate for collection1
   [junit4]   2> 655556 INFO  (coreLoadExecutor-1150-thread-1-processing-n:127.0.0.1:37752_) [n:127.0.0.1:37752_ c:control_collection   x:collection1] o.a.s.c.ZkController Check for collection zkNode:control_collection
   [junit4]   2> 655557 INFO  (coreLoadExecutor-1150-thread-1-processing-n:127.0.0.1:37752_) [n:127.0.0.1:37752_ c:control_collection   x:collection1] o.a.s.c.ZkController Collection zkNode exists
   [junit4]   2> 655557 INFO  (coreLoadExecutor-1150-thread-1-processing-n:127.0.0.1:37752_) [n:127.0.0.1:37752_ c:control_collection   x:collection1] o.a.s.c.c.ZkStateReader Load collection config from: [/collections/control_collection]
   [junit4]   2> 655557 INFO  (coreLoadExecutor-1150-thread-1-processing-n:127.0.0.1:37752_) [n:127.0.0.1:37752_ c:control_collection   x:collection1] o.a.s.c.c.ZkStateReader path=[/collections/control_collection] [configName]=[conf1] specified config exists in ZooKeeper
   [junit4]   2> 655557 INFO  (coreLoadExecutor-1150-thread-1-processing-n:127.0.0.1:37752_) [n:127.0.0.1:37752_ c:control_collection   x:collection1] o.a.s.c.SolrResourceLoader new SolrResourceLoader for directory: '/x1/jenkins/jenkins-slave/workspace/Lucene-Solr-NightlyTests-6.x/solr/build/solr-core/test/J1/temp/solr.cloud.CollectionsAPIDistributedZkTest_DC689BC529B9A8D1-001/control-001/cores/collection1'
   [junit4]   2> 655557 INFO  (coreLoadExecutor-1150-thread-1-processing-n:127.0.0.1:37752_) [n:127.0.0.1:37752_ c:control_collection   x:collection1] o.a.s.c.SolrResourceLoader JNDI not configured for solr (NoInitialContextEx)
   [junit4]   2> 655557 INFO  (coreLoadExecutor-1150-thread-1-processing-n:127.0.0.1:37752_) [n:127.0.0.1:37752_ c:control_collection   x:collection1] o.a.s.c.SolrResourceLoader solr home defaulted to 'solr/' (could not find system property or JNDI)
   [junit4]   2> 655558 INFO  (coreLoadExecutor-1150-thread-1-processing-n:127.0.0.1:37752_) [n:127.0.0.1:37752_ c:control_collection   x:collection1] o.a.s.c.Config loaded config solrconfig.xml with version 0 
   [junit4]   2> 655567 INFO  (coreLoadExecutor-1150-thread-1-processing-n:127.0.0.1:37752_) [n:127.0.0.1:37752_ c:control_collection   x:collection1] o.a.s.c.SolrConfig current version of requestparams : -1
   [junit4]   2> 655570 INFO  (coreLoadExecutor-1150-thread-1-processing-n:127.0.0.1:37752_) [n:127.0.0.1:37752_ c:control_collection   x:collection1] o.a.s.c.SolrConfig Using Lucene MatchVersion: 6.2.0
   [junit4]   2> 655605 INFO  (coreLoadExecutor-1150-thread-1-processing-n:127.0.0.1:37752_) [n:127.0.0.1:37752_ c:control_collection   x:collection1] o.a.s.c.SolrConfig Loaded SolrConfig: solrconfig.xml
   [junit4]   2> 655608 INFO  (coreLoadExecutor-1150-thread-1-processing-n:127.0.0.1:37752_) [n:127.0.0.1:37752_ c:control_collection   x:collection1] o.a.s.s.IndexSchema [collection1] Schema name=test
   [junit4]   2> 655974 INFO  (coreLoadExecutor-1150-thread-1-processing-n:127.0.0.1:37752_) [n:127.0.0.1:37752_ c:control_collection   x:collection1] o.a.s.s.OpenExchangeRatesOrgProvider Initialized with rates=open-exchange-rates.json, refreshInterval=1440.
   [junit4]   2> 655978 INFO  (coreLoadExecutor-1150-thread-1-processing-n:127.0.0.1:37752_) [n:127.0.0.1:37752_ c:control_collection   x:collection1] o.a.s.s.IndexSchema default search field in schema is text
   [junit4]   2> 655979 INFO  (coreLoadExecutor-1150-thread-1-processing-n:127.0.0.1:37752_) [n:127.0.0.1:37752_ c:control_collection   x:collection1] o.a.s.s.IndexSchema unique key field: id
   [junit4]   2> 655992 INFO  (coreLoadExecutor-1150-thread-1-processing-n:127.0.0.1:37752_) [n:127.0.0.1:37752_ c:control_collection   x:collection1] o.a.s.s.FileExchangeRateProvider Reloading exchange rates from file currency.xml
   [junit4]   2> 655993 INFO  (coreLoadExecutor-1150-thread-1-processing-n:127.0.0.1:37752_) [n:127.0.0.1:37752_ c:control_collection   x:collection1] o.a.s.s.FileExchangeRateProvider Reloading exchange rates from file currency.xml
   [junit4]   2> 655996 INFO  (coreLoadExecutor-1150-thread-1-processing-n:127.0.0.1:37752_) [n:127.0.0.1:37752_ c:control_collection   x:collection1] o.a.s.s.OpenExchangeRatesOrgProvider Reloading exchange rates from open-exchange-rates.json
   [junit4]   2> 655996 INFO  (coreLoadExecutor-1150-thread-1-processing-n:127.0.0.1:37752_) [n:127.0.0.1:37752_ c:control_collection   x:collection1] o.a.s.s.OpenExchangeRatesOrgProvider Reloading exchange rates from open-exchange-rates.json
   [junit4]   2> 655998 INFO  (coreLoadExecutor-1150-thread-1-processing-n:127.0.0.1:37752_) [n:127.0.0.1:37752_ c:control_collection   x:collection1] o.a.s.c.ConfigSetProperties Did not find ConfigSet properties, assuming default properties: Can't find resource 'configsetprops.json' in classpath or '/configs/conf1', cwd=/x1/jenkins/jenkins-slave/workspace/Lucene-Solr-NightlyTests-6.x/solr/build/solr-core/test/J1
   [junit4]   2> 655998 INFO  (coreLoadExecutor-1150-thread-1-processing-n:127.0.0.1:37752_) [n:127.0.0.1:37752_ c:control_collection   x:collection1] o.a.s.c.CoreContainer Creating SolrCore 'collection1' using configuration from collection control_collection
   [junit4]   2> 655998 INFO  (coreLoadExecutor-1150-thread-1-processing-n:127.0.0.1:37752_) [n:127.0.0.1:37752_ c:control_collection s:shard1 r:core_node1 x:collection1] o.a.s.c.SolrCore org.apache.solr.core.MockDirectoryFactory
   [junit4]   2> 656011 INFO  (coreLoadExecutor-1150-thread-1-processing-n:127.0.0.1:37752_) [n:127.0.0.1:37752_ c:control_collection s:shard1 r:core_node1 x:collection1] o.a.s.c.SolrCore [[collection1] ] Opening new SolrCore at [/x1/jenkins/jenkins-slave/workspace/Lucene-Solr-NightlyTests-6.x/solr/build/solr-core/test/J1/temp/solr.cloud.CollectionsAPIDistributedZkTest_DC689BC529B9A8D1-001/control-001/cores/collection1], dataDir=[/x1/jenkins/jenkins-slave/workspace/Lucene-Solr-NightlyTests-6.x/solr/build/solr-core/test/J1/../../../../../../../../../../x1/jenkins/jenkins-slave/workspace/Lucene-Solr-NightlyTests-6.x/solr/build/solr-core/test/J1/temp/solr.cloud.CollectionsAPIDistributedZkTest_DC689BC529B9A8D1-001/control-001/cores/collection1/data/]
   [junit4]   2> 656012 INFO  (coreLoadExecutor-1150-thread-1-processing-n:127.0.0.1:37752_) [n:127.0.0.1:37752_ c:control_collection s:shard1 r:core_node1 x:collection1] o.a.s.c.JmxMonitoredMap JMX monitoring is enabled. Adding Solr mbeans to JMX Server: com.sun.jmx.mbeanserver.JmxMBeanServer@d1e1331
   [junit4]   2> 656013 INFO  (coreLoadExecutor-1150-thread-1-processing-n:127.0.0.1:37752_) [n:127.0.0.1:37752_ c:control_collection s:shard1 r:core_node1 x:collection1] o.a.s.c.CachingDirectoryFactory return new directory for /x1/jenkins/jenkins-slave/workspace/Lucene-Solr-NightlyTests-6.x/solr/build/solr-core/test/J1/../../../../../../../../../../x1/jenkins/jenkins-slave/workspace/Lucene-Solr-NightlyTests-6.x/solr/build/solr-core/test/J1/temp/solr.cloud.CollectionsAPIDistributedZkTest_DC689BC529B9A8D1-001/control-001/cores/collection1/data
   [junit4]   2> 656013 INFO  (coreLoadExecutor-1150-thread-1-processing-n:127.0.0.1:37752_) [n:127.0.0.1:37752_ c:control_collection s:shard1 r:core_node1 x:collection1] o.a.s.c.SolrCore New index directory detected: old=null new=/x1/jenkins/jenkins-slave/workspace/Lucene-Solr-NightlyTests-6.x/solr/build/solr-core/test/J1/../../../../../../../../../../x1/jenkins/jenkins-slave/workspace/Lucene-Solr-NightlyTests-6.x/solr/build/solr-core/test/J1/temp/solr.cloud.CollectionsAPIDistributedZkTest_DC689BC529B9A8D1-001/control-001/cores/collection1/data/index/
   [junit4]   2> 656013 WARN  (coreLoadExecutor-1150-thread-1-processing-n:127.0.0.1:37752_) [n:127.0.0.1:37752_ c:control_collection s:shard1 r:core_node1 x:collection1] o.a.s.c.SolrCore [collection1] Solr index directory '/x1/jenkins/jenkins-slave/workspace/Lucene-Solr-NightlyTests-6.x/solr/build/solr-core/test/J1/../../../../../../../../../../x1/jenkins/jenkins-slave/workspace/Lucene-Solr-NightlyTests-6.x/solr/build/solr-core/test/J1/temp/solr.cloud.CollectionsAPIDistributedZkTest_DC689BC529B9A8D1-001/control-001/cores/collection1/data/index' doesn't exist. Creating new index...
   [junit4]   2> 656014 INFO  (coreLoadExecutor-1150-thread-1-processing-n:127.0.0.1:37752_) [n:127.0.0.1:37752_ c:control_collection s:shard1 r:core_node1 x:collection1] o.a.s.c.CachingDirectoryFactory return new directory for /x1/jenkins/jenkins-slave/workspace/Lucene-Solr-NightlyTests-6.x/solr/build/solr-core/test/J1/../../../../../../../../../../x1/jenkins/jenkins-slave/workspace/Lucene-Solr-NightlyTests-6.x/solr/build/solr-core/test/J1/temp/solr.cloud.CollectionsAPIDistributedZkTest_DC689BC529B9A8D1-001/control-001/cores/collection1/data/index
   [junit4]   2> 656014 INFO  (coreLoadExecutor-1150-thread-1-processing-n:127.0.0.1:37752_) [n:127.0.0.1:37752_ c:control_collection s:shard1 r:core_node1 x:collection1] o.a.s.u.RandomMergePolicy RandomMergePolicy wrapping class org.apache.lucene.index.TieredMergePolicy: [TieredMergePolicy: maxMergeAtOnce=28, maxMergeAtOnceExplicit=17, maxMergedSegmentMB=30.7099609375, floorSegmentMB=1.470703125, forceMergeDeletesPctAllowed=5.841229509584574, segmentsPerTier=30.0, maxCFSSegmentSizeMB=8.796093022207999E12, noCFSRatio=0.0
   [junit4]   2> 656027 INFO  (coreLoadExecutor-1150-thread-1-processing-n:127.0.0.1:37752_) [n:127.0.0.1:37752_ c:control_collection s:shard1 r:core_node1 x:collection1] o.a.s.c.SolrDeletionPolicy SolrDeletionPolicy.onCommit: commits: num=1
   [junit4]   2> 	commit{dir=MockDirectoryWrapper(RAMDirectory@68126cc7 lockFactory=org.apache.lucene.store.SingleInstanceLockFactory@40cf36cc),segFN=segments_1,generation=1}
   [junit4]   2> 656027 INFO  (coreLoadExecutor-1150-thread-1-processing-n:127.0.0.1:37752_) [n:127.0.0.1:37752_ c:control_collection s:shard1 r:core_node1 x:collection1] o.a.s.c.SolrDeletionPolicy newest commit generation = 1
   [junit4]   2> 656037 INFO  (coreLoadExecutor-1150-thread-1-processing-n:127.0.0.1:37752_) [n:127.0.0.1:37752_ c:control_collection s:shard1 r:core_node1 x:collection1] o.a.s.u.p.UpdateRequestProcessorChain creating updateRequestProcessorChain "nodistrib"
   [junit4]   2> 656037 INFO  (coreLoadExecutor-1150-thread-1-processing-n:127.0.0.1:37752_) [n:127.0.0.1:37752_ c:control_collection s:shard1 r:core_node1 x:collection1] o.a.s.u.p.UpdateRequestProcessorChain creating updateRequestProcessorChain "dedupe"
   [junit4]   2> 656037 INFO  (coreLoadExecutor-1150-thread-1-processing-n:127.0.0.1:37752_) [n:127.0.0.1:37752_ c:control_collection s:shard1 r:core_node1 x:collection1] o.a.s.u.p.UpdateRequestProcessorChain inserting DistributedUpdateProcessorFactory into updateRequestProcessorChain "dedupe"
   [junit4]   2> 656037 INFO  (coreLoadExecutor-1150-thread-1-processing-n:127.0.0.1:37752_) [n:127.0.0.1:37752_ c:control_collection s:shard1 r:core_node1 x:collection1] o.a.s.u.p.UpdateRequestProcessorChain creating updateRequestProcessorChain "stored_sig"
   [junit4]   2> 656037 INFO  (coreLoadExecutor-1150-thread-1-processing-n:127.0.0.1:37752_) [n:127.0.0.1:37752_ c:control_collection s:shard1 r:core_node1 x:collection1] o.a.s.u.p.UpdateRequestProcessorChain inserting DistributedUpdateProcessorFactory into updateRequestProcessorChain "stored_sig"
   [junit4]   2> 656037 INFO  (coreLoadExecutor-1150-thread-1-processing-n:127.0.0.1:37752_) [n:127.0.0.1:37752_ c:control_collection s:shard1 r:core_node1 x:collection1] o.a.s.u.p.UpdateRequestProcessorChain creating updateRequestProcessorChain "distrib-dup-test-chain-explicit"
   [junit4]   2> 656037 INFO  (coreLoadExecutor-1150-thread-1-processing-n:127.0.0.1:37752_) [n:127.0.0.1:37752_ c:control_collection s:shard1 r:core_node1 x:collection1] o.a.s.u.p.UpdateRequestProcessorChain creating updateRequestProcessorChain "distrib-dup-test-chain-implicit"
   [junit4]   2> 656037 INFO  (coreLoadExecutor-1150-thread-1-processing-n:127.0.0.1:37752_) [n:127.0.0.1:37752_ c:control_collection s:shard1 r:core_node1 x:collection1] o.a.s.u.p.UpdateRequestProcessorChain inserting DistributedUpdateProcessorFactory into updateRequestProcessorChain "distrib-dup-test-chain-implicit"
   [junit4]   2> 656037 INFO  (coreLoadExecutor-1150-thread-1-processing-n:127.0.0.1:37752_) [n:127.0.0.1:37752_ c:control_collection s:shard1 r:core_node1 x:collection1] o.a.s.c.SolrCore no updateRequestProcessorChain defined as default, creating implicit default
   [junit4]   2> 656037 WARN  (coreLoadExecutor-1150-thread-1-processing-n:127.0.0.1:37752_) [n:127.0.0.1:37752_ c:control_collection s:shard1 r:core_node1 x:collection1] o.a.s.c.RequestHandlers INVALID paramSet a in requestHandler {type = requestHandler,name = /dump,class = DumpRequestHandler,args = {defaults={a=A,b=B}}}
   [junit4]   2> 656038 INFO  (coreLoadExecutor-1150-thread-1-processing-n:127.0.0.1:37752_) [n:127.0.0.1:37752_ c:control_collection s:shard1 r:core_node1 x:collection1] o.a.s.h.l.XMLLoader xsltCacheLifetimeSeconds=60
   [junit4]   2> 656043 INFO  (coreLoadExecutor-1150-thread-1-processing-n:127.0.0.1:37752_) [n:127.0.0.1:37752_ c:control_collection s:shard1 r:core_node1 x:collection1] o.a.s.h.l.XMLLoader xsltCacheLifetimeSeconds=60
   [junit4]   2> 656044 INFO  (coreLoadExecutor-1150-thread-1-processing-n:127.0.0.1:37752_) [n:127.0.0.1:37752_ c:control_collection s:shard1 r:core_node1 x:collection1] o.a.s.h.l.XMLLoader xsltCacheLifetimeSeconds=60
   [junit4]   2> 656044 INFO  (coreLoadExecutor-1150-thread-1-processing-n:127.0.0.1:37752_) [n:127.0.0.1:37752_ c:control_collection s:shard1 r:core_node1 x:collection1] o.a.s.h.l.XMLLoader xsltCacheLifetimeSeconds=60
   [junit4]   2> 656046 INFO  (coreLoadExecutor-1150-thread-1-processing-n:127.0.0.1:37752_) [n:127.0.0.1:37752_ c:control_collection s:shard1 r:core_node1 x:collection1] o.a.s.c.RequestHandlers Registered paths: /admin/mbeans,standard,/update/json/docs,/admin/luke,/export,/get,/admin/properties,/update/json,/admin/threads,/dump,/update/csv,/sql,/graph,/admin/segments,/admin/system,/replication,/config,/stream,/schema,/admin/plugins,/admin/logging,/admin/ping,/update,/admin/file
   [junit4]   2> 656046 INFO  (coreLoadExecutor-1150-thread-1-processing-n:127.0.0.1:37752_) [n:127.0.0.1:37752_ c:control_collection s:shard1 r:core_node1 x:collection1] o.a.s.c.SolrCore Using default statsCache cache: org.apache.solr.search.stats.LocalStatsCache
   [junit4]   2> 656056 INFO  (coreLoadExecutor-1150-thread-1-processing-n:127.0.0.1:37752_) [n:127.0.0.1:37752_ c:control_collection s:shard1 r:core_node1 x:collection1] o.a.s.u.UpdateHandler Using UpdateLog implementation: org.apache.solr.update.UpdateLog
   [junit4]   2> 656056 INFO  (coreLoadExecutor-1150-thread-1-processing-n:127.0.0.1:37752_) [n:127.0.0.1:37752_ c:control_collection s:shard1 r:core_node1 x:collection1] o.a.s.u.UpdateLog Initializing UpdateLog: dataDir= defaultSyncLevel=FLUSH numRecordsToKeep=100 maxNumLogsToKeep=10 numVersionBuckets=65536
   [junit4]   2> 656057 INFO  (coreLoadExecutor-1150-thread-1-processing-n:127.0.0.1:37752_) [n:127.0.0.1:37752_ c:control_collection s:shard1 r:core_node1 x:collection1] o.a.s.u.CommitTracker Hard AutoCommit: disabled
   [junit4]   2> 656057 INFO  (coreLoadExecutor-1150-thread-1-processing-n:127.0.0.1:37752_) [n:127.0.0.1:37752_ c:control_collection s:shard1 r:core_node1 x:collection1] o.a.s.u.CommitTracker Soft AutoCommit: disabled
   [junit4]   2> 656057 INFO  (coreLoadExecutor-1150-thread-1-processing-n:127.0.0.1:37752_) [n:127.0.0.1:37752_ c:control_collection s:shard1 r:core_node1 x:collection1] o.a.s.u.RandomMergePolicy RandomMergePolicy wrapping class org.apache.lucene.index.LogByteSizeMergePolicy: [LogByteSizeMergePolicy: minMergeSize=1677721, mergeFactor=50, maxMergeSize=2147483648, maxMergeSizeForForcedMerge=9223372036854775807, calibrateSizeByDeletes=false, maxMergeDocs=2147483647, maxCFSSegmentSizeMB=8.796093022207999E12, noCFSRatio=1.0]
   [junit4]   2> 656057 INFO  (OldIndexDirectoryCleanupThreadForCore-collection1) [n:127.0.0.1:37752_ c:control_collection s:shard1 r:core_node1 x:collection1] o.a.s.c.SolrCore Looking for old index directories to cleanup for core collection1 in /x1/jenkins/jenkins-slave/workspace/Lucene-Solr-NightlyTests-6.x/solr/build/solr-core/test/J1/../../../../../../../../../../x1/jenkins/jenkins-slave/workspace/Lucene-Solr-NightlyTests-6.x/solr/build/solr-core/test/J1/temp/solr.cloud.CollectionsAPIDistributedZkTest_DC689BC529B9A8D1-001/control-001/cores/collection1/data/
   [junit4]   2> 656059 INFO  (coreLoadExecutor-1150-thread-1-processing-n:127.0.0.1:37752_) [n:127.0.0.1:37752_ c:control_collection s:shard1 r:core_node1 x:collection1] o.a.s.c.SolrDeletionPolicy SolrDeletionPolicy.onInit: commits: num=1
   [junit4]   2> 	commit{dir=MockDirectoryWrapper(RAMDirectory@68126cc7 lockFactory=org.apache.lucene.store.SingleInstanceLockFactory@40cf36cc),segFN=segments_1,generation=1}
   [junit4]   2> 656059 INFO  (coreLoadExecutor-1150-thread-1-processing-n:127.0.0.1:37752_) [n:127.0.0.1:37752_ c:control_collection s:shard1 r:core_node1 x:collection1] o.a.s.c.SolrDeletionPolicy newest commit generation = 1
   [junit4]   2> 656059 INFO  (coreLoadExecutor-1150-thread-1-processing-n:127.0.0.1:37752_) [n:127.0.0.1:37752_ c:control_collection s:shard1 r:core_node1 x:collection1] o.a.s.s.SolrIndexSearcher Opening [Searcher@1de50258[collection1] main]
   [junit4]   2> 656059 INFO  (coreLoadExecutor-1150-thread-1-processing-n:127.0.0.1:37752_) [n:127.0.0.1:37752_ c:control_collection s:shard1 r:core_node1 x:collection1] o.a.s.c.c.ZkStateReader Load collection config from: [/collections/control_collection]
   [junit4]   2> 656062 INFO  (coreLoadExecutor-1150-thread-1-processing-n:127.0.0.1:37752_) [n:127.0.0.1:37752_ c:control_collection s:shard1 r:core_node1 x:collection1] o.a.s.c.c.ZkStateReader path=[/collections/control_collection] [configName]=[conf1] specified config exists in ZooKeeper
   [junit4]   2> 656062 INFO  (coreLoadExecutor-1150-thread-1-processing-n:127.0.0.1:37752_) [n:127.0.0.1:37752_ c:control_collection s:shard1 r:core_node1 x:collection1] o.a.s.r.ManagedResourceStorage Setting up ZooKeeper-based storage for the RestManager with znodeBase: /configs/conf1
   [junit4]   2> 656062 INFO  (coreLoadExecutor-1150-thread-1-processing-n:127.0.0.1:37752_) [n:127.0.0.1:37752_ c:control_collection s:shard1 r:core_node1 x:collection1] o.a.s.r.ManagedResourceStorage Configured ZooKeeperStorageIO with znodeBase: /configs/conf1
   [junit4]   2> 656062 INFO  (coreLoadExecutor-1150-thread-1-processing-n:127.0.0.1:37752_) [n:127.0.0.1:37752_ c:control_collection s:shard1 r:core_node1 x:collection1] o.a.s.r.RestManager Initializing RestManager with initArgs: {}
   [junit4]   2> 656062 INFO  (coreLoadExecutor-1150-thread-1-processing-n:127.0.0.1:37752_) [n:127.0.0.1:37752_ c:control_collection s:shard1 r:core_node1 x:collection1] o.a.s.r.ManagedResourceStorage Reading _rest_managed.json using ZooKeeperStorageIO:path=/configs/conf1
   [junit4]   2> 656063 INFO  (coreLoadExecutor-1150-thread-1-processing-n:127.0.0.1:37752_) [n:127.0.0.1:37752_ c:control_collection s:shard1 r:core_node1 x:collection1] o.a.s.r.ManagedResourceStorage No data found for znode /configs/conf1/_rest_managed.json
   [junit4]   2> 656063 INFO  (coreLoadExecutor-1150-thread-1-processing-n:127.0.0.1:37752_) [n:127.0.0.1:37752_ c:control_collection s:shard1 r:core_node1 x:collection1] o.a.s.r.ManagedResourceStorage Loaded null at path _rest_managed.json using ZooKeeperStorageIO:path=/configs/conf1
   [junit4]   2> 656063 INFO  (coreLoadExecutor-1150-thread-1-processing-n:127.0.0.1:37752_) [n:127.0.0.1:37752_ c:control_collection s:shard1 r:core_node1 x:collection1] o.a.s.r.RestManager Initializing 0 registered ManagedResources
   [junit4]   2> 656063 INFO  (coreLoadExecutor-1150-thread-1-processing-n:127.0.0.1:37752_) [n:127.0.0.1:37752_ c:control_collection s:shard1 r:core_node1 x:collection1] o.a.s.h.ReplicationHandler Commits will be reserved for  10000
   [junit4]   2> 656063 INFO  (coreLoadExecutor-1150-thread-1-processing-n:127.0.0.1:37752_) [n:127.0.0.1:37752_ c:control_collection s:shard1 r:core_node1 x:collection1] o.a.s.u.UpdateLog Looking up max value of version field to seed version buckets
   [junit4]   2> 656063 INFO  (coreLoadExecutor-1150-thread-1-processing-n:127.0.0.1:37752_) [n:127.0.0.1:37752_ c:control_collection s:shard1 r:core_node1 x:collection1] o.a.s.u.VersionInfo Refreshing highest value of _version_ for 65536 version buckets from index
   [junit4]   2> 656064 INFO  (coreLoadExecutor-1150-thread-1-processing-n:127.0.0.1:37752_) [n:127.0.0.1:37752_ c:control_collection s:shard1 r:core_node1 x:collection1] o.a.s.u.VersionInfo No terms found for _version_, cannot seed version bucket highest value from index
   [junit4]   2> 656064 INFO  (coreLoadExecutor-1150-thread-1-processing-n:127.0.0.1:37752_) [n:127.0.0.1:37752_ c:control_collection s:shard1 r:core_node1 x:collection1] o.a.s.u.UpdateLog Could not find max version in index or recent updates, using new clock 1537304462050197504
   [junit4]   2> 656065 INFO  (searcherExecutor-1151-thread-1-processing-n:127.0.0.1:37752_ x:collection1 s:shard1 c:control_collection r:core_node1) [n:127.0.0.1:37752_ c:control_collection s:shard1 r:core_node1 x:collection1] o.a.s.c.SolrCore [collection1] Registered new searcher Searcher@1de50258[collection1] main{ExitableDirectoryReader(UninvertingDirectoryReader())}
   [junit4]   2> 656065 INFO  (coreLoadExecutor-1150-thread-1-processing-n:127.0.0.1:37752_) [n:127.0.0.1:37752_ c:control_collection s:shard1 r:core_node1 x:collection1] o.a.s.u.UpdateLog Took 1.0ms to seed version buckets with highest version 1537304462050197504
   [junit4]   2> 656066 INFO  (coreLoadExecutor-1150-thread-1-processing-n:127.0.0.1:37752_) [n:127.0.0.1:37752_ c:control_collection s:shard1 r:core_node1 x:collection1] o.a.s.c.ZkController watch zkdir /configs/conf1
   [junit4]   2> 656066 INFO  (coreLoadExecutor-1150-thread-1-processing-n:127.0.0.1:37752_) [n:127.0.0.1:37752_ c:control_collection s:shard1 r:core_node1 x:collection1] o.a.s.c.CoreContainer registering core: collection1
   [junit4]   2> 656066 INFO  (coreZkRegister-1144-thread-1-processing-n:127.0.0.1:37752_ x:collection1 s:shard1 c:control_collection r:core_node1) [n:127.0.0.1:37752_ c:control_collection s:shard1 r:core_node1 x:collection1] o.a.s.c.ZkController Register replica - core:collection1 address:http://127.0.0.1:37752 collection:control_collection shard:shard1
   [junit4]   2> 656067 INFO  (coreZkRegister-1144-thread-1-processing-n:127.0.0.1:37752_ x:collection1 s:shard1 c:control_collection r:core_node1) [n:127.0.0.1:37752_ c:control_collection s:shard1 r:core_node1 x:collection1] o.a.s.c.c.SolrZkClient makePath: /collections/control_collection/leader_elect/shard1/election
   [junit4]   2> 656069 INFO  (coreZkRegister-1144-thread-1-processing-n:127.0.0.1:37752_ x:collection1 s:shard1 c:control_collection r:core_node1) [n:127.0.0.1:37752_ c:control_collection s:shard1 r:core_node1 x:collection1] o.a.s.c.LeaderElector Joined leadership election with path: /collections/control_collection/leader_elect/shard1/election/96081528742281222-core_node1-n_0000000000
   [junit4]   2> 656069 INFO  (coreZkRegister-1144-thread-1-processing-n:127.0.0.1:37752_ x:collection1 s:shard1 c:control_collection r:core_node1) [n:127.0.0.1:37752_ c:control_collection s:shard1 r:core_node1 x:collection1] o.a.s.c.ShardLeaderElectionContext Running the leader process for shard=shard1 and weAreReplacement=false and leaderVoteWait=180000
   [junit4]   2> 656070 INFO  (coreZkRegister-1144-thread-1-processing-n:127.0.0.1:37752_ x:collection1 s:shard1 c:control_collection r:core_node1) [n:127.0.0.1:37752_ c:control_collection s:shard1 r:core_node1 x:collection1] o.a.s.c.ShardLeaderElectionContext Enough replicas found to continue.
   [junit4]   2> 656070 INFO  (coreZkRegister-1144-thread-1-processing-n:127.0.0.1:37752_ x:collection1 s:shard1 c:control_collection r:core_node1) [n:127.0.0.1:37752_ c:control_collection s:shard1 r:core_node1 x:collection1] o.a.s.c.ShardLeaderElectionContext I may be the new leader - try and sync
   [junit4]   2> 656070 INFO  (coreZkRegister-1144-thread-1-processing-n:127.0.0.1:37752_ x:collection1 s:shard1 c:control_collection r:core_node1) [n:127.0.0.1:37752_ c:control_collection s:shard1 r:core_node1 x:collection1] o.a.s.c.SyncStrategy Sync replicas to http://127.0.0.1:37752/collection1/
   [junit4]   2> 656070 INFO  (coreZkRegister-1144-thread-1-processing-n:127.0.0.1:37752_ x:collection1 s:shard1 c:control_collection r:core_node1) [n:127.0.0.1:37752_ c:control_collection s:shard1 r:core_node1 x:collection1] o.a.s.c.SyncStrategy Sync Success - now sync replicas to me
   [junit4]   2> 656070 INFO  (coreZkRegister-1144-thread-1-processing-n:127.0.0.1:37752_ x:collection1 s:shard1 c:control_collection r:core_node1) [n:127.0.0.1:37752_ c:control_collection s:shard1 r:core_node1 x:collection1] o.a.s.c.SyncStrategy http://127.0.0.1:37752/collection1/ has no replicas
   [junit4]   2> 656070 INFO  (coreZkRegister-1144-thread-1-processing-n:127.0.0.1:37752_ x:collection1 s:shard1 c:control_collection r:core_node1) [n:127.0.0.1:37752_ c:control_collection s:shard1 r:core_node1 x:collection1] o.a.s.c.c.SolrZkClient makePath: /collections/control_collection/leaders/shard1
   [junit4]   2> 656071 INFO  (coreZkRegister-1144-thread-1-processing-n:127.0.0.1:37752_ x:collection1 s:shard1 c:control_collection r:core_node1) [n:127.0.0.1:37752_ c:control_collection s:shard1 r:core_node1 x:collection1] o.a.s.c.ShardLeaderElectionContextBase Creating leader registration node /collections/control_collection/leaders/shard1/leader after winning as /collections/control_collection/leader_elect/shard1/election/96081528742281222-core_node1-n_0000000000
   [junit4]   2> 656072 INFO  (OverseerStateUpdate-96081528742281222-127.0.0.1:37752_-n_0000000000) [n:127.0.0.1:37752_    ] o.a.s.c.Overseer processMessage: queueSize: 1, message = {
   [junit4]   2>   "operation":"leader",
   [junit4]   2>   "shard":"shard1",
   [junit4]   2>   "collection":"control_collection"} current state version: 1
   [junit4]   2> 656073 INFO  (coreZkRegister-1144-thread-1-processing-n:127.0.0.1:37752_ x:collection1 s:shard1 c:control_collection r:core_node1) [n:127.0.0.1:37752_ c:control_collection s:shard1 r:core_node1 x:collection1] o.a.s.c.ShardLeaderElectionContext I am the new leader: http://127.0.0.1:37752/collection1/ shard1
   [junit4]   2> 656073 INFO  (zkCallback-539-thread-3-processing-n:127.0.0.1:37752_) [n:127.0.0.1:37752_    ] o.a.s.c.c.ZkStateReader A cluster state change: [WatchedEvent state:SyncConnected type:NodeDataChanged path:/clusterstate.json], has occurred - updating... (live nodes size: [1])
   [junit4]   2> 656074 INFO  (OverseerStateUpdate-96081528742281222-127.0.0.1:37752_-n_0000000000) [n:127.0.0.1:37752_    ] o.a.s.c.Overseer processMessage: queueSize: 2, message = {
   [junit4]   2>   "operation":"leader",
   [junit4]   2>   "shard":"shard1",
   [junit4]   2>   "collection":"control_collection",
   [junit4]   2>   "base_url":"http://127.0.0.1:37752",
   [junit4]   2>   "core":"collection1",
   [junit4]   2>   "state":"active"} current state version: 2
   [junit4]   2> 656263 INFO  (zkCallback-539-thread-2-processing-n:127.0.0.1:37752_) [n:127.0.0.1:37752_    ] o.a.s.c.c.ZkStateReader A cluster state change: [WatchedEvent state:SyncConnected type:NodeDataChanged path:/clusterstate.json], has occurred - updating... (live nodes size: [1])
   [junit4]   2> 656297 INFO  (coreZkRegister-1144-thread-1-processing-n:127.0.0.1:37752_ x:collection1 s:shard1 c:control_collection r:core_node1) [n:127.0.0.1:37752_ c:control_collection s:shard1 r:core_node1 x:collection1] o.a.s.c.ZkController We are http://127.0.0.1:37752/collection1/ and leader is http://127.0.0.1:37752/collection1/
   [junit4]   2> 656297 INFO  (coreZkRegister-1144-thread-1-processing-n:127.0.0.1:37752_ x:collection1 s:shard1 c:control_collection r:core_node1) [n:127.0.0.1:37752_ c:control_collection s:shard1 r:core_node1 x:collection1] o.a.s.c.ZkController No LogReplay needed for core=collection1 baseURL=http://127.0.0.1:37752
   [junit4]   2> 656297 INFO  (coreZkRegister-1144-thread-1-processing-n:127.0.0.1:37752_ x:collection1 s:shard1 c:control_collection r:core_node1) [n:127.0.0.1:37752_ c:control_collection s:shard1 r:core_node1 x:collection1] o.a.s.c.ZkController I am the leader, no recovery necessary
   [junit4]   2> 656297 INFO  (coreZkRegister-1144-thread-1-processing-n:127.0.0.1:37752_ x:collection1 s:shard1 c:control_collection r:core_node1) [n:127.0.0.1:37752_ c:control_collection s:shard1 r:core_node1 x:collection1] o.a.s.c.ZkController publishing state=active
   [junit4]   2> 656297 INFO  (coreZkRegister-1144-thread-1-processing-n:127.0.0.1:37752_ x:collection1 s:shard1 c:control_collection r:core_node1) [n:127.0.0.1:37752_ c:control_collection s:shard1 r:core_node1 x:collection1] o.a.s.c.ZkController numShards not found on descriptor - reading it from system property
   [junit4]   2> 656300 INFO  (OverseerStateUpdate-96081528742281222-127.0.0.1:37752_-n_0000000000) [n:127.0.0.1:37752_    ] o.a.s.c.Overseer processMessage: queueSize: 1, message = {
   [junit4]   2>   "core":"collection1",
   [junit4]   2>   "core_node_name":"core_node1",
   [junit4]   2>   "roles":null,
   [junit4]   2>   "base_url":"http://127.0.0.1:37752",
   [junit4]   2>   "node_name":"127.0.0.1:37752_",
   [junit4]   2>   "numShards":"1",
   [junit4]   2>   "state":"active",
   [junit4]   2>   "shard":"shard1",
   [junit4]   2>   "collection":"control_collection",
   [junit4]   2>   "operation":"state"} current state version: 3
   [junit4]   2> 656300 INFO  (OverseerStateUpdate-96081528742281222-127.0.0.1:37752_-n_0000000000) [n:127.0.0.1:37752_    ] o.a.s.c.o.ReplicaMutator Update state numShards=1 message={
   [junit4]   2>   "core":"collection1",
   [junit4]   2>   "core_node_name":"core_node1",
   [junit4]   2>   "roles":null,
   [junit4]   2>   "base_url":"http://127.0.0.1:37752",
   [junit4]   2>   "node_name":"127.0.0.1:37752_",
   [junit4]   2>   "numShards":"1",
   [junit4]   2>   "state":"active",
   [junit4]   2>   "shard":"shard1",
   [junit4]   2>   "collection":"control_collection",
   [junit4]   2>   "operation":"state"}
   [junit4]   2> 656401 INFO  (zkCallback-539-thread-1-processing-n:127.0.0.1:37752_) [n:127.0.0.1:37752_    ] o.a.s.c.c.ZkStateReader A cluster state change: [WatchedEvent state:SyncConnected type:NodeDataChanged path:/clusterstate.json], has occurred - updating... (live nodes size: [1])
   [junit4]   2> 656557 INFO  (TEST-CollectionsAPIDistributedZkTest.test-seed#[DC689BC529B9A8D1]) [    ] o.a.s.c.c.SolrZkClient Using default ZkCredentialsProvider
   [junit4]   2> 656563 INFO  (TEST-CollectionsAPIDistributedZkTest.test-seed#[DC689BC529B9A8D1]) [    ] o.a.s.c.c.ConnectionManager Waiting for client to connect to ZooKeeper
   [junit4]   2> 656566 INFO  (zkCallback-543-thread-1) [    ] o.a.s.c.c.ConnectionManager Watcher org.apache.solr.common.cloud.ConnectionManager@7e5a5716 name:ZooKeeperConnection Watcher:127.0.0.1:51265/solr got event WatchedEvent state:SyncConnected type:None path:null path:null type:None
   [junit4]   2> 656566 INFO  (TEST-CollectionsAPIDistributedZkTest.test-seed#[DC689BC529B9A8D1]) [    ] o.a.s.c.c.ConnectionManager Client is connected to ZooKeeper
   [junit4]   2> 656566 INFO  (TEST-CollectionsAPIDistributedZkTest.test-seed#[DC689BC529B9A8D1]) [    ] o.a.s.c.c.SolrZkClient Using default ZkACLProvider
   [junit4]   2> 656566 INFO  (TEST-CollectionsAPIDistributedZkTest.test-seed#[DC689BC529B9A8D1]) [    ] o.a.s.c.c.ZkStateReader Updating cluster state from ZooKeeper... 
   [junit4]   2> 656566 INFO  (TEST-CollectionsAPIDistributedZkTest.test-seed#[DC689BC529B9A8D1]) [    ] o.a.s.c.c.ZkStateReader Loaded empty cluster properties
   [junit4]   2> 656567 INFO  (TEST-CollectionsAPIDistributedZkTest.test-seed#[DC689BC529B9A8D1]) [    ] o.a.s.c.c.ZkStateReader Updated live nodes from ZooKeeper... (0) -> (1)
   [junit4]   2> 656567 INFO  (TEST-CollectionsAPIDistributedZkTest.test-seed#[DC689BC529B9A8D1]) [    ] o.a.s.c.ChaosMonkey monkey: init - expire sessions:false cause connection loss:false
   [junit4]   2> 656567 INFO  (TEST-CollectionsAPIDistributedZkTest.test-seed#[DC689BC529B9A8D1]) [    ] o.a.s.c.AbstractFullDistribZkTestBase Creating collection1 with stateFormat=2
   [junit4]   2> 656568 INFO  (TEST-CollectionsAPIDistributedZkTest.test-seed#[DC689BC529B9A8D1]) [    ] o.a.s.c.c.SolrZkClient Using default ZkCredentialsProvider
   [junit4]   2> 656569 INFO  (TEST-CollectionsAPIDistributedZkTest.test-seed#[DC689BC529B9A8D1]) [    ] o.a.s.c.c.ConnectionManager Waiting for client to connect to ZooKeeper
   [junit4]   2> 656571 INFO  (zkCallback-544-thread-1) [    ] o.a.s.c.c.ConnectionManager Watcher org.apache.solr.common.cloud.ConnectionManager@306e2854 name:ZooKeeperConnection Watcher:127.0.0.1:51265/solr got event WatchedEvent state:SyncConnected type:None path:null path:null type:None
   [junit4]   2> 656571 INFO  (TEST-CollectionsAPIDistributedZkTest.test-seed#[DC689BC529B9A8D1]) [    ] o.a.s.c.c.ConnectionManager Client is connected to ZooKeeper
   [junit4]   2> 656571 INFO  (TEST-CollectionsAPIDistributedZkTest.test-seed#[DC689BC529B9A8D1]) [    ] o.a.s.c.c.SolrZkClient Using default ZkACLProvider
   [junit4]   2> 656574 INFO  (OverseerStateUpdate-96081528742281222-127.0.0.1:37752_-n_0000000000) [n:127.0.0.1:37752_    ] o.a.s.c.Overseer processMessage: queueSize: 1, message = {
   [junit4]   2>   "operation":"create",
   [junit4]   2>   "name":"collection1",
   [junit4]   2>   "numShards":"2",
   [junit4]   2>   "stateFormat":"2"} current state version: 4
   [junit4]   2> 656574 INFO  (OverseerStateUpdate-96081528742281222-127.0.0.1:37752_-n_0000000000) [n:127.0.0.1:37752_    ] o.a.s.c.o.ClusterStateMutator building a new cName: collection1
   [junit4]   2> 656674 INFO  (TEST-CollectionsAPIDistributedZkTest.test-seed#[DC689BC529B9A8D1]) [    ] o.a.s.SolrTestCaseJ4 Writing core.properties file to /x1/jenkins/jenkins-slave/workspace/Lucene-Solr-NightlyTests-6.x/solr/build/solr-core/test/J1/temp/solr.cloud.CollectionsAPIDistributedZkTest_DC689BC529B9A8D1-001/shard-1-001/cores/collection1
   [junit4]   2> 656675 INFO  (TEST-CollectionsAPIDistributedZkTest.test-seed#[DC689BC529B9A8D1]) [    ] o.a.s.c.AbstractFullDistribZkTestBase create jetty 1 in directory /x1/jenkins/jenkins-slave/workspace/Lucene-Solr-NightlyTests-6.x/solr/build/solr-core/test/J1/temp/solr.cloud.CollectionsAPIDistributedZkTest_DC689BC529B9A8D1-001/shard-1-001
   [junit4]   2> 656675 INFO  (TEST-CollectionsAPIDistributedZkTest.test-seed#[DC689BC529B9A8D1]) [    ] o.e.j.s.Server jetty-9.3.8.v20160314
   [junit4]   2> 656676 INFO  (TEST-CollectionsAPIDistributedZkTest.test-seed#[DC689BC529B9A8D1]) [    ] o.e.j.s.h.ContextHandler Started o.e.j.s.ServletContextHandler@14953e87{/,null,AVAILABLE}
   [junit4]   2> 656677 INFO  (TEST-CollectionsAPIDistributedZkTest.test-seed#[DC689BC529B9A8D1]) [    ] o.e.j.s.ServerConnector Started ServerConnector@2a64859c{HTTP/1.1,[http/1.1]}{127.0.0.1:38898}
   [junit4]   2> 656683 INFO  (TEST-CollectionsAPIDistributedZkTest.test-seed#[DC689BC529B9A8D1]) [    ] o.e.j.s.Server Started @659830ms
   [junit4]   2> 656683 INFO  (TEST-CollectionsAPIDistributedZkTest.test-seed#[DC689BC529B9A8D1]) [    ] o.a.s.c.s.e.JettySolrRunner Jetty properties: {solr.data.dir=/x1/jenkins/jenkins-slave/workspace/Lucene-Solr-NightlyTests-6.x/solr/build/solr-core/test/J1/temp/solr.cloud.CollectionsAPIDistributedZkTest_DC689BC529B9A8D1-001/tempDir-001/jetty1, solrconfig=solrconfig.xml, hostContext=/, hostPort=38898, coreRootDirectory=/x1/jenkins/jenkins-slave/workspace/Lucene-Solr-NightlyTests-6.x/solr/build/solr-core/test/J1/temp/solr.cloud.CollectionsAPIDistributedZkTest_DC689BC529B9A8D1-001/shard-1-001/cores}
   [junit4]   2> 656683 INFO  (TEST-CollectionsAPIDistributedZkTest.test-seed#[DC689BC529B9A8D1]) [    ] o.a.s.s.SolrDispatchFilter SolrDispatchFilter.init(): sun.misc.Launcher$AppClassLoader@73d16e93
   [junit4]   2> 656684 INFO  (TEST-CollectionsAPIDistributedZkTest.test-seed#[DC689BC529B9A8D1]) [    ] o.a.s.c.SolrResourceLoader new SolrResourceLoader for directory: '/x1/jenkins/jenkins-slave/workspace/Lucene-Solr-NightlyTests-6.x/solr/build/solr-core/test/J1/temp/solr.cloud.CollectionsAPIDistributedZkTest_DC689BC529B9A8D1-001/shard-1-001'
   [junit4]   2> 656684 INFO  (TEST-CollectionsAPIDistributedZkTest.test-seed#[DC689BC529B9A8D1]) [    ] o.a.s.c.SolrResourceLoader JNDI not configured for solr (NoInitialContextEx)
   [junit4]   2> 656684 INFO  (TEST-CollectionsAPIDistributedZkTest.test-seed#[DC689BC529B9A8D1]) [    ] o.a.s.c.SolrResourceLoader solr home defaulted to 'solr/' (could not find system property or JNDI)
   [junit4]   2> 656684 INFO  (OverseerStateUpdate-96081528742281222-127.0.0.1:37752_-n_0000000000) [n:127.0.0.1:37752_    ] o.a.s.c.o.ZkStateWriter going to create_collection /collections/collection1/state.json
   [junit4]   2> 656684 INFO  (TEST-CollectionsAPIDistributedZkTest.test-seed#[DC689BC529B9A8D1]) [    ] o.a.s.c.c.SolrZkClient Using default ZkCredentialsProvider
   [junit4]   2> 656686 INFO  (TEST-CollectionsAPIDistributedZkTest.test-seed#[DC689BC529B9A8D1]) [    ] o.a.s.c.c.ConnectionManager Waiting for client to connect to ZooKeeper
   [junit4]   2> 656686 INFO  (zkCallback-545-thread-1) [    ] o.a.s.c.c.ConnectionManager Watcher org.apache.solr.common.cloud.ConnectionManager@6716c5fd name:ZooKeeperConnection Watcher:127.0.0.1:51265/solr got event WatchedEvent state:SyncConnected type:None path:null path:null type:None
   [junit4]   2> 656686 INFO  (TEST-CollectionsAPIDistributedZkTest.test-seed#[DC689BC529B9A8D1]) [    ] o.a.s.c.c.ConnectionManager Client is connected to ZooKeeper
   [junit4]   2> 656686 INFO  (TEST-CollectionsAPIDistributedZkTest.test-seed#[DC689BC529B9A8D1]) [    ] o.a.s.c.c.SolrZkClient Using default ZkACLProvider
   [junit4]   2> 656688 INFO  (TEST-CollectionsAPIDistributedZkTest.test-seed#[DC689BC529B9A8D1]) [    ] o.a.s.s.SolrDispatchFilter Loading solr.xml from SolrHome (not found in ZooKeeper)
   [junit4]   2> 656688 INFO  (TEST-CollectionsAPIDistributedZkTest.test-seed#[DC689BC529B9A8D1]) [    ] o.a.s.c.SolrXmlConfig Loading container configuration from /x1/jenkins/jenkins-slave/workspace/Lucene-Solr-NightlyTests-6.x/solr/build/solr-core/test/J1/temp/solr.cloud.CollectionsAPIDistributedZkTest_DC689BC529B9A8D1-001/shard-1-001/solr.xml
   [junit4]   2> 656692 INFO  (TEST-CollectionsAPIDistributedZkTest.test-seed#[DC689BC529B9A8D1]) [    ] o.a.s.c.CorePropertiesLocator Config-defined core root directory: /x1/jenkins/jenkins-slave/workspace/Lucene-Solr-NightlyTests-6.x/solr/build/solr-core/test/J1/temp/solr.cloud.CollectionsAPIDistributedZkTest_DC689BC529B9A8D1-001/shard-1-001/cores
   [junit4]   2> 656692 INFO  (TEST-CollectionsAPIDistributedZkTest.test-seed#[DC689BC529B9A8D1]) [    ] o.a.s.c.CoreContainer New CoreContainer 566027340
   [junit4]   2> 656692 INFO  (TEST-CollectionsAPIDistributedZkTest.test-seed#[DC689BC529B9A8D1]) [    ] o.a.s.c.CoreContainer Loading cores into CoreContainer [instanceDir=/x1/jenkins/jenkins-slave/workspace/Lucene-Solr-NightlyTests-6.x/solr/build/solr-core/test/J1/temp/solr.cloud.CollectionsAPIDistributedZkTest_DC689BC529B9A8D1-001/shard-1-001]
   [junit4]   2> 656692 WARN  (TEST-CollectionsAPIDistributedZkTest.test-seed#[DC689BC529B9A8D1]) [    ] o.a.s.c.CoreContainer Couldn't add files from /x1/jenkins/jenkins-slave/workspace/Lucene-Solr-NightlyTests-6.x/solr/build/solr-core/test/J1/temp/solr.cloud.CollectionsAPIDistributedZkTest_DC689BC529B9A8D1-001/shard-1-001/lib to classpath: /x1/jenkins/jenkins-slave/workspace/Lucene-Solr-NightlyTests-6.x/solr/build/solr-core/test/J1/temp/solr.cloud.CollectionsAPIDistributedZkTest_DC689BC529B9A8D1-001/shard-1-001/lib
   [junit4]   2> 656692 INFO  (TEST-CollectionsAPIDistributedZkTest.test-seed#[DC689BC529B9A8D1]) [    ] o.a.s.h.c.HttpShardHandlerFactory created with socketTimeout : 90000,urlScheme : ,connTimeout : 15000,maxConnectionsPerHost : 20,maxConnections : 10000,corePoolSize : 0,maximumPoolSize : 2147483647,maxThreadIdleTime : 5,sizeOfQueue : -1,fairnessPolicy : false,useRetries : false,
   [junit4]   2> 656694 INFO  (TEST-CollectionsAPIDistributedZkTest.test-seed#[DC689BC529B9A8D1]) [    ] o.a.s.u.UpdateShardHandler Creating UpdateShardHandler HTTP client with params: socketTimeout=340000&connTimeout=45000&retry=true
   [junit4]   2> 656694 INFO  (TEST-CollectionsAPIDistributedZkTest.test-seed#[DC689BC529B9A8D1]) [    ] o.a.s.l.LogWatcher SLF4J impl is org.slf4j.impl.Log4jLoggerFactory
   [junit4]   2> 656694 INFO  (TEST-CollectionsAPIDistributedZkTest.test-seed#[DC689BC529B9A8D1]) [    ] o.a.s.l.LogWatcher Registering Log Listener [Log4j (org.slf4j.impl.Log4jLoggerFactory)]
   [junit4]   2> 656694 INFO  (TEST-CollectionsAPIDistributedZkTest.test-seed#[DC689BC529B9A8D1]) [    ] o.a.s.c.ZkContainer Zookeeper client=127.0.0.1:51265/solr
   [junit4]   2> 656694 INFO  (TEST-CollectionsAPIDistributedZkTest.test-seed#[DC689BC529B9A8D1]) [    ] o.a.s.c.ZkController zkHost includes chroot
   [junit4]   2> 656694 INFO  (TEST-CollectionsAPIDistributedZkTest.test-seed#[DC689BC529B9A8D1]) [    ] o.a.s.c.c.SolrZkClient Using default ZkCredentialsProvider
   [junit4]   2> 656694 INFO  (TEST-CollectionsAPIDistributedZkTest.test-seed#[DC689BC529B9A8D1]) [    ] o.a.s.c.c.ConnectionManager Waiting for client to connect to ZooKeeper
   [junit4]   2> 656695 INFO  (zkCallback-548-thread-1) [    ] o.a.s.c.c.ConnectionManager Watcher org.apache.solr.common.cloud.ConnectionManager@3b9522c7 name:ZooKeeperConnection Watcher:127.0.0.1:51265 got event WatchedEvent state:SyncConnected type:None path:null path:null type:None
   [junit4]   2> 656696 INFO  (TEST-CollectionsAPIDistributedZkTest.test-seed#[DC689BC529B9A8D1]) [    ] o.a.s.c.c.ConnectionManager Client is connected to ZooKeeper
   [junit4]   2> 656696 INFO  (TEST-CollectionsAPIDistributedZkTest.test-seed#[DC689BC529B9A8D1]) [    ] o.a.s.c.c.SolrZkClient Using default ZkACLProvider
   [junit4]   2> 656701 INFO  (TEST-CollectionsAPIDistributedZkTest.test-seed#[DC689BC529B9A8D1]) [n:127.0.0.1:38898_    ] o.a.s.c.ZkController Added new OnReconnect listener org.apache.solr.cloud.ZkController$$Lambda$74/1731504286@25f71df4
   [junit4]   2> 656703 INFO  (TEST-CollectionsAPIDistributedZkTest.test-seed#[DC689BC529B9A8D1]) [n:127.0.0.1:38898_    ] o.a.s.c.c.ConnectionManager Waiting for client to connect to ZooKeeper
   [junit4]   2> 656707 INFO  (zkCallback-549-thread-1-processing-n:127.0.0.1:38898_) [n:127.0.0.1:38898_    ] o.a.s.c.c.ConnectionManager Watcher org.apache.solr.common.cloud.ConnectionManager@5092cca6 name:ZooKeeperConnection Watcher:127.0.0.1:51265/solr got event WatchedEvent state:SyncConnected type:None path:null path:null type:None
   [junit4]   2> 656707 INFO  (TEST-CollectionsAPIDistributedZkTest.test-seed#[DC689BC529B9A8D1]) [n:127.0.0.1:38898_    ] o.a.s.c.c.ConnectionManager Client is connected to ZooKeeper
   [junit4]   2> 656712 INFO  (TEST-CollectionsAPIDistributedZkTest.test-seed#[DC689BC529B9A8D1]) [n:127.0.0.1:38898_    ] o.a.s.c.c.ZkStateReader Updating cluster state from ZooKeeper... 
   [junit4]   2> 656712 INFO  (TEST-CollectionsAPIDistributedZkTest.test-seed#[DC689BC529B9A8D1]) [n:127.0.0.1:38898_    ] o.a.s.c.c.ZkStateReader Loaded empty cluster properties
   [junit4]   2> 656715 INFO  (TEST-CollectionsAPIDistributedZkTest.test-seed#[DC689BC529B9A8D1]) [n:127.0.0.1:38898_    ] o.a.s.c.c.ZkStateReader Updated live nodes from ZooKeeper... (0) -> (1)
   [junit4]   2> 656722 INFO  (TEST-CollectionsAPIDistr

[...truncated too long message...]

l.teardownClass(HdfsTestUtil.java:198)
   [junit4]   2> 	at org.apache.solr.cloud.hdfs.HdfsCollectionsAPIDistributedZkTest.teardownClass(HdfsCollectionsAPIDistributedZkTest.java:52)
   [junit4]   2> 	at sun.reflect.NativeMethodAccessorImpl.invoke0(Native Method)
   [junit4]   2> 	at sun.reflect.NativeMethodAccessorImpl.invoke(NativeMethodAccessorImpl.java:62)
   [junit4]   2> 	at sun.reflect.DelegatingMethodAccessorImpl.invoke(DelegatingMethodAccessorImpl.java:43)
   [junit4]   2> 	at java.lang.reflect.Method.invoke(Method.java:498)
   [junit4]   2> 	at com.carrotsearch.randomizedtesting.RandomizedRunner.invoke(RandomizedRunner.java:1764)
   [junit4]   2> 	at com.carrotsearch.randomizedtesting.RandomizedRunner$7.evaluate(RandomizedRunner.java:834)
   [junit4]   2> 	at com.carrotsearch.randomizedtesting.rules.StatementAdapter.evaluate(StatementAdapter.java:36)
   [junit4]   2> 	at com.carrotsearch.randomizedtesting.rules.SystemPropertiesRestoreRule$1.evaluate(SystemPropertiesRestoreRule.java:57)
   [junit4]   2> 	at org.apache.lucene.util.AbstractBeforeAfterRule$1.evaluate(AbstractBeforeAfterRule.java:45)
   [junit4]   2> 	at com.carrotsearch.randomizedtesting.rules.StatementAdapter.evaluate(StatementAdapter.java:36)
   [junit4]   2> 	at org.apache.lucene.util.TestRuleStoreClassName$1.evaluate(TestRuleStoreClassName.java:41)
   [junit4]   2> 	at com.carrotsearch.randomizedtesting.rules.NoShadowingOrOverridesOnMethodsRule$1.evaluate(NoShadowingOrOverridesOnMethodsRule.java:40)
   [junit4]   2> 	at com.carrotsearch.randomizedtesting.rules.NoShadowingOrOverridesOnMethodsRule$1.evaluate(NoShadowingOrOverridesOnMethodsRule.java:40)
   [junit4]   2> 	at com.carrotsearch.randomizedtesting.rules.StatementAdapter.evaluate(StatementAdapter.java:36)
   [junit4]   2> 	at com.carrotsearch.randomizedtesting.rules.StatementAdapter.evaluate(StatementAdapter.java:36)
   [junit4]   2> 	at com.carrotsearch.randomizedtesting.rules.StatementAdapter.evaluate(StatementAdapter.java:36)
   [junit4]   2> 	at org.apache.lucene.util.TestRuleAssertionsRequired$1.evaluate(TestRuleAssertionsRequired.java:53)
   [junit4]   2> 	at org.apache.lucene.util.TestRuleMarkFailure$1.evaluate(TestRuleMarkFailure.java:47)
   [junit4]   2> 	at org.apache.lucene.util.TestRuleIgnoreAfterMaxFailures$1.evaluate(TestRuleIgnoreAfterMaxFailures.java:64)
   [junit4]   2> 	at org.apache.lucene.util.TestRuleIgnoreTestSuites$1.evaluate(TestRuleIgnoreTestSuites.java:54)
   [junit4]   2> 	at com.carrotsearch.randomizedtesting.rules.StatementAdapter.evaluate(StatementAdapter.java:36)
   [junit4]   2> 	at com.carrotsearch.randomizedtesting.ThreadLeakControl$StatementRunner.run(ThreadLeakControl.java:367)
   [junit4]   2> 	at java.lang.Thread.run(Thread.java:745)
   [junit4]   2> Caused by: java.lang.NullPointerException
   [junit4]   2> 	at org.apache.hadoop.hdfs.server.blockmanagement.BlocksMap.size(BlocksMap.java:198)
   [junit4]   2> 	at org.apache.hadoop.hdfs.server.blockmanagement.BlockManager.getTotalBlocks(BlockManager.java:3291)
   [junit4]   2> 	at org.apache.hadoop.hdfs.server.namenode.FSNamesystem.getBlocksTotal(FSNamesystem.java:6223)
   [junit4]   2> 	... 54 more
   [junit4]   2> 5270060 INFO  (SUITE-HdfsCollectionsAPIDistributedZkTest-seed#[DC689BC529B9A8D1]-worker) [    ] o.a.s.SolrTestCaseJ4 ###deleteCore
   [junit4]   2> NOTE: leaving temporary files on disk at: /x1/jenkins/jenkins-slave/workspace/Lucene-Solr-NightlyTests-6.x/solr/build/solr-core/test/J1/temp/solr.cloud.hdfs.HdfsCollectionsAPIDistributedZkTest_DC689BC529B9A8D1-001
   [junit4]   2> Jun 16, 2016 3:53:15 PM com.carrotsearch.randomizedtesting.ThreadLeakControl checkThreadLeaks
   [junit4]   2> WARNING: Will linger awaiting termination of 3 leaked thread(s).
   [junit4]   2> NOTE: test params are: codec=Asserting(Lucene62): {other_tl1=PostingsFormat(name=Memory doPackFST= false), range_facet_l_dv=FSTOrd50, _version_=PostingsFormat(name=Memory doPackFST= false), multiDefault=PostingsFormat(name=LuceneFixedGap), a_t=PostingsFormat(name=LuceneFixedGap), intDefault=PostingsFormat(name=Memory doPackFST= false), a_i1=PostingsFormat(name=LuceneFixedGap), id=FSTOrd50, range_facet_i_dv=PostingsFormat(name=LuceneFixedGap), text=PostingsFormat(name=LuceneVarGapDocFreqInterval), range_facet_l=PostingsFormat(name=LuceneFixedGap), timestamp=PostingsFormat(name=LuceneFixedGap)}, docValues:{range_facet_l_dv=DocValuesFormat(name=Lucene54), range_facet_i_dv=DocValuesFormat(name=Asserting), timestamp=DocValuesFormat(name=Asserting)}, maxPointsInLeafNode=1925, maxMBSortInHeap=7.39377657525173, sim=ClassicSimilarity, locale=pt-PT, timezone=Pacific/Palau
   [junit4]   2> NOTE: Linux 3.13.0-85-generic amd64/Oracle Corporation 1.8.0_74 (64-bit)/cpus=4,threads=2,free=107348912,total=462946304
   [junit4]   2> NOTE: All tests run in this JVM: [TestSolrQueryParserResource, MBeansHandlerTest, TestCoreContainer, ChaosMonkeyNothingIsSafeTest, AliasIntegrationTest, RecoveryAfterSoftCommitTest, TestDocumentBuilder, SpellingQueryConverterTest, TestCodecSupport, ExplicitHLLTest, TestSimpleQParserPlugin, CheckHdfsIndexTest, RestartWhileUpdatingTest, DistributedQueueTest, TestRandomCollapseQParserPlugin, BJQParserTest, TestCollectionAPI, TestMinMaxOnMultiValuedField, SoftAutoCommitTest, TestCloudDeleteByQuery, TestReloadAndDeleteDocs, CSVRequestHandlerTest, AtomicUpdatesTest, IndexBasedSpellCheckerTest, SecurityConfHandlerTest, CollectionsAPIDistributedZkTest, TestComplexPhraseQParserPlugin, TestPivotHelperCode, DistributedMLTComponentTest, EnumFieldTest, TestDistributedGrouping, SimpleMLTQParserTest, TestDownShardTolerantSearch, TestRTimerTree, TestUpdate, ClusterStateUpdateTest, MoreLikeThisHandlerTest, TestSolrConfigHandlerCloud, DocumentBuilderTest, TestTrie, HdfsThreadLeakTest, TestPartialUpdateDeduplication, TestHashPartitioner, UpdateRequestProcessorFactoryTest, SaslZkACLProviderTest, TestFastLRUCache, TestFieldCacheVsDocValues, TestConfigSets, ZkStateReaderTest, TestPKIAuthenticationPlugin, ZkSolrClientTest, TestInitQParser, DOMUtilTest, DistributedQueryComponentCustomSortTest, ZkControllerTest, TestLeaderInitiatedRecoveryThread, FacetPivotSmallTest, DataDrivenBlockJoinTest, MinimalSchemaTest, SpellCheckComponentTest, TestNumericTerms32, ConvertedLegacyTest, TestRecoveryHdfs, TestManagedResourceStorage, TestTolerantUpdateProcessorCloud, TestBM25SimilarityFactory, TestQuerySenderNoQuery, TermsComponentTest, TestSolrDynamicMBean, DocValuesTest, BufferStoreTest, TermVectorComponentTest, WordBreakSolrSpellCheckerTest, TestDynamicFieldCollectionResource, TestMiniSolrCloudClusterBase, SpatialFilterTest, TestSurroundQueryParser, TestSystemIdResolver, MultiTermTest, TestSolrCloudWithKerberosAlt, TestFieldCacheSanityChecker, TestRawResponseWriter, TestBinaryResponseWriter, TestSimpleTrackingShardHandler, CoreAdminRequestStatusTest, ShardRoutingTest, TestSchemaNameResource, TestQueryUtils, ResponseHeaderTest, CustomCollectionTest, SolrIndexConfigTest, SchemaVersionSpecificBehaviorTest, TestCollationFieldDocValues, DistribCursorPagingTest, AnalyticsMergeStrategyTest, OpenCloseCoreStressTest, TestFiltering, TestReplicationHandler, CleanupOldIndexTest, CloudExitableDirectoryReaderTest, CollectionReloadTest, CollectionStateFormat2Test, CollectionsAPIAsyncDistributedZkTest, ConfigSetsAPITest, CreateCollectionCleanupTest, DeleteInactiveReplicaTest, DeleteShardTest, DeleteStatusTest, HttpPartitionTest, MultiThreadedOCPTest, OutOfBoxZkACLAndCredentialsProvidersTest, OverriddenZkACLAndCredentialsProvidersTest, OverseerCollectionConfigSetProcessorTest, RemoteQueryErrorTest, RollingRestartTest, SharedFSAutoReplicaFailoverUtilsTest, SolrXmlInZkTest, TestCloudBackupRestore, TestDistribDocBasedVersion, TestExclusionRuleCollectionAccess, TestRandomRequestDistribution, TestRequestStatusCollectionAPI, TriLevelCompositeIdRoutingTest, VMParamsZkACLAndCredentialsProvidersTest, HdfsBasicDistributedZk2Test, HdfsCollectionsAPIDistributedZkTest]
   [junit4] Completed [585/615 (2!)] on J1 in 1010.13s, 1 test, 1 error <<< FAILURES!

[...truncated 97 lines...]
   [junit4] JVM J1: stdout was not empty, see: /x1/jenkins/jenkins-slave/workspace/Lucene-Solr-NightlyTests-6.x/solr/build/solr-core/test/temp/junit4-J1-20160616_142522_670.sysout
   [junit4] >>> JVM J1 emitted unexpected output (verbatim) ----
   [junit4] java.lang.OutOfMemoryError: GC overhead limit exceeded
   [junit4] Dumping heap to /x1/jenkins/jenkins-slave/workspace/Lucene-Solr-NightlyTests-6.x/heapdumps/java_pid29363.hprof ...
   [junit4] Heap dump file created [616333093 bytes in 3.661 secs]
   [junit4] <<< JVM J1: EOF ----

[...truncated 11 lines...]
BUILD FAILED
/x1/jenkins/jenkins-slave/workspace/Lucene-Solr-NightlyTests-6.x/build.xml:747: The following error occurred while executing this line:
/x1/jenkins/jenkins-slave/workspace/Lucene-Solr-NightlyTests-6.x/build.xml:684: The following error occurred while executing this line:
/x1/jenkins/jenkins-slave/workspace/Lucene-Solr-NightlyTests-6.x/build.xml:59: The following error occurred while executing this line:
/x1/jenkins/jenkins-slave/workspace/Lucene-Solr-NightlyTests-6.x/solr/build.xml:233: The following error occurred while executing this line:
/x1/jenkins/jenkins-slave/workspace/Lucene-Solr-NightlyTests-6.x/solr/common-build.xml:531: The following error occurred while executing this line:
/x1/jenkins/jenkins-slave/workspace/Lucene-Solr-NightlyTests-6.x/lucene/common-build.xml:1427: The following error occurred while executing this line:
/x1/jenkins/jenkins-slave/workspace/Lucene-Solr-NightlyTests-6.x/lucene/common-build.xml:984: There were test failures: 615 suites (10 ignored), 2591 tests, 2 errors, 33 ignored (18 assumptions) [seed: DC689BC529B9A8D1]

Total time: 256 minutes 0 seconds
Build step 'Invoke Ant' marked build as failure
Archiving artifacts
No prior successful build to compare, so performing full copy of artifacts
Recording test results
Email was triggered for: Failure - Any
Sending email for trigger: Failure - Any




Mime
View raw message