lucene-dev mailing list archives

Site index · List index
Message view « Date » · « Thread »
Top « Date » · « Thread »
From Policeman Jenkins Server <jenk...@thetaphi.de>
Subject [JENKINS] Lucene-Solr-5.5-Windows (32bit/jdk1.7.0_80) - Build # 93 - Still Failing!
Date Tue, 21 Jun 2016 03:23:56 GMT
Build: http://jenkins.thetaphi.de/job/Lucene-Solr-5.5-Windows/93/
Java: 32bit/jdk1.7.0_80 -server -XX:+UseSerialGC

1 tests failed.
FAILED:  org.apache.solr.schema.TestManagedSchemaAPI.test

Error Message:
Error from server at http://127.0.0.1:64694/solr/testschemaapi_shard1_replica2: ERROR: [doc=2] unknown field 'myNewField1'

Stack Trace:
org.apache.solr.client.solrj.impl.CloudSolrClient$RouteException: Error from server at http://127.0.0.1:64694/solr/testschemaapi_shard1_replica2: ERROR: [doc=2] unknown field 'myNewField1'
	at __randomizedtesting.SeedInfo.seed([9E84302F8BEC9B18:16D00FF52510F6E0]:0)
	at org.apache.solr.client.solrj.impl.CloudSolrClient.directUpdate(CloudSolrClient.java:632)
	at org.apache.solr.client.solrj.impl.CloudSolrClient.sendRequest(CloudSolrClient.java:981)
	at org.apache.solr.client.solrj.impl.CloudSolrClient.requestWithRetryOnStaleState(CloudSolrClient.java:870)
	at org.apache.solr.client.solrj.impl.CloudSolrClient.request(CloudSolrClient.java:806)
	at org.apache.solr.schema.TestManagedSchemaAPI.testAddFieldAndDocument(TestManagedSchemaAPI.java:101)
	at org.apache.solr.schema.TestManagedSchemaAPI.test(TestManagedSchemaAPI.java:69)
	at sun.reflect.NativeMethodAccessorImpl.invoke0(Native Method)
	at sun.reflect.NativeMethodAccessorImpl.invoke(NativeMethodAccessorImpl.java:57)
	at sun.reflect.DelegatingMethodAccessorImpl.invoke(DelegatingMethodAccessorImpl.java:43)
	at java.lang.reflect.Method.invoke(Method.java:606)
	at com.carrotsearch.randomizedtesting.RandomizedRunner.invoke(RandomizedRunner.java:1764)
	at com.carrotsearch.randomizedtesting.RandomizedRunner$8.evaluate(RandomizedRunner.java:871)
	at com.carrotsearch.randomizedtesting.RandomizedRunner$9.evaluate(RandomizedRunner.java:907)
	at com.carrotsearch.randomizedtesting.RandomizedRunner$10.evaluate(RandomizedRunner.java:921)
	at com.carrotsearch.randomizedtesting.rules.SystemPropertiesRestoreRule$1.evaluate(SystemPropertiesRestoreRule.java:57)
	at org.apache.lucene.util.TestRuleSetupTeardownChained$1.evaluate(TestRuleSetupTeardownChained.java:49)
	at org.apache.lucene.util.AbstractBeforeAfterRule$1.evaluate(AbstractBeforeAfterRule.java:45)
	at org.apache.lucene.util.TestRuleThreadAndTestName$1.evaluate(TestRuleThreadAndTestName.java:48)
	at org.apache.lucene.util.TestRuleIgnoreAfterMaxFailures$1.evaluate(TestRuleIgnoreAfterMaxFailures.java:64)
	at org.apache.lucene.util.TestRuleMarkFailure$1.evaluate(TestRuleMarkFailure.java:47)
	at com.carrotsearch.randomizedtesting.rules.StatementAdapter.evaluate(StatementAdapter.java:36)
	at com.carrotsearch.randomizedtesting.ThreadLeakControl$StatementRunner.run(ThreadLeakControl.java:367)
	at com.carrotsearch.randomizedtesting.ThreadLeakControl.forkTimeoutingTask(ThreadLeakControl.java:809)
	at com.carrotsearch.randomizedtesting.ThreadLeakControl$3.evaluate(ThreadLeakControl.java:460)
	at com.carrotsearch.randomizedtesting.RandomizedRunner.runSingleTest(RandomizedRunner.java:880)
	at com.carrotsearch.randomizedtesting.RandomizedRunner$5.evaluate(RandomizedRunner.java:781)
	at com.carrotsearch.randomizedtesting.RandomizedRunner$6.evaluate(RandomizedRunner.java:816)
	at com.carrotsearch.randomizedtesting.RandomizedRunner$7.evaluate(RandomizedRunner.java:827)
	at com.carrotsearch.randomizedtesting.rules.StatementAdapter.evaluate(StatementAdapter.java:36)
	at com.carrotsearch.randomizedtesting.rules.SystemPropertiesRestoreRule$1.evaluate(SystemPropertiesRestoreRule.java:57)
	at org.apache.lucene.util.AbstractBeforeAfterRule$1.evaluate(AbstractBeforeAfterRule.java:45)
	at com.carrotsearch.randomizedtesting.rules.StatementAdapter.evaluate(StatementAdapter.java:36)
	at org.apache.lucene.util.TestRuleStoreClassName$1.evaluate(TestRuleStoreClassName.java:41)
	at com.carrotsearch.randomizedtesting.rules.NoShadowingOrOverridesOnMethodsRule$1.evaluate(NoShadowingOrOverridesOnMethodsRule.java:40)
	at com.carrotsearch.randomizedtesting.rules.NoShadowingOrOverridesOnMethodsRule$1.evaluate(NoShadowingOrOverridesOnMethodsRule.java:40)
	at com.carrotsearch.randomizedtesting.rules.StatementAdapter.evaluate(StatementAdapter.java:36)
	at com.carrotsearch.randomizedtesting.rules.StatementAdapter.evaluate(StatementAdapter.java:36)
	at com.carrotsearch.randomizedtesting.rules.StatementAdapter.evaluate(StatementAdapter.java:36)
	at org.apache.lucene.util.TestRuleAssertionsRequired$1.evaluate(TestRuleAssertionsRequired.java:53)
	at org.apache.lucene.util.TestRuleMarkFailure$1.evaluate(TestRuleMarkFailure.java:47)
	at org.apache.lucene.util.TestRuleIgnoreAfterMaxFailures$1.evaluate(TestRuleIgnoreAfterMaxFailures.java:64)
	at org.apache.lucene.util.TestRuleIgnoreTestSuites$1.evaluate(TestRuleIgnoreTestSuites.java:54)
	at com.carrotsearch.randomizedtesting.rules.StatementAdapter.evaluate(StatementAdapter.java:36)
	at com.carrotsearch.randomizedtesting.ThreadLeakControl$StatementRunner.run(ThreadLeakControl.java:367)
	at java.lang.Thread.run(Thread.java:745)
Caused by: org.apache.solr.client.solrj.impl.HttpSolrClient$RemoteSolrException: Error from server at http://127.0.0.1:64694/solr/testschemaapi_shard1_replica2: ERROR: [doc=2] unknown field 'myNewField1'
	at org.apache.solr.client.solrj.impl.HttpSolrClient.executeMethod(HttpSolrClient.java:577)
	at org.apache.solr.client.solrj.impl.HttpSolrClient.request(HttpSolrClient.java:241)
	at org.apache.solr.client.solrj.impl.HttpSolrClient.request(HttpSolrClient.java:230)
	at org.apache.solr.client.solrj.impl.LBHttpSolrClient.doRequest(LBHttpSolrClient.java:372)
	at org.apache.solr.client.solrj.impl.LBHttpSolrClient.request(LBHttpSolrClient.java:325)
	at org.apache.solr.client.solrj.impl.CloudSolrClient$2.call(CloudSolrClient.java:607)
	at org.apache.solr.client.solrj.impl.CloudSolrClient$2.call(CloudSolrClient.java:604)
	at java.util.concurrent.FutureTask.run(FutureTask.java:262)
	at org.apache.solr.common.util.ExecutorUtil$MDCAwareThreadPoolExecutor$1.run(ExecutorUtil.java:231)
	at java.util.concurrent.ThreadPoolExecutor.runWorker(ThreadPoolExecutor.java:1145)
	at java.util.concurrent.ThreadPoolExecutor$Worker.run(ThreadPoolExecutor.java:615)
	... 1 more




Build Log:
[...truncated 12233 lines...]
   [junit4] Suite: org.apache.solr.schema.TestManagedSchemaAPI
   [junit4]   2> Creating dataDir: C:\Users\jenkins\workspace\Lucene-Solr-5.5-Windows\solr\build\solr-core\test\J0\temp\solr.schema.TestManagedSchemaAPI_9E84302F8BEC9B18-001\init-core-data-001
   [junit4]   2> 3287771 INFO  (SUITE-TestManagedSchemaAPI-seed#[9E84302F8BEC9B18]-worker) [    ] o.a.s.SolrTestCaseJ4 Randomized ssl (false) and clientAuth (false)
   [junit4]   2> 3287773 INFO  (TEST-TestManagedSchemaAPI.test-seed#[9E84302F8BEC9B18]) [    ] o.a.s.SolrTestCaseJ4 ###Starting test
   [junit4]   2> 3287775 INFO  (TEST-TestManagedSchemaAPI.test-seed#[9E84302F8BEC9B18]) [    ] o.a.s.c.ZkTestServer STARTING ZK TEST SERVER
   [junit4]   2> 3287776 INFO  (Thread-8493) [    ] o.a.s.c.ZkTestServer client port:0.0.0.0/0.0.0.0:0
   [junit4]   2> 3287776 INFO  (Thread-8493) [    ] o.a.s.c.ZkTestServer Starting server
   [junit4]   2> 3287875 INFO  (TEST-TestManagedSchemaAPI.test-seed#[9E84302F8BEC9B18]) [    ] o.a.s.c.ZkTestServer start zk server on port:64690
   [junit4]   2> 3287875 INFO  (TEST-TestManagedSchemaAPI.test-seed#[9E84302F8BEC9B18]) [    ] o.a.s.c.c.SolrZkClient Using default ZkCredentialsProvider
   [junit4]   2> 3287876 INFO  (TEST-TestManagedSchemaAPI.test-seed#[9E84302F8BEC9B18]) [    ] o.a.s.c.c.ConnectionManager Waiting for client to connect to ZooKeeper
   [junit4]   2> 3287882 INFO  (zkCallback-3522-thread-1) [    ] o.a.s.c.c.ConnectionManager Watcher org.apache.solr.common.cloud.ConnectionManager@1ee8f36 name:ZooKeeperConnection Watcher:127.0.0.1:64690 got event WatchedEvent state:SyncConnected type:None path:null path:null type:None
   [junit4]   2> 3287882 INFO  (TEST-TestManagedSchemaAPI.test-seed#[9E84302F8BEC9B18]) [    ] o.a.s.c.c.ConnectionManager Client is connected to ZooKeeper
   [junit4]   2> 3287883 INFO  (TEST-TestManagedSchemaAPI.test-seed#[9E84302F8BEC9B18]) [    ] o.a.s.c.c.SolrZkClient Using default ZkACLProvider
   [junit4]   2> 3287883 INFO  (TEST-TestManagedSchemaAPI.test-seed#[9E84302F8BEC9B18]) [    ] o.a.s.c.c.SolrZkClient makePath: /solr/solr.xml
   [junit4]   2> 3287891 INFO  (jetty-launcher-3521-thread-2) [    ] o.e.j.s.Server jetty-9.2.13.v20150730
   [junit4]   2> 3287891 INFO  (jetty-launcher-3521-thread-1) [    ] o.e.j.s.Server jetty-9.2.13.v20150730
   [junit4]   2> 3287892 INFO  (jetty-launcher-3521-thread-2) [    ] o.e.j.s.h.ContextHandler Started o.e.j.s.ServletContextHandler@455f56{/solr,null,AVAILABLE}
   [junit4]   2> 3287892 INFO  (jetty-launcher-3521-thread-1) [    ] o.e.j.s.h.ContextHandler Started o.e.j.s.ServletContextHandler@172ce31{/solr,null,AVAILABLE}
   [junit4]   2> 3287894 INFO  (jetty-launcher-3521-thread-2) [    ] o.e.j.s.ServerConnector Started ServerConnector@135556e{HTTP/1.1}{127.0.0.1:64694}
   [junit4]   2> 3287894 INFO  (jetty-launcher-3521-thread-1) [    ] o.e.j.s.ServerConnector Started ServerConnector@3ef4bb{HTTP/1.1}{127.0.0.1:64695}
   [junit4]   2> 3287894 INFO  (jetty-launcher-3521-thread-2) [    ] o.e.j.s.Server Started @3294235ms
   [junit4]   2> 3287894 INFO  (jetty-launcher-3521-thread-1) [    ] o.e.j.s.Server Started @3294235ms
   [junit4]   2> 3287894 INFO  (jetty-launcher-3521-thread-2) [    ] o.a.s.c.s.e.JettySolrRunner Jetty properties: {hostPort=64694, hostContext=/solr}
   [junit4]   2> 3287894 INFO  (jetty-launcher-3521-thread-1) [    ] o.a.s.c.s.e.JettySolrRunner Jetty properties: {hostContext=/solr, hostPort=64695}
   [junit4]   2> 3287894 INFO  (jetty-launcher-3521-thread-2) [    ] o.a.s.s.SolrDispatchFilter SolrDispatchFilter.init(): sun.misc.Launcher$AppClassLoader@161bfa3
   [junit4]   2> 3287894 INFO  (jetty-launcher-3521-thread-1) [    ] o.a.s.s.SolrDispatchFilter SolrDispatchFilter.init(): sun.misc.Launcher$AppClassLoader@161bfa3
   [junit4]   2> 3287894 INFO  (jetty-launcher-3521-thread-2) [    ] o.a.s.c.SolrResourceLoader new SolrResourceLoader for directory: 'C:\Users\jenkins\workspace\Lucene-Solr-5.5-Windows\solr\build\solr-core\test\J0\temp\solr.schema.TestManagedSchemaAPI_9E84302F8BEC9B18-001\tempDir-001\node2'
   [junit4]   2> 3287894 INFO  (jetty-launcher-3521-thread-1) [    ] o.a.s.c.SolrResourceLoader new SolrResourceLoader for directory: 'C:\Users\jenkins\workspace\Lucene-Solr-5.5-Windows\solr\build\solr-core\test\J0\temp\solr.schema.TestManagedSchemaAPI_9E84302F8BEC9B18-001\tempDir-001\node1'
   [junit4]   2> 3287894 INFO  (jetty-launcher-3521-thread-2) [    ] o.a.s.c.SolrResourceLoader JNDI not configured for solr (NoInitialContextEx)
   [junit4]   2> 3287896 INFO  (jetty-launcher-3521-thread-1) [    ] o.a.s.c.SolrResourceLoader JNDI not configured for solr (NoInitialContextEx)
   [junit4]   2> 3287896 INFO  (jetty-launcher-3521-thread-2) [    ] o.a.s.c.SolrResourceLoader solr home defaulted to 'solr/' (could not find system property or JNDI)
   [junit4]   2> 3287896 INFO  (jetty-launcher-3521-thread-1) [    ] o.a.s.c.SolrResourceLoader solr home defaulted to 'solr/' (could not find system property or JNDI)
   [junit4]   2> 3287896 INFO  (jetty-launcher-3521-thread-1) [    ] o.a.s.c.c.SolrZkClient Using default ZkCredentialsProvider
   [junit4]   2> 3287896 INFO  (jetty-launcher-3521-thread-2) [    ] o.a.s.c.c.SolrZkClient Using default ZkCredentialsProvider
   [junit4]   2> 3287898 INFO  (jetty-launcher-3521-thread-1) [    ] o.a.s.c.c.ConnectionManager Waiting for client to connect to ZooKeeper
   [junit4]   2> 3287898 INFO  (jetty-launcher-3521-thread-2) [    ] o.a.s.c.c.ConnectionManager Waiting for client to connect to ZooKeeper
   [junit4]   2> 3287901 INFO  (zkCallback-3523-thread-1) [    ] o.a.s.c.c.ConnectionManager Watcher org.apache.solr.common.cloud.ConnectionManager@c10225 name:ZooKeeperConnection Watcher:127.0.0.1:64690/solr got event WatchedEvent state:SyncConnected type:None path:null path:null type:None
   [junit4]   2> 3287901 INFO  (jetty-launcher-3521-thread-1) [    ] o.a.s.c.c.ConnectionManager Client is connected to ZooKeeper
   [junit4]   2> 3287901 INFO  (zkCallback-3524-thread-1) [    ] o.a.s.c.c.ConnectionManager Watcher org.apache.solr.common.cloud.ConnectionManager@10f72c8 name:ZooKeeperConnection Watcher:127.0.0.1:64690/solr got event WatchedEvent state:SyncConnected type:None path:null path:null type:None
   [junit4]   2> 3287901 INFO  (jetty-launcher-3521-thread-1) [    ] o.a.s.c.c.SolrZkClient Using default ZkACLProvider
   [junit4]   2> 3287901 INFO  (jetty-launcher-3521-thread-2) [    ] o.a.s.c.c.ConnectionManager Client is connected to ZooKeeper
   [junit4]   2> 3287901 INFO  (jetty-launcher-3521-thread-2) [    ] o.a.s.c.c.SolrZkClient Using default ZkACLProvider
   [junit4]   2> 3287902 INFO  (jetty-launcher-3521-thread-1) [    ] o.a.s.s.SolrDispatchFilter solr.xml found in ZooKeeper. Loading...
   [junit4]   2> 3287902 INFO  (jetty-launcher-3521-thread-2) [    ] o.a.s.s.SolrDispatchFilter solr.xml found in ZooKeeper. Loading...
   [junit4]   2> 3287921 WARN  (NIOServerCxn.Factory:0.0.0.0/0.0.0.0:0) [    ] o.a.z.s.NIOServerCnxn caught end of stream exception
   [junit4]   2> EndOfStreamException: Unable to read additional data from client sessionid 0x15570f6a3930002, likely client has closed socket
   [junit4]   2> 	at org.apache.zookeeper.server.NIOServerCnxn.doIO(NIOServerCnxn.java:228)
   [junit4]   2> 	at org.apache.zookeeper.server.NIOServerCnxnFactory.run(NIOServerCnxnFactory.java:208)
   [junit4]   2> 	at java.lang.Thread.run(Thread.java:745)
   [junit4]   2> 3287922 INFO  (jetty-launcher-3521-thread-2) [    ] o.a.s.c.CorePropertiesLocator Config-defined core root directory: C:\Users\jenkins\workspace\Lucene-Solr-5.5-Windows\solr\build\solr-core\test\J0\temp\solr.schema.TestManagedSchemaAPI_9E84302F8BEC9B18-001\tempDir-001\node2\.
   [junit4]   2> 3287922 INFO  (jetty-launcher-3521-thread-2) [    ] o.a.s.c.CoreContainer New CoreContainer 1894632
   [junit4]   2> 3287923 INFO  (jetty-launcher-3521-thread-2) [    ] o.a.s.c.CoreContainer Loading cores into CoreContainer [instanceDir=C:\Users\jenkins\workspace\Lucene-Solr-5.5-Windows\solr\build\solr-core\test\J0\temp\solr.schema.TestManagedSchemaAPI_9E84302F8BEC9B18-001\tempDir-001\node2]
   [junit4]   2> 3287923 WARN  (jetty-launcher-3521-thread-2) [    ] o.a.s.c.CoreContainer Couldn't add files from C:\Users\jenkins\workspace\Lucene-Solr-5.5-Windows\solr\build\solr-core\test\J0\temp\solr.schema.TestManagedSchemaAPI_9E84302F8BEC9B18-001\tempDir-001\node2\lib to classpath: C:\Users\jenkins\workspace\Lucene-Solr-5.5-Windows\solr\build\solr-core\test\J0\temp\solr.schema.TestManagedSchemaAPI_9E84302F8BEC9B18-001\tempDir-001\node2\lib
   [junit4]   2> 3287923 INFO  (jetty-launcher-3521-thread-2) [    ] o.a.s.h.c.HttpShardHandlerFactory created with socketTimeout : 90000,urlScheme : ,connTimeout : 15000,maxConnectionsPerHost : 20,maxConnections : 10000,corePoolSize : 0,maximumPoolSize : 2147483647,maxThreadIdleTime : 5,sizeOfQueue : -1,fairnessPolicy : false,useRetries : false,
   [junit4]   2> 3287924 INFO  (jetty-launcher-3521-thread-2) [    ] o.a.s.u.UpdateShardHandler Creating UpdateShardHandler HTTP client with params: socketTimeout=340000&connTimeout=45000&retry=true
   [junit4]   2> 3287924 INFO  (jetty-launcher-3521-thread-2) [    ] o.a.s.l.LogWatcher SLF4J impl is org.slf4j.impl.Log4jLoggerFactory
   [junit4]   2> 3287925 INFO  (jetty-launcher-3521-thread-2) [    ] o.a.s.l.LogWatcher Registering Log Listener [Log4j (org.slf4j.impl.Log4jLoggerFactory)]
   [junit4]   2> 3287925 INFO  (jetty-launcher-3521-thread-2) [    ] o.a.s.c.ZkContainer Zookeeper client=127.0.0.1:64690/solr
   [junit4]   2> 3287925 INFO  (jetty-launcher-3521-thread-2) [    ] o.a.s.c.ZkController zkHost includes chroot
   [junit4]   2> 3287925 INFO  (jetty-launcher-3521-thread-2) [    ] o.a.s.c.c.SolrZkClient Using default ZkCredentialsProvider
   [junit4]   2> 3287926 INFO  (jetty-launcher-3521-thread-2) [    ] o.a.s.c.c.ConnectionManager Waiting for client to connect to ZooKeeper
   [junit4]   2> 3287929 INFO  (jetty-launcher-3521-thread-1) [    ] o.a.s.c.CorePropertiesLocator Config-defined core root directory: C:\Users\jenkins\workspace\Lucene-Solr-5.5-Windows\solr\build\solr-core\test\J0\temp\solr.schema.TestManagedSchemaAPI_9E84302F8BEC9B18-001\tempDir-001\node1\.
   [junit4]   2> 3287929 INFO  (jetty-launcher-3521-thread-1) [    ] o.a.s.c.CoreContainer New CoreContainer 31516124
   [junit4]   2> 3287929 INFO  (jetty-launcher-3521-thread-1) [    ] o.a.s.c.CoreContainer Loading cores into CoreContainer [instanceDir=C:\Users\jenkins\workspace\Lucene-Solr-5.5-Windows\solr\build\solr-core\test\J0\temp\solr.schema.TestManagedSchemaAPI_9E84302F8BEC9B18-001\tempDir-001\node1]
   [junit4]   2> 3287929 WARN  (jetty-launcher-3521-thread-1) [    ] o.a.s.c.CoreContainer Couldn't add files from C:\Users\jenkins\workspace\Lucene-Solr-5.5-Windows\solr\build\solr-core\test\J0\temp\solr.schema.TestManagedSchemaAPI_9E84302F8BEC9B18-001\tempDir-001\node1\lib to classpath: C:\Users\jenkins\workspace\Lucene-Solr-5.5-Windows\solr\build\solr-core\test\J0\temp\solr.schema.TestManagedSchemaAPI_9E84302F8BEC9B18-001\tempDir-001\node1\lib
   [junit4]   2> 3287929 INFO  (jetty-launcher-3521-thread-1) [    ] o.a.s.h.c.HttpShardHandlerFactory created with socketTimeout : 90000,urlScheme : ,connTimeout : 15000,maxConnectionsPerHost : 20,maxConnections : 10000,corePoolSize : 0,maximumPoolSize : 2147483647,maxThreadIdleTime : 5,sizeOfQueue : -1,fairnessPolicy : false,useRetries : false,
   [junit4]   2> 3287930 INFO  (zkCallback-3527-thread-1) [    ] o.a.s.c.c.ConnectionManager Watcher org.apache.solr.common.cloud.ConnectionManager@78fc0b name:ZooKeeperConnection Watcher:127.0.0.1:64690 got event WatchedEvent state:SyncConnected type:None path:null path:null type:None
   [junit4]   2> 3287930 INFO  (jetty-launcher-3521-thread-2) [    ] o.a.s.c.c.ConnectionManager Client is connected to ZooKeeper
   [junit4]   2> 3287930 INFO  (jetty-launcher-3521-thread-1) [    ] o.a.s.u.UpdateShardHandler Creating UpdateShardHandler HTTP client with params: socketTimeout=340000&connTimeout=45000&retry=true
   [junit4]   2> 3287930 INFO  (jetty-launcher-3521-thread-2) [    ] o.a.s.c.c.SolrZkClient Using default ZkACLProvider
   [junit4]   2> 3287931 INFO  (jetty-launcher-3521-thread-1) [    ] o.a.s.l.LogWatcher SLF4J impl is org.slf4j.impl.Log4jLoggerFactory
   [junit4]   2> 3287931 INFO  (jetty-launcher-3521-thread-1) [    ] o.a.s.l.LogWatcher Registering Log Listener [Log4j (org.slf4j.impl.Log4jLoggerFactory)]
   [junit4]   2> 3287931 INFO  (jetty-launcher-3521-thread-1) [    ] o.a.s.c.ZkContainer Zookeeper client=127.0.0.1:64690/solr
   [junit4]   2> 3287931 INFO  (jetty-launcher-3521-thread-1) [    ] o.a.s.c.ZkController zkHost includes chroot
   [junit4]   2> 3287931 INFO  (jetty-launcher-3521-thread-1) [    ] o.a.s.c.c.SolrZkClient Using default ZkCredentialsProvider
   [junit4]   2> 3287933 INFO  (jetty-launcher-3521-thread-1) [    ] o.a.s.c.c.ConnectionManager Waiting for client to connect to ZooKeeper
   [junit4]   2> 3287934 WARN  (NIOServerCxn.Factory:0.0.0.0/0.0.0.0:0) [    ] o.a.z.s.NIOServerCnxn caught end of stream exception
   [junit4]   2> EndOfStreamException: Unable to read additional data from client sessionid 0x15570f6a3930003, likely client has closed socket
   [junit4]   2> 	at org.apache.zookeeper.server.NIOServerCnxn.doIO(NIOServerCnxn.java:228)
   [junit4]   2> 	at org.apache.zookeeper.server.NIOServerCnxnFactory.run(NIOServerCnxnFactory.java:208)
   [junit4]   2> 	at java.lang.Thread.run(Thread.java:745)
   [junit4]   2> 3287934 INFO  (jetty-launcher-3521-thread-2) [n:127.0.0.1:64694_solr    ] o.a.s.c.ZkController Added new OnReconnect listener org.apache.solr.cloud.ZkController$6@1b09570
   [junit4]   2> 3287935 INFO  (jetty-launcher-3521-thread-2) [n:127.0.0.1:64694_solr    ] o.a.s.c.c.ConnectionManager Waiting for client to connect to ZooKeeper
   [junit4]   2> 3287936 INFO  (zkCallback-3530-thread-1) [    ] o.a.s.c.c.ConnectionManager Watcher org.apache.solr.common.cloud.ConnectionManager@301f48 name:ZooKeeperConnection Watcher:127.0.0.1:64690 got event WatchedEvent state:SyncConnected type:None path:null path:null type:None
   [junit4]   2> 3287937 INFO  (jetty-launcher-3521-thread-1) [    ] o.a.s.c.c.ConnectionManager Client is connected to ZooKeeper
   [junit4]   2> 3287937 INFO  (jetty-launcher-3521-thread-1) [    ] o.a.s.c.c.SolrZkClient Using default ZkACLProvider
   [junit4]   2> 3287937 INFO  (zkCallback-3531-thread-1-processing-n:127.0.0.1:64694_solr) [n:127.0.0.1:64694_solr    ] o.a.s.c.c.ConnectionManager Watcher org.apache.solr.common.cloud.ConnectionManager@18d0908 name:ZooKeeperConnection Watcher:127.0.0.1:64690/solr got event WatchedEvent state:SyncConnected type:None path:null path:null type:None
   [junit4]   2> 3287938 INFO  (jetty-launcher-3521-thread-2) [n:127.0.0.1:64694_solr    ] o.a.s.c.c.ConnectionManager Client is connected to ZooKeeper
   [junit4]   2> 3287939 INFO  (jetty-launcher-3521-thread-2) [n:127.0.0.1:64694_solr    ] o.a.s.c.c.SolrZkClient makePath: /overseer/queue
   [junit4]   2> 3287939 INFO  (jetty-launcher-3521-thread-1) [n:127.0.0.1:64695_solr    ] o.a.s.c.ZkController Added new OnReconnect listener org.apache.solr.cloud.ZkController$6@1667ad0
   [junit4]   2> 3287943 INFO  (jetty-launcher-3521-thread-1) [n:127.0.0.1:64695_solr    ] o.a.s.c.c.ConnectionManager Waiting for client to connect to ZooKeeper
   [junit4]   2> 3287945 INFO  (jetty-launcher-3521-thread-2) [n:127.0.0.1:64694_solr    ] o.a.s.c.c.SolrZkClient makePath: /overseer/collection-queue-work
   [junit4]   2> 3287947 INFO  (zkCallback-3532-thread-1-processing-n:127.0.0.1:64695_solr) [n:127.0.0.1:64695_solr    ] o.a.s.c.c.ConnectionManager Watcher org.apache.solr.common.cloud.ConnectionManager@1151341 name:ZooKeeperConnection Watcher:127.0.0.1:64690/solr got event WatchedEvent state:SyncConnected type:None path:null path:null type:None
   [junit4]   2> 3287947 INFO  (jetty-launcher-3521-thread-1) [n:127.0.0.1:64695_solr    ] o.a.s.c.c.ConnectionManager Client is connected to ZooKeeper
   [junit4]   2> 3287950 INFO  (jetty-launcher-3521-thread-2) [n:127.0.0.1:64694_solr    ] o.a.s.c.c.SolrZkClient makePath: /overseer/collection-map-running
   [junit4]   2> 3287954 INFO  (jetty-launcher-3521-thread-1) [n:127.0.0.1:64695_solr    ] o.a.s.c.c.SolrZkClient makePath: /overseer/collection-map-completed
   [junit4]   2> 3287955 INFO  (jetty-launcher-3521-thread-2) [n:127.0.0.1:64694_solr    ] o.a.s.c.c.SolrZkClient makePath: /overseer/collection-map-completed
   [junit4]   2> 3287958 INFO  (jetty-launcher-3521-thread-1) [n:127.0.0.1:64695_solr    ] o.a.s.c.c.SolrZkClient makePath: /overseer/collection-map-failure
   [junit4]   2> 3287958 INFO  (jetty-launcher-3521-thread-2) [n:127.0.0.1:64694_solr    ] o.a.s.c.c.SolrZkClient makePath: /overseer/collection-map-failure
   [junit4]   2> 3287963 INFO  (jetty-launcher-3521-thread-2) [n:127.0.0.1:64694_solr    ] o.a.s.c.c.SolrZkClient makePath: /live_nodes
   [junit4]   2> 3287963 INFO  (jetty-launcher-3521-thread-1) [n:127.0.0.1:64695_solr    ] o.a.s.c.c.SolrZkClient makePath: /live_nodes
   [junit4]   2> 3287966 INFO  (jetty-launcher-3521-thread-2) [n:127.0.0.1:64694_solr    ] o.a.s.c.c.SolrZkClient makePath: /collections
   [junit4]   2> 3287966 INFO  (jetty-launcher-3521-thread-1) [n:127.0.0.1:64695_solr    ] o.a.s.c.c.SolrZkClient makePath: /collections
   [junit4]   2> 3287967 INFO  (jetty-launcher-3521-thread-2) [n:127.0.0.1:64694_solr    ] o.a.s.c.c.SolrZkClient makePath: /aliases.json
   [junit4]   2> 3287967 INFO  (jetty-launcher-3521-thread-1) [n:127.0.0.1:64695_solr    ] o.a.s.c.c.SolrZkClient makePath: /aliases.json
   [junit4]   2> 3287971 INFO  (jetty-launcher-3521-thread-2) [n:127.0.0.1:64694_solr    ] o.a.s.c.c.SolrZkClient makePath: /clusterstate.json
   [junit4]   2> 3287972 INFO  (jetty-launcher-3521-thread-1) [n:127.0.0.1:64695_solr    ] o.a.s.c.c.SolrZkClient makePath: /clusterstate.json
   [junit4]   2> 3287974 INFO  (jetty-launcher-3521-thread-2) [n:127.0.0.1:64694_solr    ] o.a.s.c.c.SolrZkClient makePath: /security.json
   [junit4]   2> 3287975 INFO  (jetty-launcher-3521-thread-1) [n:127.0.0.1:64695_solr    ] o.a.s.c.c.SolrZkClient makePath: /security.json
   [junit4]   2> 3287977 INFO  (jetty-launcher-3521-thread-2) [n:127.0.0.1:64694_solr    ] o.a.s.c.ZkController Register node as live in ZooKeeper:/live_nodes/127.0.0.1:64694_solr
   [junit4]   2> 3287977 INFO  (jetty-launcher-3521-thread-1) [n:127.0.0.1:64695_solr    ] o.a.s.c.ZkController Register node as live in ZooKeeper:/live_nodes/127.0.0.1:64695_solr
   [junit4]   2> 3287977 INFO  (jetty-launcher-3521-thread-2) [n:127.0.0.1:64694_solr    ] o.a.s.c.c.SolrZkClient makePath: /live_nodes/127.0.0.1:64694_solr
   [junit4]   2> 3287977 INFO  (jetty-launcher-3521-thread-1) [n:127.0.0.1:64695_solr    ] o.a.s.c.c.SolrZkClient makePath: /live_nodes/127.0.0.1:64695_solr
   [junit4]   2> 3287982 INFO  (jetty-launcher-3521-thread-2) [n:127.0.0.1:64694_solr    ] o.a.s.c.c.SolrZkClient makePath: /overseer_elect
   [junit4]   2> 3287983 INFO  (jetty-launcher-3521-thread-1) [n:127.0.0.1:64695_solr    ] o.a.s.c.c.SolrZkClient makePath: /overseer_elect
   [junit4]   2> 3287985 INFO  (jetty-launcher-3521-thread-1) [n:127.0.0.1:64695_solr    ] o.a.s.c.c.SolrZkClient makePath: /overseer_elect/election
   [junit4]   2> 3287985 INFO  (jetty-launcher-3521-thread-2) [n:127.0.0.1:64694_solr    ] o.a.s.c.c.SolrZkClient makePath: /overseer_elect/election
   [junit4]   2> 3287988 INFO  (jetty-launcher-3521-thread-2) [n:127.0.0.1:64694_solr    ] o.a.s.c.Overseer Overseer (id=null) closing
   [junit4]   2> 3287988 INFO  (jetty-launcher-3521-thread-1) [n:127.0.0.1:64695_solr    ] o.a.s.c.Overseer Overseer (id=null) closing
   [junit4]   2> 3287988 INFO  (jetty-launcher-3521-thread-2) [n:127.0.0.1:64694_solr    ] o.a.s.c.LeaderElector Joined leadership election with path: /overseer_elect/election/96107171666919429-127.0.0.1:64694_solr-n_0000000000
   [junit4]   2> 3287990 INFO  (jetty-launcher-3521-thread-1) [n:127.0.0.1:64695_solr    ] o.a.s.c.LeaderElector Joined leadership election with path: /overseer_elect/election/96107171666919430-127.0.0.1:64695_solr-n_0000000001
   [junit4]   2> 3287990 INFO  (jetty-launcher-3521-thread-2) [n:127.0.0.1:64694_solr    ] o.a.s.c.OverseerElectionContext I am going to be the leader 127.0.0.1:64694_solr
   [junit4]   2> 3287990 INFO  (jetty-launcher-3521-thread-2) [n:127.0.0.1:64694_solr    ] o.a.s.c.c.SolrZkClient makePath: /overseer_elect/leader
   [junit4]   2> 3287991 INFO  (jetty-launcher-3521-thread-1) [n:127.0.0.1:64695_solr    ] o.a.s.c.LeaderElector Watching path /overseer_elect/election/96107171666919429-127.0.0.1:64694_solr-n_0000000000 to know if I could be the leader
   [junit4]   2> 3287992 INFO  (jetty-launcher-3521-thread-1) [n:127.0.0.1:64695_solr    ] o.a.s.c.c.ZkStateReader Updating cluster state from ZooKeeper... 
   [junit4]   2> 3287993 INFO  (jetty-launcher-3521-thread-2) [n:127.0.0.1:64694_solr    ] o.a.s.c.Overseer Overseer (id=96107171666919429-127.0.0.1:64694_solr-n_0000000000) starting
   [junit4]   2> 3287997 INFO  (jetty-launcher-3521-thread-2) [n:127.0.0.1:64694_solr    ] o.a.s.c.c.SolrZkClient makePath: /overseer/queue-work
   [junit4]   2> 3288008 INFO  (jetty-launcher-3521-thread-2) [n:127.0.0.1:64694_solr    ] o.a.s.c.OverseerAutoReplicaFailoverThread Starting OverseerAutoReplicaFailoverThread autoReplicaFailoverWorkLoopDelay=10000 autoReplicaFailoverWaitAfterExpiration=30000 autoReplicaFailoverBadNodeExpiration=60000
   [junit4]   2> 3288008 INFO  (jetty-launcher-3521-thread-2) [n:127.0.0.1:64694_solr    ] o.a.s.c.c.ZkStateReader Updating cluster state from ZooKeeper... 
   [junit4]   2> 3288010 INFO  (OverseerStateUpdate-96107171666919429-127.0.0.1:64694_solr-n_0000000000) [n:127.0.0.1:64694_solr    ] o.a.s.c.Overseer Starting to work on the main queue
   [junit4]   2> 3288010 INFO  (OverseerCollectionConfigSetProcessor-96107171666919429-127.0.0.1:64694_solr-n_0000000000) [n:127.0.0.1:64694_solr    ] o.a.s.c.OverseerTaskProcessor Process current queue of overseer operations
   [junit4]   2> 3288015 INFO  (jetty-launcher-3521-thread-1) [n:127.0.0.1:64695_solr    ] o.a.s.c.CoreContainer Security conf doesn't exist. Skipping setup for authorization module.
   [junit4]   2> 3288016 INFO  (jetty-launcher-3521-thread-1) [n:127.0.0.1:64695_solr    ] o.a.s.c.CoreContainer No authentication plugin used.
   [junit4]   2> 3288017 INFO  (jetty-launcher-3521-thread-1) [n:127.0.0.1:64695_solr    ] o.a.s.c.CorePropertiesLocator Looking for core definitions underneath C:\Users\jenkins\workspace\Lucene-Solr-5.5-Windows\solr\build\solr-core\test\J0\temp\solr.schema.TestManagedSchemaAPI_9E84302F8BEC9B18-001\tempDir-001\node1\.
   [junit4]   2> 3288018 INFO  (jetty-launcher-3521-thread-1) [n:127.0.0.1:64695_solr    ] o.a.s.c.CorePropertiesLocator Found 0 core definitions
   [junit4]   2> 3288019 INFO  (jetty-launcher-3521-thread-1) [n:127.0.0.1:64695_solr    ] o.a.s.s.SolrDispatchFilter user.dir=C:\Users\jenkins\workspace\Lucene-Solr-5.5-Windows\solr\build\solr-core\test\J0
   [junit4]   2> 3288019 INFO  (jetty-launcher-3521-thread-1) [n:127.0.0.1:64695_solr    ] o.a.s.s.SolrDispatchFilter SolrDispatchFilter.init() done
   [junit4]   2> 3288035 INFO  (jetty-launcher-3521-thread-2) [n:127.0.0.1:64694_solr    ] o.a.s.c.CoreContainer Security conf doesn't exist. Skipping setup for authorization module.
   [junit4]   2> 3288036 INFO  (jetty-launcher-3521-thread-2) [n:127.0.0.1:64694_solr    ] o.a.s.c.CoreContainer No authentication plugin used.
   [junit4]   2> 3288037 INFO  (jetty-launcher-3521-thread-2) [n:127.0.0.1:64694_solr    ] o.a.s.c.CorePropertiesLocator Looking for core definitions underneath C:\Users\jenkins\workspace\Lucene-Solr-5.5-Windows\solr\build\solr-core\test\J0\temp\solr.schema.TestManagedSchemaAPI_9E84302F8BEC9B18-001\tempDir-001\node2\.
   [junit4]   2> 3288038 INFO  (jetty-launcher-3521-thread-2) [n:127.0.0.1:64694_solr    ] o.a.s.c.CorePropertiesLocator Found 0 core definitions
   [junit4]   2> 3288039 INFO  (jetty-launcher-3521-thread-2) [n:127.0.0.1:64694_solr    ] o.a.s.s.SolrDispatchFilter user.dir=C:\Users\jenkins\workspace\Lucene-Solr-5.5-Windows\solr\build\solr-core\test\J0
   [junit4]   2> 3288039 INFO  (jetty-launcher-3521-thread-2) [n:127.0.0.1:64694_solr    ] o.a.s.s.SolrDispatchFilter SolrDispatchFilter.init() done
   [junit4]   2> 3288039 INFO  (TEST-TestManagedSchemaAPI.test-seed#[9E84302F8BEC9B18]) [    ] o.a.s.c.c.SolrZkClient Using default ZkCredentialsProvider
   [junit4]   2> 3288041 INFO  (TEST-TestManagedSchemaAPI.test-seed#[9E84302F8BEC9B18]) [    ] o.a.s.c.c.ConnectionManager Waiting for client to connect to ZooKeeper
   [junit4]   2> 3288044 INFO  (zkCallback-3533-thread-1) [    ] o.a.s.c.c.ConnectionManager Watcher org.apache.solr.common.cloud.ConnectionManager@a2ec39 name:ZooKeeperConnection Watcher:127.0.0.1:64690 got event WatchedEvent state:SyncConnected type:None path:null path:null type:None
   [junit4]   2> 3288044 INFO  (TEST-TestManagedSchemaAPI.test-seed#[9E84302F8BEC9B18]) [    ] o.a.s.c.c.ConnectionManager Client is connected to ZooKeeper
   [junit4]   2> 3288044 INFO  (TEST-TestManagedSchemaAPI.test-seed#[9E84302F8BEC9B18]) [    ] o.a.s.c.c.SolrZkClient Using default ZkACLProvider
   [junit4]   2> 3288049 INFO  (TEST-TestManagedSchemaAPI.test-seed#[9E84302F8BEC9B18]) [    ] o.a.s.c.c.SolrZkClient Using default ZkCredentialsProvider
   [junit4]   2> 3288050 INFO  (TEST-TestManagedSchemaAPI.test-seed#[9E84302F8BEC9B18]) [    ] o.a.s.c.c.ConnectionManager Waiting for client to connect to ZooKeeper
   [junit4]   2> 3288052 INFO  (zkCallback-3535-thread-1) [    ] o.a.s.c.c.ConnectionManager Watcher org.apache.solr.common.cloud.ConnectionManager@1d0d715 name:ZooKeeperConnection Watcher:127.0.0.1:64690/solr got event WatchedEvent state:SyncConnected type:None path:null path:null type:None
   [junit4]   2> 3288052 INFO  (TEST-TestManagedSchemaAPI.test-seed#[9E84302F8BEC9B18]) [    ] o.a.s.c.c.ConnectionManager Client is connected to ZooKeeper
   [junit4]   2> 3288052 INFO  (TEST-TestManagedSchemaAPI.test-seed#[9E84302F8BEC9B18]) [    ] o.a.s.c.c.SolrZkClient Using default ZkACLProvider
   [junit4]   2> 3288054 INFO  (TEST-TestManagedSchemaAPI.test-seed#[9E84302F8BEC9B18]) [    ] o.a.s.c.c.SolrZkClient makePath: /configs/conf1/managed-schema
   [junit4]   2> 3288059 INFO  (TEST-TestManagedSchemaAPI.test-seed#[9E84302F8BEC9B18]) [    ] o.a.s.c.c.SolrZkClient makePath: /configs/conf1/solrconfig.xml
   [junit4]   2> 3288064 WARN  (NIOServerCxn.Factory:0.0.0.0/0.0.0.0:0) [    ] o.a.z.s.NIOServerCnxn caught end of stream exception
   [junit4]   2> EndOfStreamException: Unable to read additional data from client sessionid 0x15570f6a3930008, likely client has closed socket
   [junit4]   2> 	at org.apache.zookeeper.server.NIOServerCnxn.doIO(NIOServerCnxn.java:228)
   [junit4]   2> 	at org.apache.zookeeper.server.NIOServerCnxnFactory.run(NIOServerCnxnFactory.java:208)
   [junit4]   2> 	at java.lang.Thread.run(Thread.java:745)
   [junit4]   2> 3288064 INFO  (TEST-TestManagedSchemaAPI.test-seed#[9E84302F8BEC9B18]) [    ] o.a.s.c.c.SolrZkClient Using default ZkCredentialsProvider
   [junit4]   2> 3288066 INFO  (TEST-TestManagedSchemaAPI.test-seed#[9E84302F8BEC9B18]) [    ] o.a.s.c.c.ConnectionManager Waiting for client to connect to ZooKeeper
   [junit4]   2> 3288068 INFO  (zkCallback-3536-thread-1) [    ] o.a.s.c.c.ConnectionManager Watcher org.apache.solr.common.cloud.ConnectionManager@1a5bd08 name:ZooKeeperConnection Watcher:127.0.0.1:64690/solr got event WatchedEvent state:SyncConnected type:None path:null path:null type:None
   [junit4]   2> 3288068 INFO  (TEST-TestManagedSchemaAPI.test-seed#[9E84302F8BEC9B18]) [    ] o.a.s.c.c.ConnectionManager Client is connected to ZooKeeper
   [junit4]   2> 3288070 INFO  (TEST-TestManagedSchemaAPI.test-seed#[9E84302F8BEC9B18]) [    ] o.a.s.c.c.SolrZkClient Using default ZkACLProvider
   [junit4]   2> 3288070 INFO  (TEST-TestManagedSchemaAPI.test-seed#[9E84302F8BEC9B18]) [    ] o.a.s.c.c.ZkStateReader Updating cluster state from ZooKeeper... 
   [junit4]   2> 3288078 INFO  (qtp29778174-23044) [n:127.0.0.1:64694_solr    ] o.a.s.h.a.CollectionsHandler Invoked Collection Action :create with params numShards=1&replicationFactor=2&collection.configName=conf1&action=CREATE&name=testschemaapi&version=2&wt=javabin and sendToOCPQueue=true
   [junit4]   2> 3288083 INFO  (OverseerCollectionConfigSetProcessor-96107171666919429-127.0.0.1:64694_solr-n_0000000000) [n:127.0.0.1:64694_solr    ] o.a.s.c.OverseerTaskProcessor Overseer Collection Message Handler: Get the message id:/overseer/collection-queue-work/qn-0000000000 message:{
   [junit4]   2>   "name":"testschemaapi",
   [junit4]   2>   "fromApi":"true",
   [junit4]   2>   "replicationFactor":"2",
   [junit4]   2>   "collection.configName":"conf1",
   [junit4]   2>   "numShards":"1",
   [junit4]   2>   "stateFormat":"2",
   [junit4]   2>   "operation":"create"}
   [junit4]   2> 3288084 INFO  (OverseerThreadFactory-10268-thread-1-processing-n:127.0.0.1:64694_solr) [n:127.0.0.1:64694_solr    ] o.a.s.c.OverseerCollectionMessageHandler OverseerCollectionMessageHandler.processMessage : create , {
   [junit4]   2>   "name":"testschemaapi",
   [junit4]   2>   "fromApi":"true",
   [junit4]   2>   "replicationFactor":"2",
   [junit4]   2>   "collection.configName":"conf1",
   [junit4]   2>   "numShards":"1",
   [junit4]   2>   "stateFormat":"2",
   [junit4]   2>   "operation":"create"}
   [junit4]   2> 3288085 INFO  (OverseerThreadFactory-10268-thread-1-processing-n:127.0.0.1:64694_solr) [n:127.0.0.1:64694_solr    ] o.a.s.c.OverseerCollectionMessageHandler Create collection testschemaapi
   [junit4]   2> 3288086 INFO  (OverseerThreadFactory-10268-thread-1-processing-n:127.0.0.1:64694_solr) [n:127.0.0.1:64694_solr    ] o.a.s.c.OverseerCollectionMessageHandler creating collections conf node /collections/testschemaapi 
   [junit4]   2> 3288087 INFO  (OverseerThreadFactory-10268-thread-1-processing-n:127.0.0.1:64694_solr) [n:127.0.0.1:64694_solr    ] o.a.s.c.c.SolrZkClient makePath: /collections/testschemaapi
   [junit4]   2> 3288090 INFO  (zkCallback-3536-thread-1) [    ] o.a.s.c.c.ZkStateReader A collections change: [WatchedEvent state:SyncConnected type:NodeChildrenChanged path:/collections], has occurred - updating...
   [junit4]   2> 3288091 INFO  (zkCallback-3531-thread-1-processing-n:127.0.0.1:64694_solr) [n:127.0.0.1:64694_solr    ] o.a.s.c.c.ZkStateReader A collections change: [WatchedEvent state:SyncConnected type:NodeChildrenChanged path:/collections], has occurred - updating...
   [junit4]   2> 3288091 INFO  (zkCallback-3532-thread-1-processing-n:127.0.0.1:64695_solr) [n:127.0.0.1:64695_solr    ] o.a.s.c.c.ZkStateReader A collections change: [WatchedEvent state:SyncConnected type:NodeChildrenChanged path:/collections], has occurred - updating...
   [junit4]   2> 3288097 INFO  (OverseerStateUpdate-96107171666919429-127.0.0.1:64694_solr-n_0000000000) [n:127.0.0.1:64694_solr    ] o.a.s.c.Overseer processMessage: queueSize: 1, message = {
   [junit4]   2>   "name":"testschemaapi",
   [junit4]   2>   "fromApi":"true",
   [junit4]   2>   "replicationFactor":"2",
   [junit4]   2>   "collection.configName":"conf1",
   [junit4]   2>   "numShards":"1",
   [junit4]   2>   "stateFormat":"2",
   [junit4]   2>   "operation":"create"} current state version: 0
   [junit4]   2> 3288097 INFO  (OverseerStateUpdate-96107171666919429-127.0.0.1:64694_solr-n_0000000000) [n:127.0.0.1:64694_solr    ] o.a.s.c.o.ClusterStateMutator building a new cName: testschemaapi
   [junit4]   2> 3288098 INFO  (OverseerStateUpdate-96107171666919429-127.0.0.1:64694_solr-n_0000000000) [n:127.0.0.1:64694_solr    ] o.a.s.c.o.ZkStateWriter going to create_collection /collections/testschemaapi/state.json
   [junit4]   2> 3288196 INFO  (OverseerThreadFactory-10268-thread-1-processing-n:127.0.0.1:64694_solr) [n:127.0.0.1:64694_solr    ] o.a.s.c.OverseerCollectionMessageHandler Creating SolrCores for new collection testschemaapi, shardNames [shard1] , replicationFactor : 2
   [junit4]   2> 3288198 INFO  (OverseerThreadFactory-10268-thread-1-processing-n:127.0.0.1:64694_solr) [n:127.0.0.1:64694_solr    ] o.a.s.c.OverseerCollectionMessageHandler Creating core testschemaapi_shard1_replica1 as part of shard shard1 of collection testschemaapi on 127.0.0.1:64695_solr
   [junit4]   2> 3288199 INFO  (OverseerThreadFactory-10268-thread-1-processing-n:127.0.0.1:64694_solr) [n:127.0.0.1:64694_solr    ] o.a.s.c.OverseerCollectionMessageHandler Creating core testschemaapi_shard1_replica2 as part of shard shard1 of collection testschemaapi on 127.0.0.1:64694_solr
   [junit4]   2> 3288201 INFO  (qtp29778174-23046) [n:127.0.0.1:64694_solr    ] o.a.s.h.a.CoreAdminOperation core create command numShards=1&collection.configName=conf1&shard=shard1&action=CREATE&name=testschemaapi_shard1_replica2&collection=testschemaapi&qt=/admin/cores&wt=javabin&version=2
   [junit4]   2> 3288202 INFO  (qtp26906451-23052) [n:127.0.0.1:64695_solr    ] o.a.s.h.a.CoreAdminOperation core create command numShards=1&collection.configName=conf1&shard=shard1&action=CREATE&name=testschemaapi_shard1_replica1&collection=testschemaapi&qt=/admin/cores&wt=javabin&version=2
   [junit4]   2> 3288203 INFO  (qtp29778174-23046) [n:127.0.0.1:64694_solr    ] o.a.s.c.CoreDescriptor Created CoreDescriptor: {shard=shard1, loadOnStartup=true, numShards=1, config=solrconfig.xml, collection.configName=conf1, transient=false, name=testschemaapi_shard1_replica2, collection=testschemaapi, schema=schema.xml, configSetProperties=configsetprops.json, dataDir=data\}
   [junit4]   2> 3288203 INFO  (qtp26906451-23052) [n:127.0.0.1:64695_solr    ] o.a.s.c.CoreDescriptor Created CoreDescriptor: {collection=testschemaapi, dataDir=data\, numShards=1, collection.configName=conf1, loadOnStartup=true, config=solrconfig.xml, configSetProperties=configsetprops.json, name=testschemaapi_shard1_replica1, shard=shard1, transient=false, schema=schema.xml}
   [junit4]   2> 3288205 INFO  (qtp29778174-23046) [n:127.0.0.1:64694_solr c:testschemaapi s:shard1  x:testschemaapi_shard1_replica2] o.a.s.c.ZkController publishing state=down
   [junit4]   2> 3288205 INFO  (qtp26906451-23052) [n:127.0.0.1:64695_solr c:testschemaapi s:shard1  x:testschemaapi_shard1_replica1] o.a.s.c.ZkController publishing state=down
   [junit4]   2> 3288207 INFO  (qtp29778174-23046) [n:127.0.0.1:64694_solr c:testschemaapi s:shard1  x:testschemaapi_shard1_replica2] o.a.s.c.ZkController Registering watch for collection testschemaapi
   [junit4]   2> 3288207 INFO  (qtp29778174-23046) [n:127.0.0.1:64694_solr c:testschemaapi s:shard1  x:testschemaapi_shard1_replica2] o.a.s.c.c.ZkStateReader addZkWatch [testschemaapi]
   [junit4]   2> 3288208 INFO  (qtp26906451-23052) [n:127.0.0.1:64695_solr c:testschemaapi s:shard1  x:testschemaapi_shard1_replica1] o.a.s.c.ZkController Registering watch for collection testschemaapi
   [junit4]   2> 3288208 INFO  (qtp26906451-23052) [n:127.0.0.1:64695_solr c:testschemaapi s:shard1  x:testschemaapi_shard1_replica1] o.a.s.c.c.ZkStateReader addZkWatch [testschemaapi]
   [junit4]   2> 3288208 INFO  (qtp29778174-23046) [n:127.0.0.1:64694_solr c:testschemaapi s:shard1  x:testschemaapi_shard1_replica2] o.a.s.c.c.ZkStateReader Add data for [testschemaapi] ver [0]
   [junit4]   2> 3288208 INFO  (qtp29778174-23046) [n:127.0.0.1:64694_solr c:testschemaapi s:shard1  x:testschemaapi_shard1_replica2] o.a.s.c.ZkController look for our core node name
   [junit4]   2> 3288208 INFO  (qtp26906451-23052) [n:127.0.0.1:64695_solr c:testschemaapi s:shard1  x:testschemaapi_shard1_replica1] o.a.s.c.c.ZkStateReader Add data for [testschemaapi] ver [0]
   [junit4]   2> 3288208 INFO  (qtp26906451-23052) [n:127.0.0.1:64695_solr c:testschemaapi s:shard1  x:testschemaapi_shard1_replica1] o.a.s.c.ZkController look for our core node name
   [junit4]   2> 3288208 INFO  (OverseerStateUpdate-96107171666919429-127.0.0.1:64694_solr-n_0000000000) [n:127.0.0.1:64694_solr    ] o.a.s.c.Overseer processMessage: queueSize: 2, message = {
   [junit4]   2>   "base_url":"http://127.0.0.1:64694/solr",
   [junit4]   2>   "operation":"state",
   [junit4]   2>   "core":"testschemaapi_shard1_replica2",
   [junit4]   2>   "numShards":"1",
   [junit4]   2>   "shard":"shard1",
   [junit4]   2>   "roles":null,
   [junit4]   2>   "collection":"testschemaapi",
   [junit4]   2>   "state":"down",
   [junit4]   2>   "node_name":"127.0.0.1:64694_solr"} current state version: 0
   [junit4]   2> 3288211 INFO  (OverseerStateUpdate-96107171666919429-127.0.0.1:64694_solr-n_0000000000) [n:127.0.0.1:64694_solr    ] o.a.s.c.o.ReplicaMutator Update state numShards=1 message={
   [junit4]   2>   "base_url":"http://127.0.0.1:64694/solr",
   [junit4]   2>   "operation":"state",
   [junit4]   2>   "core":"testschemaapi_shard1_replica2",
   [junit4]   2>   "numShards":"1",
   [junit4]   2>   "shard":"shard1",
   [junit4]   2>   "roles":null,
   [junit4]   2>   "collection":"testschemaapi",
   [junit4]   2>   "state":"down",
   [junit4]   2>   "node_name":"127.0.0.1:64694_solr"}
   [junit4]   2> 3288213 INFO  (OverseerStateUpdate-96107171666919429-127.0.0.1:64694_solr-n_0000000000) [n:127.0.0.1:64694_solr    ] o.a.s.c.Overseer processMessage: queueSize: 2, message = {
   [junit4]   2>   "base_url":"http://127.0.0.1:64695/solr",
   [junit4]   2>   "operation":"state",
   [junit4]   2>   "core":"testschemaapi_shard1_replica1",
   [junit4]   2>   "numShards":"1",
   [junit4]   2>   "shard":"shard1",
   [junit4]   2>   "roles":null,
   [junit4]   2>   "collection":"testschemaapi",
   [junit4]   2>   "state":"down",
   [junit4]   2>   "node_name":"127.0.0.1:64695_solr"} current state version: 0
   [junit4]   2> 3288213 INFO  (OverseerStateUpdate-96107171666919429-127.0.0.1:64694_solr-n_0000000000) [n:127.0.0.1:64694_solr    ] o.a.s.c.o.ReplicaMutator Update state numShards=1 message={
   [junit4]   2>   "base_url":"http://127.0.0.1:64695/solr",
   [junit4]   2>   "operation":"state",
   [junit4]   2>   "core":"testschemaapi_shard1_replica1",
   [junit4]   2>   "numShards":"1",
   [junit4]   2>   "shard":"shard1",
   [junit4]   2>   "roles":null,
   [junit4]   2>   "collection":"testschemaapi",
   [junit4]   2>   "state":"down",
   [junit4]   2>   "node_name":"127.0.0.1:64695_solr"}
   [junit4]   2> 3288319 INFO  (OverseerStateUpdate-96107171666919429-127.0.0.1:64694_solr-n_0000000000) [n:127.0.0.1:64694_solr    ] o.a.s.c.o.ZkStateWriter going to update_collection /collections/testschemaapi/state.json version: 0
   [junit4]   2> 3288319 INFO  (zkCallback-3532-thread-1-processing-n:127.0.0.1:64695_solr) [n:127.0.0.1:64695_solr    ] o.a.s.c.c.ZkStateReader A cluster state change: [WatchedEvent state:SyncConnected type:NodeDataChanged path:/collections/testschemaapi/state.json] for collection [testschemaapi] has occurred - updating... (live nodes size: [2])
   [junit4]   2> 3288319 INFO  (zkCallback-3531-thread-2-processing-n:127.0.0.1:64694_solr) [n:127.0.0.1:64694_solr    ] o.a.s.c.c.ZkStateReader A cluster state change: [WatchedEvent state:SyncConnected type:NodeDataChanged path:/collections/testschemaapi/state.json] for collection [testschemaapi] has occurred - updating... (live nodes size: [2])
   [junit4]   2> 3288320 INFO  (zkCallback-3532-thread-1-processing-n:127.0.0.1:64695_solr) [n:127.0.0.1:64695_solr    ] o.a.s.c.c.ZkStateReader Updating data for [testschemaapi] from [0] to [1]
   [junit4]   2> 3288320 INFO  (zkCallback-3531-thread-2-processing-n:127.0.0.1:64694_solr) [n:127.0.0.1:64694_solr    ] o.a.s.c.c.ZkStateReader Updating data for [testschemaapi] from [0] to [1]
   [junit4]   2> 3289208 INFO  (qtp26906451-23052) [n:127.0.0.1:64695_solr c:testschemaapi s:shard1  x:testschemaapi_shard1_replica1] o.a.s.c.ZkController waiting to find shard id in clusterstate for testschemaapi_shard1_replica1
   [junit4]   2> 3289208 INFO  (qtp29778174-23046) [n:127.0.0.1:64694_solr c:testschemaapi s:shard1  x:testschemaapi_shard1_replica2] o.a.s.c.ZkController waiting to find shard id in clusterstate for testschemaapi_shard1_replica2
   [junit4]   2> 3289208 INFO  (qtp26906451-23052) [n:127.0.0.1:64695_solr c:testschemaapi s:shard1  x:testschemaapi_shard1_replica1] o.a.s.c.ZkController Check for collection zkNode:testschemaapi
   [junit4]   2> 3289208 INFO  (qtp29778174-23046) [n:127.0.0.1:64694_solr c:testschemaapi s:shard1  x:testschemaapi_shard1_replica2] o.a.s.c.ZkController Check for collection zkNode:testschemaapi
   [junit4]   2> 3289209 INFO  (qtp29778174-23046) [n:127.0.0.1:64694_solr c:testschemaapi s:shard1  x:testschemaapi_shard1_replica2] o.a.s.c.ZkController Collection zkNode exists
   [junit4]   2> 3289209 INFO  (qtp29778174-23046) [n:127.0.0.1:64694_solr c:testschemaapi s:shard1  x:testschemaapi_shard1_replica2] o.a.s.c.c.ZkStateReader Load collection config from: [/collections/testschemaapi]
   [junit4]   2> 3289210 INFO  (qtp26906451-23052) [n:127.0.0.1:64695_solr c:testschemaapi s:shard1  x:testschemaapi_shard1_replica1] o.a.s.c.ZkController Collection zkNode exists
   [junit4]   2> 3289210 INFO  (qtp26906451-23052) [n:127.0.0.1:64695_solr c:testschemaapi s:shard1  x:testschemaapi_shard1_replica1] o.a.s.c.c.ZkStateReader Load collection config from: [/collections/testschemaapi]
   [junit4]   2> 3289212 INFO  (qtp29778174-23046) [n:127.0.0.1:64694_solr c:testschemaapi s:shard1  x:testschemaapi_shard1_replica2] o.a.s.c.c.ZkStateReader path=[/collections/testschemaapi] [configName]=[conf1] specified config exists in ZooKeeper
   [junit4]   2> 3289212 INFO  (qtp29778174-23046) [n:127.0.0.1:64694_solr c:testschemaapi s:shard1  x:testschemaapi_shard1_replica2] o.a.s.c.SolrResourceLoader new SolrResourceLoader for directory: 'C:\Users\jenkins\workspace\Lucene-Solr-5.5-Windows\solr\build\solr-core\test\J0\temp\solr.schema.TestManagedSchemaAPI_9E84302F8BEC9B18-001\tempDir-001\node2\testschemaapi_shard1_replica2'
   [junit4]   2> 3289212 INFO  (qtp29778174-23046) [n:127.0.0.1:64694_solr c:testschemaapi s:shard1  x:testschemaapi_shard1_replica2] o.a.s.c.SolrResourceLoader JNDI not configured for solr (NoInitialContextEx)
   [junit4]   2> 3289212 INFO  (qtp29778174-23046) [n:127.0.0.1:64694_solr c:testschemaapi s:shard1  x:testschemaapi_shard1_replica2] o.a.s.c.SolrResourceLoader solr home defaulted to 'solr/' (could not find system property or JNDI)
   [junit4]   2> 3289214 INFO  (qtp26906451-23052) [n:127.0.0.1:64695_solr c:testschemaapi s:shard1  x:testschemaapi_shard1_replica1] o.a.s.c.c.ZkStateReader path=[/collections/testschemaapi] [configName]=[conf1] specified config exists in ZooKeeper
   [junit4]   2> 3289214 INFO  (qtp26906451-23052) [n:127.0.0.1:64695_solr c:testschemaapi s:shard1  x:testschemaapi_shard1_replica1] o.a.s.c.SolrResourceLoader new SolrResourceLoader for directory: 'C:\Users\jenkins\workspace\Lucene-Solr-5.5-Windows\solr\build\solr-core\test\J0\temp\solr.schema.TestManagedSchemaAPI_9E84302F8BEC9B18-001\tempDir-001\node1\testschemaapi_shard1_replica1'
   [junit4]   2> 3289214 INFO  (qtp26906451-23052) [n:127.0.0.1:64695_solr c:testschemaapi s:shard1  x:testschemaapi_shard1_replica1] o.a.s.c.SolrResourceLoader JNDI not configured for solr (NoInitialContextEx)
   [junit4]   2> 3289214 INFO  (qtp26906451-23052) [n:127.0.0.1:64695_solr c:testschemaapi s:shard1  x:testschemaapi_shard1_replica1] o.a.s.c.SolrResourceLoader solr home defaulted to 'solr/' (could not find system property or JNDI)
   [junit4]   2> 3289226 INFO  (qtp26906451-23052) [n:127.0.0.1:64695_solr c:testschemaapi s:shard1  x:testschemaapi_shard1_replica1] o.a.s.c.Config loaded config solrconfig.xml with version 0 
   [junit4]   2> 3289227 INFO  (qtp29778174-23046) [n:127.0.0.1:64694_solr c:testschemaapi s:shard1  x:testschemaapi_shard1_replica2] o.a.s.c.Config loaded config solrconfig.xml with version 0 
   [junit4]   2> 3289258 INFO  (qtp29778174-23046) [n:127.0.0.1:64694_solr c:testschemaapi s:shard1  x:testschemaapi_shard1_replica2] o.a.s.c.SolrConfig current version of requestparams : -1
   [junit4]   2> 3289259 INFO  (qtp26906451-23052) [n:127.0.0.1:64695_solr c:testschemaapi s:shard1  x:testschemaapi_shard1_replica1] o.a.s.c.SolrConfig current version of requestparams : -1
   [junit4]   2> 3289294 INFO  (qtp29778174-23046) [n:127.0.0.1:64694_solr c:testschemaapi s:shard1  x:testschemaapi_shard1_replica2] o.a.s.c.SolrConfig Using Lucene MatchVersion: 5.5.2
   [junit4]   2> 3289298 INFO  (qtp26906451-23052) [n:127.0.0.1:64695_solr c:testschemaapi s:shard1  x:testschemaapi_shard1_replica1] o.a.s.c.SolrConfig Using Lucene MatchVersion: 5.5.2
   [junit4]   2> 3289347 INFO  (qtp26906451-23052) [n:127.0.0.1:64695_solr c:testschemaapi s:shard1  x:testschemaapi_shard1_replica1] o.a.s.c.SolrConfig Loaded SolrConfig: solrconfig.xml
   [junit4]   2> 3289351 INFO  (qtp29778174-23046) [n:127.0.0.1:64694_solr c:testschemaapi s:shard1  x:testschemaapi_shard1_replica2] o.a.s.c.SolrConfig Loaded SolrConfig: solrconfig.xml
   [junit4]   2> 3289362 INFO  (qtp26906451-23052) [n:127.0.0.1:64695_solr c:testschemaapi s:shard1  x:testschemaapi_shard1_replica1] o.a.s.s.IndexSchema [testschemaapi_shard1_replica1] Schema name=minimal
   [junit4]   2> 3289363 INFO  (qtp29778174-23046) [n:127.0.0.1:64694_solr c:testschemaapi s:shard1  x:testschemaapi_shard1_replica2] o.a.s.s.IndexSchema [testschemaapi_shard1_replica2] Schema name=minimal
   [junit4]   2> 3289379 INFO  (qtp29778174-23046) [n:127.0.0.1:64694_solr c:testschemaapi s:shard1  x:testschemaapi_shard1_replica2] o.a.s.s.IndexSchema unique key field: id
   [junit4]   2> 3289381 INFO  (qtp29778174-23046) [n:127.0.0.1:64694_solr c:testschemaapi s:shard1  x:testschemaapi_shard1_replica2] o.a.s.c.ConfigSetProperties Did not find ConfigSet properties, assuming default properties: Can't find resource 'configsetprops.json' in classpath or '/configs/conf1', cwd=C:\Users\jenkins\workspace\Lucene-Solr-5.5-Windows\solr\build\solr-core\test\J0
   [junit4]   2> 3289382 INFO  (qtp29778174-23046) [n:127.0.0.1:64694_solr c:testschemaapi s:shard1  x:testschemaapi_shard1_replica2] o.a.s.c.CoreContainer Creating SolrCore 'testschemaapi_shard1_replica2' using configuration from collection testschemaapi
   [junit4]   2> 3289382 INFO  (qtp29778174-23046) [n:127.0.0.1:64694_solr c:testschemaapi s:shard1 r:core_node1 x:testschemaapi_shard1_replica2] o.a.s.c.SolrCore org.apache.solr.core.MockDirectoryFactory
   [junit4]   2> 3289382 INFO  (qtp29778174-23046) [n:127.0.0.1:64694_solr c:testschemaapi s:shard1 r:core_node1 x:testschemaapi_shard1_replica2] o.a.s.c.SolrCore [[testschemaapi_shard1_replica2] ] Opening new SolrCore at [C:\Users\jenkins\workspace\Lucene-Solr-5.5-Windows\solr\build\solr-core\test\J0\temp\solr.schema.TestManagedSchemaAPI_9E84302F8BEC9B18-001\tempDir-001\node2\testschemaapi_shard1_replica2], dataDir=[C:\Users\jenkins\workspace\Lucene-Solr-5.5-Windows\solr\build\solr-core\test\J0\temp\solr.schema.TestManagedSchemaAPI_9E84302F8BEC9B18-001\tempDir-001\node2\.\testschemaapi_shard1_replica2\data\]
   [junit4]   2> 3289382 INFO  (qtp29778174-23046) [n:127.0.0.1:64694_solr c:testschemaapi s:shard1 r:core_node1 x:testschemaapi_shard1_replica2] o.a.s.c.SolrCore JMX monitoring not detected for core: testschemaapi_shard1_replica2
   [junit4]   2> 3289383 INFO  (qtp29778174-23046) [n:127.0.0.1:64694_solr c:testschemaapi s:shard1 r:core_node1 x:testschemaapi_shard1_replica2] o.a.s.c.CachingDirectoryFactory return new directory for C:\Users\jenkins\workspace\Lucene-Solr-5.5-Windows\solr\build\solr-core\test\J0\temp\solr.schema.TestManagedSchemaAPI_9E84302F8BEC9B18-001\tempDir-001\node2\.\testschemaapi_shard1_replica2\data\
   [junit4]   2> 3289383 INFO  (qtp26906451-23052) [n:127.0.0.1:64695_solr c:testschemaapi s:shard1  x:testschemaapi_shard1_replica1] o.a.s.s.IndexSchema unique key field: id
   [junit4]   2> 3289383 INFO  (qtp29778174-23046) [n:127.0.0.1:64694_solr c:testschemaapi s:shard1 r:core_node1 x:testschemaapi_shard1_replica2] o.a.s.c.SolrCore New index directory detected: old=null new=C:\Users\jenkins\workspace\Lucene-Solr-5.5-Windows\solr\build\solr-core\test\J0\temp\solr.schema.TestManagedSchemaAPI_9E84302F8BEC9B18-001\tempDir-001\node2\.\testschemaapi_shard1_replica2\data\index/
   [junit4]   2> 3289384 WARN  (qtp29778174-23046) [n:127.0.0.1:64694_solr c:testschemaapi s:shard1 r:core_node1 x:testschemaapi_shard1_replica2] o.a.s.c.SolrCore [testschemaapi_shard1_replica2] Solr index directory 'C:\Users\jenkins\workspace\Lucene-Solr-5.5-Windows\solr\build\solr-core\test\J0\temp\solr.schema.TestManagedSchemaAPI_9E84302F8BEC9B18-001\tempDir-001\node2\.\testschemaapi_shard1_replica2\data\index' doesn't exist. Creating new index...
   [junit4]   2> 3289384 INFO  (qtp29778174-23046) [n:127.0.0.1:64694_solr c:testschemaapi s:shard1 r:core_node1 x:testschemaapi_shard1_replica2] o.a.s.c.CachingDirectoryFactory return new directory for C:\Users\jenkins\workspace\Lucene-Solr-5.5-Windows\solr\build\solr-core\test\J0\temp\solr.schema.TestManagedSchemaAPI_9E84302F8BEC9B18-001\tempDir-001\node2\.\testschemaapi_shard1_replica2\data\index
   [junit4]   2> 3289385 INFO  (qtp29778174-23046) [n:127.0.0.1:64694_solr c:testschemaapi s:shard1 r:core_node1 x:testschemaapi_shard1_replica2] o.a.s.c.SolrDeletionPolicy SolrDeletionPolicy.onCommit: commits: num=1
   [junit4]   2> 	commit{dir=MockDirectoryWrapper(RAMDirectory@10eab64 lockFactory=org.apache.lucene.store.SingleInstanceLockFactory@166611),segFN=segments_1,generation=1}
   [junit4]   2> 3289385 INFO  (qtp29778174-23046) [n:127.0.0.1:64694_solr c:testschemaapi s:shard1 r:core_node1 x:testschemaapi_shard1_replica2] o.a.s.c.SolrDeletionPolicy newest commit generation = 1
   [junit4]   2> 3289387 INFO  (OldIndexDirectoryCleanupThreadForCore-testschemaapi_shard1_replica2) [n:127.0.0.1:64694_solr c:testschemaapi s:shard1 r:core_node1 x:testschemaapi_shard1_replica2] o.a.s.c.SolrCore Looking for old index directories to cleanup for core testschemaapi_shard1_replica2 in C:\Users\jenkins\workspace\Lucene-Solr-5.5-Windows\solr\build\solr-core\test\J0\temp\solr.schema.TestManagedSchemaAPI_9E84302F8BEC9B18-001\tempDir-001\node2\.\testschemaapi_shard1_replica2\data\
   [junit4]   2> 3289387 INFO  (qtp26906451-23052) [n:127.0.0.1:64695_solr c:testschemaapi s:shard1  x:testschemaapi_shard1_replica1] o.a.s.c.ConfigSetProperties Did not find ConfigSet properties, assuming default properties: Can't find resource 'configsetprops.json' in classpath or '/configs/conf1', cwd=C:\Users\jenkins\workspace\Lucene-Solr-5.5-Windows\solr\build\solr-core\test\J0
   [junit4]   2> 3289388 INFO  (qtp26906451-23052) [n:127.0.0.1:64695_solr c:testschemaapi s:shard1  x:testschemaapi_shard1_replica1] o.a.s.c.CoreContainer Creating SolrCore 'testschemaapi_shard1_replica1' using configuration from collection testschemaapi
   [junit4]   2> 3289388 INFO  (qtp29778174-23046) [n:127.0.0.1:64694_solr c:testschemaapi s:shard1 r:core_node1 x:testschemaapi_shard1_replica2] o.a.s.c.SolrCore no updateRequestProcessorChain defined as default, creating implicit default
   [junit4]   2> 3289388 INFO  (qtp26906451-23052) [n:127.0.0.1:64695_solr c:testschemaapi s:shard1 r:core_node2 x:testschemaapi_shard1_replica1] o.a.s.c.SolrCore org.apache.solr.core.MockDirectoryFactory
   [junit4]   2> 3289389 INFO  (qtp26906451-23052) [n:127.0.0.1:64695_solr c:testschemaapi s:shard1 r:core_node2 x:testschemaapi_shard1_replica1] o.a.s.c.SolrCore [[testschemaapi_shard1_replica1] ] Opening new SolrCore at [C:\Users\jenkins\workspace\Lucene-Solr-5.5-Windows\solr\build\solr-core\test\J0\temp\solr.schema.TestManagedSchemaAPI_9E84302F8BEC9B18-001\tempDir-001\node1\testschemaapi_shard1_replica1], dataDir=[C:\Users\jenkins\workspace\Lucene-Solr-5.5-Windows\solr\build\solr-core\test\J0\temp\solr.schema.TestManagedSchemaAPI_9E84302F8BEC9B18-001\tempDir-001\node1\.\testschemaapi_shard1_replica1\data\]
   [junit4]   2> 3289389 INFO  (qtp26906451-23052) [n:127.0.0.1:64695_solr c:testschemaapi s:shard1 r:core_node2 x:testschemaapi_shard1_replica1] o.a.s.c.SolrCore JMX monitoring not detected for core: testschemaapi_shard1_replica1
   [junit4]   2> 3289390 INFO  (qtp26906451-23052) [n:127.0.0.1:64695_solr c:testschemaapi s:shard1 r:core_node2 x:testschemaapi_shard1_replica1] o.a.s.c.CachingDirectoryFactory return new directory for C:\Users\jenkins\workspace\Lucene-Solr-5.5-Windows\solr\build\solr-core\test\J0\temp\solr.schema.TestManagedSchemaAPI_9E84302F8BEC9B18-001\tempDir-001\node1\.\testschemaapi_shard1_replica1\data\
   [junit4]   2> 3289391 WARN  (OldIndexDirectoryCleanupThreadForCore-testschemaapi_shard1_replica2) [n:127.0.0.1:64694_solr c:testschemaapi s:shard1 r:core_node1 x:testschemaapi_shard1_replica2] o.a.s.c.DirectoryFactory C:\Users\jenkins\workspace\Lucene-Solr-5.5-Windows\solr\build\solr-core\test\J0\temp\solr.schema.TestManagedSchemaAPI_9E84302F8BEC9B18-001\tempDir-001\node2\.\testschemaapi_shard1_replica2\data\ does not point to a valid data directory; skipping clean-up of old index directories.
   [junit4]   2> 3289391 INFO  (qtp29778174-23046) [n:127.0.0.1:64694_solr c:testschemaapi s:shard1 r:core_node1 x:testschemaapi_shard1_replica2] o.a.s.h.l.XMLLoader xsltCacheLifetimeSeconds=60
   [junit4]   2> 3289391 INFO  (qtp26906451-23052) [n:127.0.0.1:64695_solr c:testschemaapi s:shard1 r:core_node2 x:testschemaapi_shard1_replica1] o.a.s.c.SolrCore New index directory detected: old=null new=C:\Users\jenkins\workspace\Lucene-Solr-5.5-Windows\solr\build\solr-core\test\J0\temp\solr.schema.TestManagedSchemaAPI_9E84302F8BEC9B18-001\tempDir-001\node1\.\testschemaapi_shard1_replica1\data\index/
   [junit4]   2> 3289391 WARN  (qtp26906451-23052) [n:127.0.0.1:64695_solr c:testschemaapi s:shard1 r:core_node2 x:testschemaapi_shard1_replica1] o.a.s.c.SolrCore [testschemaapi_shard1_replica1] Solr index directory 'C:\Users\jenkins\workspace\Lucene-Solr-5.5-Windows\solr\build\solr-core\test\J0\temp\solr.schema.TestManagedSchemaAPI_9E84302F8BEC9B18-001\tempDir-001\node1\.\testschemaapi_shard1_replica1\data\index' doesn't exist. Creating new index...
   [junit4]   2> 3289392 INFO  (qtp26906451-23052) [n:127.0.0.1:64695_solr c:testschemaapi s:shard1 r:core_node2 x:testschemaapi_shard1_replica1] o.a.s.c.CachingDirectoryFactory return new directory for C:\Users\jenkins\workspace\Lucene-Solr-5.5-Windows\solr\build\solr-core\test\J0\temp\solr.schema.TestManagedSchemaAPI_9E84302F8BEC9B18-001\tempDir-001\node1\.\testschemaapi_shard1_replica1\data\index
   [junit4]   2> 3289393 INFO  (qtp26906451-23052) [n:127.0.0.1:64695_solr c:testschemaapi s:shard1 r:core_node2 x:testschemaapi_shard1_replica1] o.a.s.c.SolrDeletionPolicy SolrDeletionPolicy.onCommit: commits: num=1
   [junit4]   2> 	commit{dir=MockDirectoryWrapper(RAMDirectory@6e13a0 lockFactory=org.apache.lucene.store.SingleInstanceLockFactory@ca72b9),segFN=segments_1,generation=1}
   [junit4]   2> 3289393 INFO  (qtp26906451-23052) [n:127.0.0.1:64695_solr c:testschemaapi s:shard1 r:core_node2 x:testschemaapi_shard1_replica1] o.a.s.c.SolrDeletionPolicy newest commit generation = 1
   [junit4]   2> 3289393 INFO  (qtp29778174-23046) [n:127.0.0.1:64694_solr c:testschemaapi s:shard1 r:core_node1 x:testschemaapi_shard1_replica2] o.a.s.h.l.XMLLoader xsltCacheLifetimeSeconds=60
   [junit4]   2> 3289393 INFO  (OldIndexDirectoryCleanupThreadForCore-testschemaapi_shard1_replica1) [n:127.0.0.1:64695_solr c:testschemaapi s:shard1 r:core_node2 x:testschemaapi_shard1_replica1] o.a.s.c.SolrCore Looking for old index directories to cleanup for core testschemaapi_shard1_replica1 in C:\Users\jenkins\workspace\Lucene-Solr-5.5-Windows\solr\build\solr-core\test\J0\temp\solr.schema.TestManagedSchemaAPI_9E84302F8BEC9B18-001\tempDir-001\node1\.\testschemaapi_shard1_replica1\data\
   [junit4]   2> 3289394 INFO  (qtp26906451-23052) [n:127.0.0.1:64695_solr c:testschemaapi s:shard1 r:core_node2 x:testschemaapi_shard1_replica1] o.a.s.c.SolrCore no updateRequestProcessorChain defined as default, creating implicit default
   [junit4]   2> 3289395 WARN  (OldIndexDirectoryCleanupThreadForCore-testschemaapi_shard1_replica1) [n:127.0.0.1:64695_solr c:testschemaapi s:shard1 r:core_node2 x:testschemaapi_shard1_replica1] o.a.s.c.DirectoryFactory C:\Users\jenkins\workspace\Lucene-Solr-5.5-Windows\solr\build\solr-core\test\J0\temp\solr.schema.TestManagedSchemaAPI_9E84302F8BEC9B18-001\tempDir-001\node1\.\testschemaapi_shard1_replica1\data\ does not point to a valid data directory; skipping clean-up of old index directories.
   [junit4]   2> 3289396 INFO  (qtp29778174-23046) [n:127.0.0.1:64694_solr c:testschemaapi s:shard1 r:core_node1 x:testschemaapi_shard1_replica2] o.a.s.h.l.XMLLoader xsltCacheLifetimeSeconds=60
   [junit4]   2> 3289396 INFO  (qtp26906451-23052) [n:127.0.0.1:64695_solr c:testschemaapi s:shard1 r:core_node2 x:testschemaapi_shard1_replica1] o.a.s.h.l.XMLLoader xsltCacheLifetimeSeconds=60
   [junit4]   2> 3289400 INFO  (qtp26906451-23052) [n:127.0.0.1:64695_solr c:testschemaapi s:shard1 r:core_node2 x:testschemaapi_shard1_replica1] o.a.s.h.l.XMLLoader xsltCacheLifetimeSeconds=60
   [junit4]   2> 3289401 INFO  (qtp29778174-23046) [n:127.0.0.1:64694_solr c:testschemaapi s:shard1 r:core_node1 x:testschemaapi_shard1_replica2] o.a.s.h.l.XMLLoader xsltCacheLifetimeSeconds=60
   [junit4]   2> 3289403 INFO  (qtp29778174-23046) [n:127.0.0.1:64694_solr c:testschemaapi s:shard1 r:core_node1 x:testschemaapi_shard1_replica2] o.a.s.c.RequestHandlers Registered paths: /admin/file,/update/json/docs,/get,/admin/luke,/select,/config,/admin/mbeans,/admin/plugins,/update/json,/schema,/replication,/admin/threads,/admin/segments,/update,/admin/system,/admin/properties,/admin/logging,/update/csv,/admin/ping
   [junit4]   2> 3289403 INFO  (qtp26906451-23052) [n:127.0.0.1:64695_solr c:testschemaapi s:shard1 r:core_node2 x:testschemaapi_shard1_replica1] o.a.s.h.l.XMLLoader xsltCacheLifetimeSeconds=60
   [junit4]   2> 3289405 INFO  (qtp29778174-23046) [n:127.0.0.1:64694_solr c:testschemaapi s:shard1 r:core_node1 x:testschemaapi_shard1_replica2] o.a.s.c.SolrCore Using default statsCache cache: org.apache.solr.search.stats.LocalStatsCache
   [junit4]   2> 3289406 INFO  (qtp29778174-23046) [n:127.0.0.1:64694_solr c:testschemaapi s:shard1 r:core_node1 x:testschemaapi_shard1_replica2] o.a.s.u.UpdateHandler Using UpdateLog implementation: org.apache.solr.update.UpdateLog
   [junit4]   2> 3289406 INFO  (qtp29778174-23046) [n:127.0.0.1:64694_solr c:testschemaapi s:shard1 r:core_node1 x:testschemaapi_shard1_replica2] o.a.s.u.UpdateLog Initializing UpdateLog: dataDir=null defaultSyncLevel=FLUSH numRecordsToKeep=100 maxNumLogsToKeep=10 numVersionBuckets=65536
   [junit4]   2> 3289407 INFO  (qtp26906451-23052) [n:127.0.0.1:64695_solr c:testschemaapi s:shard1 r:core_node2 x:testschemaapi_shard1_replica1] o.a.s.h.l.XMLLoader xsltCacheLifetimeSeconds=60
   [junit4]   2> 3289408 INFO  (qtp29778174-23046) [n:127.0.0.1:64694_solr c:testschemaapi s:shard1 r:core_node1 x:testschemaapi_shard1_replica2] o.a.s.u.CommitTracker Hard AutoCommit: disabled
   [junit4]   2> 3289408 INFO  (qtp29778174-23046) [n:127.0.0.1:64694_solr c:testschemaapi s:shard1 r:core_node1 x:testschemaapi_shard1_replica2] o.a.s.u.CommitTracker Soft AutoCommit: disabled
   [junit4]   2> 3289409 INFO  (qtp26906451-23052) [n:127.0.0.1:64695_solr c:testschemaapi s:shard1 r:core_node2 x:testschemaapi_shard1_replica1] o.a.s.c.RequestHandlers Registered paths: /admin/file,/update/json/docs,/get,/admin/luke,/select,/config,/admin/mbeans,/admin/plugins,/update/json,/schema,/replication,/admin/threads,/admin/segments,/update,/admin/system,/admin/properties,/admin/logging,/update/csv,/admin/ping
   [junit4]   2> 3289409 INFO  (qtp29778174-23046) [n:127.0.0.1:64694_solr c:testschemaapi s:shard1 r:core_node1 x:testschemaapi_shard1_replica2] o.a.s.c.SolrDeletionPolicy SolrDeletionPolicy.onInit: commits: num=1
   [junit4]   2> 	commit{dir=MockDirectoryWrapper(RAMDirectory@10eab64 lockFactory=org.apache.lucene.store.SingleInstanceLockFactory@166611),segFN=segments_1,generation=1}
   [junit4]   2> 3289409 INFO  (qtp29778174-23046) [n:127.0.0.1:64694_solr c:testschemaapi s:shard1 r:core_node1 x:testschemaapi_shard1_replica2] o.a.s.c.SolrDeletionPolicy newest commit generation = 1
   [junit4]   2> 3289411 INFO  (qtp29778174-23046) [n:127.0.0.1:64694_solr c:testschemaapi s:shard1 r:core_node1 x:testschemaapi_shard1_replica2] o.a.s.s.SolrIndexSearcher Opening Searcher@fb6185[testschemaapi_shard1_replica2] main
   [junit4]   2> 3289411 INFO  (qtp29778174-23046) [n:127.0.0.1:64694_solr c:testschemaapi s:shard1 r:core_node1 x:testschemaapi_shard1_replica2] o.a.s.c.c.ZkStateReader Load collection config from: [/collections/testschemaapi]
   [junit4]   2> 3289413 INFO  (qtp26906451-23052) [n:127.0.0.1:64695_solr c:testschemaapi s:shard1 r:core_node2 x:testschemaapi_shard1_replica1] o.a.s.c.SolrCore Using default statsCache cache: org.apache.solr.search.stats.LocalStatsCache
   [junit4]   2> 3289414 INFO  (qtp29778174-23046) [n:127.0.0.1:64694_solr c:testschemaapi s:shard1 r:core_node1 x:testschemaapi_shard1_replica2] o.a.s.c.c.ZkStateReader path=[/collections/testschemaapi] [configName]=[conf1] specified config exists in ZooKeeper
   [junit4]   2> 3289415 INFO  (qtp26906451-23052) [n:127.0.0.1:64695_solr c:testschemaapi s:shard1 r:core_node2 x:testschemaapi_shard1_replica1] o.a.s.u.UpdateHandler Using UpdateLog implementation: org.apache.solr.update.UpdateLog
   [junit4]   2> 3289415 INFO  (qtp29778174-23046) [n:127.0.0.1:64694_solr c:testschemaapi s:shard1 r:core_node1 x:testschemaapi_shard1_replica2] o.a.s.r.ManagedResourceStorage Setting up ZooKeeper-based storage for the RestManager with znodeBase: /configs/conf1
   [junit4]   2> 3289415 INFO  (qtp26906451-23052) [n:127.0.0.1:64695_solr c:testschemaapi s:shard1 r:core_node2 x:testschemaapi_shard1_replica1] o.a.s.u.UpdateLog Initializing UpdateLog: dataDir=null defaultSyncLevel=FLUSH numRecordsToKeep=100 maxNumLogsToKeep=10 numVersionBuckets=65536
   [junit4]   2> 3289415 INFO  (qtp29778174-23046) [n:127.0.0.1:64694_solr c:testschemaapi s:shard1 r:core_node1 x:testschemaapi_shard1_replica2] o.a.s.r.ManagedResourceStorage Configured ZooKeeperStorageIO with znodeBase: /configs/conf1
   [junit4]   2> 3289415 INFO  (qtp29778174-23046) [n:127.0.0.1:64694_solr c:testschemaapi s:shard1 r:core_node1 x:testschemaapi_shard1_replica2] o.a.s.r.RestManager Initializing RestManager with initArgs: {}
   [junit4]   2> 3289415 INFO  (qtp29778174-23046) [n:127.0.0.1:64694_solr c:testschemaapi s:shard1 r:core_node1 x:testschemaapi_shard1_replica2] o.a.s.r.ManagedResourceStorage Reading _rest_managed.json using ZooKeeperStorageIO:path=/configs/conf1
   [junit4]   2> 3289416 INFO  (qtp29778174-23046) [n:127.0.0.1:64694_solr c:testschemaapi s:shard1 r:core_node1 x:testschemaapi_shard1_replica2] o.a.s.r.ManagedResourceStorage No data found for znode /configs/conf1/_rest_managed.json
   [junit4]   2> 3289416 INFO  (qtp29778174-23046) [n:127.0.0.1:64694_solr c:testschemaapi s:shard1 r:core_node1 x:testschemaapi_shard1_replica2] o.a.s.r.ManagedResourceStorage Loaded null at path _rest_managed.json using ZooKeeperStorageIO:path=/configs/conf1
   [junit4]   2> 3289416 INFO  (qtp29778174-23046) [n:127.0.0.1:64694_solr c:testschemaapi s:shard1 r:core_node1 x:testschemaapi_shard1_replica2] o.a.s.r.RestManager Initializing 0 registered ManagedResources
   [junit4]   2> 3289416 INFO  (qtp29778174-23046) [n:127.0.0.1:64694_solr c:testschemaapi s:shard1 r:core_node1 x:testschemaapi_shard1_replica2] o.a.s.s.ZkIndexSchemaReader Creating ZooKeeper watch for the managed schema at /configs/conf1/managed-schema
   [junit4]   2> 3289417 INFO  (qtp26906451-23052) [n:127.0.0.1:64695_solr c:testschemaapi s:shard1 r:core_node2 x:testschemaapi_shard1_replica1] o.a.s.u.CommitTracker Hard AutoCommit: disabled
   [junit4]   2> 3289417 INFO  (qtp26906451-23052) [n:127.0.0.1:64695_solr c:testschemaapi s:shard1 r:core_node2 x:testschemaapi_shard1_replica1] o.a.s.u.CommitTracker Soft AutoCommit: disabled
   [junit4]   2> 3289417 INFO  (qtp29778174-23046) [n:127.0.0.1:64694_solr c:testschemaapi s:shard1 r:core_node1 x:testschemaapi_shard1_replica2] o.a.s.c.ZkController Added new OnReconnect listener ZkIndexSchemaReader: /configs/conf1/managed-schema, uniqueCoreId: testschemaapi_shard1_replica2:384284275453409
   [junit4]   2> 3289417 INFO  (qtp29778174-23046) [n:127.0.0.1:64694_solr c:testschemaapi s:shard1 r:core_node1 x:testschemaapi_shard1_replica2] o.a.s.h.ReplicationHandler Commits will be reserved for  10000
   [junit4]   2> 3289418 INFO  (searcherExecutor-10273-thread-1-processing-x:testschemaapi_shard1_replica2 s:shard1 c:testschemaapi r:core_node1 n:127.0.0.1:64694_solr) [n:127.0.0.1:64694_solr c:testschemaapi s:shard1 r:core_node1 x:testschemaapi_shard1_replica2] o.a.s.c.SolrCore [testschemaapi_shard1_replica2] Registered new searcher Searcher@fb6185[testschemaapi_shard1_replica2] main{ExitableDirectoryReader(UninvertingDirectoryReader())}
   [junit4]   2> 3289418 INFO  (qtp26906451-23052) [n:127.0.0.1:64695_solr c:testschemaapi s:shard1 r:core_node2 x:testschemaapi_shard1_replica1] o.a.s.c.SolrDeletionPolicy SolrDeletionPolicy.onInit: commits: num=1
   [junit4]   2> 	commit{dir=MockDirectoryWrapper(RAMDirectory@6e13a0 lockFactory=org.apache.lucene.store.SingleInstanceLockFactory@ca72b9),segFN=segments_1,generation=1}
   [junit4]   2> 3289418 INFO  (qtp26906451-23052) [n:127.0.0.1:64695_solr c:testschemaapi s:shard1 r:core_node2 x:testschemaapi_shard1_replica1] o.a.s.c.SolrDeletionPolicy newest commit generation = 1
   [junit4]   2> 3289418 INFO  (qtp26906451-23052) [n:127.0.0.1:64695_solr c:testschemaapi s:shard1 r:core_node2 x:testschemaapi_shard1_replica1] o.a.s.s.SolrIndexSearcher Opening Searcher@18244c0[testschemaapi_shard1_replica1] main
   [junit4]   2> 3289418 INFO  (qtp26906451-23052) [n:127.0.0.1:64695_solr c:testschemaapi s:shard1 r:core_node2 x:testschemaapi_shard1_replica1] o.a.s.c.c.ZkStateReader Load collection config from: [/collections/testschemaapi]
   [junit4]   2> 3289419 INFO  (qtp29778174-23046) [n:127.0.0.1:64694_solr c:testschemaapi s:shard1 r:core_node1 x:testschemaapi_shard1_replica2] o.a.s.u.UpdateLog Looking up max value of version field to seed version buckets
   [junit4]   2> 3289419 INFO  (qtp29778174-23046) [n:127.0.0.1:64694_solr c:testschemaapi s:shard1 r:core_node1 x:testschemaapi_shard1_replica2] o.a.s.u.VersionInfo Refreshing highest value of _version_ for 65536 version buckets from index
   [junit4]   2> 3289419 INFO  (qtp29778174-23046) [n:127.0.0.1:64694_solr c:testschemaapi s:shard1 r:core_node1 x:testschemaapi_shard1_replica2] o.a.s.u.VersionInfo No terms found for _version_, cannot seed version bucket highest value from index
   [junit4]   2> 3289419 INFO  (qtp29778174-23046) [n:127.0.0.1:64694_solr c:testschemaapi s:shard1 r:core_node1 x:testschemaapi_shard1_replica2] o.a.s.u.UpdateLog Could not find max version in index or recent updates, using new clock 1537714748389326848
   [junit4]   2> 3289421 INFO  (qtp29778174-23046) [n:127.0.0.1:64694_solr c:testschemaapi s:shard1 r:core_node1 x:testschemaapi_shard1_replica2] o.a.s.u.UpdateLog Took 2.0ms to seed version buckets with highest version 1537714748389326848
   [junit4]   2> 3289421 INFO  (qtp26906451-23052) [n:127.0.0.1:64695_solr c:testschemaapi s:shard1 r:core_node2 x:testschemaapi_shard1_replica1] o.a.s.c.c.ZkStateReader path=[/collections/testschemaapi] [configName]=[conf1] specified config exists in ZooKeeper
   [junit4]   2> 3289423 INFO  (qtp26906451-23052) [n:127.0.0.1:64695_solr c:testschemaapi s:shard1 r:core_node2 x:testschemaapi_shard1_replica1] o.a.s.r.ManagedResourceStorage Setting up ZooKeeper-based storage for the RestManager with znodeBase: /configs/conf1
   [junit4]   2> 3289423 INFO  (qtp29778174-23046) [n:127.0.0.1:64694_solr c:testschemaapi s:shard1 r:core_node1 x:testschemaapi_shard1_replica2] o.a.s.c.ZkController watch zkdir /configs/conf1
   [junit4]   2> 3289423 INFO  (qtp26906451-23052) [n:127.0.0.1:64695_solr c:testschemaapi s:shard1 r:core_node2 x:testschemaapi_shard1_replica1] o.a.s.r.ManagedResourceStorage Configured ZooKeeperStorageIO with znodeBase: /configs/conf1
   [junit4]   2> 3289423 INFO  (qtp26906451-23052) [n:127.0.0.1:64695_solr c:testschemaapi s:shard1 r:core_node2 x:testschemaapi_shard1_replica1] o.a.s.r.RestManager Initializing RestManager with initArgs: {}
   [junit4]   2> 3289423 INFO  (qtp26906451-23052) [n:127.0.0.1:64695_solr c:testschemaapi s:shard1 r:core_node2 x:testschemaapi_shard1_replica1] o.a.s.r.ManagedResourceStorage Reading _rest_managed.json using ZooKeeperStorageIO:path=/configs/conf1
   [junit4]   2> 3289424 INFO  (qtp29778174-23046) [n:127.0.0.1:64694_solr c:testschemaapi s:shard1 r:core_node1 x:testschemaapi_shard1_replica2] o.a.s.c.CoreContainer registering core: testschemaapi_shard1_replica2
   [junit4]   2> 3289424 INFO  (qtp29778174-23046) [n:127.0.0.1:64694_solr c:testschemaapi s:shard1 r:core_node1 x:testschemaapi_shard1_replica2] o.a.s.c.ZkController Register replica - core:testschemaapi_shard1_replica2 address:http://127.0.0.1:64694/solr collection:testschemaapi shard:shard1
   [junit4]   2> 3289425 INFO  (qtp26906451-23052) [n:127.0.0.1:64695_solr c:testschemaapi s:shard1 r:core_node2 x:testschemaapi_shard1_replica1] o.a.s.r.ManagedResourceStorage No data found for znode /configs/conf1/_rest_managed.json
   [junit4]   2> 3289425 INFO  (qtp26906451-23052) [n:127.0.0.1:64695_solr c:testschemaapi s:shard1 r:core_node2 x:testschemaapi_shard1_replica1] o.a.s.r.ManagedResourceStorage Loaded null at path _rest_managed.json using ZooKeeperStorageIO:path=/configs/conf1
   [junit4]   2> 3289425 INFO  (qtp26906451-23052) [n:127.0.0.1:64695_solr c:testschemaapi s:shard1 r:core_node2 x:testschemaapi_shard1_replica1] o.a.s.r.RestManager Initializing 0 registered ManagedResources
   [junit4]   2> 3289425 INFO  (qtp26906451-23052) [n:127.0.0.1:64695_solr c:testschemaapi s:shard1 r:core_node2 x:testschemaapi_shard1_replica1] o.a.s.s.ZkIndexSchemaReader Creating ZooKeeper watch for the managed schema at /configs/conf1/managed-schema
   [junit4]   2> 3289426 INFO  (qtp26906451-23052) [n:127.0.0.1:64695_solr c:testschemaapi s:shard1 r:core_node2 x:testschemaapi_shard1_replica1] o.a.s.c.ZkController Added new OnReconnect listener ZkIndexSchemaReader: /configs/conf1/managed-schema, uniqueCoreId: testschemaapi_shard1_replica1:384284281813397
   [junit4]   2> 3289426 INFO  (qtp29778174-23046) [n:127.0.0.1:64694_solr c:testschemaapi s:shard1 r:core_node1 x:testschemaapi_shard1_replica2] o.a.s.c.c.SolrZkClient makePath: /collections/testschemaapi/leader_elect/shard1/election
   [junit4]   2> 3289426 INFO  (qtp26906451-23052) [n:127.0.0.1:64695_solr c:testschemaapi s:shard1 r:core_node2 x:testschemaapi_shard1_replica1] o.a.s.h.ReplicationHandler Commits will be reserved for  10000
   [junit4]   2> 3289426 INFO  (searcherExecutor-10274-thread-1-processing-x:testschemaapi_shard1_replica1 s:shard1 c:testschemaapi n:127.0.0.1:64695_solr r:core_node2) [n:127.0.0.1:64695_solr c:testschemaapi s:shard1 r:core_node2 x:testschemaapi_shard1_replica1] o.a.s.c.SolrCore [testschemaapi_shard1_replica1] Registered new searcher Searcher@18244c0[testschemaapi_shard1_replica1] main{ExitableDirectoryReader(UninvertingDirectoryReader())}
   [junit4]   2> 3289427 INFO  (qtp26906451-23052) [n:127.0.0.1:64695_solr c:testschemaapi s:shard1 r:core_node2 x:testschemaapi_shard1_replica1] o.a.s.u.UpdateLog Looking up max value of version field to seed version buckets
   [junit4]   2> 3289427 INFO  (qtp26906451-23052) [n:127.0.0.1:64695_solr c:testschemaapi s:shard1 r:core_node2 x:testschemaapi_shard1_replica1] o.a.s.u.VersionInfo Refreshing highest value of _version_ for 65536 version buckets from index
   [junit4]   2> 3289427 INFO  (qtp26906451-23052) [n:127.0.0.1:64695_solr c:testschemaapi s:shard1 r:core_node2 x:testschemaapi_shard1_replica1] o.a.s.u.VersionInfo No terms found for _version_, cannot seed version bucket highest value from index
   [junit4]   2> 3289427 INFO  (qtp26906451-23052) [n:127.0.0.1:64695_solr c:testschemaapi s:shard1 r:core_node2 x:testschemaapi_shard1_replica1] o.a.s.u.UpdateLog Could not find max version in index or recent updates, using new clock 1537714748397715456
   [junit4]   2> 3289429 INFO  (qtp26906451-23052) [n:127.0.0.1:64695_solr c:testschemaapi s:shard1 r:core_node2 x:testschemaapi_shard1_replica1] o.a.s.u.UpdateLog Took 1.0ms to seed version buckets with highest version 1537714748397715456
   [junit4]   2> 3289429 INFO  (qtp26906451-23052) [n:127.0.0.1:64695_solr c:testschemaapi s:shard1 r:core_node2 x:testschemaapi_shard1_replica1] o.a.s.c.ZkController watch zkdir /configs/conf1
   [junit4]   2> 3289430 INFO  (qtp26906451-23052) [n:127.0.0.1:64695_solr c:testschemaapi s:shard1 r:core_node2 x:testschemaapi_shard1_replica1] o.a.s.c.CoreContainer registering core: testschemaapi_shard1_replica1
   [junit4]   2> 3289430 INFO  (qtp26906451-23052) [n:127.0.0.1:64695_solr c:testschemaapi s:shard1 r:core_node2 x:testschemaapi_shard1_replica1] o.a.s.c.ZkController Register replica - core:testschemaapi_shard1_replica1 address:http://127.0.0.1:64695/solr collection:testschemaapi shard:shard1
   [junit4]   2> 3289432 INFO  (qtp26906451-23052) [n:127.0.0.1:64695_solr c:testschemaapi s:shard1 r:core_node2 x:testschemaapi_shard1_replica1] o.a.s.c.c.SolrZkClient makePath: /collections/testschemaapi/leader_elect/shard1/election
   [junit4]   2> 3289438 INFO  (qtp29778174-23046) [n:127.0.0.1:64694_solr c:testschemaapi s:shard1 r:core_node1 x:testschemaapi_shard1_replica2] o.a.s.c.LeaderElector Joined leadership election with path: /collections/testschemaapi/leader_elect/shard1/election/96107171666919429-core_node1-n_0000000000
   [junit4]   2> 3289439 INFO  (qtp29778174-23046) [n:127.0.0.1:64694_solr c:testschemaapi s:shard1 r:core_node1 x:testschemaapi_shard1_replica2] o.a.s.c.ShardLeaderElectionContext Running the leader process for shard=shard1 and weAreReplacement=false and leaderVoteWait=10000
   [junit4]   2> 3289440 INFO  (qtp26906451-23052) [n:127.0.0.1:64695_solr c:testschemaapi s:shard1 r:core_node2 x:testschemaapi_shard1_replica1] o.a.s.c.LeaderElector Joined leadership election with path: /collections/testschemaapi/leader_elect/shard1/election/96107171666919430-core_node2-n_0000000001
   [junit4]   2> 3289441 INFO  (qtp26906451-23052) [n:127.0.0.1:64695_solr c:testschemaapi s:shard1 r:core_node2 x:testschemaapi_shard1_replica1] o.a.s.c.LeaderElector Watching path /collections/testschemaapi/leader_elect/shard1/election/96107171666919429-core_node1-n_0000000000 to know if I could be the leader
   [junit4]   2> 3289441 INFO  (qtp29778174-23046) [n:127.0.0.1:64694_solr c:testschemaapi s:shard1 r:core_node1 x:testschemaapi_shard1_replica2] o.a.s.c.ShardLeaderElectionContext Enough replicas found to continue.
   [junit4]   2> 3289441 INFO  (qtp29778174-23046) [n:127.0.0.1:64694_solr c:testschemaapi s:shard1 r:core_node1 x:testschemaapi_shard1_replica2] o.a.s.c.ShardLeaderElectionContext I may be the new leader - try and sync
   [junit4]   2> 3289441 INFO  (qtp29778174-23046) [n:127.0.0.1:64694_solr c:testschemaapi s:shard1 r:core_node1 x:testschemaapi_shard1_replica2] o.a.s.c.SyncStrategy Sync replicas to http://127.0.0.1:64694/solr/testschemaapi_shard1_replica2/
   [junit4]   2> 3289441 INFO  (qtp29778174-23046) [n:127.0.0.1:64694_solr c:testschemaapi s:shard1 r:core_node1 x:testschemaapi_shard1_replica2] o.a.s.u.PeerSync PeerSync: core=testschemaapi_shard1_replica2 url=http://127.0.0.1:64694/solr START replicas=[http://127.0.0.1:64695/solr/testschemaapi_shard1_replica1/] nUpdates=100
   [junit4]   2> 3289442 INFO  (qtp29778174-23046) [n:127.0.0.1:64694_solr c:testschemaapi s:shard1 r:core_node1 x:testschemaapi_shard1_replica2] o.a.s.u.PeerSync PeerSync: core=testschemaapi_shard1_replica2 url=http://127.0.0.1:64694/solr DONE.  We have no versions.  sync failed.
   [junit4]   2> 3289442 INFO  (qtp29778174-23046) [n:127.0.0.1:64694_solr c:testschemaapi s:shard1 r:core_node1 x:testschemaapi_shard1_replica2] o.a.s.c.SyncStrategy Leader's attempt to sync with shard failed, moving to the next candidate
   [junit4]   2> 3289442 INFO  (qtp29778174-23046) [n:127.0.0.1:64694_solr c:testschemaapi s:shard1 r:core_node1 x:testschemaapi_shard1_replica2] o.a.s.c.ShardLeaderElectionContext We failed sync, but we have no versions - we can't sync in that case - we were active before, so become leader anyway
   [junit4]   2> 3289442 INFO  (OverseerStateUpdate-96107171666919429-127.0.0.1:64694_solr-n_0000000000) [n:127.0.0.1:64694_solr    ] o.a.s.c.Overseer processMessage: queueSize: 1, message = {
   [junit4]   2>   "operation":"leader",
   [junit4]   2>   "shard":"shard1",
   [junit4]   2>   "collection":"testschemaapi"} current state version: 0
   [junit4]   2> 3289443 INFO  (qtp29778174-23046) [n:127.0.0.1:64694_solr c:testschemaapi s:shard1 r:core_node1 x:testschemaapi_shard1_replica2] o.a.s.c.c.SolrZkClient makePath: /collections/testschemaapi/leaders/shard1
   [junit4]   2> 3289445 INFO  (qtp26906451-23054) [n:127.0.0.1:64695_solr c:testschemaapi s:shard1 r:core_node2 x:testschemaapi_shard1_replica1] o.a.s.c.S.Request [testschemaapi_shard1_replica1]  webapp=/solr path=/get params={getVersions=100&distrib=false&fingerprint=false&qt=/get&version=2&wt=javabin} status=0 QTime=0
   [junit4]   2> 3289449 INFO  (qtp29778174-23046) [n:127.0.0.1:64694_solr c:testschemaapi s:shard1 r:core_node1 x:testschemaapi_shard1_replica2] o.a.s.c.ShardLeaderElectionContextBase Creating leader registration node /collections/testschemaapi/leaders/shard1/leader after winning as /collections/testschemaapi/leader_elect/shard1/election/96107171666919429-core_node1-n_0000000000
   [junit4]   2> 3289458 INFO  (qtp29778174-23046) [n:127.0.0.1:64694_solr c:testschemaapi s:shard1 r:core_node1 x:testschemaapi_shard1_replica2] o.a.s.c.ShardLeaderElectionContext I am the new leader: http://127.0.0.1:64694/solr/testschemaapi_shard1_replica2/ shard1
   [junit4]   2> 3289461 INFO  (OverseerStateUpdate-96107171666919429-127.0.0.1:64694_solr-n_0000000000) [n:127.0.0.1:64694_solr    ] o.a.s.c.Overseer processMessage: queueSize: 1, message = {
   [junit4]   2>   "operation":"leader",
   [junit4]   2>   "shard":"shard1",
   [junit4]   2>   "collection":"testschemaapi",
   [junit4]   2>   "base_url":"http://127.0.0.1:64694/solr",
   [junit4]   2>   "core":"testschemaapi_shard1_replica2",
   [junit4]   2>   "state":"active"} current state version: 0
   [junit4]   2> 3289567 INFO  (OverseerStateUpdate-96107171666919429-127.0.0.1:64694_solr-n_0000000000) [n:127.0.0.1:64694_solr    ] o.a.s.c.o.ZkStateWriter going to update_collection /collections/testschemaapi/state.json version: 1
   [junit4]   2> 3289568 INFO  (zkCallback-3532-thread-1-processing-n:127.0.0.1:64695_solr) [n:127.0.0.1:64695_solr    ] o.a.s.c.c.ZkStateReader A cluster state change: [WatchedEvent state:SyncConnected type:NodeDataChanged path:/collections/testschemaapi/state.json] for collection [testschemaapi] has occurred - updating... (live nodes size: [2])
   [junit4]   2> 3289568 INFO  (zkCallback-3531-thread-2-processing-n:127.0.0.1:64694_solr) [n:127.0.0.1:64694_solr    ] o.a.s.c.c.ZkStateReader A cluster state change: [WatchedEvent state:SyncConnected type:NodeDataChanged path:/collections/testschemaapi/state.json] for collection [testschemaapi] has occurred - updating... (live nodes size: [2])
   [junit4]   2> 3289569 INFO  (zkCallback-3532-thread-1-processing-n:127.0.0.1:64695_solr) [n:127.0.0.1:64695_solr    ] o.a.s.c.c.ZkStateReader Updating data for [testschemaapi] from [1] to [2]
   [junit4]   2> 3289569 INFO  (zkCallback-3531-thread-2-processing-n:127.0.0.1:64694_solr) [n:127.0.0.1:64694_solr    ] o.a.s.c.c.ZkStateReader Updating data for [testschemaapi] from [1] to [2]
   [junit4]   2> 3289616 INFO  (qtp29778174-23046) [n:127.0.0.1:64694_solr c:testschemaapi s:shard1 r:core_node1 x:testschemaapi_shard1_replica2] o.a.s.c.ZkController We are http://127.0.0.1:64694/solr/testschemaapi_shard1_replica2/ and leader is http://127.0.0.1:64694/solr/testschemaapi_shard1_replica2/
   [junit4]   2> 3289616 INFO  (qtp29778174-23046) [n:127.0.0.1:64694_solr c:testschemaapi s:shard1 r:core_node1 x:testschemaapi_shard1_replica2] o.a.s.c.ZkController No LogReplay needed for core=testschemaapi_shard1_replica2 baseURL=http://127.0.0.1:64694/solr
   [junit4]   2> 3289616 INFO  (qtp29778174-23046) [n:127.0.0.1:64694_solr c:testschemaapi s:shard1 r:core_node1 x:testschemaapi_shard1_replica2] o.a.s.c.ZkController I am the leader, no recovery necessary
   [junit4]   2> 3289616 INFO  (qtp29778174-23046) [n:127.0.0.1:64694_solr c:testschemaapi s:shard1 r:core_node1 x:testschemaapi_shard1_replica2] o.a.s.c.ZkController publishing state=active
   [junit4]   2> 3289619 INFO  (OverseerStateUpdate-96107171666919429-127.0.0.1:64694_solr-n_0000000000) [n:127.0.0.1:64694_solr    ] o.a.s.c.Overseer processMessage: queueSize: 1, message = {
   [junit4]   2>   "base_url":"http://127.0.0.1:64694/solr",
   [junit4]   2>   "operation":"state",
   [junit4]   2>   "core_node_name":"core_node1",
   [junit4]   2>   "core":"testschemaapi_shard1_replica2",
   [junit4]   2>   "numShards":"1",
   [junit4]   2>   "shard":"shard1",
   [junit4]   2>   "roles":null,
   [junit4]   2>   "collection":"testschemaapi",
   [junit4]   2>   "state":"active",
   [junit4]   2>   "node_name":"127.0.0.1:64694_solr"} current state version: 0
   [junit4]   2> 3289620 INFO  (OverseerStateUpdate-96107171666919429-127.0.0.1:64694_solr-n_0000000000) [n:127.0.0.1:64694_solr    ] o.a.s.c.o.ReplicaMutator Update state numShards=1 message={
   [junit4]   2>   "base_url":"http://127.0.0.1:64694/solr",
   [junit4]   2>   "operation":"state",
   [junit4]   2>   "core_node_name":"core_node1",
   [junit4]   2>   "core":"testschemaapi_shard1_replica2",
   [junit4]   2>   "numShards":"1",
   [junit4]   2>   "shard":"shard1",
   [junit4]   2>   "roles":null,
   [junit4]   2>   "collection":"testschemaapi",
   [junit4]   2>   "state":"active",
   [junit4]   2>   "node_name":"127.0.0.1:64694_solr"}
   [junit4]   2> 3289622 INFO  (qtp29778174-23046) [n:127.0.0.1:64694_solr c:testschemaapi s:shard1 r:core_node1 x:testschemaapi_shard1_replica2] o.a.s.s.HttpSolrCall [admin] webapp=null path=/admin/cores params={numShards=1&collection.configName=conf1&shard=shard1&action=CREATE&name=testschemaapi_shard1_replica2&qt=/admin/cores&collection=testschemaapi&version=2&wt=javabin} status=0 QTime=1421
   [junit4]   2> 3289726 INFO  (OverseerStateUpdate-96107171666919429-127.0.0.1:64694_solr-n_0000000000) [n:127.0.0.1:64694_solr    ] o.a.s.c.o.ZkStateWriter going to update_collection /collections/testschemaapi/state.json version: 2
   [junit4]   2> 3289727 INFO  (zkCallback-3531-thread-3-processing-n:127.0.0.1:64694_solr) [n:127.0.0.1:64694_solr    ] o.a.s.c.c.ZkStateReader A cluster state change: [WatchedEvent state:SyncConnected type:NodeDataChanged path:/collections/testschemaapi/state.json] for collection [testschemaapi] has occurred - updating... (live nodes size: [2])
   [junit4]   2> 3289728 INFO  (zkCallback-3532-thread-1-processing-n:127.0.0.1:64695_solr) [n:127.0.0.1:64695_solr    ] o.a.s.c.c.ZkStateReader A cluster state change

[...truncated too long message...]

: Will linger awaiting termination of 2 leaked thread(s).
   [junit4]   2> 3310540 WARN  (Thread-8532) [n:127.0.0.1:64694_solr    ] o.a.s.c.ZkController listener throws error
   [junit4]   2> org.apache.solr.common.SolrException: Unable to reload core [testschemaapi_shard1_replica2]
   [junit4]   2> 	at org.apache.solr.core.CoreContainer.reload(CoreContainer.java:921)
   [junit4]   2> 	at org.apache.solr.core.SolrCore$11.run(SolrCore.java:2623)
   [junit4]   2> 	at org.apache.solr.cloud.ZkController$5.run(ZkController.java:2480)
   [junit4]   2> Caused by: org.apache.solr.common.SolrException: Could not load conf for core testschemaapi_shard1_replica2: Unable to load reader for ConfigSet properties: configsetprops.json
   [junit4]   2> 	at org.apache.solr.core.ConfigSetService.getConfig(ConfigSetService.java:84)
   [junit4]   2> 	at org.apache.solr.core.CoreContainer.reload(CoreContainer.java:914)
   [junit4]   2> 	... 2 more
   [junit4]   2> Caused by: org.apache.solr.common.SolrException: Unable to load reader for ConfigSet properties: configsetprops.json
   [junit4]   2> 	at org.apache.solr.core.ConfigSetProperties.readFromResourceLoader(ConfigSetProperties.java:57)
   [junit4]   2> 	at org.apache.solr.core.ConfigSetService.createConfigSetProperties(ConfigSetService.java:118)
   [junit4]   2> 	at org.apache.solr.core.ConfigSetService.getConfig(ConfigSetService.java:80)
   [junit4]   2> 	... 3 more
   [junit4]   2> Caused by: java.io.IOException: We re-tried 10 times but was still unable to fetch resource=configsetprops.json from ZK
   [junit4]   2> 	at org.apache.solr.cloud.ZkSolrResourceLoader.openResource(ZkSolrResourceLoader.java:116)
   [junit4]   2> 	at org.apache.solr.core.ConfigSetProperties.readFromResourceLoader(ConfigSetProperties.java:52)
   [junit4]   2> 	... 5 more
   [junit4]   2> Caused by: org.apache.zookeeper.KeeperException$SessionExpiredException: KeeperErrorCode = Session expired for /configs/conf1/configsetprops.json
   [junit4]   2> 	at org.apache.zookeeper.KeeperException.create(KeeperException.java:127)
   [junit4]   2> 	at org.apache.zookeeper.KeeperException.create(KeeperException.java:51)
   [junit4]   2> 	at org.apache.zookeeper.ZooKeeper.exists(ZooKeeper.java:1045)
   [junit4]   2> 	at org.apache.solr.common.cloud.SolrZkClient$5.execute(SolrZkClient.java:311)
   [junit4]   2> 	at org.apache.solr.common.cloud.SolrZkClient$5.execute(SolrZkClient.java:308)
   [junit4]   2> 	at org.apache.solr.common.cloud.ZkCmdExecutor.retryOperation(ZkCmdExecutor.java:60)
   [junit4]   2> 	at org.apache.solr.common.cloud.SolrZkClient.exists(SolrZkClient.java:308)
   [junit4]   2> 	at org.apache.solr.cloud.ZkController.pathExists(ZkController.java:839)
   [junit4]   2> 	at org.apache.solr.cloud.ZkSolrResourceLoader.openResource(ZkSolrResourceLoader.java:89)
   [junit4]   2> 	... 6 more
   [junit4]   2> NOTE: test params are: codec=Asserting(Lucene54): {myNewField=Lucene50(blocksize=128), _version_=Lucene50(blocksize=128), id=BlockTreeOrds(blocksize=128)}, docValues:{}, sim=DefaultSimilarity, locale=id, timezone=Asia/Thimphu
   [junit4]   2> NOTE: Windows 8.1 6.3 x86/Oracle Corporation 1.7.0_80 (32-bit)/cpus=3,threads=1,free=111530768,total=453861376
   [junit4]   2> NOTE: All tests run in this JVM: [ShardSplitTest, PrimUtilsTest, TestJsonRequest, TestObjectReleaseTracker, SchemaVersionSpecificBehaviorTest, DeleteStatusTest, BlockJoinFacetRandomTest, RestartWhileUpdatingTest, QueryResultKeyTest, ChaosMonkeyNothingIsSafeTest, XsltUpdateRequestHandlerTest, HdfsBasicDistributedZkTest, TimeZoneUtilsTest, TestConfigSetImmutable, RuleEngineTest, DeleteReplicaTest, DeleteInactiveReplicaTest, TestManagedSchema, ClusterStateUpdateTest, ClusterStateTest, TestMiniSolrCloudCluster, ReturnFieldsTest, TestUseDocValuesAsStored2, TestSolrQueryParserDefaultOperatorResource, DistributedQueueTest, TestInitQParser, CachingDirectoryFactoryTest, TestCoreContainer, PathHierarchyTokenizerFactoryTest, LeaderInitiatedRecoveryOnShardRestartTest, TestFreeTextSuggestions, CheckHdfsIndexTest, HLLUtilTest, TestLeaderElectionZkExpiry, StandardRequestHandlerTest, TestCryptoKeys, TestReplicationHandler, TestMergePolicyConfig, TestStressVersions, TestRebalanceLeaders, TestWordDelimiterFilterFactory, TestLazyCores, TestCloudSchemaless, PKIAuthenticationIntegrationTest, JSONWriterTest, CreateCollectionCleanupTest, TestRawResponseWriter, TestShortCircuitedRequests, CollectionTooManyReplicasTest, TestSha256AuthenticationProvider, TestQuerySenderNoQuery, TestLFUCache, TestTrackingShardHandlerFactory, BitVectorTest, SoftAutoCommitTest, TestExpandComponent, SimpleFacetsTest, TestSolrCLIRunExample, TestRestoreCore, SharedFSAutoReplicaFailoverUtilsTest, TestOrdValues, StressHdfsTest, XmlUpdateRequestHandlerTest, TestSweetSpotSimilarityFactory, SystemInfoHandlerTest, TestDefaultStatsCache, HdfsSyncSliceTest, TestCloudManagedSchema, PeerSyncTest, DistributedFacetPivotLongTailTest, DocumentBuilderTest, AlternateDirectoryTest, SolrCoreTest, SolrTestCaseJ4Test, HighlighterMaxOffsetTest, TestEmbeddedSolrServerConstructors, UpdateParamsTest, TestRestManager, ConfigSetsAPITest, BadComponentTest, TestReloadAndDeleteDocs, SortSpecParsingTest, URLClassifyProcessorTest, TestUniqueKeyFieldResource, SliceStateTest, TestClassNameShortening, CursorPagingTest, TestTolerantSearch, CloneFieldUpdateProcessorFactoryTest, AnalysisErrorHandlingTest, TestPostingsSolrHighlighter, AnalysisAfterCoreReloadTest, TestScoreJoinQPNoScore, MultiThreadedOCPTest, TestDistributedSearch, SampleTest, TestJmxMonitoredMap, TestChildDocTransformer, TestBlobHandler, CircularListTest, TestAuthenticationFramework, DirectSolrSpellCheckerTest, ChangedSchemaMergeTest, TestPartialUpdateDeduplication, TestSort, RecoveryZkTest, DocValuesMultiTest, TestGroupingSearch, SolrCloudExampleTest, DistributedSuggestComponentTest, TestLMDirichletSimilarityFactory, LeaderElectionTest, TestSolrQueryResponse, SpatialRPTFieldTypeTest, TestIntervalFaceting, TestUpdate, TestDynamicFieldResource, TestArbitraryIndexDir, TestCollectionAPI, RemoteQueryErrorTest, SimpleMLTQParserTest, TestFunctionQuery, BJQParserTest, CurrencyFieldXmlFileTest, TestStressLucene, TestComplexPhraseQParserPlugin, TestSearchPerf, TestDownShardTolerantSearch, MergeStrategyTest, TestSolrConfigHandlerConcurrent, HdfsChaosMonkeySafeLeaderTest, TestDocBasedVersionConstraints, TestBlendedInfixSuggestions, TestManagedSchemaFieldResource, TestRandomDVFaceting, CollectionReloadTest, RequiredFieldsTest, TestJsonFacets, LeaderElectionIntegrationTest, FullSolrCloudDistribCmdsTest, DistributedSpellCheckComponentTest, HardAutoCommitTest, QueryElevationComponentTest, DirectUpdateHandlerTest, SimplePostToolTest, TestCoreDiscovery, TestExtendedDismaxParser, SolrRequestParserTest, DocValuesTest, TestQueryTypes, PrimitiveFieldTypeTest, RequestHandlersTest, TestIndexingPerformance, FieldAnalysisRequestHandlerTest, FastVectorHighlighterTest, IndexSchemaTest, TestCollationField, TestCSVResponseWriter, TestAnalyzedSuggestions, JsonLoaderTest, PingRequestHandlerTest, OutputWriterTest, DirectSolrConnectionTest, TestPhraseSuggestions, TestCodecSupport, TestIBSimilarityFactory, ScriptEngineTest, TestFastLRUCache, TestSuggestSpellingConverter, DateFieldTest, TestCursorMarkWithoutUniqueKey, TestHighlightDedupGrouping, ActionThrottleTest, AssignTest, AsyncCallRequestStatusResponseTest, CleanupOldIndexTest, CollectionStateFormat2Test, ConcurrentDeleteAndCreateCollectionTest, CustomCollectionTest, DistribJoinFromCollectionTest, ForceLeaderTest, OverseerTaskQueueTest, SSLMigrationTest, SaslZkACLProviderTest, TestCloudDeleteByQuery, TestConfigSetsAPIExclusivity, TestConfigSetsAPIZkFailure, TestDistribDocBasedVersion, TestLeaderInitiatedRecoveryThread, TestOnReconnectListenerSupport, TestReplicaProperties, TestSolrCloudWithKerberosAlt, TriLevelCompositeIdRoutingTest, VMParamsZkACLAndCredentialsProvidersTest, HdfsBasicDistributedZk2Test, HdfsCollectionsAPIDistributedZkTest, HdfsNNFailoverTest, HdfsRecoverLeaseTest, HdfsRecoveryZkTest, HdfsRestartWhileUpdatingTest, HdfsUnloadDistributedZkTest, HdfsWriteToMultipleCollectionsTest, TestClusterStateMutator, ZkStateReaderTest, RulesTest, TestSolrXml, TestReplicationHandlerBackup, TestReqParamsAPI, CoreAdminCreateDiscoverTest, CoreAdminRequestStatusTest, InfoHandlerTest, DistributedExpandComponentTest, DistributedFacetPivotSmallTest, DistributedQueryComponentCustomSortTest, FacetPivotSmallTest, SuggestComponentContextFilterQueryTest, SuggestComponentTest, TestDistributedStatsComponentCardinality, TestCollationFieldDocValues, TestManagedSchemaAPI]
   [junit4] Completed [520/573 (1!)] on J0 in 22.89s, 1 test, 1 error <<< FAILURES!

[...truncated 175 lines...]
BUILD FAILED
C:\Users\jenkins\workspace\Lucene-Solr-5.5-Windows\build.xml:750: The following error occurred while executing this line:
C:\Users\jenkins\workspace\Lucene-Solr-5.5-Windows\build.xml:694: The following error occurred while executing this line:
C:\Users\jenkins\workspace\Lucene-Solr-5.5-Windows\build.xml:59: The following error occurred while executing this line:
C:\Users\jenkins\workspace\Lucene-Solr-5.5-Windows\solr\build.xml:233: The following error occurred while executing this line:
C:\Users\jenkins\workspace\Lucene-Solr-5.5-Windows\solr\common-build.xml:534: The following error occurred while executing this line:
C:\Users\jenkins\workspace\Lucene-Solr-5.5-Windows\lucene\common-build.xml:1477: The following error occurred while executing this line:
C:\Users\jenkins\workspace\Lucene-Solr-5.5-Windows\lucene\common-build.xml:1033: There were test failures: 573 suites (7 ignored), 2319 tests, 1 error, 94 ignored (49 assumptions) [seed: 9E84302F8BEC9B18]

Total time: 84 minutes 20 seconds
Build step 'Invoke Ant' marked build as failure
Archiving artifacts
[WARNINGS] Skipping publisher since build result is FAILURE
Recording test results
Email was triggered for: Failure - Any
Sending email for trigger: Failure - Any



Mime
View raw message