lucene-dev mailing list archives

Site index · List index
Message view « Date » · « Thread »
Top « Date » · « Thread »
From Policeman Jenkins Server <jenk...@thetaphi.de>
Subject [JENKINS] Lucene-Solr-6.1-Linux (64bit/jdk1.8.0_92) - Build # 7 - Failure!
Date Thu, 09 Jun 2016 23:28:39 GMT
Build: http://jenkins.thetaphi.de/job/Lucene-Solr-6.1-Linux/7/
Java: 64bit/jdk1.8.0_92 -XX:+UseCompressedOops -XX:+UseParallelGC

1 tests failed.
FAILED:  org.apache.solr.handler.TestReqParamsAPI.test

Error Message:
Could not get expected value  'CY val' for path 'response/params/y/c' full output: {   "responseHeader":{     "status":0,     "QTime":0},   "response":{     "znodeVersion":0,     "params":{"x":{         "a":"A val",         "b":"B val",         "":{"v":0}}}}},  from server:  https://127.0.0.1:38739/collection1

Stack Trace:
java.lang.AssertionError: Could not get expected value  'CY val' for path 'response/params/y/c' full output: {
  "responseHeader":{
    "status":0,
    "QTime":0},
  "response":{
    "znodeVersion":0,
    "params":{"x":{
        "a":"A val",
        "b":"B val",
        "":{"v":0}}}}},  from server:  https://127.0.0.1:38739/collection1
	at __randomizedtesting.SeedInfo.seed([C9C144B8420A7A25:41957B62ECF617DD]:0)
	at org.junit.Assert.fail(Assert.java:93)
	at org.junit.Assert.assertTrue(Assert.java:43)
	at org.apache.solr.core.TestSolrConfigHandler.testForResponseElement(TestSolrConfigHandler.java:481)
	at org.apache.solr.handler.TestReqParamsAPI.testReqParams(TestReqParamsAPI.java:160)
	at org.apache.solr.handler.TestReqParamsAPI.test(TestReqParamsAPI.java:62)
	at sun.reflect.NativeMethodAccessorImpl.invoke0(Native Method)
	at sun.reflect.NativeMethodAccessorImpl.invoke(NativeMethodAccessorImpl.java:62)
	at sun.reflect.DelegatingMethodAccessorImpl.invoke(DelegatingMethodAccessorImpl.java:43)
	at java.lang.reflect.Method.invoke(Method.java:498)
	at com.carrotsearch.randomizedtesting.RandomizedRunner.invoke(RandomizedRunner.java:1764)
	at com.carrotsearch.randomizedtesting.RandomizedRunner$8.evaluate(RandomizedRunner.java:871)
	at com.carrotsearch.randomizedtesting.RandomizedRunner$9.evaluate(RandomizedRunner.java:907)
	at com.carrotsearch.randomizedtesting.RandomizedRunner$10.evaluate(RandomizedRunner.java:921)
	at org.apache.solr.BaseDistributedSearchTestCase$ShardsRepeatRule$ShardsFixedStatement.callStatement(BaseDistributedSearchTestCase.java:992)
	at org.apache.solr.BaseDistributedSearchTestCase$ShardsRepeatRule$ShardsStatement.evaluate(BaseDistributedSearchTestCase.java:967)
	at com.carrotsearch.randomizedtesting.rules.SystemPropertiesRestoreRule$1.evaluate(SystemPropertiesRestoreRule.java:57)
	at org.apache.lucene.util.TestRuleSetupTeardownChained$1.evaluate(TestRuleSetupTeardownChained.java:49)
	at org.apache.lucene.util.AbstractBeforeAfterRule$1.evaluate(AbstractBeforeAfterRule.java:45)
	at org.apache.lucene.util.TestRuleThreadAndTestName$1.evaluate(TestRuleThreadAndTestName.java:48)
	at org.apache.lucene.util.TestRuleIgnoreAfterMaxFailures$1.evaluate(TestRuleIgnoreAfterMaxFailures.java:64)
	at org.apache.lucene.util.TestRuleMarkFailure$1.evaluate(TestRuleMarkFailure.java:47)
	at com.carrotsearch.randomizedtesting.rules.StatementAdapter.evaluate(StatementAdapter.java:36)
	at com.carrotsearch.randomizedtesting.ThreadLeakControl$StatementRunner.run(ThreadLeakControl.java:367)
	at com.carrotsearch.randomizedtesting.ThreadLeakControl.forkTimeoutingTask(ThreadLeakControl.java:809)
	at com.carrotsearch.randomizedtesting.ThreadLeakControl$3.evaluate(ThreadLeakControl.java:460)
	at com.carrotsearch.randomizedtesting.RandomizedRunner.runSingleTest(RandomizedRunner.java:880)
	at com.carrotsearch.randomizedtesting.RandomizedRunner$5.evaluate(RandomizedRunner.java:781)
	at com.carrotsearch.randomizedtesting.RandomizedRunner$6.evaluate(RandomizedRunner.java:816)
	at com.carrotsearch.randomizedtesting.RandomizedRunner$7.evaluate(RandomizedRunner.java:827)
	at com.carrotsearch.randomizedtesting.rules.StatementAdapter.evaluate(StatementAdapter.java:36)
	at com.carrotsearch.randomizedtesting.rules.SystemPropertiesRestoreRule$1.evaluate(SystemPropertiesRestoreRule.java:57)
	at org.apache.lucene.util.AbstractBeforeAfterRule$1.evaluate(AbstractBeforeAfterRule.java:45)
	at com.carrotsearch.randomizedtesting.rules.StatementAdapter.evaluate(StatementAdapter.java:36)
	at org.apache.lucene.util.TestRuleStoreClassName$1.evaluate(TestRuleStoreClassName.java:41)
	at com.carrotsearch.randomizedtesting.rules.NoShadowingOrOverridesOnMethodsRule$1.evaluate(NoShadowingOrOverridesOnMethodsRule.java:40)
	at com.carrotsearch.randomizedtesting.rules.NoShadowingOrOverridesOnMethodsRule$1.evaluate(NoShadowingOrOverridesOnMethodsRule.java:40)
	at com.carrotsearch.randomizedtesting.rules.StatementAdapter.evaluate(StatementAdapter.java:36)
	at com.carrotsearch.randomizedtesting.rules.StatementAdapter.evaluate(StatementAdapter.java:36)
	at com.carrotsearch.randomizedtesting.rules.StatementAdapter.evaluate(StatementAdapter.java:36)
	at org.apache.lucene.util.TestRuleAssertionsRequired$1.evaluate(TestRuleAssertionsRequired.java:53)
	at org.apache.lucene.util.TestRuleMarkFailure$1.evaluate(TestRuleMarkFailure.java:47)
	at org.apache.lucene.util.TestRuleIgnoreAfterMaxFailures$1.evaluate(TestRuleIgnoreAfterMaxFailures.java:64)
	at org.apache.lucene.util.TestRuleIgnoreTestSuites$1.evaluate(TestRuleIgnoreTestSuites.java:54)
	at com.carrotsearch.randomizedtesting.rules.StatementAdapter.evaluate(StatementAdapter.java:36)
	at com.carrotsearch.randomizedtesting.ThreadLeakControl$StatementRunner.run(ThreadLeakControl.java:367)
	at java.lang.Thread.run(Thread.java:745)




Build Log:
[...truncated 11315 lines...]
   [junit4] Suite: org.apache.solr.handler.TestReqParamsAPI
   [junit4]   2> Creating dataDir: /home/jenkins/workspace/Lucene-Solr-6.1-Linux/solr/build/solr-core/test/J1/temp/solr.handler.TestReqParamsAPI_C9C144B8420A7A25-001/init-core-data-001
   [junit4]   2> 964596 INFO  (SUITE-TestReqParamsAPI-seed#[C9C144B8420A7A25]-worker) [    ] o.a.s.SolrTestCaseJ4 Randomized ssl (true) and clientAuth (true) via: @org.apache.solr.util.RandomizeSSL(reason=, ssl=NaN, value=NaN, clientAuth=NaN)
   [junit4]   2> 964596 INFO  (SUITE-TestReqParamsAPI-seed#[C9C144B8420A7A25]-worker) [    ] o.a.s.BaseDistributedSearchTestCase Setting hostContext system property: /
   [junit4]   2> 964598 INFO  (TEST-TestReqParamsAPI.test-seed#[C9C144B8420A7A25]) [    ] o.a.s.c.ZkTestServer STARTING ZK TEST SERVER
   [junit4]   2> 964598 INFO  (Thread-2148) [    ] o.a.s.c.ZkTestServer client port:0.0.0.0/0.0.0.0:0
   [junit4]   2> 964598 INFO  (Thread-2148) [    ] o.a.s.c.ZkTestServer Starting server
   [junit4]   2> 964698 INFO  (TEST-TestReqParamsAPI.test-seed#[C9C144B8420A7A25]) [    ] o.a.s.c.ZkTestServer start zk server on port:42268
   [junit4]   2> 964698 INFO  (TEST-TestReqParamsAPI.test-seed#[C9C144B8420A7A25]) [    ] o.a.s.c.c.SolrZkClient Using default ZkCredentialsProvider
   [junit4]   2> 964698 INFO  (TEST-TestReqParamsAPI.test-seed#[C9C144B8420A7A25]) [    ] o.a.s.c.c.ConnectionManager Waiting for client to connect to ZooKeeper
   [junit4]   2> 964700 INFO  (zkCallback-1030-thread-1) [    ] o.a.s.c.c.ConnectionManager Watcher org.apache.solr.common.cloud.ConnectionManager@72cc9fb0 name:ZooKeeperConnection Watcher:127.0.0.1:42268 got event WatchedEvent state:SyncConnected type:None path:null path:null type:None
   [junit4]   2> 964700 INFO  (TEST-TestReqParamsAPI.test-seed#[C9C144B8420A7A25]) [    ] o.a.s.c.c.ConnectionManager Client is connected to ZooKeeper
   [junit4]   2> 964700 INFO  (TEST-TestReqParamsAPI.test-seed#[C9C144B8420A7A25]) [    ] o.a.s.c.c.SolrZkClient Using default ZkACLProvider
   [junit4]   2> 964700 INFO  (TEST-TestReqParamsAPI.test-seed#[C9C144B8420A7A25]) [    ] o.a.s.c.c.SolrZkClient makePath: /solr
   [junit4]   2> 964701 INFO  (TEST-TestReqParamsAPI.test-seed#[C9C144B8420A7A25]) [    ] o.a.s.c.c.SolrZkClient Using default ZkCredentialsProvider
   [junit4]   2> 964701 INFO  (TEST-TestReqParamsAPI.test-seed#[C9C144B8420A7A25]) [    ] o.a.s.c.c.ConnectionManager Waiting for client to connect to ZooKeeper
   [junit4]   2> 964702 INFO  (zkCallback-1031-thread-1) [    ] o.a.s.c.c.ConnectionManager Watcher org.apache.solr.common.cloud.ConnectionManager@6bcf0804 name:ZooKeeperConnection Watcher:127.0.0.1:42268/solr got event WatchedEvent state:SyncConnected type:None path:null path:null type:None
   [junit4]   2> 964702 INFO  (TEST-TestReqParamsAPI.test-seed#[C9C144B8420A7A25]) [    ] o.a.s.c.c.ConnectionManager Client is connected to ZooKeeper
   [junit4]   2> 964702 INFO  (TEST-TestReqParamsAPI.test-seed#[C9C144B8420A7A25]) [    ] o.a.s.c.c.SolrZkClient Using default ZkACLProvider
   [junit4]   2> 964702 INFO  (TEST-TestReqParamsAPI.test-seed#[C9C144B8420A7A25]) [    ] o.a.s.c.c.SolrZkClient makePath: /collections/collection1
   [junit4]   2> 964703 INFO  (TEST-TestReqParamsAPI.test-seed#[C9C144B8420A7A25]) [    ] o.a.s.c.c.SolrZkClient makePath: /collections/collection1/shards
   [junit4]   2> 964703 INFO  (TEST-TestReqParamsAPI.test-seed#[C9C144B8420A7A25]) [    ] o.a.s.c.c.SolrZkClient makePath: /collections/control_collection
   [junit4]   2> 964704 INFO  (TEST-TestReqParamsAPI.test-seed#[C9C144B8420A7A25]) [    ] o.a.s.c.c.SolrZkClient makePath: /collections/control_collection/shards
   [junit4]   2> 964704 INFO  (TEST-TestReqParamsAPI.test-seed#[C9C144B8420A7A25]) [    ] o.a.s.c.AbstractZkTestCase put /home/jenkins/workspace/Lucene-Solr-6.1-Linux/solr/core/src/test-files/solr/collection1/conf/solrconfig-tlog.xml to /configs/conf1/solrconfig.xml
   [junit4]   2> 964704 INFO  (TEST-TestReqParamsAPI.test-seed#[C9C144B8420A7A25]) [    ] o.a.s.c.c.SolrZkClient makePath: /configs/conf1/solrconfig.xml
   [junit4]   2> 964705 INFO  (TEST-TestReqParamsAPI.test-seed#[C9C144B8420A7A25]) [    ] o.a.s.c.AbstractZkTestCase put /home/jenkins/workspace/Lucene-Solr-6.1-Linux/solr/core/src/test-files/solr/collection1/conf/schema.xml to /configs/conf1/schema.xml
   [junit4]   2> 964705 INFO  (TEST-TestReqParamsAPI.test-seed#[C9C144B8420A7A25]) [    ] o.a.s.c.c.SolrZkClient makePath: /configs/conf1/schema.xml
   [junit4]   2> 964706 INFO  (TEST-TestReqParamsAPI.test-seed#[C9C144B8420A7A25]) [    ] o.a.s.c.AbstractZkTestCase put /home/jenkins/workspace/Lucene-Solr-6.1-Linux/solr/core/src/test-files/solr/collection1/conf/solrconfig.snippet.randomindexconfig.xml to /configs/conf1/solrconfig.snippet.randomindexconfig.xml
   [junit4]   2> 964706 INFO  (TEST-TestReqParamsAPI.test-seed#[C9C144B8420A7A25]) [    ] o.a.s.c.c.SolrZkClient makePath: /configs/conf1/solrconfig.snippet.randomindexconfig.xml
   [junit4]   2> 964706 INFO  (TEST-TestReqParamsAPI.test-seed#[C9C144B8420A7A25]) [    ] o.a.s.c.AbstractZkTestCase put /home/jenkins/workspace/Lucene-Solr-6.1-Linux/solr/core/src/test-files/solr/collection1/conf/stopwords.txt to /configs/conf1/stopwords.txt
   [junit4]   2> 964706 INFO  (TEST-TestReqParamsAPI.test-seed#[C9C144B8420A7A25]) [    ] o.a.s.c.c.SolrZkClient makePath: /configs/conf1/stopwords.txt
   [junit4]   2> 964707 INFO  (TEST-TestReqParamsAPI.test-seed#[C9C144B8420A7A25]) [    ] o.a.s.c.AbstractZkTestCase put /home/jenkins/workspace/Lucene-Solr-6.1-Linux/solr/core/src/test-files/solr/collection1/conf/protwords.txt to /configs/conf1/protwords.txt
   [junit4]   2> 964707 INFO  (TEST-TestReqParamsAPI.test-seed#[C9C144B8420A7A25]) [    ] o.a.s.c.c.SolrZkClient makePath: /configs/conf1/protwords.txt
   [junit4]   2> 964707 INFO  (TEST-TestReqParamsAPI.test-seed#[C9C144B8420A7A25]) [    ] o.a.s.c.AbstractZkTestCase put /home/jenkins/workspace/Lucene-Solr-6.1-Linux/solr/core/src/test-files/solr/collection1/conf/currency.xml to /configs/conf1/currency.xml
   [junit4]   2> 964707 INFO  (TEST-TestReqParamsAPI.test-seed#[C9C144B8420A7A25]) [    ] o.a.s.c.c.SolrZkClient makePath: /configs/conf1/currency.xml
   [junit4]   2> 964708 INFO  (TEST-TestReqParamsAPI.test-seed#[C9C144B8420A7A25]) [    ] o.a.s.c.AbstractZkTestCase put /home/jenkins/workspace/Lucene-Solr-6.1-Linux/solr/core/src/test-files/solr/collection1/conf/enumsConfig.xml to /configs/conf1/enumsConfig.xml
   [junit4]   2> 964708 INFO  (TEST-TestReqParamsAPI.test-seed#[C9C144B8420A7A25]) [    ] o.a.s.c.c.SolrZkClient makePath: /configs/conf1/enumsConfig.xml
   [junit4]   2> 964708 INFO  (TEST-TestReqParamsAPI.test-seed#[C9C144B8420A7A25]) [    ] o.a.s.c.AbstractZkTestCase put /home/jenkins/workspace/Lucene-Solr-6.1-Linux/solr/core/src/test-files/solr/collection1/conf/open-exchange-rates.json to /configs/conf1/open-exchange-rates.json
   [junit4]   2> 964709 INFO  (TEST-TestReqParamsAPI.test-seed#[C9C144B8420A7A25]) [    ] o.a.s.c.c.SolrZkClient makePath: /configs/conf1/open-exchange-rates.json
   [junit4]   2> 964709 INFO  (TEST-TestReqParamsAPI.test-seed#[C9C144B8420A7A25]) [    ] o.a.s.c.AbstractZkTestCase put /home/jenkins/workspace/Lucene-Solr-6.1-Linux/solr/core/src/test-files/solr/collection1/conf/mapping-ISOLatin1Accent.txt to /configs/conf1/mapping-ISOLatin1Accent.txt
   [junit4]   2> 964709 INFO  (TEST-TestReqParamsAPI.test-seed#[C9C144B8420A7A25]) [    ] o.a.s.c.c.SolrZkClient makePath: /configs/conf1/mapping-ISOLatin1Accent.txt
   [junit4]   2> 964709 INFO  (TEST-TestReqParamsAPI.test-seed#[C9C144B8420A7A25]) [    ] o.a.s.c.AbstractZkTestCase put /home/jenkins/workspace/Lucene-Solr-6.1-Linux/solr/core/src/test-files/solr/collection1/conf/old_synonyms.txt to /configs/conf1/old_synonyms.txt
   [junit4]   2> 964710 INFO  (TEST-TestReqParamsAPI.test-seed#[C9C144B8420A7A25]) [    ] o.a.s.c.c.SolrZkClient makePath: /configs/conf1/old_synonyms.txt
   [junit4]   2> 964710 INFO  (TEST-TestReqParamsAPI.test-seed#[C9C144B8420A7A25]) [    ] o.a.s.c.AbstractZkTestCase put /home/jenkins/workspace/Lucene-Solr-6.1-Linux/solr/core/src/test-files/solr/collection1/conf/synonyms.txt to /configs/conf1/synonyms.txt
   [junit4]   2> 964710 INFO  (TEST-TestReqParamsAPI.test-seed#[C9C144B8420A7A25]) [    ] o.a.s.c.c.SolrZkClient makePath: /configs/conf1/synonyms.txt
   [junit4]   2> 964711 INFO  (TEST-TestReqParamsAPI.test-seed#[C9C144B8420A7A25]) [    ] o.a.s.c.c.SolrZkClient Using default ZkCredentialsProvider
   [junit4]   2> 964711 INFO  (TEST-TestReqParamsAPI.test-seed#[C9C144B8420A7A25]) [    ] o.a.s.c.c.ConnectionManager Waiting for client to connect to ZooKeeper
   [junit4]   2> 964711 INFO  (zkCallback-1033-thread-1) [    ] o.a.s.c.c.ConnectionManager Watcher org.apache.solr.common.cloud.ConnectionManager@5f2bb940 name:ZooKeeperConnection Watcher:127.0.0.1:42268/solr got event WatchedEvent state:SyncConnected type:None path:null path:null type:None
   [junit4]   2> 964711 INFO  (TEST-TestReqParamsAPI.test-seed#[C9C144B8420A7A25]) [    ] o.a.s.c.c.ConnectionManager Client is connected to ZooKeeper
   [junit4]   2> 964712 INFO  (TEST-TestReqParamsAPI.test-seed#[C9C144B8420A7A25]) [    ] o.a.s.c.c.SolrZkClient Using default ZkACLProvider
   [junit4]   2> 964763 INFO  (TEST-TestReqParamsAPI.test-seed#[C9C144B8420A7A25]) [    ] o.a.s.SolrTestCaseJ4 Writing core.properties file to /home/jenkins/workspace/Lucene-Solr-6.1-Linux/solr/build/solr-core/test/J1/temp/solr.handler.TestReqParamsAPI_C9C144B8420A7A25-001/control-001/cores/collection1
   [junit4]   2> 964765 INFO  (TEST-TestReqParamsAPI.test-seed#[C9C144B8420A7A25]) [    ] o.e.j.s.Server jetty-9.3.8.v20160314
   [junit4]   2> 964765 INFO  (TEST-TestReqParamsAPI.test-seed#[C9C144B8420A7A25]) [    ] o.e.j.s.h.ContextHandler Started o.e.j.s.ServletContextHandler@6c1d42dd{/,null,AVAILABLE}
   [junit4]   2> 964768 INFO  (TEST-TestReqParamsAPI.test-seed#[C9C144B8420A7A25]) [    ] o.e.j.s.ServerConnector Started ServerConnector@12522329{SSL,[ssl, http/1.1]}{127.0.0.1:33871}
   [junit4]   2> 964768 INFO  (TEST-TestReqParamsAPI.test-seed#[C9C144B8420A7A25]) [    ] o.e.j.s.Server Started @966479ms
   [junit4]   2> 964768 INFO  (TEST-TestReqParamsAPI.test-seed#[C9C144B8420A7A25]) [    ] o.a.s.c.s.e.JettySolrRunner Jetty properties: {solr.data.dir=/home/jenkins/workspace/Lucene-Solr-6.1-Linux/solr/build/solr-core/test/J1/temp/solr.handler.TestReqParamsAPI_C9C144B8420A7A25-001/tempDir-001/control/data, hostContext=/, hostPort=33871, coreRootDirectory=/home/jenkins/workspace/Lucene-Solr-6.1-Linux/solr/build/solr-core/test/J1/temp/solr.handler.TestReqParamsAPI_C9C144B8420A7A25-001/control-001/cores}
   [junit4]   2> 964768 INFO  (TEST-TestReqParamsAPI.test-seed#[C9C144B8420A7A25]) [    ] o.a.s.s.SolrDispatchFilter SolrDispatchFilter.init(): sun.misc.Launcher$AppClassLoader@73d16e93
   [junit4]   2> 964768 INFO  (TEST-TestReqParamsAPI.test-seed#[C9C144B8420A7A25]) [    ] o.a.s.c.SolrResourceLoader new SolrResourceLoader for directory: '/home/jenkins/workspace/Lucene-Solr-6.1-Linux/solr/build/solr-core/test/J1/temp/solr.handler.TestReqParamsAPI_C9C144B8420A7A25-001/control-001'
   [junit4]   2> 964768 INFO  (TEST-TestReqParamsAPI.test-seed#[C9C144B8420A7A25]) [    ] o.a.s.c.SolrResourceLoader JNDI not configured for solr (NoInitialContextEx)
   [junit4]   2> 964768 INFO  (TEST-TestReqParamsAPI.test-seed#[C9C144B8420A7A25]) [    ] o.a.s.c.SolrResourceLoader solr home defaulted to 'solr/' (could not find system property or JNDI)
   [junit4]   2> 964768 INFO  (TEST-TestReqParamsAPI.test-seed#[C9C144B8420A7A25]) [    ] o.a.s.c.c.SolrZkClient Using default ZkCredentialsProvider
   [junit4]   2> 964768 INFO  (TEST-TestReqParamsAPI.test-seed#[C9C144B8420A7A25]) [    ] o.a.s.c.c.ConnectionManager Waiting for client to connect to ZooKeeper
   [junit4]   2> 964769 INFO  (zkCallback-1034-thread-1) [    ] o.a.s.c.c.ConnectionManager Watcher org.apache.solr.common.cloud.ConnectionManager@5aeef514 name:ZooKeeperConnection Watcher:127.0.0.1:42268/solr got event WatchedEvent state:SyncConnected type:None path:null path:null type:None
   [junit4]   2> 964769 INFO  (TEST-TestReqParamsAPI.test-seed#[C9C144B8420A7A25]) [    ] o.a.s.c.c.ConnectionManager Client is connected to ZooKeeper
   [junit4]   2> 964769 INFO  (TEST-TestReqParamsAPI.test-seed#[C9C144B8420A7A25]) [    ] o.a.s.c.c.SolrZkClient Using default ZkACLProvider
   [junit4]   2> 964770 INFO  (TEST-TestReqParamsAPI.test-seed#[C9C144B8420A7A25]) [    ] o.a.s.s.SolrDispatchFilter Loading solr.xml from SolrHome (not found in ZooKeeper)
   [junit4]   2> 964770 INFO  (TEST-TestReqParamsAPI.test-seed#[C9C144B8420A7A25]) [    ] o.a.s.c.SolrXmlConfig Loading container configuration from /home/jenkins/workspace/Lucene-Solr-6.1-Linux/solr/build/solr-core/test/J1/temp/solr.handler.TestReqParamsAPI_C9C144B8420A7A25-001/control-001/solr.xml
   [junit4]   2> 964773 INFO  (TEST-TestReqParamsAPI.test-seed#[C9C144B8420A7A25]) [    ] o.a.s.c.CorePropertiesLocator Config-defined core root directory: /home/jenkins/workspace/Lucene-Solr-6.1-Linux/solr/build/solr-core/test/J1/temp/solr.handler.TestReqParamsAPI_C9C144B8420A7A25-001/control-001/cores
   [junit4]   2> 964773 INFO  (TEST-TestReqParamsAPI.test-seed#[C9C144B8420A7A25]) [    ] o.a.s.c.CoreContainer New CoreContainer 294939867
   [junit4]   2> 964773 INFO  (TEST-TestReqParamsAPI.test-seed#[C9C144B8420A7A25]) [    ] o.a.s.c.CoreContainer Loading cores into CoreContainer [instanceDir=/home/jenkins/workspace/Lucene-Solr-6.1-Linux/solr/build/solr-core/test/J1/temp/solr.handler.TestReqParamsAPI_C9C144B8420A7A25-001/control-001]
   [junit4]   2> 964773 WARN  (TEST-TestReqParamsAPI.test-seed#[C9C144B8420A7A25]) [    ] o.a.s.c.CoreContainer Couldn't add files from /home/jenkins/workspace/Lucene-Solr-6.1-Linux/solr/build/solr-core/test/J1/temp/solr.handler.TestReqParamsAPI_C9C144B8420A7A25-001/control-001/lib to classpath: /home/jenkins/workspace/Lucene-Solr-6.1-Linux/solr/build/solr-core/test/J1/temp/solr.handler.TestReqParamsAPI_C9C144B8420A7A25-001/control-001/lib
   [junit4]   2> 964773 INFO  (TEST-TestReqParamsAPI.test-seed#[C9C144B8420A7A25]) [    ] o.a.s.h.c.HttpShardHandlerFactory created with socketTimeout : 90000,urlScheme : ,connTimeout : 15000,maxConnectionsPerHost : 20,maxConnections : 10000,corePoolSize : 0,maximumPoolSize : 2147483647,maxThreadIdleTime : 5,sizeOfQueue : -1,fairnessPolicy : false,useRetries : false,
   [junit4]   2> 964774 INFO  (TEST-TestReqParamsAPI.test-seed#[C9C144B8420A7A25]) [    ] o.a.s.u.UpdateShardHandler Creating UpdateShardHandler HTTP client with params: socketTimeout=340000&connTimeout=45000&retry=true
   [junit4]   2> 964774 INFO  (TEST-TestReqParamsAPI.test-seed#[C9C144B8420A7A25]) [    ] o.a.s.l.LogWatcher SLF4J impl is org.slf4j.impl.Log4jLoggerFactory
   [junit4]   2> 964774 INFO  (TEST-TestReqParamsAPI.test-seed#[C9C144B8420A7A25]) [    ] o.a.s.l.LogWatcher Registering Log Listener [Log4j (org.slf4j.impl.Log4jLoggerFactory)]
   [junit4]   2> 964775 INFO  (TEST-TestReqParamsAPI.test-seed#[C9C144B8420A7A25]) [    ] o.a.s.c.ZkContainer Zookeeper client=127.0.0.1:42268/solr
   [junit4]   2> 964775 INFO  (TEST-TestReqParamsAPI.test-seed#[C9C144B8420A7A25]) [    ] o.a.s.c.ZkController zkHost includes chroot
   [junit4]   2> 964775 INFO  (TEST-TestReqParamsAPI.test-seed#[C9C144B8420A7A25]) [    ] o.a.s.c.c.SolrZkClient Using default ZkCredentialsProvider
   [junit4]   2> 964775 INFO  (TEST-TestReqParamsAPI.test-seed#[C9C144B8420A7A25]) [    ] o.a.s.c.c.ConnectionManager Waiting for client to connect to ZooKeeper
   [junit4]   2> 964775 INFO  (zkCallback-1037-thread-1) [    ] o.a.s.c.c.ConnectionManager Watcher org.apache.solr.common.cloud.ConnectionManager@70392bd0 name:ZooKeeperConnection Watcher:127.0.0.1:42268 got event WatchedEvent state:SyncConnected type:None path:null path:null type:None
   [junit4]   2> 964776 INFO  (TEST-TestReqParamsAPI.test-seed#[C9C144B8420A7A25]) [    ] o.a.s.c.c.ConnectionManager Client is connected to ZooKeeper
   [junit4]   2> 964776 INFO  (TEST-TestReqParamsAPI.test-seed#[C9C144B8420A7A25]) [    ] o.a.s.c.c.SolrZkClient Using default ZkACLProvider
   [junit4]   2> 964776 INFO  (TEST-TestReqParamsAPI.test-seed#[C9C144B8420A7A25]) [n:127.0.0.1:33871_    ] o.a.s.c.ZkController Added new OnReconnect listener org.apache.solr.cloud.ZkController$$Lambda$10/4722365@75e61cbb
   [junit4]   2> 964776 INFO  (TEST-TestReqParamsAPI.test-seed#[C9C144B8420A7A25]) [n:127.0.0.1:33871_    ] o.a.s.c.c.ConnectionManager Waiting for client to connect to ZooKeeper
   [junit4]   2> 964777 INFO  (zkCallback-1038-thread-1-processing-n:127.0.0.1:33871_) [n:127.0.0.1:33871_    ] o.a.s.c.c.ConnectionManager Watcher org.apache.solr.common.cloud.ConnectionManager@1f0da289 name:ZooKeeperConnection Watcher:127.0.0.1:42268/solr got event WatchedEvent state:SyncConnected type:None path:null path:null type:None
   [junit4]   2> 964777 INFO  (TEST-TestReqParamsAPI.test-seed#[C9C144B8420A7A25]) [n:127.0.0.1:33871_    ] o.a.s.c.c.ConnectionManager Client is connected to ZooKeeper
   [junit4]   2> 964777 INFO  (TEST-TestReqParamsAPI.test-seed#[C9C144B8420A7A25]) [n:127.0.0.1:33871_    ] o.a.s.c.c.SolrZkClient makePath: /overseer/queue
   [junit4]   2> 964778 INFO  (TEST-TestReqParamsAPI.test-seed#[C9C144B8420A7A25]) [n:127.0.0.1:33871_    ] o.a.s.c.c.SolrZkClient makePath: /overseer/collection-queue-work
   [junit4]   2> 964780 INFO  (TEST-TestReqParamsAPI.test-seed#[C9C144B8420A7A25]) [n:127.0.0.1:33871_    ] o.a.s.c.c.SolrZkClient makePath: /overseer/collection-map-running
   [junit4]   2> 964780 INFO  (TEST-TestReqParamsAPI.test-seed#[C9C144B8420A7A25]) [n:127.0.0.1:33871_    ] o.a.s.c.c.SolrZkClient makePath: /overseer/collection-map-completed
   [junit4]   2> 964781 INFO  (TEST-TestReqParamsAPI.test-seed#[C9C144B8420A7A25]) [n:127.0.0.1:33871_    ] o.a.s.c.c.SolrZkClient makePath: /overseer/collection-map-failure
   [junit4]   2> 964781 INFO  (TEST-TestReqParamsAPI.test-seed#[C9C144B8420A7A25]) [n:127.0.0.1:33871_    ] o.a.s.c.c.SolrZkClient makePath: /live_nodes
   [junit4]   2> 964782 INFO  (TEST-TestReqParamsAPI.test-seed#[C9C144B8420A7A25]) [n:127.0.0.1:33871_    ] o.a.s.c.c.SolrZkClient makePath: /aliases.json
   [junit4]   2> 964782 INFO  (TEST-TestReqParamsAPI.test-seed#[C9C144B8420A7A25]) [n:127.0.0.1:33871_    ] o.a.s.c.c.SolrZkClient makePath: /clusterstate.json
   [junit4]   2> 964782 INFO  (TEST-TestReqParamsAPI.test-seed#[C9C144B8420A7A25]) [n:127.0.0.1:33871_    ] o.a.s.c.c.SolrZkClient makePath: /security.json
   [junit4]   2> 964783 INFO  (TEST-TestReqParamsAPI.test-seed#[C9C144B8420A7A25]) [n:127.0.0.1:33871_    ] o.a.s.c.c.ZkStateReader Updating cluster state from ZooKeeper... 
   [junit4]   2> 964783 INFO  (TEST-TestReqParamsAPI.test-seed#[C9C144B8420A7A25]) [n:127.0.0.1:33871_    ] o.a.s.c.c.ZkStateReader Loaded cluster properties: {urlScheme=https}
   [junit4]   2> 964783 INFO  (TEST-TestReqParamsAPI.test-seed#[C9C144B8420A7A25]) [n:127.0.0.1:33871_    ] o.a.s.c.c.ZkStateReader Updated live nodes from ZooKeeper... (0) -> (0)
   [junit4]   2> 964784 INFO  (TEST-TestReqParamsAPI.test-seed#[C9C144B8420A7A25]) [n:127.0.0.1:33871_    ] o.a.s.c.c.SolrZkClient makePath: /overseer_elect
   [junit4]   2> 964784 INFO  (TEST-TestReqParamsAPI.test-seed#[C9C144B8420A7A25]) [n:127.0.0.1:33871_    ] o.a.s.c.c.SolrZkClient makePath: /overseer_elect/election
   [junit4]   2> 964784 INFO  (TEST-TestReqParamsAPI.test-seed#[C9C144B8420A7A25]) [n:127.0.0.1:33871_    ] o.a.s.c.Overseer Overseer (id=null) closing
   [junit4]   2> 964785 INFO  (TEST-TestReqParamsAPI.test-seed#[C9C144B8420A7A25]) [n:127.0.0.1:33871_    ] o.a.s.c.LeaderElector Joined leadership election with path: /overseer_elect/election/96043908244439045-127.0.0.1:33871_-n_0000000000
   [junit4]   2> 964785 INFO  (TEST-TestReqParamsAPI.test-seed#[C9C144B8420A7A25]) [n:127.0.0.1:33871_    ] o.a.s.c.OverseerElectionContext I am going to be the leader 127.0.0.1:33871_
   [junit4]   2> 964785 INFO  (TEST-TestReqParamsAPI.test-seed#[C9C144B8420A7A25]) [n:127.0.0.1:33871_    ] o.a.s.c.c.SolrZkClient makePath: /overseer_elect/leader
   [junit4]   2> 964785 INFO  (TEST-TestReqParamsAPI.test-seed#[C9C144B8420A7A25]) [n:127.0.0.1:33871_    ] o.a.s.c.Overseer Overseer (id=96043908244439045-127.0.0.1:33871_-n_0000000000) starting
   [junit4]   2> 964786 INFO  (TEST-TestReqParamsAPI.test-seed#[C9C144B8420A7A25]) [n:127.0.0.1:33871_    ] o.a.s.c.c.SolrZkClient makePath: /overseer/queue-work
   [junit4]   2> 964788 INFO  (TEST-TestReqParamsAPI.test-seed#[C9C144B8420A7A25]) [n:127.0.0.1:33871_    ] o.a.s.c.OverseerAutoReplicaFailoverThread Starting OverseerAutoReplicaFailoverThread autoReplicaFailoverWorkLoopDelay=10000 autoReplicaFailoverWaitAfterExpiration=30000 autoReplicaFailoverBadNodeExpiration=60000
   [junit4]   2> 964788 INFO  (OverseerCollectionConfigSetProcessor-96043908244439045-127.0.0.1:33871_-n_0000000000) [n:127.0.0.1:33871_    ] o.a.s.c.OverseerTaskProcessor Process current queue of overseer operations
   [junit4]   2> 964788 INFO  (TEST-TestReqParamsAPI.test-seed#[C9C144B8420A7A25]) [n:127.0.0.1:33871_    ] o.a.s.c.ZkController Register node as live in ZooKeeper:/live_nodes/127.0.0.1:33871_
   [junit4]   2> 964788 INFO  (OverseerStateUpdate-96043908244439045-127.0.0.1:33871_-n_0000000000) [n:127.0.0.1:33871_    ] o.a.s.c.Overseer Starting to work on the main queue
   [junit4]   2> 964788 INFO  (TEST-TestReqParamsAPI.test-seed#[C9C144B8420A7A25]) [n:127.0.0.1:33871_    ] o.a.s.c.c.SolrZkClient makePath: /live_nodes/127.0.0.1:33871_
   [junit4]   2> 964789 INFO  (zkCallback-1038-thread-1-processing-n:127.0.0.1:33871_) [n:127.0.0.1:33871_    ] o.a.s.c.c.ZkStateReader A live node change: [WatchedEvent state:SyncConnected type:NodeChildrenChanged path:/live_nodes], has occurred - updating... (live nodes size: [0])
   [junit4]   2> 964789 INFO  (OverseerStateUpdate-96043908244439045-127.0.0.1:33871_-n_0000000000) [n:127.0.0.1:33871_    ] o.a.s.c.c.ZkStateReader Updated live nodes from ZooKeeper... (0) -> (1)
   [junit4]   2> 964789 INFO  (zkCallback-1038-thread-1-processing-n:127.0.0.1:33871_) [n:127.0.0.1:33871_    ] o.a.s.c.c.ZkStateReader Updated live nodes from ZooKeeper... (1) -> (1)
   [junit4]   2> 964798 INFO  (TEST-TestReqParamsAPI.test-seed#[C9C144B8420A7A25]) [n:127.0.0.1:33871_    ] o.a.s.c.CoreContainer Security conf doesn't exist. Skipping setup for authorization module.
   [junit4]   2> 964799 INFO  (TEST-TestReqParamsAPI.test-seed#[C9C144B8420A7A25]) [n:127.0.0.1:33871_    ] o.a.s.c.CoreContainer No authentication plugin used.
   [junit4]   2> 964799 INFO  (TEST-TestReqParamsAPI.test-seed#[C9C144B8420A7A25]) [n:127.0.0.1:33871_    ] o.a.s.c.CorePropertiesLocator Looking for core definitions underneath /home/jenkins/workspace/Lucene-Solr-6.1-Linux/solr/build/solr-core/test/J1/temp/solr.handler.TestReqParamsAPI_C9C144B8420A7A25-001/control-001/cores
   [junit4]   2> 964800 INFO  (TEST-TestReqParamsAPI.test-seed#[C9C144B8420A7A25]) [n:127.0.0.1:33871_    ] o.a.s.c.CoreDescriptor Created CoreDescriptor: {name=collection1, config=solrconfig.xml, transient=false, schema=schema.xml, loadOnStartup=true, configSetProperties=configsetprops.json, collection=control_collection, coreNodeName=, dataDir=data/, shard=}
   [junit4]   2> 964800 INFO  (TEST-TestReqParamsAPI.test-seed#[C9C144B8420A7A25]) [n:127.0.0.1:33871_    ] o.a.s.c.CorePropertiesLocator Found core collection1 in /home/jenkins/workspace/Lucene-Solr-6.1-Linux/solr/build/solr-core/test/J1/temp/solr.handler.TestReqParamsAPI_C9C144B8420A7A25-001/control-001/cores/collection1
   [junit4]   2> 964800 INFO  (TEST-TestReqParamsAPI.test-seed#[C9C144B8420A7A25]) [n:127.0.0.1:33871_    ] o.a.s.c.CorePropertiesLocator Found 1 core definitions
   [junit4]   2> 964800 INFO  (coreLoadExecutor-2732-thread-1-processing-n:127.0.0.1:33871_) [n:127.0.0.1:33871_ c:control_collection   x:collection1] o.a.s.c.ZkController publishing state=down
   [junit4]   2> 964800 INFO  (TEST-TestReqParamsAPI.test-seed#[C9C144B8420A7A25]) [n:127.0.0.1:33871_    ] o.a.s.s.SolrDispatchFilter user.dir=/home/jenkins/workspace/Lucene-Solr-6.1-Linux/solr/build/solr-core/test/J1
   [junit4]   2> 964800 INFO  (TEST-TestReqParamsAPI.test-seed#[C9C144B8420A7A25]) [n:127.0.0.1:33871_    ] o.a.s.s.SolrDispatchFilter SolrDispatchFilter.init() done
   [junit4]   2> 964800 INFO  (coreLoadExecutor-2732-thread-1-processing-n:127.0.0.1:33871_) [n:127.0.0.1:33871_ c:control_collection   x:collection1] o.a.s.c.ZkController numShards not found on descriptor - reading it from system property
   [junit4]   2> 964801 INFO  (coreLoadExecutor-2732-thread-1-processing-n:127.0.0.1:33871_) [n:127.0.0.1:33871_ c:control_collection   x:collection1] o.a.s.c.ZkController Collection control_collection not visible yet, but flagging it so a watch is registered when it becomes visible
   [junit4]   2> 964801 INFO  (OverseerStateUpdate-96043908244439045-127.0.0.1:33871_-n_0000000000) [n:127.0.0.1:33871_    ] o.a.s.c.Overseer processMessage: queueSize: 1, message = {
   [junit4]   2>   "core":"collection1",
   [junit4]   2>   "roles":null,
   [junit4]   2>   "base_url":"https://127.0.0.1:33871",
   [junit4]   2>   "node_name":"127.0.0.1:33871_",
   [junit4]   2>   "numShards":"1",
   [junit4]   2>   "state":"down",
   [junit4]   2>   "shard":null,
   [junit4]   2>   "collection":"control_collection",
   [junit4]   2>   "operation":"state"} current state version: 0
   [junit4]   2> 964801 INFO  (OverseerStateUpdate-96043908244439045-127.0.0.1:33871_-n_0000000000) [n:127.0.0.1:33871_    ] o.a.s.c.o.ReplicaMutator Update state numShards=1 message={
   [junit4]   2>   "core":"collection1",
   [junit4]   2>   "roles":null,
   [junit4]   2>   "base_url":"https://127.0.0.1:33871",
   [junit4]   2>   "node_name":"127.0.0.1:33871_",
   [junit4]   2>   "numShards":"1",
   [junit4]   2>   "state":"down",
   [junit4]   2>   "shard":null,
   [junit4]   2>   "collection":"control_collection",
   [junit4]   2>   "operation":"state"}
   [junit4]   2> 964802 INFO  (OverseerStateUpdate-96043908244439045-127.0.0.1:33871_-n_0000000000) [n:127.0.0.1:33871_    ] o.a.s.c.o.ClusterStateMutator building a new cName: control_collection
   [junit4]   2> 964802 INFO  (coreLoadExecutor-2732-thread-1-processing-n:127.0.0.1:33871_) [n:127.0.0.1:33871_ c:control_collection   x:collection1] o.a.s.c.c.ZkStateReader Deleting data for [control_collection]
   [junit4]   2> 964803 INFO  (OverseerStateUpdate-96043908244439045-127.0.0.1:33871_-n_0000000000) [n:127.0.0.1:33871_    ] o.a.s.c.o.ReplicaMutator Assigning new node to shard shard=shard1
   [junit4]   2> 964803 INFO  (coreLoadExecutor-2732-thread-1-processing-n:127.0.0.1:33871_) [n:127.0.0.1:33871_ c:control_collection   x:collection1] o.a.s.c.ZkController look for our core node name
   [junit4]   2> 964803 INFO  (zkCallback-1038-thread-1-processing-n:127.0.0.1:33871_) [n:127.0.0.1:33871_    ] o.a.s.c.c.ZkStateReader A cluster state change: [WatchedEvent state:SyncConnected type:NodeDataChanged path:/clusterstate.json], has occurred - updating... (live nodes size: [1])
   [junit4]   2> 965803 INFO  (coreLoadExecutor-2732-thread-1-processing-n:127.0.0.1:33871_) [n:127.0.0.1:33871_ c:control_collection   x:collection1] o.a.s.c.ZkController waiting to find shard id in clusterstate for collection1
   [junit4]   2> 965803 INFO  (coreLoadExecutor-2732-thread-1-processing-n:127.0.0.1:33871_) [n:127.0.0.1:33871_ c:control_collection   x:collection1] o.a.s.c.ZkController Check for collection zkNode:control_collection
   [junit4]   2> 965803 INFO  (coreLoadExecutor-2732-thread-1-processing-n:127.0.0.1:33871_) [n:127.0.0.1:33871_ c:control_collection   x:collection1] o.a.s.c.ZkController Collection zkNode exists
   [junit4]   2> 965804 INFO  (coreLoadExecutor-2732-thread-1-processing-n:127.0.0.1:33871_) [n:127.0.0.1:33871_ c:control_collection   x:collection1] o.a.s.c.c.ZkStateReader Load collection config from: [/collections/control_collection]
   [junit4]   2> 965804 INFO  (coreLoadExecutor-2732-thread-1-processing-n:127.0.0.1:33871_) [n:127.0.0.1:33871_ c:control_collection   x:collection1] o.a.s.c.c.ZkStateReader path=[/collections/control_collection] [configName]=[conf1] specified config exists in ZooKeeper
   [junit4]   2> 965804 INFO  (coreLoadExecutor-2732-thread-1-processing-n:127.0.0.1:33871_) [n:127.0.0.1:33871_ c:control_collection   x:collection1] o.a.s.c.SolrResourceLoader new SolrResourceLoader for directory: '/home/jenkins/workspace/Lucene-Solr-6.1-Linux/solr/build/solr-core/test/J1/temp/solr.handler.TestReqParamsAPI_C9C144B8420A7A25-001/control-001/cores/collection1'
   [junit4]   2> 965804 INFO  (coreLoadExecutor-2732-thread-1-processing-n:127.0.0.1:33871_) [n:127.0.0.1:33871_ c:control_collection   x:collection1] o.a.s.c.SolrResourceLoader JNDI not configured for solr (NoInitialContextEx)
   [junit4]   2> 965804 INFO  (coreLoadExecutor-2732-thread-1-processing-n:127.0.0.1:33871_) [n:127.0.0.1:33871_ c:control_collection   x:collection1] o.a.s.c.SolrResourceLoader solr home defaulted to 'solr/' (could not find system property or JNDI)
   [junit4]   2> 965805 INFO  (coreLoadExecutor-2732-thread-1-processing-n:127.0.0.1:33871_) [n:127.0.0.1:33871_ c:control_collection   x:collection1] o.a.s.c.Config loaded config solrconfig.xml with version 0 
   [junit4]   2> 965808 INFO  (coreLoadExecutor-2732-thread-1-processing-n:127.0.0.1:33871_) [n:127.0.0.1:33871_ c:control_collection   x:collection1] o.a.s.c.SolrConfig current version of requestparams : -1
   [junit4]   2> 965810 WARN  (coreLoadExecutor-2732-thread-1-processing-n:127.0.0.1:33871_) [n:127.0.0.1:33871_ c:control_collection   x:collection1] o.a.s.c.Config Beginning with Solr 5.5, <mergePolicy> is deprecated, use <mergePolicyFactory> instead.
   [junit4]   2> 965810 INFO  (coreLoadExecutor-2732-thread-1-processing-n:127.0.0.1:33871_) [n:127.0.0.1:33871_ c:control_collection   x:collection1] o.a.s.c.SolrConfig Using Lucene MatchVersion: 6.1.0
   [junit4]   2> 965815 INFO  (coreLoadExecutor-2732-thread-1-processing-n:127.0.0.1:33871_) [n:127.0.0.1:33871_ c:control_collection   x:collection1] o.a.s.c.SolrConfig Loaded SolrConfig: solrconfig.xml
   [junit4]   2> 965819 INFO  (coreLoadExecutor-2732-thread-1-processing-n:127.0.0.1:33871_) [n:127.0.0.1:33871_ c:control_collection   x:collection1] o.a.s.s.IndexSchema [collection1] Schema name=test
   [junit4]   2> 965874 INFO  (coreLoadExecutor-2732-thread-1-processing-n:127.0.0.1:33871_) [n:127.0.0.1:33871_ c:control_collection   x:collection1] o.a.s.s.OpenExchangeRatesOrgProvider Initialized with rates=open-exchange-rates.json, refreshInterval=1440.
   [junit4]   2> 965877 INFO  (coreLoadExecutor-2732-thread-1-processing-n:127.0.0.1:33871_) [n:127.0.0.1:33871_ c:control_collection   x:collection1] o.a.s.s.IndexSchema default search field in schema is text
   [junit4]   2> 965878 INFO  (coreLoadExecutor-2732-thread-1-processing-n:127.0.0.1:33871_) [n:127.0.0.1:33871_ c:control_collection   x:collection1] o.a.s.s.IndexSchema unique key field: id
   [junit4]   2> 965881 INFO  (coreLoadExecutor-2732-thread-1-processing-n:127.0.0.1:33871_) [n:127.0.0.1:33871_ c:control_collection   x:collection1] o.a.s.s.FileExchangeRateProvider Reloading exchange rates from file currency.xml
   [junit4]   2> 965883 INFO  (coreLoadExecutor-2732-thread-1-processing-n:127.0.0.1:33871_) [n:127.0.0.1:33871_ c:control_collection   x:collection1] o.a.s.s.FileExchangeRateProvider Reloading exchange rates from file currency.xml
   [junit4]   2> 965884 INFO  (coreLoadExecutor-2732-thread-1-processing-n:127.0.0.1:33871_) [n:127.0.0.1:33871_ c:control_collection   x:collection1] o.a.s.s.OpenExchangeRatesOrgProvider Reloading exchange rates from open-exchange-rates.json
   [junit4]   2> 965885 INFO  (coreLoadExecutor-2732-thread-1-processing-n:127.0.0.1:33871_) [n:127.0.0.1:33871_ c:control_collection   x:collection1] o.a.s.s.OpenExchangeRatesOrgProvider Reloading exchange rates from open-exchange-rates.json
   [junit4]   2> 965885 INFO  (coreLoadExecutor-2732-thread-1-processing-n:127.0.0.1:33871_) [n:127.0.0.1:33871_ c:control_collection   x:collection1] o.a.s.c.ConfigSetProperties Did not find ConfigSet properties, assuming default properties: Can't find resource 'configsetprops.json' in classpath or '/configs/conf1', cwd=/home/jenkins/workspace/Lucene-Solr-6.1-Linux/solr/build/solr-core/test/J1
   [junit4]   2> 965885 INFO  (coreLoadExecutor-2732-thread-1-processing-n:127.0.0.1:33871_) [n:127.0.0.1:33871_ c:control_collection   x:collection1] o.a.s.c.CoreContainer Creating SolrCore 'collection1' using configuration from collection control_collection
   [junit4]   2> 965885 INFO  (coreLoadExecutor-2732-thread-1-processing-n:127.0.0.1:33871_) [n:127.0.0.1:33871_ c:control_collection s:shard1 r:core_node1 x:collection1] o.a.s.c.SolrCore org.apache.solr.core.MockDirectoryFactory
   [junit4]   2> 965885 INFO  (coreLoadExecutor-2732-thread-1-processing-n:127.0.0.1:33871_) [n:127.0.0.1:33871_ c:control_collection s:shard1 r:core_node1 x:collection1] o.a.s.c.SolrCore [[collection1] ] Opening new SolrCore at [/home/jenkins/workspace/Lucene-Solr-6.1-Linux/solr/build/solr-core/test/J1/temp/solr.handler.TestReqParamsAPI_C9C144B8420A7A25-001/control-001/cores/collection1], dataDir=[/home/jenkins/workspace/Lucene-Solr-6.1-Linux/solr/build/solr-core/test/J1/temp/solr.handler.TestReqParamsAPI_C9C144B8420A7A25-001/control-001/cores/collection1/data/]
   [junit4]   2> 965886 INFO  (coreLoadExecutor-2732-thread-1-processing-n:127.0.0.1:33871_) [n:127.0.0.1:33871_ c:control_collection s:shard1 r:core_node1 x:collection1] o.a.s.c.JmxMonitoredMap JMX monitoring is enabled. Adding Solr mbeans to JMX Server: com.sun.jmx.mbeanserver.JmxMBeanServer@1ca4fca4
   [junit4]   2> 965886 INFO  (coreLoadExecutor-2732-thread-1-processing-n:127.0.0.1:33871_) [n:127.0.0.1:33871_ c:control_collection s:shard1 r:core_node1 x:collection1] o.a.s.c.CachingDirectoryFactory return new directory for /home/jenkins/workspace/Lucene-Solr-6.1-Linux/solr/build/solr-core/test/J1/temp/solr.handler.TestReqParamsAPI_C9C144B8420A7A25-001/control-001/cores/collection1/data
   [junit4]   2> 965886 INFO  (coreLoadExecutor-2732-thread-1-processing-n:127.0.0.1:33871_) [n:127.0.0.1:33871_ c:control_collection s:shard1 r:core_node1 x:collection1] o.a.s.c.SolrCore New index directory detected: old=null new=/home/jenkins/workspace/Lucene-Solr-6.1-Linux/solr/build/solr-core/test/J1/temp/solr.handler.TestReqParamsAPI_C9C144B8420A7A25-001/control-001/cores/collection1/data/index/
   [junit4]   2> 965886 WARN  (coreLoadExecutor-2732-thread-1-processing-n:127.0.0.1:33871_) [n:127.0.0.1:33871_ c:control_collection s:shard1 r:core_node1 x:collection1] o.a.s.c.SolrCore [collection1] Solr index directory '/home/jenkins/workspace/Lucene-Solr-6.1-Linux/solr/build/solr-core/test/J1/temp/solr.handler.TestReqParamsAPI_C9C144B8420A7A25-001/control-001/cores/collection1/data/index' doesn't exist. Creating new index...
   [junit4]   2> 965886 INFO  (coreLoadExecutor-2732-thread-1-processing-n:127.0.0.1:33871_) [n:127.0.0.1:33871_ c:control_collection s:shard1 r:core_node1 x:collection1] o.a.s.c.CachingDirectoryFactory return new directory for /home/jenkins/workspace/Lucene-Solr-6.1-Linux/solr/build/solr-core/test/J1/temp/solr.handler.TestReqParamsAPI_C9C144B8420A7A25-001/control-001/cores/collection1/data/index
   [junit4]   2> 965886 INFO  (coreLoadExecutor-2732-thread-1-processing-n:127.0.0.1:33871_) [n:127.0.0.1:33871_ c:control_collection s:shard1 r:core_node1 x:collection1] o.a.s.u.RandomMergePolicy RandomMergePolicy wrapping class org.apache.lucene.index.LogByteSizeMergePolicy: [LogByteSizeMergePolicy: minMergeSize=1677721, mergeFactor=36, maxMergeSize=2147483648, maxMergeSizeForForcedMerge=9223372036854775807, calibrateSizeByDeletes=false, maxMergeDocs=2147483647, maxCFSSegmentSizeMB=8.796093022207999E12, noCFSRatio=1.0]
   [junit4]   2> 965886 INFO  (coreLoadExecutor-2732-thread-1-processing-n:127.0.0.1:33871_) [n:127.0.0.1:33871_ c:control_collection s:shard1 r:core_node1 x:collection1] o.a.s.c.SolrDeletionPolicy SolrDeletionPolicy.onCommit: commits: num=1
   [junit4]   2> 	commit{dir=MockDirectoryWrapper(RAMDirectory@190ee702 lockFactory=org.apache.lucene.store.SingleInstanceLockFactory@51a9624d),segFN=segments_1,generation=1}
   [junit4]   2> 965886 INFO  (coreLoadExecutor-2732-thread-1-processing-n:127.0.0.1:33871_) [n:127.0.0.1:33871_ c:control_collection s:shard1 r:core_node1 x:collection1] o.a.s.c.SolrDeletionPolicy newest commit generation = 1
   [junit4]   2> 965887 INFO  (OldIndexDirectoryCleanupThreadForCore-collection1) [n:127.0.0.1:33871_ c:control_collection s:shard1 r:core_node1 x:collection1] o.a.s.c.SolrCore Looking for old index directories to cleanup for core collection1 in /home/jenkins/workspace/Lucene-Solr-6.1-Linux/solr/build/solr-core/test/J1/temp/solr.handler.TestReqParamsAPI_C9C144B8420A7A25-001/control-001/cores/collection1/data/
   [junit4]   2> 965887 WARN  (OldIndexDirectoryCleanupThreadForCore-collection1) [n:127.0.0.1:33871_ c:control_collection s:shard1 r:core_node1 x:collection1] o.a.s.c.DirectoryFactory /home/jenkins/workspace/Lucene-Solr-6.1-Linux/solr/build/solr-core/test/J1/temp/solr.handler.TestReqParamsAPI_C9C144B8420A7A25-001/control-001/cores/collection1/data/ does not point to a valid data directory; skipping clean-up of old index directories.
   [junit4]   2> 965889 INFO  (coreLoadExecutor-2732-thread-1-processing-n:127.0.0.1:33871_) [n:127.0.0.1:33871_ c:control_collection s:shard1 r:core_node1 x:collection1] o.a.s.u.p.UpdateRequestProcessorChain creating updateRequestProcessorChain "nodistrib"
   [junit4]   2> 965889 INFO  (coreLoadExecutor-2732-thread-1-processing-n:127.0.0.1:33871_) [n:127.0.0.1:33871_ c:control_collection s:shard1 r:core_node1 x:collection1] o.a.s.u.p.UpdateRequestProcessorChain creating updateRequestProcessorChain "dedupe"
   [junit4]   2> 965889 INFO  (coreLoadExecutor-2732-thread-1-processing-n:127.0.0.1:33871_) [n:127.0.0.1:33871_ c:control_collection s:shard1 r:core_node1 x:collection1] o.a.s.u.p.UpdateRequestProcessorChain inserting DistributedUpdateProcessorFactory into updateRequestProcessorChain "dedupe"
   [junit4]   2> 965889 INFO  (coreLoadExecutor-2732-thread-1-processing-n:127.0.0.1:33871_) [n:127.0.0.1:33871_ c:control_collection s:shard1 r:core_node1 x:collection1] o.a.s.u.p.UpdateRequestProcessorChain creating updateRequestProcessorChain "stored_sig"
   [junit4]   2> 965889 INFO  (coreLoadExecutor-2732-thread-1-processing-n:127.0.0.1:33871_) [n:127.0.0.1:33871_ c:control_collection s:shard1 r:core_node1 x:collection1] o.a.s.u.p.UpdateRequestProcessorChain inserting DistributedUpdateProcessorFactory into updateRequestProcessorChain "stored_sig"
   [junit4]   2> 965889 INFO  (coreLoadExecutor-2732-thread-1-processing-n:127.0.0.1:33871_) [n:127.0.0.1:33871_ c:control_collection s:shard1 r:core_node1 x:collection1] o.a.s.u.p.UpdateRequestProcessorChain creating updateRequestProcessorChain "distrib-dup-test-chain-explicit"
   [junit4]   2> 965889 INFO  (coreLoadExecutor-2732-thread-1-processing-n:127.0.0.1:33871_) [n:127.0.0.1:33871_ c:control_collection s:shard1 r:core_node1 x:collection1] o.a.s.u.p.UpdateRequestProcessorChain creating updateRequestProcessorChain "distrib-dup-test-chain-implicit"
   [junit4]   2> 965889 INFO  (coreLoadExecutor-2732-thread-1-processing-n:127.0.0.1:33871_) [n:127.0.0.1:33871_ c:control_collection s:shard1 r:core_node1 x:collection1] o.a.s.u.p.UpdateRequestProcessorChain inserting DistributedUpdateProcessorFactory into updateRequestProcessorChain "distrib-dup-test-chain-implicit"
   [junit4]   2> 965889 INFO  (coreLoadExecutor-2732-thread-1-processing-n:127.0.0.1:33871_) [n:127.0.0.1:33871_ c:control_collection s:shard1 r:core_node1 x:collection1] o.a.s.c.SolrCore no updateRequestProcessorChain defined as default, creating implicit default
   [junit4]   2> 965889 WARN  (coreLoadExecutor-2732-thread-1-processing-n:127.0.0.1:33871_) [n:127.0.0.1:33871_ c:control_collection s:shard1 r:core_node1 x:collection1] o.a.s.c.RequestHandlers INVALID paramSet a in requestHandler {type = requestHandler,name = /dump,class = DumpRequestHandler,args = {defaults={a=A,b=B}}}
   [junit4]   2> 965891 INFO  (coreLoadExecutor-2732-thread-1-processing-n:127.0.0.1:33871_) [n:127.0.0.1:33871_ c:control_collection s:shard1 r:core_node1 x:collection1] o.a.s.h.l.XMLLoader xsltCacheLifetimeSeconds=60
   [junit4]   2> 965892 INFO  (coreLoadExecutor-2732-thread-1-processing-n:127.0.0.1:33871_) [n:127.0.0.1:33871_ c:control_collection s:shard1 r:core_node1 x:collection1] o.a.s.h.l.XMLLoader xsltCacheLifetimeSeconds=60
   [junit4]   2> 965892 INFO  (coreLoadExecutor-2732-thread-1-processing-n:127.0.0.1:33871_) [n:127.0.0.1:33871_ c:control_collection s:shard1 r:core_node1 x:collection1] o.a.s.h.l.XMLLoader xsltCacheLifetimeSeconds=60
   [junit4]   2> 965893 INFO  (coreLoadExecutor-2732-thread-1-processing-n:127.0.0.1:33871_) [n:127.0.0.1:33871_ c:control_collection s:shard1 r:core_node1 x:collection1] o.a.s.h.l.XMLLoader xsltCacheLifetimeSeconds=60
   [junit4]   2> 965894 INFO  (coreLoadExecutor-2732-thread-1-processing-n:127.0.0.1:33871_) [n:127.0.0.1:33871_ c:control_collection s:shard1 r:core_node1 x:collection1] o.a.s.c.RequestHandlers Registered paths: /admin/mbeans,standard,/update/json/docs,/admin/luke,/export,/get,/admin/properties,/update/json,/admin/threads,/dump,/update/csv,/sql,/graph,/admin/segments,/admin/system,/replication,/config,/stream,/schema,/admin/plugins,/admin/logging,/admin/ping,/update,/admin/file
   [junit4]   2> 965894 INFO  (coreLoadExecutor-2732-thread-1-processing-n:127.0.0.1:33871_) [n:127.0.0.1:33871_ c:control_collection s:shard1 r:core_node1 x:collection1] o.a.s.c.SolrCore Using default statsCache cache: org.apache.solr.search.stats.LocalStatsCache
   [junit4]   2> 965894 INFO  (coreLoadExecutor-2732-thread-1-processing-n:127.0.0.1:33871_) [n:127.0.0.1:33871_ c:control_collection s:shard1 r:core_node1 x:collection1] o.a.s.u.UpdateHandler Using UpdateLog implementation: org.apache.solr.update.UpdateLog
   [junit4]   2> 965894 INFO  (coreLoadExecutor-2732-thread-1-processing-n:127.0.0.1:33871_) [n:127.0.0.1:33871_ c:control_collection s:shard1 r:core_node1 x:collection1] o.a.s.u.UpdateLog Initializing UpdateLog: dataDir= defaultSyncLevel=FLUSH numRecordsToKeep=100 maxNumLogsToKeep=10 numVersionBuckets=65536
   [junit4]   2> 965895 INFO  (coreLoadExecutor-2732-thread-1-processing-n:127.0.0.1:33871_) [n:127.0.0.1:33871_ c:control_collection s:shard1 r:core_node1 x:collection1] o.a.s.u.CommitTracker Hard AutoCommit: disabled
   [junit4]   2> 965895 INFO  (coreLoadExecutor-2732-thread-1-processing-n:127.0.0.1:33871_) [n:127.0.0.1:33871_ c:control_collection s:shard1 r:core_node1 x:collection1] o.a.s.u.CommitTracker Soft AutoCommit: disabled
   [junit4]   2> 965895 INFO  (coreLoadExecutor-2732-thread-1-processing-n:127.0.0.1:33871_) [n:127.0.0.1:33871_ c:control_collection s:shard1 r:core_node1 x:collection1] o.a.s.u.RandomMergePolicy RandomMergePolicy wrapping class org.apache.lucene.index.TieredMergePolicy: [TieredMergePolicy: maxMergeAtOnce=28, maxMergeAtOnceExplicit=46, maxMergedSegmentMB=16.7666015625, floorSegmentMB=1.3173828125, forceMergeDeletesPctAllowed=22.66745987538869, segmentsPerTier=23.0, maxCFSSegmentSizeMB=8.796093022207999E12, noCFSRatio=1.0
   [junit4]   2> 965895 INFO  (coreLoadExecutor-2732-thread-1-processing-n:127.0.0.1:33871_) [n:127.0.0.1:33871_ c:control_collection s:shard1 r:core_node1 x:collection1] o.a.s.c.SolrDeletionPolicy SolrDeletionPolicy.onInit: commits: num=1
   [junit4]   2> 	commit{dir=MockDirectoryWrapper(RAMDirectory@190ee702 lockFactory=org.apache.lucene.store.SingleInstanceLockFactory@51a9624d),segFN=segments_1,generation=1}
   [junit4]   2> 965895 INFO  (coreLoadExecutor-2732-thread-1-processing-n:127.0.0.1:33871_) [n:127.0.0.1:33871_ c:control_collection s:shard1 r:core_node1 x:collection1] o.a.s.c.SolrDeletionPolicy newest commit generation = 1
   [junit4]   2> 965895 INFO  (coreLoadExecutor-2732-thread-1-processing-n:127.0.0.1:33871_) [n:127.0.0.1:33871_ c:control_collection s:shard1 r:core_node1 x:collection1] o.a.s.s.SolrIndexSearcher Opening [Searcher@3af307aa[collection1] main]
   [junit4]   2> 965896 INFO  (coreLoadExecutor-2732-thread-1-processing-n:127.0.0.1:33871_) [n:127.0.0.1:33871_ c:control_collection s:shard1 r:core_node1 x:collection1] o.a.s.c.c.ZkStateReader Load collection config from: [/collections/control_collection]
   [junit4]   2> 965896 INFO  (coreLoadExecutor-2732-thread-1-processing-n:127.0.0.1:33871_) [n:127.0.0.1:33871_ c:control_collection s:shard1 r:core_node1 x:collection1] o.a.s.c.c.ZkStateReader path=[/collections/control_collection] [configName]=[conf1] specified config exists in ZooKeeper
   [junit4]   2> 965896 INFO  (coreLoadExecutor-2732-thread-1-processing-n:127.0.0.1:33871_) [n:127.0.0.1:33871_ c:control_collection s:shard1 r:core_node1 x:collection1] o.a.s.r.ManagedResourceStorage Setting up ZooKeeper-based storage for the RestManager with znodeBase: /configs/conf1
   [junit4]   2> 965896 INFO  (coreLoadExecutor-2732-thread-1-processing-n:127.0.0.1:33871_) [n:127.0.0.1:33871_ c:control_collection s:shard1 r:core_node1 x:collection1] o.a.s.r.ManagedResourceStorage Configured ZooKeeperStorageIO with znodeBase: /configs/conf1
   [junit4]   2> 965896 INFO  (coreLoadExecutor-2732-thread-1-processing-n:127.0.0.1:33871_) [n:127.0.0.1:33871_ c:control_collection s:shard1 r:core_node1 x:collection1] o.a.s.r.RestManager Initializing RestManager with initArgs: {}
   [junit4]   2> 965896 INFO  (coreLoadExecutor-2732-thread-1-processing-n:127.0.0.1:33871_) [n:127.0.0.1:33871_ c:control_collection s:shard1 r:core_node1 x:collection1] o.a.s.r.ManagedResourceStorage Reading _rest_managed.json using ZooKeeperStorageIO:path=/configs/conf1
   [junit4]   2> 965896 INFO  (coreLoadExecutor-2732-thread-1-processing-n:127.0.0.1:33871_) [n:127.0.0.1:33871_ c:control_collection s:shard1 r:core_node1 x:collection1] o.a.s.r.ManagedResourceStorage No data found for znode /configs/conf1/_rest_managed.json
   [junit4]   2> 965896 INFO  (coreLoadExecutor-2732-thread-1-processing-n:127.0.0.1:33871_) [n:127.0.0.1:33871_ c:control_collection s:shard1 r:core_node1 x:collection1] o.a.s.r.ManagedResourceStorage Loaded null at path _rest_managed.json using ZooKeeperStorageIO:path=/configs/conf1
   [junit4]   2> 965896 INFO  (coreLoadExecutor-2732-thread-1-processing-n:127.0.0.1:33871_) [n:127.0.0.1:33871_ c:control_collection s:shard1 r:core_node1 x:collection1] o.a.s.r.RestManager Initializing 0 registered ManagedResources
   [junit4]   2> 965896 INFO  (coreLoadExecutor-2732-thread-1-processing-n:127.0.0.1:33871_) [n:127.0.0.1:33871_ c:control_collection s:shard1 r:core_node1 x:collection1] o.a.s.h.ReplicationHandler Commits will be reserved for  10000
   [junit4]   2> 965897 INFO  (searcherExecutor-2733-thread-1-processing-n:127.0.0.1:33871_ x:collection1 s:shard1 c:control_collection r:core_node1) [n:127.0.0.1:33871_ c:control_collection s:shard1 r:core_node1 x:collection1] o.a.s.c.SolrCore [collection1] Registered new searcher Searcher@3af307aa[collection1] main{ExitableDirectoryReader(UninvertingDirectoryReader())}
   [junit4]   2> 965897 INFO  (coreLoadExecutor-2732-thread-1-processing-n:127.0.0.1:33871_) [n:127.0.0.1:33871_ c:control_collection s:shard1 r:core_node1 x:collection1] o.a.s.u.UpdateLog Looking up max value of version field to seed version buckets
   [junit4]   2> 965897 INFO  (coreLoadExecutor-2732-thread-1-processing-n:127.0.0.1:33871_) [n:127.0.0.1:33871_ c:control_collection s:shard1 r:core_node1 x:collection1] o.a.s.u.VersionInfo Refreshing highest value of _version_ for 65536 version buckets from index
   [junit4]   2> 965897 INFO  (coreLoadExecutor-2732-thread-1-processing-n:127.0.0.1:33871_) [n:127.0.0.1:33871_ c:control_collection s:shard1 r:core_node1 x:collection1] o.a.s.u.VersionInfo No terms found for _version_, cannot seed version bucket highest value from index
   [junit4]   2> 965897 INFO  (coreLoadExecutor-2732-thread-1-processing-n:127.0.0.1:33871_) [n:127.0.0.1:33871_ c:control_collection s:shard1 r:core_node1 x:collection1] o.a.s.u.UpdateLog Could not find max version in index or recent updates, using new clock 1536702533272076288
   [junit4]   2> 965899 INFO  (coreLoadExecutor-2732-thread-1-processing-n:127.0.0.1:33871_) [n:127.0.0.1:33871_ c:control_collection s:shard1 r:core_node1 x:collection1] o.a.s.u.UpdateLog Took 1.0ms to seed version buckets with highest version 1536702533272076288
   [junit4]   2> 965899 INFO  (coreLoadExecutor-2732-thread-1-processing-n:127.0.0.1:33871_) [n:127.0.0.1:33871_ c:control_collection s:shard1 r:core_node1 x:collection1] o.a.s.c.ZkController watch zkdir /configs/conf1
   [junit4]   2> 965899 INFO  (coreLoadExecutor-2732-thread-1-processing-n:127.0.0.1:33871_) [n:127.0.0.1:33871_ c:control_collection s:shard1 r:core_node1 x:collection1] o.a.s.c.CoreContainer registering core: collection1
   [junit4]   2> 965899 INFO  (coreZkRegister-2726-thread-1-processing-n:127.0.0.1:33871_ x:collection1 s:shard1 c:control_collection r:core_node1) [n:127.0.0.1:33871_ c:control_collection s:shard1 r:core_node1 x:collection1] o.a.s.c.ZkController Register replica - core:collection1 address:https://127.0.0.1:33871 collection:control_collection shard:shard1
   [junit4]   2> 965900 INFO  (coreZkRegister-2726-thread-1-processing-n:127.0.0.1:33871_ x:collection1 s:shard1 c:control_collection r:core_node1) [n:127.0.0.1:33871_ c:control_collection s:shard1 r:core_node1 x:collection1] o.a.s.c.c.SolrZkClient makePath: /collections/control_collection/leader_elect/shard1/election
   [junit4]   2> 965900 INFO  (coreZkRegister-2726-thread-1-processing-n:127.0.0.1:33871_ x:collection1 s:shard1 c:control_collection r:core_node1) [n:127.0.0.1:33871_ c:control_collection s:shard1 r:core_node1 x:collection1] o.a.s.c.LeaderElector Joined leadership election with path: /collections/control_collection/leader_elect/shard1/election/96043908244439045-core_node1-n_0000000000
   [junit4]   2> 965901 INFO  (coreZkRegister-2726-thread-1-processing-n:127.0.0.1:33871_ x:collection1 s:shard1 c:control_collection r:core_node1) [n:127.0.0.1:33871_ c:control_collection s:shard1 r:core_node1 x:collection1] o.a.s.c.ShardLeaderElectionContext Running the leader process for shard=shard1 and weAreReplacement=false and leaderVoteWait=10000
   [junit4]   2> 965901 INFO  (coreZkRegister-2726-thread-1-processing-n:127.0.0.1:33871_ x:collection1 s:shard1 c:control_collection r:core_node1) [n:127.0.0.1:33871_ c:control_collection s:shard1 r:core_node1 x:collection1] o.a.s.c.ShardLeaderElectionContext Enough replicas found to continue.
   [junit4]   2> 965901 INFO  (coreZkRegister-2726-thread-1-processing-n:127.0.0.1:33871_ x:collection1 s:shard1 c:control_collection r:core_node1) [n:127.0.0.1:33871_ c:control_collection s:shard1 r:core_node1 x:collection1] o.a.s.c.ShardLeaderElectionContext I may be the new leader - try and sync
   [junit4]   2> 965901 INFO  (coreZkRegister-2726-thread-1-processing-n:127.0.0.1:33871_ x:collection1 s:shard1 c:control_collection r:core_node1) [n:127.0.0.1:33871_ c:control_collection s:shard1 r:core_node1 x:collection1] o.a.s.c.SyncStrategy Sync replicas to https://127.0.0.1:33871/collection1/
   [junit4]   2> 965901 INFO  (coreZkRegister-2726-thread-1-processing-n:127.0.0.1:33871_ x:collection1 s:shard1 c:control_collection r:core_node1) [n:127.0.0.1:33871_ c:control_collection s:shard1 r:core_node1 x:collection1] o.a.s.c.SyncStrategy Sync Success - now sync replicas to me
   [junit4]   2> 965901 INFO  (coreZkRegister-2726-thread-1-processing-n:127.0.0.1:33871_ x:collection1 s:shard1 c:control_collection r:core_node1) [n:127.0.0.1:33871_ c:control_collection s:shard1 r:core_node1 x:collection1] o.a.s.c.SyncStrategy https://127.0.0.1:33871/collection1/ has no replicas
   [junit4]   2> 965901 INFO  (OverseerStateUpdate-96043908244439045-127.0.0.1:33871_-n_0000000000) [n:127.0.0.1:33871_    ] o.a.s.c.Overseer processMessage: queueSize: 1, message = {
   [junit4]   2>   "operation":"leader",
   [junit4]   2>   "shard":"shard1",
   [junit4]   2>   "collection":"control_collection"} current state version: 1
   [junit4]   2> 965902 INFO  (coreZkRegister-2726-thread-1-processing-n:127.0.0.1:33871_ x:collection1 s:shard1 c:control_collection r:core_node1) [n:127.0.0.1:33871_ c:control_collection s:shard1 r:core_node1 x:collection1] o.a.s.c.c.SolrZkClient makePath: /collections/control_collection/leaders/shard1
   [junit4]   2> 965903 INFO  (coreZkRegister-2726-thread-1-processing-n:127.0.0.1:33871_ x:collection1 s:shard1 c:control_collection r:core_node1) [n:127.0.0.1:33871_ c:control_collection s:shard1 r:core_node1 x:collection1] o.a.s.c.ShardLeaderElectionContextBase Creating leader registration node /collections/control_collection/leaders/shard1/leader after winning as /collections/control_collection/leader_elect/shard1/election/96043908244439045-core_node1-n_0000000000
   [junit4]   2> 965904 INFO  (coreZkRegister-2726-thread-1-processing-n:127.0.0.1:33871_ x:collection1 s:shard1 c:control_collection r:core_node1) [n:127.0.0.1:33871_ c:control_collection s:shard1 r:core_node1 x:collection1] o.a.s.c.ShardLeaderElectionContext I am the new leader: https://127.0.0.1:33871/collection1/ shard1
   [junit4]   2> 965904 INFO  (OverseerStateUpdate-96043908244439045-127.0.0.1:33871_-n_0000000000) [n:127.0.0.1:33871_    ] o.a.s.c.Overseer processMessage: queueSize: 1, message = {
   [junit4]   2>   "operation":"leader",
   [junit4]   2>   "shard":"shard1",
   [junit4]   2>   "collection":"control_collection",
   [junit4]   2>   "base_url":"https://127.0.0.1:33871",
   [junit4]   2>   "core":"collection1",
   [junit4]   2>   "state":"active"} current state version: 1
   [junit4]   2> 966005 INFO  (zkCallback-1038-thread-1-processing-n:127.0.0.1:33871_) [n:127.0.0.1:33871_    ] o.a.s.c.c.ZkStateReader A cluster state change: [WatchedEvent state:SyncConnected type:NodeDataChanged path:/clusterstate.json], has occurred - updating... (live nodes size: [1])
   [junit4]   2> 966054 INFO  (coreZkRegister-2726-thread-1-processing-n:127.0.0.1:33871_ x:collection1 s:shard1 c:control_collection r:core_node1) [n:127.0.0.1:33871_ c:control_collection s:shard1 r:core_node1 x:collection1] o.a.s.c.ZkController We are https://127.0.0.1:33871/collection1/ and leader is https://127.0.0.1:33871/collection1/
   [junit4]   2> 966055 INFO  (coreZkRegister-2726-thread-1-processing-n:127.0.0.1:33871_ x:collection1 s:shard1 c:control_collection r:core_node1) [n:127.0.0.1:33871_ c:control_collection s:shard1 r:core_node1 x:collection1] o.a.s.c.ZkController No LogReplay needed for core=collection1 baseURL=https://127.0.0.1:33871
   [junit4]   2> 966055 INFO  (coreZkRegister-2726-thread-1-processing-n:127.0.0.1:33871_ x:collection1 s:shard1 c:control_collection r:core_node1) [n:127.0.0.1:33871_ c:control_collection s:shard1 r:core_node1 x:collection1] o.a.s.c.ZkController I am the leader, no recovery necessary
   [junit4]   2> 966055 INFO  (coreZkRegister-2726-thread-1-processing-n:127.0.0.1:33871_ x:collection1 s:shard1 c:control_collection r:core_node1) [n:127.0.0.1:33871_ c:control_collection s:shard1 r:core_node1 x:collection1] o.a.s.c.ZkController publishing state=active
   [junit4]   2> 966055 INFO  (coreZkRegister-2726-thread-1-processing-n:127.0.0.1:33871_ x:collection1 s:shard1 c:control_collection r:core_node1) [n:127.0.0.1:33871_ c:control_collection s:shard1 r:core_node1 x:collection1] o.a.s.c.ZkController numShards not found on descriptor - reading it from system property
   [junit4]   2> 966055 INFO  (OverseerStateUpdate-96043908244439045-127.0.0.1:33871_-n_0000000000) [n:127.0.0.1:33871_    ] o.a.s.c.Overseer processMessage: queueSize: 1, message = {
   [junit4]   2>   "core":"collection1",
   [junit4]   2>   "core_node_name":"core_node1",
   [junit4]   2>   "roles":null,
   [junit4]   2>   "base_url":"https://127.0.0.1:33871",
   [junit4]   2>   "node_name":"127.0.0.1:33871_",
   [junit4]   2>   "numShards":"1",
   [junit4]   2>   "state":"active",
   [junit4]   2>   "shard":"shard1",
   [junit4]   2>   "collection":"control_collection",
   [junit4]   2>   "operation":"state"} current state version: 2
   [junit4]   2> 966056 INFO  (OverseerStateUpdate-96043908244439045-127.0.0.1:33871_-n_0000000000) [n:127.0.0.1:33871_    ] o.a.s.c.o.ReplicaMutator Update state numShards=1 message={
   [junit4]   2>   "core":"collection1",
   [junit4]   2>   "core_node_name":"core_node1",
   [junit4]   2>   "roles":null,
   [junit4]   2>   "base_url":"https://127.0.0.1:33871",
   [junit4]   2>   "node_name":"127.0.0.1:33871_",
   [junit4]   2>   "numShards":"1",
   [junit4]   2>   "state":"active",
   [junit4]   2>   "shard":"shard1",
   [junit4]   2>   "collection":"control_collection",
   [junit4]   2>   "operation":"state"}
   [junit4]   2> 966157 INFO  (zkCallback-1038-thread-1-processing-n:127.0.0.1:33871_) [n:127.0.0.1:33871_    ] o.a.s.c.c.ZkStateReader A cluster state change: [WatchedEvent state:SyncConnected type:NodeDataChanged path:/clusterstate.json], has occurred - updating... (live nodes size: [1])
   [junit4]   2> 966301 INFO  (TEST-TestReqParamsAPI.test-seed#[C9C144B8420A7A25]) [    ] o.a.s.c.c.SolrZkClient Using default ZkCredentialsProvider
   [junit4]   2> 966302 INFO  (TEST-TestReqParamsAPI.test-seed#[C9C144B8420A7A25]) [    ] o.a.s.c.c.ConnectionManager Waiting for client to connect to ZooKeeper
   [junit4]   2> 966303 INFO  (zkCallback-1042-thread-1) [    ] o.a.s.c.c.ConnectionManager Watcher org.apache.solr.common.cloud.ConnectionManager@47547e name:ZooKeeperConnection Watcher:127.0.0.1:42268/solr got event WatchedEvent state:SyncConnected type:None path:null path:null type:None
   [junit4]   2> 966303 INFO  (TEST-TestReqParamsAPI.test-seed#[C9C144B8420A7A25]) [    ] o.a.s.c.c.ConnectionManager Client is connected to ZooKeeper
   [junit4]   2> 966303 INFO  (TEST-TestReqParamsAPI.test-seed#[C9C144B8420A7A25]) [    ] o.a.s.c.c.SolrZkClient Using default ZkACLProvider
   [junit4]   2> 966303 INFO  (TEST-TestReqParamsAPI.test-seed#[C9C144B8420A7A25]) [    ] o.a.s.c.c.ZkStateReader Updating cluster state from ZooKeeper... 
   [junit4]   2> 966303 INFO  (TEST-TestReqParamsAPI.test-seed#[C9C144B8420A7A25]) [    ] o.a.s.c.c.ZkStateReader Loaded cluster properties: {urlScheme=https}
   [junit4]   2> 966303 INFO  (TEST-TestReqParamsAPI.test-seed#[C9C144B8420A7A25]) [    ] o.a.s.c.c.ZkStateReader Updated live nodes from ZooKeeper... (0) -> (1)
   [junit4]   2> 966304 INFO  (TEST-TestReqParamsAPI.test-seed#[C9C144B8420A7A25]) [    ] o.a.s.c.ChaosMonkey monkey: init - expire sessions:false cause connection loss:false
   [junit4]   2> 966304 INFO  (TEST-TestReqParamsAPI.test-seed#[C9C144B8420A7A25]) [    ] o.a.s.c.AbstractFullDistribZkTestBase Creating collection1 with stateFormat=2
   [junit4]   2> 966304 INFO  (TEST-TestReqParamsAPI.test-seed#[C9C144B8420A7A25]) [    ] o.a.s.c.c.SolrZkClient Using default ZkCredentialsProvider
   [junit4]   2> 966304 INFO  (TEST-TestReqParamsAPI.test-seed#[C9C144B8420A7A25]) [    ] o.a.s.c.c.ConnectionManager Waiting for client to connect to ZooKeeper
   [junit4]   2> 966304 INFO  (zkCallback-1043-thread-1) [    ] o.a.s.c.c.ConnectionManager Watcher org.apache.solr.common.cloud.ConnectionManager@2ad731d7 name:ZooKeeperConnection Watcher:127.0.0.1:42268/solr got event WatchedEvent state:SyncConnected type:None path:null path:null type:None
   [junit4]   2> 966304 INFO  (TEST-TestReqParamsAPI.test-seed#[C9C144B8420A7A25]) [    ] o.a.s.c.c.ConnectionManager Client is connected to ZooKeeper
   [junit4]   2> 966304 INFO  (TEST-TestReqParamsAPI.test-seed#[C9C144B8420A7A25]) [    ] o.a.s.c.c.SolrZkClient Using default ZkACLProvider
   [junit4]   2> 966305 INFO  (OverseerStateUpdate-96043908244439045-127.0.0.1:33871_-n_0000000000) [n:127.0.0.1:33871_    ] o.a.s.c.Overseer processMessage: queueSize: 1, message = {
   [junit4]   2>   "operation":"create",
   [junit4]   2>   "name":"collection1",
   [junit4]   2>   "numShards":"2",
   [junit4]   2>   "stateFormat":"2"} current state version: 3
   [junit4]   2> 966305 INFO  (OverseerStateUpdate-96043908244439045-127.0.0.1:33871_-n_0000000000) [n:127.0.0.1:33871_    ] o.a.s.c.o.ClusterStateMutator building a new cName: collection1
   [junit4]   2> 966358 INFO  (TEST-TestReqParamsAPI.test-seed#[C9C144B8420A7A25]) [    ] o.a.s.SolrTestCaseJ4 Writing core.properties file to /home/jenkins/workspace/Lucene-Solr-6.1-Linux/solr/build/solr-core/test/J1/temp/solr.handler.TestReqParamsAPI_C9C144B8420A7A25-001/shard-1-001/cores/collection1
   [junit4]   2> 966358 INFO  (TEST-TestReqParamsAPI.test-seed#[C9C144B8420A7A25]) [    ] o.a.s.c.AbstractFullDistribZkTestBase create jetty 1 in directory /home/jenkins/workspace/Lucene-Solr-6.1-Linux/solr/build/solr-core/test/J1/temp/solr.handler.TestReqParamsAPI_C9C144B8420A7A25-001/shard-1-001
   [junit4]   2> 966359 INFO  (TEST-TestReqParamsAPI.test-seed#[C9C144B8420A7A25]) [    ] o.e.j.s.Server jetty-9.3.8.v20160314
   [junit4]   2> 966360 INFO  (TEST-TestReqParamsAPI.test-seed#[C9C144B8420A7A25]) [    ] o.e.j.s.h.ContextHandler Started o.e.j.s.ServletContextHandler@79d95704{/,null,AVAILABLE}
   [junit4]   2> 966361 INFO  (TEST-TestReqParamsAPI.test-seed#[C9C144B8420A7A25]) [    ] o.e.j.s.ServerConnector Started ServerConnector@22ca2884{SSL,[ssl, http/1.1]}{127.0.0.1:43738}
   [junit4]   2> 966361 INFO  (TEST-TestReqParamsAPI.test-seed#[C9C144B8420A7A25]) [    ] o.e.j.s.Server Started @968073ms
   [junit4]   2> 966361 INFO  (TEST-TestReqParamsAPI.test-seed#[C9C144B8420A7A25]) [    ] o.a.s.c.s.e.JettySolrRunner Jetty properties: {solr.data.dir=/home/jenkins/workspace/Lucene-Solr-6.1-Linux/solr/build/solr-core/test/J1/temp/solr.handler.TestReqParamsAPI_C9C144B8420A7A25-001/tempDir-001/jetty1, solrconfig=solrconfig.xml, hostContext=/, hostPort=43738, coreRootDirectory=/home/jenkins/workspace/Lucene-Solr-6.1-Linux/solr/build/solr-core/test/J1/temp/solr.handler.TestReqParamsAPI_C9C144B8420A7A25-001/shard-1-001/cores}
   [junit4]   2> 966362 INFO  (TEST-TestReqParamsAPI.test-seed#[C9C144B8420A7A25]) [    ] o.a.s.s.SolrDispatchFilter SolrDispatchFilter.init(): sun.misc.Launcher$AppClassLoader@73d16e93
   [junit4]   2> 966362 INFO  (TEST-TestReqParamsAPI.test-seed#[C9C144B8420A7A25]) [    ] o.a.s.c.SolrResourceLoader new SolrResourceLoader for directory: '/home/jenkins/workspace/Lucene-Solr-6.1-Linux/solr/build/solr-core/test/J1/temp/solr.handler.TestReqParamsAPI_C9C144B8420A7A25-001/shard-1-001'
   [junit4]   2> 966362 INFO  (TEST-TestReqParamsAPI.test-seed#[C9C144B8420A7A25]) [    ] o.a.s.c.SolrResourceLoader JNDI not configured for solr (NoInitialContextEx)
   [junit4]   2> 966362 INFO  (TEST-TestReqParamsAPI.test-seed#[C9C144B8420A7A25]) [    ] o.a.s.c.SolrResourceLoader solr home defaulted to 'solr/' (could not find system property or JNDI)
   [junit4]   2> 966362 INFO  (TEST-TestReqParamsAPI.test-seed#[C9C144B8420A7A25]) [    ] o.a.s.c.c.SolrZkClient Using default ZkCredentialsProvider
   [junit4]   2> 966362 INFO  (TEST-TestReqParamsAPI.test-seed#[C9C144B8420A7A25]) [    ] o.a.s.c.c.ConnectionManager Waiting for client to connect to ZooKeeper
   [junit4]   2> 966363 INFO  (zkCallback-1044-thread-1) [    ] o.a.s.c.c.ConnectionManager Watcher org.apache.solr.common.cloud.ConnectionManager@6961df4b name:ZooKeeperConnection Watcher:127.0.0.1:42268/solr got event WatchedEvent state:SyncConnected type:None path:null path:null type:None
   [junit4]   2> 966363 INFO  (TEST-TestReqParamsAPI.test-seed#[C9C144B8420A7A25]) [    ] o.a.s.c.c.ConnectionManager Client is connected to ZooKeeper
   [junit4]   2> 966363 INFO  (TEST-TestReqParamsAPI.test-seed#[C9C144B8420A7A25]) [    ] o.a.s.c.c.SolrZkClient Using default ZkACLProvider
   [junit4]   2> 966363 INFO  (TEST-TestReqParamsAPI.test-seed#[C9C144B8420A7A25]) [    ] o.a.s.s.SolrDispatchFilter Loading solr.xml from SolrHome (not found in ZooKeeper)
   [junit4]   2> 966363 INFO  (TEST-TestReqParamsAPI.test-seed#[C9C144B8420A7A25]) [    ] o.a.s.c.SolrXmlConfig Loading container configuration from /home/jenkins/workspace/Lucene-Solr-6.1-Linux/solr/build/solr-core/test/J1/temp/solr.handler.TestReqParamsAPI_C9C144B8420A7A25-001/shard-1-001/solr.xml
   [junit4]   2> 966366 INFO  (TEST-TestReqParamsAPI.test-seed#[C9C144B8420A7A25]) [    ] o.a.s.c.CorePropertiesLocator Config-defined core root directory: /home/jenkins/workspace/Lucene-Solr-6.1-Linux/solr/build/solr-core/test/J1/temp/solr.handler.TestReqParamsAPI_C9C144B8420A7A25-001/shard-1-001/cores
   [junit4]   2> 966366 INFO  (TEST-TestReqParamsAPI.test-seed#[C9C144B8420A7A25]) [    ] o.a.s.c.CoreContainer New CoreContainer 1567199146
   [junit4]   2> 966366 INFO  (TEST-TestReqParamsAPI.test-seed#[C9C144B8420A7A25]) [    ] o.a.s.c.CoreContainer Loading cores into CoreContainer [instanceDir=/home/jenkins/workspace/Lucene-Solr-6.1-Linux/solr/build/solr-core/test/J1/temp/solr.handler.TestReqParamsAPI_C9C144B8420A7A25-001/shard-1-001]
   [junit4]   2> 966366 WARN  (TEST-TestReqParamsAPI.test-seed#[C9C144B8420A7A25]) [    ] o.a.s.c.CoreContainer Couldn't add files from /home/jenkins/workspace/Lucene-Solr-6.1-Linux/solr/build/solr-core/test/J1/temp/solr.handler.TestReqParamsAPI_C9C144B8420A7A25-001/shard-1-001/lib to classpath: /home/jenkins/workspace/Lucene-Solr-6.1-Linux/solr/build/solr-core/test/J1/temp/solr.handler.TestReqParamsAPI_C9C144B8420A7A25-001/shard-1-001/lib
   [junit4]   2> 966367 INFO  (TEST-TestReqParamsAPI.test-seed#[C9C144B8420A7A25]) [    ] o.a.s.h.c.HttpShardHandlerFactory created with socketTimeout : 90000,urlScheme : ,connTimeout : 15000,maxConnectionsPerHost : 20,maxConnections : 10000,corePoolSize : 0,maximumPoolSize : 2147483647,maxThreadIdleTime : 5,sizeOfQueue : -1,fairnessPolicy : false,useRetries : false,
   [junit4]   2> 966367 INFO  (TEST-TestReqParamsAPI.test-seed#[C9C144B8420A7A25]) [    ] o.a.s.u.UpdateShardHandler Creating UpdateShardHandler HTTP client with params: socketTimeout=340000&connTimeout=45000&retry=true
   [junit4]   2> 966367 INFO  (TEST-TestReqParamsAPI.test-seed#[C9C144B8420A7A25]) [    ] o.a.s.l.LogWatcher SLF4J impl is org.slf4j.impl.Log4jLoggerFactory
   [junit4]   2> 966368 INFO  (TEST-TestReqParamsAPI.test-seed#[C9C144B8420A7A25]) [    ] o.a.s.l.LogWatcher Registering Log Listener [Log4j (org.slf4j.impl.Log4jLoggerFactory)]
   [junit4]   2> 966368 INFO  (TEST-TestReqParamsAPI.test-seed#[C9C144B8420A7A25]) [    ] o.a.s.c.ZkContainer Zookeeper client=127.0.0.1:42268/solr
   [junit4]   2> 966368 INFO  (TEST-TestReqParamsAPI.test-seed#[C9C144B8420A7A25]) [    ] o.a.s.c.ZkController zkHost includes chroot
   [junit4]   2> 966368 INFO  (TEST-TestReqParamsAPI.test-seed#[C9C144B8420A7A25]) [    ] o.a.s.c.c.SolrZkClient Using default ZkCredentialsProvider
   [junit4]   2> 966368 INFO  (TEST-TestReqParamsAPI.test-seed#[C9C144B8420A7A25]) [    ] o.a.s.c.c.ConnectionManager Waiting for client to connect to ZooKeeper
   [junit4]   2> 966368 INFO  (zkCallback-1047-thread-1) [    ] o.a.s.c.c.ConnectionManager Watcher org.apache.solr.common.cloud.ConnectionManager@665a0c5b name:ZooKeeperConnection Watcher:127.0.0.1:42268 got event WatchedEvent state:SyncConnected type:None path:null path:null type:None
   [junit4]   2> 966369 INFO  (TEST-TestReqParamsAPI.test-seed#[C9C144B8420A7A25]) [    ] o.a.s.c.c.ConnectionManager Client is connected to ZooKeeper
   [junit4]   2> 966369 INFO  (TEST-TestReqParamsAPI.test-seed#[C9C144B8420A7A25]) [    ] o.a.s.c.c.SolrZkClient Using default ZkACLProvider
   [junit4]   2> 966369 INFO  (TEST-TestReqParamsAPI.test-seed#[C9C144B8420A7A25]) [n:127.0.0.1:43738_    ] o.a.s.c.ZkController Added new OnReconnect listener org.apache.solr.cloud.ZkController$$Lambda$10/4722365@30db0d4e
   [junit4]   2> 966370 INFO  (TEST-TestReqParamsAPI.test-seed#[C9C144B8420A7A25]) [n:127.0.0.1:43738_    ] o.a.s.c.c.ConnectionManager Waiting for client to connect to ZooKeeper
   [junit4]   2> 966371 INFO  (zkCallback-1048-thread-1-processing-n:127.0.0.1:43738_) [n:127.0.0.1:43738_    ] o.a.s.c.c.ConnectionManager Watcher org.apache.solr.common.cloud.ConnectionManager@17e9fe6b name:ZooKeeperConnection Watcher:127.0.0.1:42268/solr got event WatchedEvent state:SyncConnected type:None path:null path:null type:None
   [junit4]   2> 966371 INFO  (TEST-TestReqParamsAPI.test-seed#[C9C144B8420A7A25]) [n:127.0.0.1:43738_    ] o.a.s.c.c.ConnectionManager Client is connected to ZooKeeper
   [junit4]   2> 966372 INFO  (TEST-TestReqParamsAPI.test-seed#[C9C144B8420A7A25]) [n:127.0.0.1:43738_    ] o.a.s.c.c.ZkStateReader Updating cluster state from ZooKeeper... 
   [junit4]   2> 966373 INFO  (TEST-TestReqParamsAPI.test-seed#[C9C144B8420A7A25]) [n:127.0.0.1:43738_    ] o.a.s.c.c.ZkStateReader Loaded cluster properties: {urlScheme=https}
   [junit4]   2> 966373 INFO  (TEST-TestReqParamsAPI.test-seed#[C9C144B8420A7A25]) [n:127.0.0.1:43738_    ] o.a.s.c.c.ZkStateReader Updated live nodes from ZooKeeper... (0) -> (1)
   [junit4]   2> 966374 INFO  (TEST-TestReqParamsAPI.test-seed#[C9C144B8420A7A25]) [n:127.0.0.1:43738_    ] o.a.s.c.Overseer Overseer (id=null) closing
   [junit4]   2> 966374 INFO  (TEST-TestReqParamsAPI.test-seed#[C9C144B8420A7A25]) [n:127.0.0.1:43738_    ] o.a.s.c.LeaderElector Joined leadership election with path: /overseer_elect/election/96043908244439050-127.0.0.1:43738_-n_0000000001
   [junit4]   2> 966374 INFO  (TEST-TestReqParamsAPI.test-seed#[C9C144B8420A7A25]) [n:127.0.0.1:43738_    ] o.a.s.c.LeaderElector Watching path /overseer_elect/election/96043908244439045-127.0.0.1:33871_-n_0000000000 to know if I could be the leader
   [junit4]   2> 966374 INFO  (TEST-TestReqParamsAPI.test-seed#[C9C144B8420A7A25]) [n:127.0.0.1:43738_    ] o.a.s.c.ZkController Publish node=127.0.0.1:43738_ as DOWN
   [junit4]   2> 966375 INFO  (OverseerStateUpdate-96043908244439045-127.0.0.1:33871_-n_0000000000) [n:127.0.0.1:33871_    ] o.a.s.c.Overseer processMessage: queueSize: 1, message = {
   [junit4]   2>   "operation":"downnode",
   [junit4]   2>   "node_name":"127.0.0.1:43738_"} current state version: 3
   [junit4]   2> 966375 INFO  (OverseerStateUpdate-96043908244439045-127.0.0.1:33871_-n_0000000000) [n:127.0.0.1:33871_    ] o.a.s.c.o.NodeMutator DownNode state invoked for node: 127.0.0.1:43738_
   [junit4]   2> 966375 INFO  (OverseerStateUpdate-96043908244439045-127.0.0.1:33871_-n_0000000000) [n:127.0.0.1:33871_    ] o.a.s.c.o.ZkStateWriter going to create_collection /collections/collection1/state.json
   [junit4]   2> 966376 INFO  (zkCallback-1048-thread-1-processing-n:127.0.0.1:43738_) [n:127.0.0.1:43738_    ] o.a.s.c.c.ZkStateReader A cluster state change: [WatchedEvent state:SyncConnected type:NodeDataChanged path:/clusterstate.json], has occurred - updating... (live nodes size: [1])
   [junit4]   2> 966376 INFO  (zkCallback-1042-thread-1) [    ] o.a.s.c.c.ZkStateReader A cluster state change: [WatchedEvent state:SyncConnected type:NodeDataChanged path:/clusterstate.json], has occurred - updating... (live nodes size: [1])
   [junit4]   2> 966376 INFO  (zkCallback-1038-thread-2-processing-n:127.0.0.1:33871_) [n:127.0.0.1:33871_    ] o.a.s.c.c.ZkStateReader A cluster state change: [WatchedEvent state:SyncConnected type:NodeDataChanged path:/clusterstate.json], has occurred - updating... (live nodes size: [1])
   [junit4]   2> 966478 INFO  (OverseerStateUpdate-96043908244439045-127.0.0.1:33871_-n_0000000000) [n:127.0.0.1:33871_    ] o.a.s.c.o.ZkStateWriter going to update_collection /collections/collection1/state.json version: 2147483647
   [junit4]   2> 966478 WARN  (OverseerStateUpdate-96043908244439045-127.0.0.1:33871_-n_0000000000) [n:127.0.0.1:33871_    ] o.a.s.c.Overseer Bad version writing to ZK using compare-and-set, will force refresh cluster state
   [junit4]   2> org.apache.zookeeper.KeeperException$BadVersionException: KeeperErrorCode = BadVersion for /collections/collection1/state.json
   [junit4]   2> 	at org.apache.zookeeper.KeeperException.create(KeeperException.java:115)
   [junit4]   2> 	at org.apache.zookeeper.KeeperException.create(KeeperException.java:51)
   [junit4]   2> 	at org.apache.zookeeper.ZooKeeper.setData(ZooKeeper.java:1270)
   [junit4]   2> 	at org.apache.solr.common.cloud.SolrZkClient$8.execute(SolrZkClient.java:365)
   [junit4]   2> 	at org.apache.solr.common.cloud.SolrZkClient$8.execute(SolrZkClient.java:362)
   [junit4]   2> 	at org.apache.solr.common.cloud.ZkCmdExecutor.retryOperation(ZkCmdExecutor.java:60)
   [junit4]   2> 	at org.apache.solr.common.cloud.SolrZkClient.setData(SolrZkClient.java:362)
   [junit4]   2> 	at org.apache.solr.cloud.overseer.ZkStateWriter.writePendingUpdates(ZkStateWriter.java:232)
   [junit4]   2> 	at org.apache.solr.cloud.Overseer$ClusterStateUpdater.run(Overseer.java:240)
   [junit4]   2> 	at java.lang.Thread.run(Thread.java:745)
   [junit4]   2> 966479 INFO  (OverseerStateUpdate-96043908244439045-127.0.0.1:33871_-n_0000000000) [n:127.0.0.1:33871_    ] o.a.s.c.c.ZkStateReader Updated live nodes from ZooKeeper... (1) -> (1)
   [junit4]   2> 966480 INFO  (OverseerStateUpdate-96043908244439045-127.0.0.1:33871_-n_0000000000) [n:127.0.0.1:33871_    ] o.a.s.c.Overseer processMessage: workQueueSize: 1, message = {
   [junit4]   2>   "operation":"downnode",
   [junit4]   2>   "node_name":"127.0.0.1:43738_"}
   [junit4]   2> 966480 INFO  (OverseerStateUpdate-96043908244439045-127.0.0.1:33871_-n_0000000000) [n:127.0.0.1:33871_    ] o.a.s.c.o.NodeMutator DownNode state invoked for node: 127.0.0.1:43738_
   [junit4]   2> 966480 INFO  (zkCallback-1048-thread-1-processing-n:127.0.0.1:43738_) [n:127.0.0.1:43738_    ] o.a.s.c.c.ZkStateReader A cluster state change: [WatchedEvent state:SyncConnected type:NodeDataChanged path:/clusterstate.json], has occurred - updating... (live nodes size: [1])
   [junit4]   2> 966480 INFO  (zkCallback-1042-thread-1) [    ] o.a.s.c.c.ZkStateReader A cluster state change: [WatchedEvent state:SyncConnected type:NodeDataChanged path:/clusterstate.json], has occurred - updating... (live nodes size: [1])
   [junit4]   2> 966480 INFO  (zkCallback-1038-thread-2-processing-n:127.0.0.1:33871_) [n:127.0.0.1:33871_    ] o.a.s.c.c.ZkStateReader A cluster state change: [WatchedEvent state:SyncConnected type:NodeDataChanged path:/clusterstate.json], has occurred - updating... (live nodes size: [1])
   [junit4]   2> 966480 INFO  (OverseerStateUpdate-96043908244439045-127.0.0.1:33871_-n_0000000000) [n:127.0.0.1:33871_    ] o.a.s.c.o.ZkStateWriter going to update_collection /collections/collection1/state.json version: 0
   [junit4]   2> 967375 INFO  (TEST-TestReqParamsAPI.test-seed#[C9C144B8420A7A25]) [n:127.0.0.1:43738_    ] o.a.s.c.ZkController Register node as live in ZooKeeper:/live_nodes/127.0.0.1:43738_
   [junit4]   2> 967375 INFO  (TEST-TestReqParamsAPI.test-seed#[C9C144B8420A7A25]) [n:127.0.0.1:43738_    ] o.a.s.c.c.SolrZkClient makePath: /live_nodes/127.0.0.1:43738_
   [junit4]   2> 967376 INFO  (zkCallback-1048-thread-1-processing-n:127.0.0.1:43738_) [n:127.0.0.1:43738_    ] o.a.s.c.c.ZkStateReader A live node change: [WatchedEvent state:SyncConnected type:NodeChildrenChanged path:/live_nodes], has occurred - updating... (live nodes size: [1])
   [junit4]   2> 967376 INFO  (zkCallback-1038-thread-2-processing-n:127.0.0.1:33871_) [n:127.0.0.1:33871_    ] o.a.s.c.c.ZkStateReader A live node change: [WatchedEvent state:SyncConnected type:NodeChildrenChanged path:/live_nodes], has occurred - updating... (live nodes size: [1])
   [junit4]   2> 967376 INFO  (zkCallback-1042-thread-1) [    ] o.a.s.c.c.ZkStateReader A live node change: [WatchedEvent state:SyncConnected type:NodeChildrenChanged path:/live_nodes], has occurred - updating... (live nodes size: [1])
   [junit4]   2> 967376 INFO  (zkCallback-1048-thread-1-processing-n:127.0.0.1:43738_) [n:127.0.0.1:43738_    ] o.a.s.c.c.ZkStateReader Updated live nodes from ZooKeeper... (1) -> (2)
   [junit4]   2> 967376 INFO  (zkCallback-1038-thread-2-processing-n:127.0.0.1:33871_) [n:127.0.0.1:33871_    ] o.a.s.c.c.ZkStateReader Updated live nodes from ZooKeeper... (1) -> (2)
   [junit4]   2> 967376 INFO  (zkCallback-1042-thread-1) [    ] o.a.s.c.c.ZkStateReader Updated live nodes from ZooKeeper... (1) -> (2)
   [junit4]   2> 967383 INFO  (TEST-TestReqParamsAPI.test-seed#[C9C144B8420A7A25]) [n:127.0.0.1:43738_    ] o.a.s.c.CoreContainer Security conf doesn't exist. Skipping setup for authorization module.
   [junit4]   2> 967383 INFO  (TEST-TestReqParamsAPI.test-seed#[C9C144B8420A7A25]) [n:127.0.0.1:43738_    ] o.a.s.c.CoreContainer No authentication plugin used.
   [junit4]   2> 967383 INFO  (TEST-TestReqParamsAPI.test-seed#[C9C144B8420A7A25]) [n:127.0.0.1:43738_    ] o.a.s.c.CorePropertiesLocator Looking for core definitions underneath /home/jenkins/workspace/Lucene-Solr-6.1-Linux/solr/build/solr-core/test/J1/temp/solr.handler.TestReqParamsAPI_C9C144B8420A7A25-001/shard-1-001/cores
   [junit4]   2> 967384 INFO  (TEST-TestReqParamsAPI.test-seed#[C9C144B8420A7A25]) [n:127.0.0.1:43738_    ] o.a.s.c.CoreDescriptor Created CoreDescriptor: {name=collection1, config=solrconfig.xml, transient=false, schema=schema.xml, loadOnStartup=true, configSetProperties=configsetprops.json, collection=collection1, coreNodeName=, dataDir=data/, shard=}
   [junit4]   2> 967384 INFO  (TEST-TestReqParamsAPI.test-seed#[C9C144B8420A7A25]) [n:127.0.0.1:43738_    ] o.a.s.c.CorePropertiesLocator Found core collection1 in /home/jenkins/workspace/Lucene-Solr-6.1-Linux/solr/build/solr-core/test/J1/temp/solr.handler.TestReqParamsAPI_C9C144B8420A7A25-001/shard-1-001/cores/collection1
   [junit4]   2> 967384 INFO  (TEST-TestReqParamsAPI.test-seed#[C9C144B8420A7A25]) [n:127.0.0.1:43738_    ] o.a.s.c.CorePropertiesLocator Found 1 core definitions
   [junit4]   2> 967384 INFO  (TEST-TestReqParamsAPI.test-seed#[C9C144B8420A7A25]) [n:127.0.0.1:43738_    ] o.a.s.s.SolrDispatchFilter user.dir=/home/jenkins/workspace/Lucene-Solr-6.1-Linux/solr/build/solr-core/test/J1
   [junit4]   2> 967385 INFO  (TEST-TestReqParamsAPI.test-seed#[C9C144B8420A7A25]) [n:127.0.0.1:43738_    ] o.a.s.s.SolrDispatchFilter SolrDispatchFilter.init() done
   [junit4]   2> 967385 INFO  (coreLoadExecutor-2743-thread-1-processing-n:127.0.0.1:43738_) [n:127.0.0.1:43738_ c:collection1   x:collection1] o.a.s.c.ZkController publishing state=down
   [junit4]   2> 967385 INFO  (coreLoadExecutor-2743-thread-1-processing-n:127.0.0.1:43738_) [n:127.0.0.1:43738_ c:collection1   x:collection1] o.a.s.c.ZkController numShards not found on descriptor - reading it from system property
   [junit4]   2> 967385 INFO  (coreLoadExecutor-2743-thread-1-processing-n:127.0.0.1:43738_) [n:127.0.0.1:43738_ c:collection1   x:collection1] o.a.s.c.ZkController Registering watch for collection collection1
   [junit4]   2> 967385 INFO  (OverseerStateUpdate-96043908244439045-127.0.0.1:33871_-n_0000000000) [n:127.0.0.1:33871_    ] o.a.s.c.Overseer processMessage: queueSize: 1, message = {
   [junit4]   2>   "core":"collection1",
   [junit4]   2>   "roles":null,
   [junit4]   2>   "base_url":"https://127.0.0.1:43738",
   [junit4]   2>   "node_name":"127.0.0.1:43738_",
   [junit4]   2>   "numShards":"2",
   [junit4]   2>   "state":"down",
   [junit4]   2>   "shard":null,
   [junit4]   2>   "collection":"collection1",
   [junit4]   2>   "operation":"state"} current state version: 5
   [junit4]   2> 967385 INFO  (coreLoadExecutor-2743-thread-1-processing-n:127.0.0.1:43738_) [n:127.0.0.1:43738_ c:collection1   x:collection1] o.a.s.c.c.ZkStateReader Add data for [collection1] ver [1]
   [junit4]   2> 967385 INFO  (OverseerStateUpdate-96043908244439045-127.0.0.1:33871_-n_0000000000) [n:127.0.0.1:33871_    ] o.a.s.c.o.ReplicaMutator Update state numShards=2 message={
   [junit4]   2>   "core":"collection1",
   [junit4]   2>   "roles":null,
   [junit4]   2>   "base_url":"https://127.0.0.1:43738",
   [junit4]   2>   "node_name":"127.0.0.1:43738_",
   [junit4]   2>   "numShards":"2",
   [junit4]   2>   "state":"down",
   [junit4]   2>   "shard":null,
   [junit4]   2>   "collection":"collection1",
   [junit4]   2>   "operation":"state"}
   [junit4]   2> 967385 INFO  (OverseerStateUpdate-96043908244439045-127.0.0.1:33871_-n_0000000000) [n:127.0.0.1:33871_    ] o.a.s.c.o.ReplicaMutator Collection already exists with numShards=2
   [junit4]   2> 967385 INFO  (OverseerStateUpdate-96043908244439045-127.0.0.1:33871_-n_0000000000) [n:127.0.0.1:33871_    ] o.a.s.c.o.ReplicaMutator Assigning new node to shard shard=shard2
   [junit4]   2> 967385 INFO  (coreLoadExecutor-2743-thread-1-processing-n:127.0.0.1:43738_) [n:127.0.0.1:43738_ c:collection1   x:collection1] o.a.s.c.ZkController look for our core node name
   [junit4]   2> 967487 INFO  (OverseerStateUpdate-96043908244439045-127.0.0.1:33871_-n_0000000000) [n:127.0.0.1:33871_    ] o.a.s.c.o.ZkStateWriter going to update_collection /collections/collection1/state.json version: 1
   [junit4]   2> 967487 INFO  (zkCallback-1048-thread-1-processing-n:127.0.0.1:43738_) [n:127.0.0.1:43738_    ] o.a.s.c.c.ZkStateReader A cluster state change: [WatchedEvent state:SyncConnected type:NodeDataChanged path:/collections/collection1/state.json] for collection [collection1] has occurred - updating... (live nodes size: [2])
   [junit4]   2> 967487 INFO  (zkCallback-1048-thread-1-processing-n:127.0.0.1:43738_) [n:127.0.0.1:43738_    ] o.a.s.c.c.ZkStateReader Updating data for [collection1] from [1] to [2]
   [junit4]   2> 968386 INFO  (coreLoadExecutor-2743-thread-1-processing-n:127.0.0.1:43738_) [n:127.0.0.1:43738_ c:collection1   x:collection1] o.a.s.c.ZkController waiting to find shard id in clusterstate for collection1
   [junit4]   2> 968386 INFO  (coreLoadExecutor-2743-thread-1-processing-n:127.0.0.1:43738_) [n:127.0.0.1:43738_ c:collection1   x:collection1] o.a.s.c.ZkController Check for collection zkNode:collection1
   [junit4]   2> 968386 INFO  (coreLoadExecutor-2743-thread-1-processing-n:127.0.0.1:43738_) [n:127.0.0.1:43738_ c:collection1   x:collection1] o.a.s.c.ZkController Collection zkNode exists
   [junit4]   2> 968386 INFO  (coreLoadExecutor-2743-thread-1-processing-n:127.0.0.1:43738_) [n:127.0.0.1:43738_ c:collection1   x:collection1] o.a.s.c.c.ZkStateReader Load collection config from: [/collections/collection1]
   [junit4]   2> 968386 INFO  (coreLoadExecutor-2743-thread-1-processing-n:127.0.0.1:43738_) [n:127.0.0.1:43738_ c:collection1   x:collection1] o.a.s.c.c.ZkStateReader path=[/collections/collection1] [configName]=[conf1] specified config exists in ZooKeeper
   [junit4]   2> 968386 INFO  (coreLoadExecutor-2743-thread-1-processing-n:127.0.0.1:43738_) [n:127.0.0.1:43738_ c:collection1   x:collection1] o.a.s.c.SolrResourceLoader new SolrResourceLoader for directory: '/home/jenkins/workspace/Lucene-Solr-6.1-Linux/solr/build/solr-core/test/J1/temp/solr.handler.TestReqParamsAPI_C9C144B8420A7A25-001/shard-1-001/cores/collection1'
   [junit4]   2> 968386 INFO  (coreLoadExecutor-2743-thread-1-processing-n:127.0.0.1:43738_) [n:127.0.0.1:43738_ c:collection1   x:collection1] o.a.s.c.SolrResourceLoader JNDI not configured for solr (NoInitialContextEx)
   [junit4]   2> 968386 INFO  (coreLoadExecutor-2743-thread-1-processing-n:127.0.0.1:43738_) [n:127.0.0.1:43738_ c:collection1   x:collection1] o.a.s.c.SolrResourceLoader solr home defaulted to 'solr/' (could not find system property or JNDI)
   [junit4]   2> 968387 INFO  (coreLoadExecutor-2743-thread-1-processing-n:127.0.0.1:43738_) [n:127.0.0.1:43738_ c:collection1   x:collection1] o.a.s.c.Config loaded config solrconfig.xml with version 0 
   [junit4]   2> 968390 INFO  (coreLoadExecutor-2743-thread-1-processing-n:127.0.0.1:43738_) [n:127.0.0.1:43738_ c:collection1   x:collection1] o.a.s.c.SolrConfig current version of requestparams : -1
   [junit4]   2> 968392 WARN  (coreLoadExecutor-2743-thread-1-processing-n:127.0.0.1:43738_) [n:127.0.0.1:43738_ c:collection1   x:collection1] o.a.s.c.Config Beginning with Solr 5.5, <mergePolicy> is deprecated, use <mergePolicyFactory> instead.
   [junit4]   2> 968393 INFO  (coreLoadExecutor-2743-thread-1-processing-n:127.0.0.1:43738_) [n:127.0.0.1:43738_ c:collection1   x:collection1] o.a.s.c.SolrConfig Using Lucene MatchVersion: 6.1.0
   [junit4]   2> 968398 INFO  (coreLoadExecutor-2743-thread-1-processing-n:127.0.0.1:43738_) [n:127.0.0.1:43738_ c:collection1   x:collection1] o.a.s.c.SolrConfig Loa

[...truncated too long message...]

ion/96043908244439059-core_node4-n_0000000001
   [junit4]   2> 991524 WARN  (zkCallback-1067-thread-2-processing-n:127.0.0.1:38739_) [n:127.0.0.1:38739_ c:collection1 s:shard1 r:core_node4 x:collection1] o.a.s.c.LeaderElector 
   [junit4]   2> org.apache.zookeeper.KeeperException$SessionExpiredException: KeeperErrorCode = Session expired for /collections/collection1/leader_elect/shard1/election/96043908244439059-core_node4-n_0000000001
   [junit4]   2> 	at org.apache.zookeeper.KeeperException.create(KeeperException.java:127)
   [junit4]   2> 	at org.apache.zookeeper.KeeperException.create(KeeperException.java:51)
   [junit4]   2> 	at org.apache.zookeeper.ZooKeeper.delete(ZooKeeper.java:873)
   [junit4]   2> 	at org.apache.solr.common.cloud.SolrZkClient$2.execute(SolrZkClient.java:244)
   [junit4]   2> 	at org.apache.solr.common.cloud.SolrZkClient$2.execute(SolrZkClient.java:241)
   [junit4]   2> 	at org.apache.solr.common.cloud.ZkCmdExecutor.retryOperation(ZkCmdExecutor.java:60)
   [junit4]   2> 	at org.apache.solr.common.cloud.SolrZkClient.delete(SolrZkClient.java:241)
   [junit4]   2> 	at org.apache.solr.cloud.ElectionContext.cancelElection(ElectionContext.java:86)
   [junit4]   2> 	at org.apache.solr.cloud.ShardLeaderElectionContextBase.cancelElection(ElectionContext.java:143)
   [junit4]   2> 	at org.apache.solr.cloud.ShardLeaderElectionContext.cancelElection(ElectionContext.java:279)
   [junit4]   2> 	at org.apache.solr.cloud.ShardLeaderElectionContext.runLeaderProcess(ElectionContext.java:455)
   [junit4]   2> 	at org.apache.solr.cloud.LeaderElector.runIamLeaderProcess(LeaderElector.java:170)
   [junit4]   2> 	at org.apache.solr.cloud.LeaderElector.checkIfIamLeader(LeaderElector.java:135)
   [junit4]   2> 	at org.apache.solr.cloud.LeaderElector.access$200(LeaderElector.java:56)
   [junit4]   2> 	at org.apache.solr.cloud.LeaderElector$ElectionWatcher.process(LeaderElector.java:348)
   [junit4]   2> 	at org.apache.solr.common.cloud.SolrZkClient$3.lambda$process$0(SolrZkClient.java:266)
   [junit4]   2> 	at java.util.concurrent.Executors$RunnableAdapter.call(Executors.java:511)
   [junit4]   2> 	at java.util.concurrent.FutureTask.run(FutureTask.java:266)
   [junit4]   2> 	at org.apache.solr.common.util.ExecutorUtil$MDCAwareThreadPoolExecutor.lambda$execute$0(ExecutorUtil.java:229)
   [junit4]   2> 	at java.util.concurrent.ThreadPoolExecutor.runWorker(ThreadPoolExecutor.java:1142)
   [junit4]   2> 	at java.util.concurrent.ThreadPoolExecutor$Worker.run(ThreadPoolExecutor.java:617)
   [junit4]   2> 	at java.lang.Thread.run(Thread.java:745)
   [junit4]   2> 991525 INFO  (TEST-TestReqParamsAPI.test-seed#[C9C144B8420A7A25]) [    ] o.e.j.s.ServerConnector Stopped ServerConnector@482b0a50{SSL,[ssl, http/1.1]}{127.0.0.1:0}
   [junit4]   2> 991526 INFO  (TEST-TestReqParamsAPI.test-seed#[C9C144B8420A7A25]) [    ] o.e.j.s.h.ContextHandler Stopped o.e.j.s.ServletContextHandler@4396825e{/,null,UNAVAILABLE}
   [junit4]   2> 991526 INFO  (TEST-TestReqParamsAPI.test-seed#[C9C144B8420A7A25]) [    ] o.a.s.c.ZkTestServer connecting to 127.0.0.1:42268 42268
   [junit4]   2> 996573 INFO  (Thread-2148) [    ] o.a.s.c.ZkTestServer connecting to 127.0.0.1:42268 42268
   [junit4]   2> 996573 WARN  (Thread-2148) [    ] o.a.s.c.ZkTestServer Watch limit violations: 
   [junit4]   2> Maximum concurrent create/delete watches above limit:
   [junit4]   2> 
   [junit4]   2> 	25	/solr/configs/conf1
   [junit4]   2> 	6	/solr/aliases.json
   [junit4]   2> 	5	/solr/security.json
   [junit4]   2> 
   [junit4]   2> Maximum concurrent data watches above limit:
   [junit4]   2> 
   [junit4]   2> 	6	/solr/clusterstate.json
   [junit4]   2> 	6	/solr/clusterprops.json
   [junit4]   2> 	4	/solr/collections/collection1/state.json
   [junit4]   2> 
   [junit4]   2> Maximum concurrent children watches above limit:
   [junit4]   2> 
   [junit4]   2> 	30	/solr/overseer/collection-queue-work
   [junit4]   2> 	26	/solr/overseer/queue
   [junit4]   2> 	14	/solr/overseer/queue-work
   [junit4]   2> 	6	/solr/live_nodes
   [junit4]   2> 	6	/solr/collections
   [junit4]   2> 
   [junit4]   2> NOTE: reproduce with: ant test  -Dtestcase=TestReqParamsAPI -Dtests.method=test -Dtests.seed=C9C144B8420A7A25 -Dtests.multiplier=3 -Dtests.slow=true -Dtests.locale=en-GB -Dtests.timezone=Etc/GMT+2 -Dtests.asserts=true -Dtests.file.encoding=US-ASCII
   [junit4] FAILURE 32.0s J1 | TestReqParamsAPI.test <<<
   [junit4]    > Throwable #1: java.lang.AssertionError: Could not get expected value  'CY val' for path 'response/params/y/c' full output: {
   [junit4]    >   "responseHeader":{
   [junit4]    >     "status":0,
   [junit4]    >     "QTime":0},
   [junit4]    >   "response":{
   [junit4]    >     "znodeVersion":0,
   [junit4]    >     "params":{"x":{
   [junit4]    >         "a":"A val",
   [junit4]    >         "b":"B val",
   [junit4]    >         "":{"v":0}}}}},  from server:  https://127.0.0.1:38739/collection1
   [junit4]    > 	at __randomizedtesting.SeedInfo.seed([C9C144B8420A7A25:41957B62ECF617DD]:0)
   [junit4]    > 	at org.apache.solr.core.TestSolrConfigHandler.testForResponseElement(TestSolrConfigHandler.java:481)
   [junit4]    > 	at org.apache.solr.handler.TestReqParamsAPI.testReqParams(TestReqParamsAPI.java:160)
   [junit4]    > 	at org.apache.solr.handler.TestReqParamsAPI.test(TestReqParamsAPI.java:62)
   [junit4]    > 	at org.apache.solr.BaseDistributedSearchTestCase$ShardsRepeatRule$ShardsFixedStatement.callStatement(BaseDistributedSearchTestCase.java:992)
   [junit4]    > 	at org.apache.solr.BaseDistributedSearchTestCase$ShardsRepeatRule$ShardsStatement.evaluate(BaseDistributedSearchTestCase.java:967)
   [junit4]    > 	at java.lang.Thread.run(Thread.java:745)
   [junit4]   2> 996576 INFO  (SUITE-TestReqParamsAPI-seed#[C9C144B8420A7A25]-worker) [    ] o.a.s.SolrTestCaseJ4 ###deleteCore
   [junit4]   2> NOTE: leaving temporary files on disk at: /home/jenkins/workspace/Lucene-Solr-6.1-Linux/solr/build/solr-core/test/J1/temp/solr.handler.TestReqParamsAPI_C9C144B8420A7A25-001
   [junit4]   2> NOTE: test params are: codec=Asserting(Lucene60): {}, docValues:{}, maxPointsInLeafNode=189, maxMBSortInHeap=7.509753626908448, sim=RandomSimilarity(queryNorm=true,coord=no): {}, locale=en-GB, timezone=Etc/GMT+2
   [junit4]   2> NOTE: Linux 4.4.0-21-generic amd64/Oracle Corporation 1.8.0_92 (64-bit)/cpus=12,threads=1,free=289916136,total=532676608
   [junit4]   2> NOTE: All tests run in this JVM: [TestCollectionAPI, OpenExchangeRatesOrgProviderTest, DistributedMLTComponentTest, CdcrUpdateLogTest, TestSearcherReuse, TestLRUStatsCache, DistributedQueueTest, ShardRoutingCustomTest, TestStressVersions, TestDynamicFieldResource, OverseerRolesTest, DeleteReplicaTest, TriLevelCompositeIdRoutingTest, TestConfigSets, CoreAdminRequestStatusTest, ZkSolrClientTest, ChaosMonkeyNothingIsSafeTest, ShardRoutingTest, LeaderInitiatedRecoveryOnShardRestartTest, TestFastLRUCache, TestInfoStreamLogging, DistributedIntervalFacetingTest, TestFieldCacheSortRandom, TermVectorComponentTest, TestDFISimilarityFactory, TestRawTransformer, BlockJoinFacetRandomTest, TestQuerySenderListener, ParsingFieldUpdateProcessorsTest, SortByFunctionTest, ZkCLITest, ChaosMonkeySafeLeaderTest, TestOnReconnectListenerSupport, CollectionsAPIAsyncDistributedZkTest, TestFieldSortValues, TestChildDocTransformer, HdfsWriteToMultipleCollectionsTest, NotRequiredUniqueKeyTest, TermsComponentTest, DistributedFacetPivotSmallAdvancedTest, TolerantUpdateProcessorTest, TestSimpleTrackingShardHandler, MinimalSchemaTest, TestObjectReleaseTracker, TestLegacyFieldCache, NumericFieldsTest, TestTrie, SaslZkACLProviderTest, TimeZoneUtilsTest, TestReRankQParserPlugin, TestScoreJoinQPNoScore, MoreLikeThisHandlerTest, TestQuerySenderNoQuery, TestSha256AuthenticationProvider, SpellCheckComponentTest, ExitableDirectoryReaderTest, HdfsThreadLeakTest, TestRestManager, TestPivotHelperCode, BitVectorTest, RuleEngineTest, MultiTermTest, WordBreakSolrSpellCheckerTest, UniqFieldsUpdateProcessorFactoryTest, TestSystemIdResolver, BlockDirectoryTest, FastVectorHighlighterTest, TestConfigSetsAPIZkFailure, TestTestInjection, TestBlobHandler, CollectionsAPIDistributedZkTest, LoggingHandlerTest, TestSolrCoreProperties, TestUniqueKeyFieldResource, TestManagedSchemaAPI, HLLSerializationTest, DocValuesTest, TestFiltering, TestCursorMarkWithoutUniqueKey, TestAuthorizationFramework, SuggesterFSTTest, TestQueryTypes, TestUpdate, TestCloudDeleteByQuery, SolrCmdDistributorTest, CloudMLTQParserTest, DirectSolrSpellCheckerTest, TestSerializedLuceneMatchVersion, SpellCheckCollatorTest, CollectionReloadTest, SchemaVersionSpecificBehaviorTest, TestReqParamsAPI]
   [junit4] Completed [231/613 (1!)] on J1 in 32.00s, 1 test, 1 failure <<< FAILURES!

[...truncated 1231 lines...]
BUILD FAILED
/home/jenkins/workspace/Lucene-Solr-6.1-Linux/build.xml:740: The following error occurred while executing this line:
/home/jenkins/workspace/Lucene-Solr-6.1-Linux/build.xml:684: The following error occurred while executing this line:
/home/jenkins/workspace/Lucene-Solr-6.1-Linux/build.xml:59: The following error occurred while executing this line:
/home/jenkins/workspace/Lucene-Solr-6.1-Linux/solr/build.xml:233: The following error occurred while executing this line:
/home/jenkins/workspace/Lucene-Solr-6.1-Linux/solr/common-build.xml:531: The following error occurred while executing this line:
/home/jenkins/workspace/Lucene-Solr-6.1-Linux/lucene/common-build.xml:1427: The following error occurred while executing this line:
/home/jenkins/workspace/Lucene-Solr-6.1-Linux/lucene/common-build.xml:984: There were test failures: 613 suites (10 ignored), 2569 tests, 1 failure, 116 ignored (72 assumptions) [seed: C9C144B8420A7A25]

Total time: 57 minutes 17 seconds
Build step 'Invoke Ant' marked build as failure
Archiving artifacts
[WARNINGS] Skipping publisher since build result is FAILURE
Recording test results
Email was triggered for: Failure - Any
Sending email for trigger: Failure - Any



Mime
View raw message