lucene-dev mailing list archives

Site index · List index
Message view « Date » · « Thread »
Top « Date » · « Thread »
From Policeman Jenkins Server <jenk...@thetaphi.de>
Subject [JENKINS] Lucene-Solr-master-Windows (64bit/jdk1.8.0_92) - Build # 5925 - Still Failing!
Date Tue, 21 Jun 2016 10:26:04 GMT
Build: http://jenkins.thetaphi.de/job/Lucene-Solr-master-Windows/5925/
Java: 64bit/jdk1.8.0_92 -XX:-UseCompressedOops -XX:+UseSerialGC

1 tests failed.
FAILED:  junit.framework.TestSuite.org.apache.solr.cloud.CdcrVersionReplicationTest

Error Message:
ObjectTracker found 1 object(s) that were not released!!! [InternalHttpClient]

Stack Trace:
java.lang.AssertionError: ObjectTracker found 1 object(s) that were not released!!! [InternalHttpClient]
	at __randomizedtesting.SeedInfo.seed([8322E4B323714702]:0)
	at org.junit.Assert.fail(Assert.java:93)
	at org.junit.Assert.assertTrue(Assert.java:43)
	at org.junit.Assert.assertNull(Assert.java:551)
	at org.apache.solr.SolrTestCaseJ4.teardownTestCases(SolrTestCaseJ4.java:256)
	at sun.reflect.GeneratedMethodAccessor21.invoke(Unknown Source)
	at sun.reflect.DelegatingMethodAccessorImpl.invoke(DelegatingMethodAccessorImpl.java:43)
	at java.lang.reflect.Method.invoke(Method.java:498)
	at com.carrotsearch.randomizedtesting.RandomizedRunner.invoke(RandomizedRunner.java:1764)
	at com.carrotsearch.randomizedtesting.RandomizedRunner$7.evaluate(RandomizedRunner.java:834)
	at com.carrotsearch.randomizedtesting.rules.StatementAdapter.evaluate(StatementAdapter.java:36)
	at com.carrotsearch.randomizedtesting.rules.SystemPropertiesRestoreRule$1.evaluate(SystemPropertiesRestoreRule.java:57)
	at org.apache.lucene.util.AbstractBeforeAfterRule$1.evaluate(AbstractBeforeAfterRule.java:45)
	at com.carrotsearch.randomizedtesting.rules.StatementAdapter.evaluate(StatementAdapter.java:36)
	at org.apache.lucene.util.TestRuleStoreClassName$1.evaluate(TestRuleStoreClassName.java:41)
	at com.carrotsearch.randomizedtesting.rules.NoShadowingOrOverridesOnMethodsRule$1.evaluate(NoShadowingOrOverridesOnMethodsRule.java:40)
	at com.carrotsearch.randomizedtesting.rules.NoShadowingOrOverridesOnMethodsRule$1.evaluate(NoShadowingOrOverridesOnMethodsRule.java:40)
	at com.carrotsearch.randomizedtesting.rules.StatementAdapter.evaluate(StatementAdapter.java:36)
	at com.carrotsearch.randomizedtesting.rules.StatementAdapter.evaluate(StatementAdapter.java:36)
	at com.carrotsearch.randomizedtesting.rules.StatementAdapter.evaluate(StatementAdapter.java:36)
	at org.apache.lucene.util.TestRuleAssertionsRequired$1.evaluate(TestRuleAssertionsRequired.java:53)
	at org.apache.lucene.util.TestRuleMarkFailure$1.evaluate(TestRuleMarkFailure.java:47)
	at org.apache.lucene.util.TestRuleIgnoreAfterMaxFailures$1.evaluate(TestRuleIgnoreAfterMaxFailures.java:64)
	at org.apache.lucene.util.TestRuleIgnoreTestSuites$1.evaluate(TestRuleIgnoreTestSuites.java:54)
	at com.carrotsearch.randomizedtesting.rules.StatementAdapter.evaluate(StatementAdapter.java:36)
	at com.carrotsearch.randomizedtesting.ThreadLeakControl$StatementRunner.run(ThreadLeakControl.java:367)
	at java.lang.Thread.run(Thread.java:745)




Build Log:
[...truncated 11960 lines...]
   [junit4] Suite: org.apache.solr.cloud.CdcrVersionReplicationTest
   [junit4]   2> Creating dataDir: C:\Users\jenkins\workspace\Lucene-Solr-master-Windows\solr\build\solr-core\test\J0\temp\solr.cloud.CdcrVersionReplicationTest_8322E4B323714702-001\init-core-data-001
   [junit4]   2> 2111012 INFO  (SUITE-CdcrVersionReplicationTest-seed#[8322E4B323714702]-worker) [    ] o.a.s.SolrTestCaseJ4 Randomized ssl (false) and clientAuth (true) via: @org.apache.solr.util.RandomizeSSL(reason=, value=NaN, ssl=NaN, clientAuth=NaN)
   [junit4]   2> 2111012 INFO  (SUITE-CdcrVersionReplicationTest-seed#[8322E4B323714702]-worker) [    ] o.a.s.BaseDistributedSearchTestCase Setting hostContext system property: /
   [junit4]   2> 2111016 INFO  (TEST-CdcrVersionReplicationTest.testCdcrDocVersions-seed#[8322E4B323714702]) [    ] o.a.s.c.ZkTestServer STARTING ZK TEST SERVER
   [junit4]   2> 2111018 INFO  (Thread-4808) [    ] o.a.s.c.ZkTestServer client port:0.0.0.0/0.0.0.0:0
   [junit4]   2> 2111018 INFO  (Thread-4808) [    ] o.a.s.c.ZkTestServer Starting server
   [junit4]   2> 2111116 INFO  (TEST-CdcrVersionReplicationTest.testCdcrDocVersions-seed#[8322E4B323714702]) [    ] o.a.s.c.ZkTestServer start zk server on port:60421
   [junit4]   2> 2111116 INFO  (TEST-CdcrVersionReplicationTest.testCdcrDocVersions-seed#[8322E4B323714702]) [    ] o.a.s.c.c.SolrZkClient Using default ZkCredentialsProvider
   [junit4]   2> 2111118 INFO  (TEST-CdcrVersionReplicationTest.testCdcrDocVersions-seed#[8322E4B323714702]) [    ] o.a.s.c.c.ConnectionManager Waiting for client to connect to ZooKeeper
   [junit4]   2> 2111121 INFO  (zkCallback-2238-thread-1) [    ] o.a.s.c.c.ConnectionManager Watcher org.apache.solr.common.cloud.ConnectionManager@2c630231 name:ZooKeeperConnection Watcher:127.0.0.1:60421 got event WatchedEvent state:SyncConnected type:None path:null path:null type:None
   [junit4]   2> 2111121 INFO  (TEST-CdcrVersionReplicationTest.testCdcrDocVersions-seed#[8322E4B323714702]) [    ] o.a.s.c.c.ConnectionManager Client is connected to ZooKeeper
   [junit4]   2> 2111121 INFO  (TEST-CdcrVersionReplicationTest.testCdcrDocVersions-seed#[8322E4B323714702]) [    ] o.a.s.c.c.SolrZkClient Using default ZkACLProvider
   [junit4]   2> 2111121 INFO  (TEST-CdcrVersionReplicationTest.testCdcrDocVersions-seed#[8322E4B323714702]) [    ] o.a.s.c.c.SolrZkClient makePath: /solr
   [junit4]   2> 2111127 INFO  (TEST-CdcrVersionReplicationTest.testCdcrDocVersions-seed#[8322E4B323714702]) [    ] o.a.s.c.c.SolrZkClient Using default ZkCredentialsProvider
   [junit4]   2> 2111129 INFO  (TEST-CdcrVersionReplicationTest.testCdcrDocVersions-seed#[8322E4B323714702]) [    ] o.a.s.c.c.ConnectionManager Waiting for client to connect to ZooKeeper
   [junit4]   2> 2111130 INFO  (zkCallback-2239-thread-1) [    ] o.a.s.c.c.ConnectionManager Watcher org.apache.solr.common.cloud.ConnectionManager@6ac09432 name:ZooKeeperConnection Watcher:127.0.0.1:60421/solr got event WatchedEvent state:SyncConnected type:None path:null path:null type:None
   [junit4]   2> 2111130 INFO  (TEST-CdcrVersionReplicationTest.testCdcrDocVersions-seed#[8322E4B323714702]) [    ] o.a.s.c.c.ConnectionManager Client is connected to ZooKeeper
   [junit4]   2> 2111130 INFO  (TEST-CdcrVersionReplicationTest.testCdcrDocVersions-seed#[8322E4B323714702]) [    ] o.a.s.c.c.SolrZkClient Using default ZkACLProvider
   [junit4]   2> 2111130 INFO  (TEST-CdcrVersionReplicationTest.testCdcrDocVersions-seed#[8322E4B323714702]) [    ] o.a.s.c.c.SolrZkClient makePath: /collections/collection1
   [junit4]   2> 2111134 INFO  (TEST-CdcrVersionReplicationTest.testCdcrDocVersions-seed#[8322E4B323714702]) [    ] o.a.s.c.c.SolrZkClient makePath: /collections/collection1/shards
   [junit4]   2> 2111136 INFO  (TEST-CdcrVersionReplicationTest.testCdcrDocVersions-seed#[8322E4B323714702]) [    ] o.a.s.c.c.SolrZkClient makePath: /collections/control_collection
   [junit4]   2> 2111137 INFO  (TEST-CdcrVersionReplicationTest.testCdcrDocVersions-seed#[8322E4B323714702]) [    ] o.a.s.c.c.SolrZkClient makePath: /collections/control_collection/shards
   [junit4]   2> 2111140 INFO  (TEST-CdcrVersionReplicationTest.testCdcrDocVersions-seed#[8322E4B323714702]) [    ] o.a.s.c.AbstractZkTestCase put C:\Users\jenkins\workspace\Lucene-Solr-master-Windows\solr\core\src\test-files\solr\collection1\conf\solrconfig-cdcr.xml to /configs/conf1/solrconfig.xml
   [junit4]   2> 2111141 INFO  (TEST-CdcrVersionReplicationTest.testCdcrDocVersions-seed#[8322E4B323714702]) [    ] o.a.s.c.c.SolrZkClient makePath: /configs/conf1/solrconfig.xml
   [junit4]   2> 2111144 INFO  (TEST-CdcrVersionReplicationTest.testCdcrDocVersions-seed#[8322E4B323714702]) [    ] o.a.s.c.AbstractZkTestCase put C:\Users\jenkins\workspace\Lucene-Solr-master-Windows\solr\core\src\test-files\solr\collection1\conf\schema15.xml to /configs/conf1/schema.xml
   [junit4]   2> 2111144 INFO  (TEST-CdcrVersionReplicationTest.testCdcrDocVersions-seed#[8322E4B323714702]) [    ] o.a.s.c.c.SolrZkClient makePath: /configs/conf1/schema.xml
   [junit4]   2> 2111147 INFO  (TEST-CdcrVersionReplicationTest.testCdcrDocVersions-seed#[8322E4B323714702]) [    ] o.a.s.c.AbstractZkTestCase put C:\Users\jenkins\workspace\Lucene-Solr-master-Windows\solr\core\src\test-files\solr\collection1\conf\solrconfig.snippet.randomindexconfig.xml to /configs/conf1/solrconfig.snippet.randomindexconfig.xml
   [junit4]   2> 2111147 INFO  (TEST-CdcrVersionReplicationTest.testCdcrDocVersions-seed#[8322E4B323714702]) [    ] o.a.s.c.c.SolrZkClient makePath: /configs/conf1/solrconfig.snippet.randomindexconfig.xml
   [junit4]   2> 2111150 INFO  (TEST-CdcrVersionReplicationTest.testCdcrDocVersions-seed#[8322E4B323714702]) [    ] o.a.s.c.AbstractZkTestCase put C:\Users\jenkins\workspace\Lucene-Solr-master-Windows\solr\core\src\test-files\solr\collection1\conf\stopwords.txt to /configs/conf1/stopwords.txt
   [junit4]   2> 2111150 INFO  (TEST-CdcrVersionReplicationTest.testCdcrDocVersions-seed#[8322E4B323714702]) [    ] o.a.s.c.c.SolrZkClient makePath: /configs/conf1/stopwords.txt
   [junit4]   2> 2111153 INFO  (TEST-CdcrVersionReplicationTest.testCdcrDocVersions-seed#[8322E4B323714702]) [    ] o.a.s.c.AbstractZkTestCase put C:\Users\jenkins\workspace\Lucene-Solr-master-Windows\solr\core\src\test-files\solr\collection1\conf\protwords.txt to /configs/conf1/protwords.txt
   [junit4]   2> 2111153 INFO  (TEST-CdcrVersionReplicationTest.testCdcrDocVersions-seed#[8322E4B323714702]) [    ] o.a.s.c.c.SolrZkClient makePath: /configs/conf1/protwords.txt
   [junit4]   2> 2111156 INFO  (TEST-CdcrVersionReplicationTest.testCdcrDocVersions-seed#[8322E4B323714702]) [    ] o.a.s.c.AbstractZkTestCase put C:\Users\jenkins\workspace\Lucene-Solr-master-Windows\solr\core\src\test-files\solr\collection1\conf\currency.xml to /configs/conf1/currency.xml
   [junit4]   2> 2111156 INFO  (TEST-CdcrVersionReplicationTest.testCdcrDocVersions-seed#[8322E4B323714702]) [    ] o.a.s.c.c.SolrZkClient makePath: /configs/conf1/currency.xml
   [junit4]   2> 2111158 INFO  (TEST-CdcrVersionReplicationTest.testCdcrDocVersions-seed#[8322E4B323714702]) [    ] o.a.s.c.AbstractZkTestCase put C:\Users\jenkins\workspace\Lucene-Solr-master-Windows\solr\core\src\test-files\solr\collection1\conf\enumsConfig.xml to /configs/conf1/enumsConfig.xml
   [junit4]   2> 2111159 INFO  (TEST-CdcrVersionReplicationTest.testCdcrDocVersions-seed#[8322E4B323714702]) [    ] o.a.s.c.c.SolrZkClient makePath: /configs/conf1/enumsConfig.xml
   [junit4]   2> 2111162 INFO  (TEST-CdcrVersionReplicationTest.testCdcrDocVersions-seed#[8322E4B323714702]) [    ] o.a.s.c.AbstractZkTestCase put C:\Users\jenkins\workspace\Lucene-Solr-master-Windows\solr\core\src\test-files\solr\collection1\conf\open-exchange-rates.json to /configs/conf1/open-exchange-rates.json
   [junit4]   2> 2111162 INFO  (TEST-CdcrVersionReplicationTest.testCdcrDocVersions-seed#[8322E4B323714702]) [    ] o.a.s.c.c.SolrZkClient makePath: /configs/conf1/open-exchange-rates.json
   [junit4]   2> 2111165 INFO  (TEST-CdcrVersionReplicationTest.testCdcrDocVersions-seed#[8322E4B323714702]) [    ] o.a.s.c.AbstractZkTestCase put C:\Users\jenkins\workspace\Lucene-Solr-master-Windows\solr\core\src\test-files\solr\collection1\conf\mapping-ISOLatin1Accent.txt to /configs/conf1/mapping-ISOLatin1Accent.txt
   [junit4]   2> 2111165 INFO  (TEST-CdcrVersionReplicationTest.testCdcrDocVersions-seed#[8322E4B323714702]) [    ] o.a.s.c.c.SolrZkClient makePath: /configs/conf1/mapping-ISOLatin1Accent.txt
   [junit4]   2> 2111168 INFO  (TEST-CdcrVersionReplicationTest.testCdcrDocVersions-seed#[8322E4B323714702]) [    ] o.a.s.c.AbstractZkTestCase put C:\Users\jenkins\workspace\Lucene-Solr-master-Windows\solr\core\src\test-files\solr\collection1\conf\old_synonyms.txt to /configs/conf1/old_synonyms.txt
   [junit4]   2> 2111168 INFO  (TEST-CdcrVersionReplicationTest.testCdcrDocVersions-seed#[8322E4B323714702]) [    ] o.a.s.c.c.SolrZkClient makePath: /configs/conf1/old_synonyms.txt
   [junit4]   2> 2111171 INFO  (TEST-CdcrVersionReplicationTest.testCdcrDocVersions-seed#[8322E4B323714702]) [    ] o.a.s.c.AbstractZkTestCase put C:\Users\jenkins\workspace\Lucene-Solr-master-Windows\solr\core\src\test-files\solr\collection1\conf\synonyms.txt to /configs/conf1/synonyms.txt
   [junit4]   2> 2111171 INFO  (TEST-CdcrVersionReplicationTest.testCdcrDocVersions-seed#[8322E4B323714702]) [    ] o.a.s.c.c.SolrZkClient makePath: /configs/conf1/synonyms.txt
   [junit4]   2> 2111174 INFO  (TEST-CdcrVersionReplicationTest.testCdcrDocVersions-seed#[8322E4B323714702]) [    ] o.a.s.SolrTestCaseJ4 ###Starting testCdcrDocVersions
   [junit4]   2> 2111703 INFO  (TEST-CdcrVersionReplicationTest.testCdcrDocVersions-seed#[8322E4B323714702]) [    ] o.a.s.SolrTestCaseJ4 Writing core.properties file to C:\Users\jenkins\workspace\Lucene-Solr-master-Windows\solr\build\solr-core\test\J0\temp\solr.cloud.CdcrVersionReplicationTest_8322E4B323714702-001\jetty-001\cores\collection1
   [junit4]   2> 2111706 INFO  (TEST-CdcrVersionReplicationTest.testCdcrDocVersions-seed#[8322E4B323714702]) [    ] o.e.j.s.Server jetty-9.3.8.v20160314
   [junit4]   2> 2111707 INFO  (TEST-CdcrVersionReplicationTest.testCdcrDocVersions-seed#[8322E4B323714702]) [    ] o.e.j.s.h.ContextHandler Started o.e.j.s.ServletContextHandler@1d77e9c{/,null,AVAILABLE}
   [junit4]   2> 2111708 INFO  (TEST-CdcrVersionReplicationTest.testCdcrDocVersions-seed#[8322E4B323714702]) [    ] o.e.j.s.ServerConnector Started ServerConnector@2a92eb18{HTTP/1.1,[http/1.1]}{127.0.0.1:60428}
   [junit4]   2> 2111708 INFO  (TEST-CdcrVersionReplicationTest.testCdcrDocVersions-seed#[8322E4B323714702]) [    ] o.e.j.s.Server Started @2116292ms
   [junit4]   2> 2111708 INFO  (TEST-CdcrVersionReplicationTest.testCdcrDocVersions-seed#[8322E4B323714702]) [    ] o.a.s.c.s.e.JettySolrRunner Jetty properties: {shards=shard1, hostContext=/, hostPort=60428, coreRootDirectory=C:\Users\jenkins\workspace\Lucene-Solr-master-Windows\solr\build\solr-core\test\J0\temp\solr.cloud.CdcrVersionReplicationTest_8322E4B323714702-001\jetty-001\cores}
   [junit4]   2> 2111708 INFO  (TEST-CdcrVersionReplicationTest.testCdcrDocVersions-seed#[8322E4B323714702]) [    ] o.a.s.s.SolrDispatchFilter SolrDispatchFilter.init(): sun.misc.Launcher$AppClassLoader@73d16e93
   [junit4]   2> 2111708 INFO  (TEST-CdcrVersionReplicationTest.testCdcrDocVersions-seed#[8322E4B323714702]) [    ] o.a.s.c.SolrResourceLoader new SolrResourceLoader for directory: 'C:\Users\jenkins\workspace\Lucene-Solr-master-Windows\solr\build\solr-core\test\J0\temp\solr.cloud.CdcrVersionReplicationTest_8322E4B323714702-001\jetty-001'
   [junit4]   2> 2111708 INFO  (TEST-CdcrVersionReplicationTest.testCdcrDocVersions-seed#[8322E4B323714702]) [    ] o.a.s.c.SolrResourceLoader JNDI not configured for solr (NoInitialContextEx)
   [junit4]   2> 2111708 INFO  (TEST-CdcrVersionReplicationTest.testCdcrDocVersions-seed#[8322E4B323714702]) [    ] o.a.s.c.SolrResourceLoader solr home defaulted to 'solr/' (could not find system property or JNDI)
   [junit4]   2> 2111709 INFO  (TEST-CdcrVersionReplicationTest.testCdcrDocVersions-seed#[8322E4B323714702]) [    ] o.a.s.c.c.SolrZkClient Using default ZkCredentialsProvider
   [junit4]   2> 2111709 INFO  (TEST-CdcrVersionReplicationTest.testCdcrDocVersions-seed#[8322E4B323714702]) [    ] o.a.s.c.c.ConnectionManager Waiting for client to connect to ZooKeeper
   [junit4]   2> 2111710 INFO  (zkCallback-2240-thread-1) [    ] o.a.s.c.c.ConnectionManager Watcher org.apache.solr.common.cloud.ConnectionManager@516d932a name:ZooKeeperConnection Watcher:127.0.0.1:60421/solr got event WatchedEvent state:SyncConnected type:None path:null path:null type:None
   [junit4]   2> 2111710 INFO  (TEST-CdcrVersionReplicationTest.testCdcrDocVersions-seed#[8322E4B323714702]) [    ] o.a.s.c.c.ConnectionManager Client is connected to ZooKeeper
   [junit4]   2> 2111710 INFO  (TEST-CdcrVersionReplicationTest.testCdcrDocVersions-seed#[8322E4B323714702]) [    ] o.a.s.c.c.SolrZkClient Using default ZkACLProvider
   [junit4]   2> 2111711 INFO  (TEST-CdcrVersionReplicationTest.testCdcrDocVersions-seed#[8322E4B323714702]) [    ] o.a.s.s.SolrDispatchFilter Loading solr.xml from SolrHome (not found in ZooKeeper)
   [junit4]   2> 2111711 INFO  (TEST-CdcrVersionReplicationTest.testCdcrDocVersions-seed#[8322E4B323714702]) [    ] o.a.s.c.SolrXmlConfig Loading container configuration from C:\Users\jenkins\workspace\Lucene-Solr-master-Windows\solr\build\solr-core\test\J0\temp\solr.cloud.CdcrVersionReplicationTest_8322E4B323714702-001\jetty-001\solr.xml
   [junit4]   2> 2111713 WARN  (NIOServerCxn.Factory:0.0.0.0/0.0.0.0:0) [    ] o.a.z.s.NIOServerCnxn caught end of stream exception
   [junit4]   2> EndOfStreamException: Unable to read additional data from client sessionid 0x155726d80320002, likely client has closed socket
   [junit4]   2> 	at org.apache.zookeeper.server.NIOServerCnxn.doIO(NIOServerCnxn.java:228)
   [junit4]   2> 	at org.apache.zookeeper.server.NIOServerCnxnFactory.run(NIOServerCnxnFactory.java:208)
   [junit4]   2> 	at java.lang.Thread.run(Thread.java:745)
   [junit4]   2> 2111723 INFO  (TEST-CdcrVersionReplicationTest.testCdcrDocVersions-seed#[8322E4B323714702]) [    ] o.a.s.c.CorePropertiesLocator Config-defined core root directory: C:\Users\jenkins\workspace\Lucene-Solr-master-Windows\solr\build\solr-core\test\J0\temp\solr.cloud.CdcrVersionReplicationTest_8322E4B323714702-001\jetty-001\cores
   [junit4]   2> 2111723 INFO  (TEST-CdcrVersionReplicationTest.testCdcrDocVersions-seed#[8322E4B323714702]) [    ] o.a.s.c.CoreContainer New CoreContainer 2073697835
   [junit4]   2> 2111723 INFO  (TEST-CdcrVersionReplicationTest.testCdcrDocVersions-seed#[8322E4B323714702]) [    ] o.a.s.c.CoreContainer Loading cores into CoreContainer [instanceDir=C:\Users\jenkins\workspace\Lucene-Solr-master-Windows\solr\build\solr-core\test\J0\temp\solr.cloud.CdcrVersionReplicationTest_8322E4B323714702-001\jetty-001]
   [junit4]   2> 2111723 WARN  (TEST-CdcrVersionReplicationTest.testCdcrDocVersions-seed#[8322E4B323714702]) [    ] o.a.s.c.CoreContainer Couldn't add files from C:\Users\jenkins\workspace\Lucene-Solr-master-Windows\solr\build\solr-core\test\J0\temp\solr.cloud.CdcrVersionReplicationTest_8322E4B323714702-001\jetty-001\lib to classpath: C:\Users\jenkins\workspace\Lucene-Solr-master-Windows\solr\build\solr-core\test\J0\temp\solr.cloud.CdcrVersionReplicationTest_8322E4B323714702-001\jetty-001\lib
   [junit4]   2> 2111723 INFO  (TEST-CdcrVersionReplicationTest.testCdcrDocVersions-seed#[8322E4B323714702]) [    ] o.a.s.h.c.HttpShardHandlerFactory created with socketTimeout : 90000,urlScheme : ,connTimeout : 15000,maxConnectionsPerHost : 20,maxConnections : 10000,corePoolSize : 0,maximumPoolSize : 2147483647,maxThreadIdleTime : 5,sizeOfQueue : -1,fairnessPolicy : false,
   [junit4]   2> 2111727 INFO  (TEST-CdcrVersionReplicationTest.testCdcrDocVersions-seed#[8322E4B323714702]) [    ] o.a.s.u.UpdateShardHandler Creating UpdateShardHandler HTTP client with params: 
   [junit4]   2> 2111728 INFO  (TEST-CdcrVersionReplicationTest.testCdcrDocVersions-seed#[8322E4B323714702]) [    ] o.a.s.l.LogWatcher SLF4J impl is org.slf4j.impl.Log4jLoggerFactory
   [junit4]   2> 2111728 INFO  (TEST-CdcrVersionReplicationTest.testCdcrDocVersions-seed#[8322E4B323714702]) [    ] o.a.s.l.LogWatcher Registering Log Listener [Log4j (org.slf4j.impl.Log4jLoggerFactory)]
   [junit4]   2> 2111728 INFO  (TEST-CdcrVersionReplicationTest.testCdcrDocVersions-seed#[8322E4B323714702]) [    ] o.a.s.c.ZkContainer Zookeeper client=127.0.0.1:60421/solr
   [junit4]   2> 2111728 INFO  (TEST-CdcrVersionReplicationTest.testCdcrDocVersions-seed#[8322E4B323714702]) [    ] o.a.s.c.ZkController zkHost includes chroot
   [junit4]   2> 2111728 INFO  (TEST-CdcrVersionReplicationTest.testCdcrDocVersions-seed#[8322E4B323714702]) [    ] o.a.s.c.c.SolrZkClient Using default ZkCredentialsProvider
   [junit4]   2> 2111729 INFO  (TEST-CdcrVersionReplicationTest.testCdcrDocVersions-seed#[8322E4B323714702]) [    ] o.a.s.c.c.ConnectionManager Waiting for client to connect to ZooKeeper
   [junit4]   2> 2111730 INFO  (zkCallback-2243-thread-1) [    ] o.a.s.c.c.ConnectionManager Watcher org.apache.solr.common.cloud.ConnectionManager@650d516 name:ZooKeeperConnection Watcher:127.0.0.1:60421 got event WatchedEvent state:SyncConnected type:None path:null path:null type:None
   [junit4]   2> 2111731 INFO  (TEST-CdcrVersionReplicationTest.testCdcrDocVersions-seed#[8322E4B323714702]) [    ] o.a.s.c.c.ConnectionManager Client is connected to ZooKeeper
   [junit4]   2> 2111731 INFO  (TEST-CdcrVersionReplicationTest.testCdcrDocVersions-seed#[8322E4B323714702]) [    ] o.a.s.c.c.SolrZkClient Using default ZkACLProvider
   [junit4]   2> 2111731 WARN  (NIOServerCxn.Factory:0.0.0.0/0.0.0.0:0) [    ] o.a.z.s.NIOServerCnxn caught end of stream exception
   [junit4]   2> EndOfStreamException: Unable to read additional data from client sessionid 0x155726d80320003, likely client has closed socket
   [junit4]   2> 	at org.apache.zookeeper.server.NIOServerCnxn.doIO(NIOServerCnxn.java:228)
   [junit4]   2> 	at org.apache.zookeeper.server.NIOServerCnxnFactory.run(NIOServerCnxnFactory.java:208)
   [junit4]   2> 	at java.lang.Thread.run(Thread.java:745)
   [junit4]   2> 2111731 INFO  (TEST-CdcrVersionReplicationTest.testCdcrDocVersions-seed#[8322E4B323714702]) [n:127.0.0.1:60428_    ] o.a.s.c.ZkController Added new OnReconnect listener org.apache.solr.cloud.ZkController$$Lambda$9/1879742860@55117048
   [junit4]   2> 2111733 INFO  (TEST-CdcrVersionReplicationTest.testCdcrDocVersions-seed#[8322E4B323714702]) [n:127.0.0.1:60428_    ] o.a.s.c.c.ConnectionManager Waiting for client to connect to ZooKeeper
   [junit4]   2> 2111734 INFO  (zkCallback-2244-thread-1-processing-n:127.0.0.1:60428_) [n:127.0.0.1:60428_    ] o.a.s.c.c.ConnectionManager Watcher org.apache.solr.common.cloud.ConnectionManager@4a43faf2 name:ZooKeeperConnection Watcher:127.0.0.1:60421/solr got event WatchedEvent state:SyncConnected type:None path:null path:null type:None
   [junit4]   2> 2111734 INFO  (TEST-CdcrVersionReplicationTest.testCdcrDocVersions-seed#[8322E4B323714702]) [n:127.0.0.1:60428_    ] o.a.s.c.c.ConnectionManager Client is connected to ZooKeeper
   [junit4]   2> 2111735 INFO  (TEST-CdcrVersionReplicationTest.testCdcrDocVersions-seed#[8322E4B323714702]) [n:127.0.0.1:60428_    ] o.a.s.c.c.SolrZkClient makePath: /overseer/queue
   [junit4]   2> 2111738 INFO  (TEST-CdcrVersionReplicationTest.testCdcrDocVersions-seed#[8322E4B323714702]) [n:127.0.0.1:60428_    ] o.a.s.c.c.SolrZkClient makePath: /overseer/collection-queue-work
   [junit4]   2> 2111741 INFO  (TEST-CdcrVersionReplicationTest.testCdcrDocVersions-seed#[8322E4B323714702]) [n:127.0.0.1:60428_    ] o.a.s.c.c.SolrZkClient makePath: /overseer/collection-map-running
   [junit4]   2> 2111744 INFO  (TEST-CdcrVersionReplicationTest.testCdcrDocVersions-seed#[8322E4B323714702]) [n:127.0.0.1:60428_    ] o.a.s.c.c.SolrZkClient makePath: /overseer/collection-map-completed
   [junit4]   2> 2111747 INFO  (TEST-CdcrVersionReplicationTest.testCdcrDocVersions-seed#[8322E4B323714702]) [n:127.0.0.1:60428_    ] o.a.s.c.c.SolrZkClient makePath: /overseer/collection-map-failure
   [junit4]   2> 2111749 INFO  (TEST-CdcrVersionReplicationTest.testCdcrDocVersions-seed#[8322E4B323714702]) [n:127.0.0.1:60428_    ] o.a.s.c.c.SolrZkClient makePath: /live_nodes
   [junit4]   2> 2111751 INFO  (TEST-CdcrVersionReplicationTest.testCdcrDocVersions-seed#[8322E4B323714702]) [n:127.0.0.1:60428_    ] o.a.s.c.c.SolrZkClient makePath: /aliases.json
   [junit4]   2> 2111752 INFO  (TEST-CdcrVersionReplicationTest.testCdcrDocVersions-seed#[8322E4B323714702]) [n:127.0.0.1:60428_    ] o.a.s.c.c.SolrZkClient makePath: /clusterstate.json
   [junit4]   2> 2111754 INFO  (TEST-CdcrVersionReplicationTest.testCdcrDocVersions-seed#[8322E4B323714702]) [n:127.0.0.1:60428_    ] o.a.s.c.c.SolrZkClient makePath: /security.json
   [junit4]   2> 2111755 INFO  (TEST-CdcrVersionReplicationTest.testCdcrDocVersions-seed#[8322E4B323714702]) [n:127.0.0.1:60428_    ] o.a.s.c.c.ZkStateReader Updating cluster state from ZooKeeper... 
   [junit4]   2> 2111756 INFO  (TEST-CdcrVersionReplicationTest.testCdcrDocVersions-seed#[8322E4B323714702]) [n:127.0.0.1:60428_    ] o.a.s.c.c.ZkStateReader Loaded empty cluster properties
   [junit4]   2> 2111757 INFO  (TEST-CdcrVersionReplicationTest.testCdcrDocVersions-seed#[8322E4B323714702]) [n:127.0.0.1:60428_    ] o.a.s.c.c.ZkStateReader Updated live nodes from ZooKeeper... (0) -> (0)
   [junit4]   2> 2111760 INFO  (TEST-CdcrVersionReplicationTest.testCdcrDocVersions-seed#[8322E4B323714702]) [n:127.0.0.1:60428_    ] o.a.s.c.c.SolrZkClient makePath: /overseer_elect
   [junit4]   2> 2111762 INFO  (TEST-CdcrVersionReplicationTest.testCdcrDocVersions-seed#[8322E4B323714702]) [n:127.0.0.1:60428_    ] o.a.s.c.c.SolrZkClient makePath: /overseer_elect/election
   [junit4]   2> 2111764 INFO  (TEST-CdcrVersionReplicationTest.testCdcrDocVersions-seed#[8322E4B323714702]) [n:127.0.0.1:60428_    ] o.a.s.c.Overseer Overseer (id=null) closing
   [junit4]   2> 2111764 INFO  (TEST-CdcrVersionReplicationTest.testCdcrDocVersions-seed#[8322E4B323714702]) [n:127.0.0.1:60428_    ] o.a.s.c.LeaderElector Joined leadership election with path: /overseer_elect/election/96108781686095876-127.0.0.1:60428_-n_0000000000
   [junit4]   2> 2111764 INFO  (TEST-CdcrVersionReplicationTest.testCdcrDocVersions-seed#[8322E4B323714702]) [n:127.0.0.1:60428_    ] o.a.s.c.OverseerElectionContext I am going to be the leader 127.0.0.1:60428_
   [junit4]   2> 2111764 INFO  (TEST-CdcrVersionReplicationTest.testCdcrDocVersions-seed#[8322E4B323714702]) [n:127.0.0.1:60428_    ] o.a.s.c.c.SolrZkClient makePath: /overseer_elect/leader
   [junit4]   2> 2111766 INFO  (TEST-CdcrVersionReplicationTest.testCdcrDocVersions-seed#[8322E4B323714702]) [n:127.0.0.1:60428_    ] o.a.s.c.Overseer Overseer (id=96108781686095876-127.0.0.1:60428_-n_0000000000) starting
   [junit4]   2> 2111768 INFO  (TEST-CdcrVersionReplicationTest.testCdcrDocVersions-seed#[8322E4B323714702]) [n:127.0.0.1:60428_    ] o.a.s.c.c.SolrZkClient makePath: /overseer/queue-work
   [junit4]   2> 2111775 INFO  (TEST-CdcrVersionReplicationTest.testCdcrDocVersions-seed#[8322E4B323714702]) [n:127.0.0.1:60428_    ] o.a.s.c.OverseerAutoReplicaFailoverThread Starting OverseerAutoReplicaFailoverThread autoReplicaFailoverWorkLoopDelay=10000 autoReplicaFailoverWaitAfterExpiration=30000 autoReplicaFailoverBadNodeExpiration=60000
   [junit4]   2> 2111777 INFO  (OverseerCollectionConfigSetProcessor-96108781686095876-127.0.0.1:60428_-n_0000000000) [n:127.0.0.1:60428_    ] o.a.s.c.OverseerTaskProcessor Process current queue of overseer operations
   [junit4]   2> 2111777 INFO  (TEST-CdcrVersionReplicationTest.testCdcrDocVersions-seed#[8322E4B323714702]) [n:127.0.0.1:60428_    ] o.a.s.c.ZkController Register node as live in ZooKeeper:/live_nodes/127.0.0.1:60428_
   [junit4]   2> 2111777 INFO  (TEST-CdcrVersionReplicationTest.testCdcrDocVersions-seed#[8322E4B323714702]) [n:127.0.0.1:60428_    ] o.a.s.c.c.SolrZkClient makePath: /live_nodes/127.0.0.1:60428_
   [junit4]   2> 2111778 INFO  (OverseerStateUpdate-96108781686095876-127.0.0.1:60428_-n_0000000000) [n:127.0.0.1:60428_    ] o.a.s.c.Overseer Starting to work on the main queue
   [junit4]   2> 2111779 INFO  (zkCallback-2244-thread-1-processing-n:127.0.0.1:60428_) [n:127.0.0.1:60428_    ] o.a.s.c.c.ZkStateReader A live node change: [WatchedEvent state:SyncConnected type:NodeChildrenChanged path:/live_nodes], has occurred - updating... (live nodes size: [0])
   [junit4]   2> 2111780 INFO  (OverseerStateUpdate-96108781686095876-127.0.0.1:60428_-n_0000000000) [n:127.0.0.1:60428_    ] o.a.s.c.c.ZkStateReader Updated live nodes from ZooKeeper... (0) -> (1)
   [junit4]   2> 2111786 INFO  (TEST-CdcrVersionReplicationTest.testCdcrDocVersions-seed#[8322E4B323714702]) [n:127.0.0.1:60428_    ] o.a.s.c.CoreContainer Security conf doesn't exist. Skipping setup for authorization module.
   [junit4]   2> 2111786 INFO  (TEST-CdcrVersionReplicationTest.testCdcrDocVersions-seed#[8322E4B323714702]) [n:127.0.0.1:60428_    ] o.a.s.c.CoreContainer No authentication plugin used.
   [junit4]   2> 2111788 INFO  (TEST-CdcrVersionReplicationTest.testCdcrDocVersions-seed#[8322E4B323714702]) [n:127.0.0.1:60428_    ] o.a.s.c.CorePropertiesLocator Looking for core definitions underneath C:\Users\jenkins\workspace\Lucene-Solr-master-Windows\solr\build\solr-core\test\J0\temp\solr.cloud.CdcrVersionReplicationTest_8322E4B323714702-001\jetty-001\cores
   [junit4]   2> 2111790 INFO  (TEST-CdcrVersionReplicationTest.testCdcrDocVersions-seed#[8322E4B323714702]) [n:127.0.0.1:60428_    ] o.a.s.c.CoreDescriptor Created CoreDescriptor: {name=collection1, config=solrconfig.xml, transient=false, schema=schema.xml, loadOnStartup=true, configSetProperties=configsetprops.json, collection=tmp_collection, coreNodeName=, dataDir=data\, shard=}
   [junit4]   2> 2111790 INFO  (TEST-CdcrVersionReplicationTest.testCdcrDocVersions-seed#[8322E4B323714702]) [n:127.0.0.1:60428_    ] o.a.s.c.CorePropertiesLocator Found core collection1 in C:\Users\jenkins\workspace\Lucene-Solr-master-Windows\solr\build\solr-core\test\J0\temp\solr.cloud.CdcrVersionReplicationTest_8322E4B323714702-001\jetty-001\cores\collection1
   [junit4]   2> 2111790 INFO  (TEST-CdcrVersionReplicationTest.testCdcrDocVersions-seed#[8322E4B323714702]) [n:127.0.0.1:60428_    ] o.a.s.c.CorePropertiesLocator Found 1 core definitions
   [junit4]   2> 2111791 INFO  (coreLoadExecutor-6307-thread-1-processing-n:127.0.0.1:60428_) [n:127.0.0.1:60428_ c:tmp_collection   x:collection1] o.a.s.c.ZkController publishing state=down
   [junit4]   2> 2111791 INFO  (coreLoadExecutor-6307-thread-1-processing-n:127.0.0.1:60428_) [n:127.0.0.1:60428_ c:tmp_collection   x:collection1] o.a.s.c.ZkController numShards not found on descriptor - reading it from system property
   [junit4]   2> 2111791 INFO  (TEST-CdcrVersionReplicationTest.testCdcrDocVersions-seed#[8322E4B323714702]) [n:127.0.0.1:60428_    ] o.a.s.s.SolrDispatchFilter user.dir=C:\Users\jenkins\workspace\Lucene-Solr-master-Windows\solr\build\solr-core\test\J0
   [junit4]   2> 2111791 INFO  (TEST-CdcrVersionReplicationTest.testCdcrDocVersions-seed#[8322E4B323714702]) [n:127.0.0.1:60428_    ] o.a.s.s.SolrDispatchFilter SolrDispatchFilter.init() done
   [junit4]   2> 2111792 INFO  (coreLoadExecutor-6307-thread-1-processing-n:127.0.0.1:60428_) [n:127.0.0.1:60428_ c:tmp_collection   x:collection1] o.a.s.c.ZkController Collection tmp_collection not visible yet, but flagging it so a watch is registered when it becomes visible
   [junit4]   2> 2111793 INFO  (OverseerStateUpdate-96108781686095876-127.0.0.1:60428_-n_0000000000) [n:127.0.0.1:60428_    ] o.a.s.c.Overseer processMessage: queueSize: 1, message = {
   [junit4]   2>   "core":"collection1",
   [junit4]   2>   "roles":null,
   [junit4]   2>   "base_url":"http://127.0.0.1:60428",
   [junit4]   2>   "node_name":"127.0.0.1:60428_",
   [junit4]   2>   "numShards":"2",
   [junit4]   2>   "state":"down",
   [junit4]   2>   "shard":null,
   [junit4]   2>   "collection":"tmp_collection",
   [junit4]   2>   "operation":"state"} current state version: 0
   [junit4]   2> 2111793 INFO  (OverseerStateUpdate-96108781686095876-127.0.0.1:60428_-n_0000000000) [n:127.0.0.1:60428_    ] o.a.s.c.o.ReplicaMutator Update state numShards=2 message={
   [junit4]   2>   "core":"collection1",
   [junit4]   2>   "roles":null,
   [junit4]   2>   "base_url":"http://127.0.0.1:60428",
   [junit4]   2>   "node_name":"127.0.0.1:60428_",
   [junit4]   2>   "numShards":"2",
   [junit4]   2>   "state":"down",
   [junit4]   2>   "shard":null,
   [junit4]   2>   "collection":"tmp_collection",
   [junit4]   2>   "operation":"state"}
   [junit4]   2> 2111793 INFO  (OverseerStateUpdate-96108781686095876-127.0.0.1:60428_-n_0000000000) [n:127.0.0.1:60428_    ] o.a.s.c.o.ClusterStateMutator building a new cName: tmp_collection
   [junit4]   2> 2111793 INFO  (OverseerStateUpdate-96108781686095876-127.0.0.1:60428_-n_0000000000) [n:127.0.0.1:60428_    ] o.a.s.c.o.ReplicaMutator Assigning new node to shard shard=shard2
   [junit4]   2> 2111793 INFO  (coreLoadExecutor-6307-thread-1-processing-n:127.0.0.1:60428_) [n:127.0.0.1:60428_ c:tmp_collection   x:collection1] o.a.s.c.c.ZkStateReader Deleting data for [tmp_collection]
   [junit4]   2> 2111794 INFO  (zkCallback-2244-thread-1-processing-n:127.0.0.1:60428_) [n:127.0.0.1:60428_    ] o.a.s.c.c.ZkStateReader A cluster state change: [WatchedEvent state:SyncConnected type:NodeDataChanged path:/clusterstate.json], has occurred - updating... (live nodes size: [1])
   [junit4]   2> 2111794 INFO  (coreLoadExecutor-6307-thread-1-processing-n:127.0.0.1:60428_) [n:127.0.0.1:60428_ c:tmp_collection   x:collection1] o.a.s.c.ZkController look for our core node name
   [junit4]   2> 2111794 INFO  (coreLoadExecutor-6307-thread-1-processing-n:127.0.0.1:60428_) [n:127.0.0.1:60428_ c:tmp_collection   x:collection1] o.a.s.c.ZkController waiting to find shard id in clusterstate for collection1
   [junit4]   2> 2111794 INFO  (coreLoadExecutor-6307-thread-1-processing-n:127.0.0.1:60428_) [n:127.0.0.1:60428_ c:tmp_collection   x:collection1] o.a.s.c.ZkController Check for collection zkNode:tmp_collection
   [junit4]   2> 2111796 INFO  (coreLoadExecutor-6307-thread-1-processing-n:127.0.0.1:60428_) [n:127.0.0.1:60428_ c:tmp_collection   x:collection1] o.a.s.c.ZkController Creating collection in ZooKeeper:tmp_collection
   [junit4]   2> 2111796 INFO  (coreLoadExecutor-6307-thread-1-processing-n:127.0.0.1:60428_) [n:127.0.0.1:60428_ c:tmp_collection   x:collection1] o.a.s.c.ZkController Looking for collection configName
   [junit4]   2> 2111797 INFO  (coreLoadExecutor-6307-thread-1-processing-n:127.0.0.1:60428_) [n:127.0.0.1:60428_ c:tmp_collection   x:collection1] o.a.s.c.ZkController Only one config set found in zk - using it:conf1
   [junit4]   2> 2111797 INFO  (coreLoadExecutor-6307-thread-1-processing-n:127.0.0.1:60428_) [n:127.0.0.1:60428_ c:tmp_collection   x:collection1] o.a.s.c.c.SolrZkClient makePath: /collections/tmp_collection
   [junit4]   2> 2111798 INFO  (zkCallback-2244-thread-1-processing-n:127.0.0.1:60428_) [n:127.0.0.1:60428_    ] o.a.s.c.c.ZkStateReader A collections change: [WatchedEvent state:SyncConnected type:NodeChildrenChanged path:/collections], has occurred - updating...
   [junit4]   2> 2111799 INFO  (coreLoadExecutor-6307-thread-1-processing-n:127.0.0.1:60428_) [n:127.0.0.1:60428_ c:tmp_collection   x:collection1] o.a.s.c.c.ZkStateReader Load collection config from: [/collections/tmp_collection]
   [junit4]   2> 2111800 INFO  (coreLoadExecutor-6307-thread-1-processing-n:127.0.0.1:60428_) [n:127.0.0.1:60428_ c:tmp_collection   x:collection1] o.a.s.c.c.ZkStateReader path=[/collections/tmp_collection] [configName]=[conf1] specified config exists in ZooKeeper
   [junit4]   2> 2111800 INFO  (coreLoadExecutor-6307-thread-1-processing-n:127.0.0.1:60428_) [n:127.0.0.1:60428_ c:tmp_collection   x:collection1] o.a.s.c.SolrResourceLoader new SolrResourceLoader for directory: 'C:\Users\jenkins\workspace\Lucene-Solr-master-Windows\solr\build\solr-core\test\J0\temp\solr.cloud.CdcrVersionReplicationTest_8322E4B323714702-001\jetty-001\cores\collection1'
   [junit4]   2> 2111800 INFO  (coreLoadExecutor-6307-thread-1-processing-n:127.0.0.1:60428_) [n:127.0.0.1:60428_ c:tmp_collection   x:collection1] o.a.s.c.SolrResourceLoader JNDI not configured for solr (NoInitialContextEx)
   [junit4]   2> 2111800 INFO  (coreLoadExecutor-6307-thread-1-processing-n:127.0.0.1:60428_) [n:127.0.0.1:60428_ c:tmp_collection   x:collection1] o.a.s.c.SolrResourceLoader solr home defaulted to 'solr/' (could not find system property or JNDI)
   [junit4]   2> 2111802 INFO  (coreLoadExecutor-6307-thread-1-processing-n:127.0.0.1:60428_) [n:127.0.0.1:60428_ c:tmp_collection   x:collection1] o.a.s.c.Config loaded config solrconfig.xml with version 0 
   [junit4]   2> 2111810 INFO  (coreLoadExecutor-6307-thread-1-processing-n:127.0.0.1:60428_) [n:127.0.0.1:60428_ c:tmp_collection   x:collection1] o.a.s.c.SolrConfig current version of requestparams : -1
   [junit4]   2> 2111833 INFO  (coreLoadExecutor-6307-thread-1-processing-n:127.0.0.1:60428_) [n:127.0.0.1:60428_ c:tmp_collection   x:collection1] o.a.s.c.SolrConfig Using Lucene MatchVersion: 7.0.0
   [junit4]   2> 2111839 INFO  (coreLoadExecutor-6307-thread-1-processing-n:127.0.0.1:60428_) [n:127.0.0.1:60428_ c:tmp_collection   x:collection1] o.a.s.c.SolrConfig Loaded SolrConfig: solrconfig.xml
   [junit4]   2> 2111844 INFO  (coreLoadExecutor-6307-thread-1-processing-n:127.0.0.1:60428_) [n:127.0.0.1:60428_ c:tmp_collection   x:collection1] o.a.s.s.IndexSchema [collection1] Schema name=test
   [junit4]   2> 2111914 INFO  (coreLoadExecutor-6307-thread-1-processing-n:127.0.0.1:60428_) [n:127.0.0.1:60428_ c:tmp_collection   x:collection1] o.a.s.s.IndexSchema default search field in schema is text
   [junit4]   2> 2111915 INFO  (coreLoadExecutor-6307-thread-1-processing-n:127.0.0.1:60428_) [n:127.0.0.1:60428_ c:tmp_collection   x:collection1] o.a.s.s.IndexSchema unique key field: id
   [junit4]   2> 2111916 INFO  (coreLoadExecutor-6307-thread-1-processing-n:127.0.0.1:60428_) [n:127.0.0.1:60428_ c:tmp_collection   x:collection1] o.a.s.s.FileExchangeRateProvider Reloading exchange rates from file currency.xml
   [junit4]   2> 2111919 INFO  (coreLoadExecutor-6307-thread-1-processing-n:127.0.0.1:60428_) [n:127.0.0.1:60428_ c:tmp_collection   x:collection1] o.a.s.s.FileExchangeRateProvider Reloading exchange rates from file currency.xml
   [junit4]   2> 2111942 INFO  (coreLoadExecutor-6307-thread-1-processing-n:127.0.0.1:60428_) [n:127.0.0.1:60428_ c:tmp_collection   x:collection1] o.a.s.c.ConfigSetProperties Did not find ConfigSet properties, assuming default properties: Can't find resource 'configsetprops.json' in classpath or '/configs/conf1', cwd=C:\Users\jenkins\workspace\Lucene-Solr-master-Windows\solr\build\solr-core\test\J0
   [junit4]   2> 2111942 INFO  (coreLoadExecutor-6307-thread-1-processing-n:127.0.0.1:60428_) [n:127.0.0.1:60428_ c:tmp_collection   x:collection1] o.a.s.c.CoreContainer Creating SolrCore 'collection1' using configuration from collection tmp_collection
   [junit4]   2> 2111942 INFO  (coreLoadExecutor-6307-thread-1-processing-n:127.0.0.1:60428_) [n:127.0.0.1:60428_ c:tmp_collection s:shard2 r:core_node1 x:collection1] o.a.s.c.SolrCore org.apache.solr.core.MockDirectoryFactory
   [junit4]   2> 2111943 INFO  (coreLoadExecutor-6307-thread-1-processing-n:127.0.0.1:60428_) [n:127.0.0.1:60428_ c:tmp_collection s:shard2 r:core_node1 x:collection1] o.a.s.c.SolrCore [[collection1] ] Opening new SolrCore at [C:\Users\jenkins\workspace\Lucene-Solr-master-Windows\solr\build\solr-core\test\J0\temp\solr.cloud.CdcrVersionReplicationTest_8322E4B323714702-001\jetty-001\cores\collection1], dataDir=[C:\Users\jenkins\workspace\Lucene-Solr-master-Windows\solr\build\solr-core\test\J0\temp\solr.cloud.CdcrVersionReplicationTest_8322E4B323714702-001\jetty-001\cores\collection1\data\]
   [junit4]   2> 2111943 INFO  (coreLoadExecutor-6307-thread-1-processing-n:127.0.0.1:60428_) [n:127.0.0.1:60428_ c:tmp_collection s:shard2 r:core_node1 x:collection1] o.a.s.c.JmxMonitoredMap JMX monitoring is enabled. Adding Solr mbeans to JMX Server: com.sun.jmx.mbeanserver.JmxMBeanServer@6e5382cc
   [junit4]   2> 2111943 INFO  (coreLoadExecutor-6307-thread-1-processing-n:127.0.0.1:60428_) [n:127.0.0.1:60428_ c:tmp_collection s:shard2 r:core_node1 x:collection1] o.a.s.c.CachingDirectoryFactory return new directory for C:\Users\jenkins\workspace\Lucene-Solr-master-Windows\solr\build\solr-core\test\J0\temp\solr.cloud.CdcrVersionReplicationTest_8322E4B323714702-001\jetty-001\cores\collection1\data\
   [junit4]   2> 2111943 INFO  (coreLoadExecutor-6307-thread-1-processing-n:127.0.0.1:60428_) [n:127.0.0.1:60428_ c:tmp_collection s:shard2 r:core_node1 x:collection1] o.a.s.c.SolrCore New index directory detected: old=null new=C:\Users\jenkins\workspace\Lucene-Solr-master-Windows\solr\build\solr-core\test\J0\temp\solr.cloud.CdcrVersionReplicationTest_8322E4B323714702-001\jetty-001\cores\collection1\data\index/
   [junit4]   2> 2111943 WARN  (coreLoadExecutor-6307-thread-1-processing-n:127.0.0.1:60428_) [n:127.0.0.1:60428_ c:tmp_collection s:shard2 r:core_node1 x:collection1] o.a.s.c.SolrCore [collection1] Solr index directory 'C:\Users\jenkins\workspace\Lucene-Solr-master-Windows\solr\build\solr-core\test\J0\temp\solr.cloud.CdcrVersionReplicationTest_8322E4B323714702-001\jetty-001\cores\collection1\data\index' doesn't exist. Creating new index...
   [junit4]   2> 2111944 INFO  (coreLoadExecutor-6307-thread-1-processing-n:127.0.0.1:60428_) [n:127.0.0.1:60428_ c:tmp_collection s:shard2 r:core_node1 x:collection1] o.a.s.c.CachingDirectoryFactory return new directory for C:\Users\jenkins\workspace\Lucene-Solr-master-Windows\solr\build\solr-core\test\J0\temp\solr.cloud.CdcrVersionReplicationTest_8322E4B323714702-001\jetty-001\cores\collection1\data\index
   [junit4]   2> 2111944 INFO  (coreLoadExecutor-6307-thread-1-processing-n:127.0.0.1:60428_) [n:127.0.0.1:60428_ c:tmp_collection s:shard2 r:core_node1 x:collection1] o.a.s.u.RandomMergePolicy RandomMergePolicy wrapping class org.apache.lucene.index.TieredMergePolicy: [TieredMergePolicy: maxMergeAtOnce=17, maxMergeAtOnceExplicit=13, maxMergedSegmentMB=3.1240234375, floorSegmentMB=1.4814453125, forceMergeDeletesPctAllowed=26.035615007161816, segmentsPerTier=43.0, maxCFSSegmentSizeMB=8.796093022207999E12, noCFSRatio=0.0
   [junit4]   2> 2111944 INFO  (coreLoadExecutor-6307-thread-1-processing-n:127.0.0.1:60428_) [n:127.0.0.1:60428_ c:tmp_collection s:shard2 r:core_node1 x:collection1] o.a.s.c.SolrDeletionPolicy SolrDeletionPolicy.onCommit: commits: num=1
   [junit4]   2> 	commit{dir=MockDirectoryWrapper(RAMDirectory@18a33eda lockFactory=org.apache.lucene.store.SingleInstanceLockFactory@3a4ac3bf),segFN=segments_1,generation=1}
   [junit4]   2> 2111944 INFO  (coreLoadExecutor-6307-thread-1-processing-n:127.0.0.1:60428_) [n:127.0.0.1:60428_ c:tmp_collection s:shard2 r:core_node1 x:collection1] o.a.s.c.SolrDeletionPolicy newest commit generation = 1
   [junit4]   2> 2111945 INFO  (OldIndexDirectoryCleanupThreadForCore-collection1) [n:127.0.0.1:60428_ c:tmp_collection s:shard2 r:core_node1 x:collection1] o.a.s.c.SolrCore Looking for old index directories to cleanup for core collection1 in C:\Users\jenkins\workspace\Lucene-Solr-master-Windows\solr\build\solr-core\test\J0\temp\solr.cloud.CdcrVersionReplicationTest_8322E4B323714702-001\jetty-001\cores\collection1\data\
   [junit4]   2> 2111946 WARN  (OldIndexDirectoryCleanupThreadForCore-collection1) [n:127.0.0.1:60428_ c:tmp_collection s:shard2 r:core_node1 x:collection1] o.a.s.c.DirectoryFactory C:\Users\jenkins\workspace\Lucene-Solr-master-Windows\solr\build\solr-core\test\J0\temp\solr.cloud.CdcrVersionReplicationTest_8322E4B323714702-001\jetty-001\cores\collection1\data\ does not point to a valid data directory; skipping clean-up of old index directories.
   [junit4]   2> 2111947 INFO  (coreLoadExecutor-6307-thread-1-processing-n:127.0.0.1:60428_) [n:127.0.0.1:60428_ c:tmp_collection s:shard2 r:core_node1 x:collection1] o.a.s.u.p.UpdateRequestProcessorChain creating updateRequestProcessorChain "cdcr-processor-chain"
   [junit4]   2> 2111995 INFO  (coreLoadExecutor-6307-thread-1-processing-n:127.0.0.1:60428_) [n:127.0.0.1:60428_ c:tmp_collection s:shard2 r:core_node1 x:collection1] o.a.s.c.SolrCore no updateRequestProcessorChain defined as default, creating implicit default
   [junit4]   2> 2111999 INFO  (coreLoadExecutor-6307-thread-1-processing-n:127.0.0.1:60428_) [n:127.0.0.1:60428_ c:tmp_collection s:shard2 r:core_node1 x:collection1] o.a.s.h.l.XMLLoader xsltCacheLifetimeSeconds=60
   [junit4]   2> 2112000 INFO  (coreLoadExecutor-6307-thread-1-processing-n:127.0.0.1:60428_) [n:127.0.0.1:60428_ c:tmp_collection s:shard2 r:core_node1 x:collection1] o.a.s.h.l.XMLLoader xsltCacheLifetimeSeconds=60
   [junit4]   2> 2112001 INFO  (coreLoadExecutor-6307-thread-1-processing-n:127.0.0.1:60428_) [n:127.0.0.1:60428_ c:tmp_collection s:shard2 r:core_node1 x:collection1] o.a.s.h.l.XMLLoader xsltCacheLifetimeSeconds=60
   [junit4]   2> 2112002 INFO  (coreLoadExecutor-6307-thread-1-processing-n:127.0.0.1:60428_) [n:127.0.0.1:60428_ c:tmp_collection s:shard2 r:core_node1 x:collection1] o.a.s.h.l.XMLLoader xsltCacheLifetimeSeconds=60
   [junit4]   2> 2112026 INFO  (coreLoadExecutor-6307-thread-1-processing-n:127.0.0.1:60428_) [n:127.0.0.1:60428_ c:tmp_collection s:shard2 r:core_node1 x:collection1] o.a.s.c.RequestHandlers Registered paths: /admin/mbeans,standard,/update/json/docs,/admin/luke,/export,/get,/admin/properties,/update/json,/admin/threads,/update/csv,/sql,/graph,/admin/segments,/admin/system,/replication,/config,/stream,/schema,/admin/plugins,/admin/logging,/admin/ping,/cdcr,/update,/admin/file
   [junit4]   2> 2112026 INFO  (coreLoadExecutor-6307-thread-1-processing-n:127.0.0.1:60428_) [n:127.0.0.1:60428_ c:tmp_collection s:shard2 r:core_node1 x:collection1] o.a.s.c.SolrCore Using default statsCache cache: org.apache.solr.search.stats.LocalStatsCache
   [junit4]   2> 2112058 INFO  (coreLoadExecutor-6307-thread-1-processing-n:127.0.0.1:60428_) [n:127.0.0.1:60428_ c:tmp_collection s:shard2 r:core_node1 x:collection1] o.a.s.u.UpdateHandler Using UpdateLog implementation: org.apache.solr.update.CdcrUpdateLog
   [junit4]   2> 2112058 INFO  (coreLoadExecutor-6307-thread-1-processing-n:127.0.0.1:60428_) [n:127.0.0.1:60428_ c:tmp_collection s:shard2 r:core_node1 x:collection1] o.a.s.u.UpdateLog Initializing UpdateLog: dataDir= defaultSyncLevel=FLUSH numRecordsToKeep=100 maxNumLogsToKeep=10 numVersionBuckets=65536
   [junit4]   2> 2112060 INFO  (coreLoadExecutor-6307-thread-1-processing-n:127.0.0.1:60428_) [n:127.0.0.1:60428_ c:tmp_collection s:shard2 r:core_node1 x:collection1] o.a.s.u.CommitTracker Hard AutoCommit: disabled
   [junit4]   2> 2112060 INFO  (coreLoadExecutor-6307-thread-1-processing-n:127.0.0.1:60428_) [n:127.0.0.1:60428_ c:tmp_collection s:shard2 r:core_node1 x:collection1] o.a.s.u.CommitTracker Soft AutoCommit: disabled
   [junit4]   2> 2112060 INFO  (coreLoadExecutor-6307-thread-1-processing-n:127.0.0.1:60428_) [n:127.0.0.1:60428_ c:tmp_collection s:shard2 r:core_node1 x:collection1] o.a.s.u.RandomMergePolicy RandomMergePolicy wrapping class org.apache.lucene.index.LogByteSizeMergePolicy: [LogByteSizeMergePolicy: minMergeSize=1677721, mergeFactor=10, maxMergeSize=2147483648, maxMergeSizeForForcedMerge=9223372036854775807, calibrateSizeByDeletes=false, maxMergeDocs=2147483647, maxCFSSegmentSizeMB=8.796093022207999E12, noCFSRatio=0.20227271957935386]
   [junit4]   2> 2112061 INFO  (coreLoadExecutor-6307-thread-1-processing-n:127.0.0.1:60428_) [n:127.0.0.1:60428_ c:tmp_collection s:shard2 r:core_node1 x:collection1] o.a.s.c.SolrDeletionPolicy SolrDeletionPolicy.onInit: commits: num=1
   [junit4]   2> 	commit{dir=MockDirectoryWrapper(RAMDirectory@18a33eda lockFactory=org.apache.lucene.store.SingleInstanceLockFactory@3a4ac3bf),segFN=segments_1,generation=1}
   [junit4]   2> 2112061 INFO  (coreLoadExecutor-6307-thread-1-processing-n:127.0.0.1:60428_) [n:127.0.0.1:60428_ c:tmp_collection s:shard2 r:core_node1 x:collection1] o.a.s.c.SolrDeletionPolicy newest commit generation = 1
   [junit4]   2> 2112061 INFO  (coreLoadExecutor-6307-thread-1-processing-n:127.0.0.1:60428_) [n:127.0.0.1:60428_ c:tmp_collection s:shard2 r:core_node1 x:collection1] o.a.s.s.SolrIndexSearcher Opening [Searcher@15c2762f[collection1] main]
   [junit4]   2> 2112061 INFO  (coreLoadExecutor-6307-thread-1-processing-n:127.0.0.1:60428_) [n:127.0.0.1:60428_ c:tmp_collection s:shard2 r:core_node1 x:collection1] o.a.s.c.c.ZkStateReader Load collection config from: [/collections/tmp_collection]
   [junit4]   2> 2112062 INFO  (coreLoadExecutor-6307-thread-1-processing-n:127.0.0.1:60428_) [n:127.0.0.1:60428_ c:tmp_collection s:shard2 r:core_node1 x:collection1] o.a.s.c.c.ZkStateReader path=[/collections/tmp_collection] [configName]=[conf1] specified config exists in ZooKeeper
   [junit4]   2> 2112062 INFO  (coreLoadExecutor-6307-thread-1-processing-n:127.0.0.1:60428_) [n:127.0.0.1:60428_ c:tmp_collection s:shard2 r:core_node1 x:collection1] o.a.s.r.ManagedResourceStorage Setting up ZooKeeper-based storage for the RestManager with znodeBase: /configs/conf1
   [junit4]   2> 2112062 INFO  (coreLoadExecutor-6307-thread-1-processing-n:127.0.0.1:60428_) [n:127.0.0.1:60428_ c:tmp_collection s:shard2 r:core_node1 x:collection1] o.a.s.r.ManagedResourceStorage Configured ZooKeeperStorageIO with znodeBase: /configs/conf1
   [junit4]   2> 2112062 INFO  (coreLoadExecutor-6307-thread-1-processing-n:127.0.0.1:60428_) [n:127.0.0.1:60428_ c:tmp_collection s:shard2 r:core_node1 x:collection1] o.a.s.r.RestManager Initializing RestManager with initArgs: {}
   [junit4]   2> 2112062 INFO  (coreLoadExecutor-6307-thread-1-processing-n:127.0.0.1:60428_) [n:127.0.0.1:60428_ c:tmp_collection s:shard2 r:core_node1 x:collection1] o.a.s.r.ManagedResourceStorage Reading _rest_managed.json using ZooKeeperStorageIO:path=/configs/conf1
   [junit4]   2> 2112062 INFO  (coreLoadExecutor-6307-thread-1-processing-n:127.0.0.1:60428_) [n:127.0.0.1:60428_ c:tmp_collection s:shard2 r:core_node1 x:collection1] o.a.s.r.ManagedResourceStorage No data found for znode /configs/conf1/_rest_managed.json
   [junit4]   2> 2112062 INFO  (coreLoadExecutor-6307-thread-1-processing-n:127.0.0.1:60428_) [n:127.0.0.1:60428_ c:tmp_collection s:shard2 r:core_node1 x:collection1] o.a.s.r.ManagedResourceStorage Loaded null at path _rest_managed.json using ZooKeeperStorageIO:path=/configs/conf1
   [junit4]   2> 2112062 INFO  (coreLoadExecutor-6307-thread-1-processing-n:127.0.0.1:60428_) [n:127.0.0.1:60428_ c:tmp_collection s:shard2 r:core_node1 x:collection1] o.a.s.r.RestManager Initializing 0 registered ManagedResources
   [junit4]   2> 2112062 INFO  (coreLoadExecutor-6307-thread-1-processing-n:127.0.0.1:60428_) [n:127.0.0.1:60428_ c:tmp_collection s:shard2 r:core_node1 x:collection1] o.a.s.h.ReplicationHandler Commits will be reserved for  10000
   [junit4]   2> 2112070 INFO  (coreLoadExecutor-6307-thread-1-processing-n:127.0.0.1:60428_) [n:127.0.0.1:60428_ c:tmp_collection s:shard2 r:core_node1 x:collection1] o.a.s.c.c.SolrZkClient makePath: /collections/tmp_collection/cdcr/state
   [junit4]   2> 2112074 INFO  (coreLoadExecutor-6307-thread-1-processing-n:127.0.0.1:60428_) [n:127.0.0.1:60428_ c:tmp_collection s:shard2 r:core_node1 x:collection1] o.a.s.h.CdcrBufferStateManager Created znode /collections/tmp_collection/cdcr/state/buffer
   [junit4]   2> 2112085 INFO  (coreLoadExecutor-6307-thread-1-processing-n:127.0.0.1:60428_) [n:127.0.0.1:60428_ c:tmp_collection s:shard2 r:core_node1 x:collection1] o.a.s.h.CdcrProcessStateManager Created znode /collections/tmp_collection/cdcr/state/process
   [junit4]   2> 2112133 INFO  (searcherExecutor-6308-thread-1-processing-n:127.0.0.1:60428_ x:collection1 s:shard2 c:tmp_collection r:core_node1) [n:127.0.0.1:60428_ c:tmp_collection s:shard2 r:core_node1 x:collection1] o.a.s.c.SolrCore [collection1] Registered new searcher Searcher@15c2762f[collection1] main{ExitableDirectoryReader(UninvertingDirectoryReader())}
   [junit4]   2> 2112133 INFO  (coreLoadExecutor-6307-thread-1-processing-n:127.0.0.1:60428_) [n:127.0.0.1:60428_ c:tmp_collection s:shard2 r:core_node1 x:collection1] o.a.s.u.UpdateLog Looking up max value of version field to seed version buckets
   [junit4]   2> 2112133 INFO  (coreLoadExecutor-6307-thread-1-processing-n:127.0.0.1:60428_) [n:127.0.0.1:60428_ c:tmp_collection s:shard2 r:core_node1 x:collection1] o.a.s.u.VersionInfo Refreshing highest value of _version_ for 65536 version buckets from index
   [junit4]   2> 2112133 INFO  (coreLoadExecutor-6307-thread-1-processing-n:127.0.0.1:60428_) [n:127.0.0.1:60428_ c:tmp_collection s:shard2 r:core_node1 x:collection1] o.a.s.u.VersionInfo No terms found for _version_, cannot seed version bucket highest value from index
   [junit4]   2> 2112133 INFO  (coreLoadExecutor-6307-thread-1-processing-n:127.0.0.1:60428_) [n:127.0.0.1:60428_ c:tmp_collection s:shard2 r:core_node1 x:collection1] o.a.s.u.UpdateLog Could not find max version in index or recent updates, using new clock 1537740508139356160
   [junit4]   2> 2112136 INFO  (coreLoadExecutor-6307-thread-1-processing-n:127.0.0.1:60428_) [n:127.0.0.1:60428_ c:tmp_collection s:shard2 r:core_node1 x:collection1] o.a.s.u.UpdateLog Took 1.0ms to seed version buckets with highest version 1537740508139356160
   [junit4]   2> 2112136 INFO  (coreLoadExecutor-6307-thread-1-processing-n:127.0.0.1:60428_) [n:127.0.0.1:60428_ c:tmp_collection s:shard2 r:core_node1 x:collection1] o.a.s.c.ZkController watch zkdir /configs/conf1
   [junit4]   2> 2112137 INFO  (coreLoadExecutor-6307-thread-1-processing-n:127.0.0.1:60428_) [n:127.0.0.1:60428_ c:tmp_collection s:shard2 r:core_node1 x:collection1] o.a.s.c.CoreContainer registering core: collection1
   [junit4]   2> 2112138 INFO  (coreZkRegister-6301-thread-1-processing-n:127.0.0.1:60428_ x:collection1 s:shard2 c:tmp_collection r:core_node1) [n:127.0.0.1:60428_ c:tmp_collection s:shard2 r:core_node1 x:collection1] o.a.s.c.ZkController Register replica - core:collection1 address:http://127.0.0.1:60428 collection:tmp_collection shard:shard2
   [junit4]   2> 2112138 INFO  (coreZkRegister-6301-thread-1-processing-n:127.0.0.1:60428_ x:collection1 s:shard2 c:tmp_collection r:core_node1) [n:127.0.0.1:60428_ c:tmp_collection s:shard2 r:core_node1 x:collection1] o.a.s.c.c.SolrZkClient makePath: /collections/tmp_collection/leader_elect/shard2/election
   [junit4]   2> 2112142 INFO  (coreZkRegister-6301-thread-1-processing-n:127.0.0.1:60428_ x:collection1 s:shard2 c:tmp_collection r:core_node1) [n:127.0.0.1:60428_ c:tmp_collection s:shard2 r:core_node1 x:collection1] o.a.s.c.LeaderElector Joined leadership election with path: /collections/tmp_collection/leader_elect/shard2/election/96108781686095876-core_node1-n_0000000000
   [junit4]   2> 2112143 INFO  (coreZkRegister-6301-thread-1-processing-n:127.0.0.1:60428_ x:collection1 s:shard2 c:tmp_collection r:core_node1) [n:127.0.0.1:60428_ c:tmp_collection s:shard2 r:core_node1 x:collection1] o.a.s.c.ShardLeaderElectionContext Running the leader process for shard=shard2 and weAreReplacement=false and leaderVoteWait=10000
   [junit4]   2> 2112145 INFO  (coreZkRegister-6301-thread-1-processing-n:127.0.0.1:60428_ x:collection1 s:shard2 c:tmp_collection r:core_node1) [n:127.0.0.1:60428_ c:tmp_collection s:shard2 r:core_node1 x:collection1] o.a.s.c.ShardLeaderElectionContext Enough replicas found to continue.
   [junit4]   2> 2112145 INFO  (coreZkRegister-6301-thread-1-processing-n:127.0.0.1:60428_ x:collection1 s:shard2 c:tmp_collection r:core_node1) [n:127.0.0.1:60428_ c:tmp_collection s:shard2 r:core_node1 x:collection1] o.a.s.c.ShardLeaderElectionContext I may be the new leader - try and sync
   [junit4]   2> 2112145 INFO  (coreZkRegister-6301-thread-1-processing-n:127.0.0.1:60428_ x:collection1 s:shard2 c:tmp_collection r:core_node1) [n:127.0.0.1:60428_ c:tmp_collection s:shard2 r:core_node1 x:collection1] o.a.s.c.SyncStrategy Sync replicas to http://127.0.0.1:60428/collection1/
   [junit4]   2> 2112145 INFO  (coreZkRegister-6301-thread-1-processing-n:127.0.0.1:60428_ x:collection1 s:shard2 c:tmp_collection r:core_node1) [n:127.0.0.1:60428_ c:tmp_collection s:shard2 r:core_node1 x:collection1] o.a.s.c.SyncStrategy Sync Success - now sync replicas to me
   [junit4]   2> 2112145 INFO  (OverseerStateUpdate-96108781686095876-127.0.0.1:60428_-n_0000000000) [n:127.0.0.1:60428_    ] o.a.s.c.Overseer processMessage: queueSize: 1, message = {
   [junit4]   2>   "operation":"leader",
   [junit4]   2>   "shard":"shard2",
   [junit4]   2>   "collection":"tmp_collection"} current state version: 1
   [junit4]   2> 2112145 INFO  (coreZkRegister-6301-thread-1-processing-n:127.0.0.1:60428_ x:collection1 s:shard2 c:tmp_collection r:core_node1) [n:127.0.0.1:60428_ c:tmp_collection s:shard2 r:core_node1 x:collection1] o.a.s.c.SyncStrategy http://127.0.0.1:60428/collection1/ has no replicas
   [junit4]   2> 2112146 INFO  (coreZkRegister-6301-thread-1-processing-n:127.0.0.1:60428_ x:collection1 s:shard2 c:tmp_collection r:core_node1) [n:127.0.0.1:60428_ c:tmp_collection s:shard2 r:core_node1 x:collection1] o.a.s.c.c.SolrZkClient makePath: /collections/tmp_collection/leaders/shard2
   [junit4]   2> 2112150 INFO  (coreZkRegister-6301-thread-1-processing-n:127.0.0.1:60428_ x:collection1 s:shard2 c:tmp_collection r:core_node1) [n:127.0.0.1:60428_ c:tmp_collection s:shard2 r:core_node1 x:collection1] o.a.s.c.ShardLeaderElectionContextBase Creating leader registration node /collections/tmp_collection/leaders/shard2/leader after winning as /collections/tmp_collection/leader_elect/shard2/election/96108781686095876-core_node1-n_0000000000
   [junit4]   2> 2112150 INFO  (zkCallback-2244-thread-1-processing-n:127.0.0.1:60428_) [n:127.0.0.1:60428_    ] o.a.s.h.CdcrLeaderStateManager Received new leader state @ tmp_collection:shard2
   [junit4]   2> 2112153 INFO  (coreZkRegister-6301-thread-1-processing-n:127.0.0.1:60428_ x:collection1 s:shard2 c:tmp_collection r:core_node1) [n:127.0.0.1:60428_ c:tmp_collection s:shard2 r:core_node1 x:collection1] o.a.s.c.ShardLeaderElectionContext I am the new leader: http://127.0.0.1:60428/collection1/ shard2
   [junit4]   2> 2112153 INFO  (OverseerStateUpdate-96108781686095876-127.0.0.1:60428_-n_0000000000) [n:127.0.0.1:60428_    ] o.a.s.c.Overseer processMessage: queueSize: 1, message = {
   [junit4]   2>   "operation":"leader",
   [junit4]   2>   "shard":"shard2",
   [junit4]   2>   "collection":"tmp_collection",
   [junit4]   2>   "base_url":"http://127.0.0.1:60428",
   [junit4]   2>   "core":"collection1",
   [junit4]   2>   "state":"active"} current state version: 1
   [junit4]   2> 2112258 INFO  (zkCallback-2244-thread-1-processing-n:127.0.0.1:60428_) [n:127.0.0.1:60428_    ] o.a.s.c.c.ZkStateReader A cluster state change: [WatchedEvent state:SyncConnected type:NodeDataChanged path:/clusterstate.json], has occurred - updating... (live nodes size: [1])
   [junit4]   2> 2112305 INFO  (coreZkRegister-6301-thread-1-processing-n:127.0.0.1:60428_ x:collection1 s:shard2 c:tmp_collection r:core_node1) [n:127.0.0.1:60428_ c:tmp_collection s:shard2 r:core_node1 x:collection1] o.a.s.c.ZkController We are http://127.0.0.1:60428/collection1/ and leader is http://127.0.0.1:60428/collection1/
   [junit4]   2> 2112305 INFO  (coreZkRegister-6301-thread-1-processing-n:127.0.0.1:60428_ x:collection1 s:shard2 c:tmp_collection r:core_node1) [n:127.0.0.1:60428_ c:tmp_collection s:shard2 r:core_node1 x:collection1] o.a.s.c.ZkController No LogReplay needed for core=collection1 baseURL=http://127.0.0.1:60428
   [junit4]   2> 2112305 INFO  (coreZkRegister-6301-thread-1-processing-n:127.0.0.1:60428_ x:collection1 s:shard2 c:tmp_collection r:core_node1) [n:127.0.0.1:60428_ c:tmp_collection s:shard2 r:core_node1 x:collection1] o.a.s.c.ZkController I am the leader, no recovery necessary
   [junit4]   2> 2112305 INFO  (coreZkRegister-6301-thread-1-processing-n:127.0.0.1:60428_ x:collection1 s:shard2 c:tmp_collection r:core_node1) [n:127.0.0.1:60428_ c:tmp_collection s:shard2 r:core_node1 x:collection1] o.a.s.c.ZkController publishing state=active
   [junit4]   2> 2112305 INFO  (coreZkRegister-6301-thread-1-processing-n:127.0.0.1:60428_ x:collection1 s:shard2 c:tmp_collection r:core_node1) [n:127.0.0.1:60428_ c:tmp_collection s:shard2 r:core_node1 x:collection1] o.a.s.c.ZkController numShards not found on descriptor - reading it from system property
   [junit4]   2> 2112307 INFO  (OverseerStateUpdate-96108781686095876-127.0.0.1:60428_-n_0000000000) [n:127.0.0.1:60428_    ] o.a.s.c.Overseer processMessage: queueSize: 1, message = {
   [junit4]   2>   "core":"collection1",
   [junit4]   2>   "core_node_name":"core_node1",
   [junit4]   2>   "roles":null,
   [junit4]   2>   "base_url":"http://127.0.0.1:60428",
   [junit4]   2>   "node_name":"127.0.0.1:60428_",
   [junit4]   2>   "numShards":"2",
   [junit4]   2>   "state":"active",
   [junit4]   2>   "shard":"shard2",
   [junit4]   2>   "collection":"tmp_collection",
   [junit4]   2>   "operation":"state"} current state version: 2
   [junit4]   2> 2112307 INFO  (OverseerStateUpdate-96108781686095876-127.0.0.1:60428_-n_0000000000) [n:127.0.0.1:60428_    ] o.a.s.c.o.ReplicaMutator Update state numShards=2 message={
   [junit4]   2>   "core":"collection1",
   [junit4]   2>   "core_node_name":"core_node1",
   [junit4]   2>   "roles":null,
   [junit4]   2>   "base_url":"http://127.0.0.1:60428",
   [junit4]   2>   "node_name":"127.0.0.1:60428_",
   [junit4]   2>   "numShards":"2",
   [junit4]   2>   "state":"active",
   [junit4]   2>   "shard":"shard2",
   [junit4]   2>   "collection":"tmp_collection",
   [junit4]   2>   "operation":"state"}
   [junit4]   2> 2112413 INFO  (zkCallback-2244-thread-3-processing-n:127.0.0.1:60428_) [n:127.0.0.1:60428_    ] o.a.s.c.c.ZkStateReader A cluster state change: [WatchedEvent state:SyncConnected type:NodeDataChanged path:/clusterstate.json], has occurred - updating... (live nodes size: [1])
   [junit4]   2> 2112758 INFO  (TEST-CdcrVersionReplicationTest.testCdcrDocVersions-seed#[8322E4B323714702]) [    ] o.a.s.SolrTestCaseJ4 Writing core.properties file to C:\Users\jenkins\workspace\Lucene-Solr-master-Windows\solr\build\solr-core\test\J0\temp\solr.cloud.CdcrVersionReplicationTest_8322E4B323714702-001\jetty-002\cores\collection1
   [junit4]   2> 2112762 INFO  (TEST-CdcrVersionReplicationTest.testCdcrDocVersions-seed#[8322E4B323714702]) [    ] o.e.j.s.Server jetty-9.3.8.v20160314
   [junit4]   2> 2112762 INFO  (TEST-CdcrVersionReplicationTest.testCdcrDocVersions-seed#[8322E4B323714702]) [    ] o.e.j.s.h.ContextHandler Started o.e.j.s.ServletContextHandler@65bfcd56{/,null,AVAILABLE}
   [junit4]   2> 2112764 INFO  (TEST-CdcrVersionReplicationTest.testCdcrDocVersions-seed#[8322E4B323714702]) [    ] o.e.j.s.ServerConnector Started ServerConnector@36b7de75{HTTP/1.1,[http/1.1]}{127.0.0.1:60440}
   [junit4]   2> 2112764 INFO  (TEST-CdcrVersionReplicationTest.testCdcrDocVersions-seed#[8322E4B323714702]) [    ] o.e.j.s.Server Started @2117348ms
   [junit4]   2> 2112764 INFO  (TEST-CdcrVersionReplicationTest.testCdcrDocVersions-seed#[8322E4B323714702]) [    ] o.a.s.c.s.e.JettySolrRunner Jetty properties: {shards=shard2, hostContext=/, hostPort=60440, coreRootDirectory=C:\Users\jenkins\workspace\Lucene-Solr-master-Windows\solr\build\solr-core\test\J0\temp\solr.cloud.CdcrVersionReplicationTest_8322E4B323714702-001\jetty-002\cores}
   [junit4]   2> 2112764 INFO  (TEST-CdcrVersionReplicationTest.testCdcrDocVersions-seed#[8322E4B323714702]) [    ] o.a.s.s.SolrDispatchFilter SolrDispatchFilter.init(): sun.misc.Launcher$AppClassLoader@73d16e93
   [junit4]   2> 2112765 INFO  (TEST-CdcrVersionReplicationTest.testCdcrDocVersions-seed#[8322E4B323714702]) [    ] o.a.s.c.SolrResourceLoader new SolrResourceLoader for directory: 'C:\Users\jenkins\workspace\Lucene-Solr-master-Windows\solr\build\solr-core\test\J0\temp\solr.cloud.CdcrVersionReplicationTest_8322E4B323714702-001\jetty-002'
   [junit4]   2> 2112765 INFO  (TEST-CdcrVersionReplicationTest.testCdcrDocVersions-seed#[8322E4B323714702]) [    ] o.a.s.c.SolrResourceLoader JNDI not configured for solr (NoInitialContextEx)
   [junit4]   2> 2112765 INFO  (TEST-CdcrVersionReplicationTest.testCdcrDocVersions-seed#[8322E4B323714702]) [    ] o.a.s.c.SolrResourceLoader solr home defaulted to 'solr/' (could not find system property or JNDI)
   [junit4]   2> 2112765 INFO  (TEST-CdcrVersionReplicationTest.testCdcrDocVersions-seed#[8322E4B323714702]) [    ] o.a.s.c.c.SolrZkClient Using default ZkCredentialsProvider
   [junit4]   2> 2112766 INFO  (TEST-CdcrVersionReplicationTest.testCdcrDocVersions-seed#[8322E4B323714702]) [    ] o.a.s.c.c.ConnectionManager Waiting for client to connect to ZooKeeper
   [junit4]   2> 2112767 INFO  (zkCallback-2246-thread-1) [    ] o.a.s.c.c.ConnectionManager Watcher org.apache.solr.common.cloud.ConnectionManager@f136cdb name:ZooKeeperConnection Watcher:127.0.0.1:60421/solr got event WatchedEvent state:SyncConnected type:None path:null path:null type:None
   [junit4]   2> 2112768 INFO  (TEST-CdcrVersionReplicationTest.testCdcrDocVersions-seed#[8322E4B323714702]) [    ] o.a.s.c.c.ConnectionManager Client is connected to ZooKeeper
   [junit4]   2> 2112768 INFO  (TEST-CdcrVersionReplicationTest.testCdcrDocVersions-seed#[8322E4B323714702]) [    ] o.a.s.c.c.SolrZkClient Using default ZkACLProvider
   [junit4]   2> 2112769 INFO  (TEST-CdcrVersionReplicationTest.testCdcrDocVersions-seed#[8322E4B323714702]) [    ] o.a.s.s.SolrDispatchFilter Loading solr.xml from SolrHome (not found in ZooKeeper)
   [junit4]   2> 2112769 INFO  (TEST-CdcrVersionReplicationTest.testCdcrDocVersions-seed#[8322E4B323714702]) [    ] o.a.s.c.SolrXmlConfig Loading container configuration from C:\Users\jenkins\workspace\Lucene-Solr-master-Windows\solr\build\solr-core\test\J0\temp\solr.cloud.CdcrVersionReplicationTest_8322E4B323714702-001\jetty-002\solr.xml
   [junit4]   2> 2112770 WARN  (NIOServerCxn.Factory:0.0.0.0/0.0.0.0:0) [    ] o.a.z.s.NIOServerCnxn caught end of stream exception
   [junit4]   2> EndOfStreamException: Unable to read additional data from client sessionid 0x155726d80320005, likely client has closed socket
   [junit4]   2> 	at org.apache.zookeeper.server.NIOServerCnxn.doIO(NIOServerCnxn.java:228)
   [junit4]   2> 	at org.apache.zookeeper.server.NIOServerCnxnFactory.run(NIOServerCnxnFactory.java:208)
   [junit4]   2> 	at java.lang.Thread.run(Thread.java:745)
   [junit4]   2> 2112797 INFO  (TEST-CdcrVersionReplicationTest.testCdcrDocVersions-seed#[8322E4B323714702]) [    ] o.a.s.c.CorePropertiesLocator Config-defined core root directory: C:\Users\jenkins\workspace\Lucene-Solr-master-Windows\solr\build\solr-core\test\J0\temp\solr.cloud.CdcrVersionReplicationTest_8322E4B323714702-001\jetty-002\cores
   [junit4]   2> 2112797 INFO  (TEST-CdcrVersionReplicationTest.testCdcrDocVersions-seed#[8322E4B323714702]) [    ] o.a.s.c.CoreContainer New CoreContainer 197204910
   [junit4]   2> 2112797 INFO  (TEST-CdcrVersionReplicationTest.testCdcrDocVersions-seed#[8322E4B323714702]) [    ] o.a.s.c.CoreContainer Loading cores into CoreContainer [instanceDir=C:\Users\jenkins\workspace\Lucene-Solr-master-Windows\solr\build\solr-core\test\J0\temp\solr.cloud.CdcrVersionReplicationTest_8322E4B323714702-001\jetty-002]
   [junit4]   2> 2112797 WARN  (TEST-CdcrVersionReplicationTest.testCdcrDocVersions-seed#[8322E4B323714702]) [    ] o.a.s.c.CoreContainer Couldn't add files from C:\Users\jenkins\workspace\Lucene-Solr-master-Windows\solr\build\solr-core\test\J0\temp\solr.cloud.CdcrVersionReplicationTest_8322E4B323714702-001\jetty-002\lib to classpath: C:\Users\jenkins\workspace\Lucene-Solr-master-Windows\solr\build\solr-core\test\J0\temp\solr.cloud.CdcrVersionReplicationTest_8322E4B323714702-001\jetty-002\lib
   [junit4]   2> 2112797 INFO  (TEST-CdcrVersionReplicationTest.testCdcrDocVersions-seed#[8322E4B323714702]) [    ] o.a.s.h.c.HttpShardHandlerFactory created with socketTimeout : 90000,urlScheme : ,connTimeout : 15000,maxConnectionsPerHost : 20,maxConnections : 10000,corePoolSize : 0,maximumPoolSize : 2147483647,maxThreadIdleTime : 5,sizeOfQueue : -1,fairnessPolicy : false,
   [junit4]   2> 2112802 INFO  (TEST-CdcrVersionReplicationTest.testCdcrDocVersions-seed#[8322E4B323714702]) [    ] o.a.s.u.UpdateShardHandler Creating UpdateShardHandler HTTP client with params: 
   [junit4]   2> 2112802 INFO  (TEST-CdcrVersionReplicationTest.testCdcrDocVersions-seed#[8322E4B323714702]) [    ] o.a.s.l.LogWatcher SLF4J impl is org.slf4j.impl.Log4jLoggerFactory
   [junit4]   2> 2112802 INFO  (TEST-CdcrVersionReplicationTest.testCdcrDocVersions-seed#[8322E4B323714702]) [    ] o.a.s.l.LogWatcher Registering Log Listener [Log4j (org.slf4j.impl.Log4jLoggerFactory)]
   [junit4]   2> 2112803 INFO  (TEST-CdcrVersionReplicationTest.testCdcrDocVersions-seed#[8322E4B323714702]) [    ] o.a.s.c.ZkContainer Zookeeper client=127.0.0.1:60421/solr
   [junit4]   2> 2112803 INFO  (TEST-CdcrVersionReplicationTest.testCdcrDocVersions-seed#[8322E4B323714702]) [    ] o.a.s.c.ZkController zkHost includes chroot
   [junit4]   2> 2112803 INFO  (TEST-CdcrVersionReplicationTest.testCdcrDocVersions-seed#[8322E4B323714702]) [    ] o.a.s.c.c.SolrZkClient Using default ZkCredentialsProvider
   [junit4]   2> 2112805 INFO  (TEST-CdcrVersionReplicationTest.testCdcrDocVersions-seed#[8322E4B323714702]) [    ] o.a.s.c.c.ConnectionManager Waiting for client to connect to ZooKeeper
   [junit4]   2> 2112805 INFO  (zkCallback-2249-thread-1) [    ] o.a.s.c.c.ConnectionManager Watcher org.apache.solr.common.cloud.ConnectionManager@66227e52 name:ZooKeeperConnection Watcher:127.0.0.1:60421 got event WatchedEvent state:SyncConnected type:None path:null path:null type:None
   [junit4]   2> 2112805 INFO  (TEST-CdcrVersionReplicationTest.testCdcrDocVersions-seed#[8322E4B323714702]) [    ] o.a.s.c.c.ConnectionManager Client is connected to ZooKeeper
   [junit4]   2> 2112805 INFO  (TEST-CdcrVersionReplicationTest.testCdcrDocVersions-seed#[8322E4B323714702]) [    ] o.a.s.c.c.SolrZkClient Using default ZkACLProvider
   [junit4]   2> 2112807 INFO  (TEST-CdcrVersionReplicationTest.testCdcrDocVersions-seed#[8322E4B323714702]) [n:127.0.0.1:60440_    ] o.a.s.c.ZkController Added new OnReconnect listener org.apache.solr.cloud.ZkController$$Lambda$9/1879742860@196b779
   [junit4]   2> 2112810 INFO  (TEST-CdcrVersionReplicationTest.testCdcrDocVersions-seed#[8322E4B323714702]) [n:127.0.0.1:60440_    ] o.a.s.c.c.ConnectionManager Waiting for client to connect to ZooKeeper
   [junit4]   2> 2112810 INFO  (zkCallback-2250-thread-1-processing-n:127.0.0.1:60440_) [n:127.0.0.1:60440_    ] o.a.s.c.c.ConnectionManager Watcher org.apache.solr.common.cloud.ConnectionManager@6de955c7 name:ZooKeeperConnection Watcher:127.0.0.1:60421/solr got event WatchedEvent state:SyncConnected type:None path:null path:null type:None
   [junit4]   2> 2112811 INFO  (TEST-CdcrVersionReplicationTest.testCdcrDocVersions-seed#[8322E4B323714702]) [n:127.0.0.1:60440_    ] o.a.s.c.c.ConnectionManager Client is connected to ZooKeeper
   [junit4]   2> 2112819 INFO  (TEST-CdcrVersionReplicationTest.testCdcrDocVersions-seed#[8322E4B323714702]) [n:127.0.0.1:60440_    ] o.a.s.c.c.ZkStateReader Updating cluster state from ZooKeeper... 
   [junit4]   2> 2112819 INFO  (TEST-CdcrVersionReplicationTest.testCdcrDocVersions-seed#[8322E4B323714702]) [n:127.0.0.1:60440_    ] o.a.s.c.c.ZkStateReader Loaded empty cluster properties
   [junit4]   2> 2112820 INFO  (TEST-CdcrVersionReplicationTest.testCdcrDocVersions-seed#[8322E4B323714702]) [n:127.0.0.1:60440_    ] o.a.s.c.c.ZkStateReader Updated live nodes from ZooKeeper... (0) -> (1)
   [junit4]   2> 2112824 INFO  (TEST-CdcrVersionReplicationTest.testCdcrDocVersions-seed#[8322E4B323714702]) [n:127.0.0.1:60440_    ] o.a.s.c.Overseer Overseer (id=null) closing
   [junit4]   2> 2112824 INFO  (TEST-CdcrVersionReplicationTest.testCdcrDocVersions-seed#[8322E4B323714702]) [n:127.0.0.1:60440_    ] o.a.s.c.LeaderElector Joined leadership election with path: /overseer_elect/election/96108781686095879-127.0.0.1:60440_-n_0000000001
   [junit4]   2> 2112825 INFO  (TEST-CdcrVersionReplicationTest.testCdcrDocVersions-seed#[8322E4B323714702]) [n:127.0.0.1:60440_    ] o.a.s.c.LeaderElector Watching path /overseer_elect/election/96108781686095876-127.0.0.1:60428_-n_0000000000 to know if I could be the leader
   [junit4]   2> 2112825 INFO  (TEST-CdcrVersionReplicationTest.testCdcrDocVersions-seed#[8322E4B323714702]) [n:127.0.0.1:60440_    ] o.a.s.c.ZkController Publish node=127.0.0.1:60440_ as DOWN
   [junit4]   2> 2112828 INFO  (OverseerStateUpdate-96108781686095876-127.0.0.1:60428_-n_0000000000) [n:127.0.0.1:60428_    ] o.a.s.c.Overseer processMessage: queueSize: 1, message = {
   [junit4]   2>   "operation":"downnode",
   [junit4]   2>   "node_name":"127.0.0.1:60440_"} current state version: 3
   [junit4]   2> 2112828 INFO  (OverseerStateUpdate-96108781686095876-127.0.0.1:60428_-n_0000000000) [n:127.0.0.1:60428_    ] o.a.s.c.o.NodeMutator DownNode state invoked for node: 127.0.0.1:60440_
   [junit4]   2> 2112931 INFO  (zkCallback-2250-thread-1-processing-n:127.0.0.1:60440_) [n:127.0.0.1:60440_    ] o.a.s.c.c.ZkStateReader A cluster state change: [WatchedEvent state:SyncConnected type:NodeDataChanged path:/clusterstate.json], has occurred - updating... (live nodes size: [1])
   [junit4]   2> 2112931 INFO  (zkCallback-2244-thread-2-processing-n:127.0.0.1:60428_) [n:127.0.0.1:60428_    ] o.a.s.c.c.ZkStateReader A cluster state change: [WatchedEvent state:SyncConnected type:NodeDataChanged path:/clusterstate.json], has occurred - updating... (live nodes size: [1])
   [junit4]   2> 2113828 INFO  (TEST-CdcrVersionReplicationTest.testCdcrDocVersions-seed#[8322E4B323714702]) [n:127.0.0.1:60440_    ] o.a.s.c.ZkController Register node as live in ZooKeeper:/live_nodes/127.0.0.1:60440_
   [junit4]   2> 2113829 INFO  (TEST-CdcrVersionReplicationTest.testCdcrDocVersions-seed#[8322E4B323714702]) [n:127.0.0.1:60440_    ] o.a.s.c.c.SolrZkClient makePath: /live_nodes/127.0.0.1:60440_
   [junit4]   2> 2113830 INFO  (zkCallback-2244-thread-2-processing-n:127.0.0.1:60428_) [n:127.0.0.1:60428_    ] o.a.s.c.c.ZkStateReader A live node change: [WatchedEvent state:SyncConnected type:NodeChildrenChanged path:/live_nodes], has occurred - updating... (live nodes size: [1])
   [junit4]   2> 2113830 INFO  (zkCallback-2250-thread-1-processing-n:127.0.0.1:60440_) [n:127.0.0.1:60440_    ] o.a.s.c.c.ZkStateReader A live node change: [WatchedEvent state:SyncConnected type:NodeChildrenChanged path:/live_nodes], has occurred - updating... (live nodes size: [1])
   [junit4]   2> 2113830 INFO  (zkCallback-2244-thread-2-processing-n:127.0.0.1:60428_) [n:127.0.0.1:60428_    ] o.a.s.c.c.ZkStateReader Updated live nodes from ZooKeeper... (1) -> (2)
   [junit4]   2> 2113831 INFO  (zkCallback-2250-thread-1-processing-n:127.0.0.1:60440_) [n:127.0.0.1:60440_    ] o.a.s.c.c.ZkStateReader Updated live nodes from ZooKeeper... (1) -> (2)
   [junit4]   2> 2113838 INFO  (TEST-CdcrVersionReplicationTest.testCdcrDocVersions-seed#[8322E4B323714702]) [n:127.0.0.1:60440_    ] o.a.s.c.CoreContainer Security conf doesn't exist. Skipping setup for authorization module.
   [junit4]   2> 2113838 INFO  (TEST-CdcrVersionReplicationTest.testCdcrDocVersions-seed#[8322E4B323714702]) [n:127.0.0.1:60440_    ] o.a.s.c.CoreContainer No authentication plugin used.
   [junit4]   2> 2113839 INFO  (TEST-CdcrVersionReplicationTest.testCdcrDocVersions-seed#[8322E4B323714702]) [n:127.0.0.1:60440_    ] o.a.s.c.CorePropertiesLocator Looking for core definitions underneath C:\Users\jenkins\workspace\Lucene-Solr-master-Windows\solr\build\solr-core\test\J0\temp\solr.cloud.CdcrVersionReplicationTest_8322E4B323714702-001\jetty-002\cores
   [junit4]   2> 2113842 INFO  (TEST-CdcrVersionReplicationTest.testCdcrDocVersions-seed#[8322E4B323714702]) [n:127.0.0.1:60440_    ] o.a.s.c.CoreDescriptor Created CoreDescriptor: {name=collection1, config=solrconfig.xml, transient=false, schema=schema.xml, loadOnStartup=true, configSetProperties=configsetprops.json, collection=tmp_collection, coreNodeName=, dataDir=data\, shard=}
   [junit4]   2> 2113842 INFO  (TEST-CdcrVersionReplicationTest.testCdcrDocVersions-seed#[8322E4B323714702]) [n:127.0.0.1:60440_    ] o.a.s.c.CorePropertiesLocator Found core collection1 in C:\Users\jenkins\workspace\Lucene-Solr-master-Windows\solr\build\solr-core\test\J0\temp\solr.cloud.CdcrVersionReplicationTest_8322E4B323714702-001\jetty-002\cores\collection1
   [junit4]   2> 2113842 INFO  (TEST-CdcrVersionReplicationTest.testCdcrDocVersions-seed#[8322E4B323714702]) [n:127.0.0.1:60440_    ] o.a.s.c.CorePropertiesLocator Found 1 core definitions
   [junit4]   2> 2113842 INFO  (coreLoadExecutor-6319-thread-1-processing-n:127.0.0.1:60440_) [n:127.0.0.1:60440_ c:tmp_collection   x:collection1] o.a.s.c.ZkController publishing state=down
   [junit4]   2> 2113842 INFO  (coreLoadExecutor-6319-thread-1-processing-n:127.0.0.1:60440_) [n:127.0.0.1:60440_ c:tmp_collection   x:collection1] o.a.s.c.ZkController numShards not found on descriptor - reading it from system property
   [junit4]   2> 2113843 INFO  (TEST-CdcrVersionReplicationTest.testCdcrDocVersions-seed#[8322E4B323714702]) [n:127.0.0.1:60440_    ] o.a.s.s.SolrDispatchFilter user.dir=C:\Users\jenkins\workspace\Lucene-Solr-master-Windows\solr\build\solr-core\test\J0
   [junit4]   2> 2113843 INFO  (TEST-CdcrVersionReplicationTest.testCdcrDocVersions-seed#[8322E4B323714702]) [n:127.0.0.1:60440_    ] o.a.s.s.SolrDispatchFilter SolrDispatchFilter.init() done
   [junit4]   2> 2113843 INFO  (coreLoadExecutor-6319-thread-1-processing-n:127.0.0.1:60440_) [n:127.0.0.1:60440_ c:tmp_collection   x:collection1] o.a.s.c.ZkController Registering watch for collection tmp_collection
   [junit4]   2> 2113844 INFO  (OverseerStateUpdate-96108781686095876-127.0.0.1:60428_-n_0000000000) [n:127.0.0.1:60428_    ] o.a.s.c.Overseer processMessage: queueSize: 1, message = {
   [junit4]   2>   "core":"collection1",
   [junit4]   2>   "roles":null,
   [junit4]   2>   "base_url":"http://127.0.0.1:60440",
   [junit4]   2>   "node_name":"127.0.0.1:60440_",
   [junit4]   2>   "numShards":"2",
   [junit4]   2>   "state":"down",
   [junit4]   2>   "shard":null,
   [junit4]   2>   "collection":"tmp_collection",
   [junit4]   2>   "operation":"state"} current state version: 4
   [junit4]   2> 2113844 INFO  (OverseerStateUpdate-96108781686095876-127.0.0.1:60428_-n_0000000000) [n:127.0.0.1:60428_    ] o.a.s.c.o.ReplicaMutator Update state numShards=2 message={
   [junit4]   2>   "core":"collection1",
   [junit4]   2>   "roles":null,
   [junit4]   2>   "base_url":"http://127.0.0.1:60440",
   [junit4]   2>   "node_name":"127.0.0.1:60440_",
   [junit4]   2>   "numShards":"2",
   [junit4]   2>   "state":"down",
   [junit4]   2>   "shard":null,
   [junit4]   2>   "collection":"tmp_collection",
   [junit4]   2>   "operation":"state"}
   [junit4]   2> 2113844 INFO  (OverseerStateUpdate-96108781686095876-127.0.0.1:60428_-n_0000000000) [n:127.0.0.1:60428_    ] o.a.s.c.o.ReplicaMutator Collection already exists with numShards=2
   [junit4]   2> 2113844 INFO  (OverseerStateUpdate-96108781686095876-127.0.0.1:60428_-n_0000000000) [n:127.0.0.1:60428_    ] o.a.s.c.o.ReplicaMutator Assigning new node to shard shard=shard1
   [junit4]   2> 2113845 INFO  (coreLoadExecutor-6319-thread-1-processing-n:127.0.0.1:60440_) [n:127.0.0.1:60440_ c:tmp_collection   x:collection1] o.a.s.c.c.ZkStateReader Deleting data for [tmp_collection]
   [junit4]   2> 2113846 INFO  (coreLoadExecutor-6319-thread-1-processing-n:127.0.0.1:60440_) [n:127.0.0.1:60440_ c:tmp_collection   x:collection1] o.a.s.c.ZkController look for our core node name
   [junit4]   2> 2113947 INFO  (zkCallback-2250-thread-1-processing-n:127.0.0.1:60440_) [n:127.0.0.1:60440_    ] o.a.s.c.c.ZkStateReader A cluster state change: [WatchedEvent state:SyncConnected type:NodeDataChanged path:/clusterstate.json], has occurred - updating... (live nodes size: [2])
   [junit4]   2> 2113947 INFO  (zkCallback-2244-thread-1-processing-n:127.0.0.1:60428_) [n:127.0.0.1:60428_    ] o.a.s.c.c.ZkStateReader A cluster state change: [WatchedEvent state:SyncConnected type:NodeDataChanged path:/clusterstate.json], has occurred - updating... (live nodes size: [2])
   [junit4]   2> 2114847 INFO  (coreLoadExecutor-6319-thread-1-processing-n:127.0.0.1:60440_) [n:127.0.0.1:60440_ c:tmp_collection   x:collection1] o.a.s.c.ZkController waiting to find shard id in clusterstate for collection1
   [junit4]   2> 2114847 INFO  (coreLoadExecutor-6319-thread-1-processing-n:127.0.0.1:60440_) [n:127.0.0.1:60440_ c:tmp_collection   x:collection1] o.a.s.c.ZkController Check for collection zkNode:tmp_collection
   [junit4]   2> 2114847 INFO  (coreLoadExecutor-6319-thread-1-processing-n:127.0.0.1:60440_) [n:127.0.0.1:60440_ c:tmp_collection   x:collection1] o.a.s.c.ZkController Collection zkNode exists
   [junit4]   2> 2114847 INFO  (coreLoadExecutor-6319-thread-1-processing-n:127.0.0.1:60440_) [n:127.0.0.1:60440_ c:tmp_collection   x:collection1] o.a.s.c.c.ZkStateReader Load collection config from: [/collections/tmp_collection]
   [junit4]   2> 2114849 INFO  (coreLoadExecutor-6319-thread-1-processing-n:127.0.0.1:60440_) [n:127.0.0.1:60440_ c:tmp_collection   x:collection1] o.a.s.c.c.ZkStateReader path=[/collections/tmp_collection] [configName]=[conf1] specified config exists in ZooKeeper
   [junit4]   2> 2114849 INFO  (coreLoadExecutor-6319-thread-1-processing-n:127.0.0.1:60440_) [n:127.0.0.1:60440_ c:tmp_collection   x:collection1] o.a.s.c.SolrResourceLoader new SolrResourceLoader for directory: 'C:\Users\jenkins\workspace\Lucene-Solr-master-Windows\solr\build\solr-core\test\J0\temp\solr.cloud.CdcrVersionReplicationTest_8322E4B323714702-001\jetty-002\cores\collection1'
   [junit4]   2> 2114849 INFO  (coreLoadExecutor-6319-thread-1-processing-n:127.0.0.1:60440_) [n:127.0.0.1:60440_ c:tmp_collection   x:collection1] o.a.s.c.SolrResourceLoader JNDI not configured for solr (NoInitialContextEx)
   [junit4]   2> 2114849 INFO  (coreLoadExecutor-6319-thread-1-processing-n:127.0.0.1:60440_) [n:127.0.0.1:60440_ c:tmp_collection   x:collection1] o.a.s.c.SolrResourceLoader solr home defaulted to 'solr/' (could not find system property or JNDI)
   [junit4]   2> 2114851 INFO  (coreLoadExecutor-6319-thread-1-processing-n:127.0.0.1:60440_) [n:127.0.0.1:60440_ c:tmp_collection   x:collection1] o.a.s.c.Config loaded config solrconfig.xml with version 0 
   [junit4]   2> 2114861 INFO  (coreLoadExecutor-6319-thread-1-processing-n:127.0.0.1:60440_) [n:127.0.0.1:60440_ c:tmp_collection   x:collection1] o.a.s.c.SolrConfig current version of requestparams : -1
   [junit4]   2> 2114864 INFO  (coreLoadExecutor-6319-thread-1-processing-n:127.0.0.1:60440_) [n:127.0.0.1:60440_ c:tmp_collection   x:collection1] o.a.s.c.SolrConfig Using Lucene MatchVersion: 7.0.0
   [junit4]   2> 2114872 INFO  (coreLoadExecutor-6319-thread-1-processing-n:127.0.0.1:60440_) [n:127.0.0.1:60440_ c:tmp_collection   x:collection1] o.a.s.c.SolrConfig Loaded SolrConfig: solrconfig.xml
   [junit4]   2> 2114878 INFO  (coreLoadExecutor-6319-thread-1-processing-n:127.0.0.1:60440_) [n:127.0.0.1:60440_ c:tmp_collection   x:collection1] o.a.s.s.IndexSchema [collection1] Schema name=test
   [junit4]   2> 2114987 INFO  (coreLoadExecutor-6319-thread-1-processing-n:127.0.0.1:60440_) [n:127.0.0.1:60440_ c:tmp_collection   x:collection1] o.a.s.s.IndexSchema default search field in schema is text
   [junit4]   2> 2114989 INFO  (coreLoadExecutor-6319-thread-1-processing-n:127.0.0.1:60440_) [n:127.0.0.1:60440_ c:tmp_collection   x:collection1] o.a.s.s.IndexSchema unique key field: id
   [junit4]   2> 2114990 INFO  (coreLoadExecutor-6319-thread-1-processing-n:127.0.0.1:60440_) [n:127.0.0.1:60440_ c:tmp_collection   x:collection1] o.a.s.s.FileExchangeRateProvider Reloading exchange rates from file currency.xml
   [junit4]   2> 2114992 INFO  (coreLoadExecutor-6319-thread-1-processing-n:127.0.0.1:60440_) [n:127.0.0.1:60440_ c:tmp_collection   x:collection1] o.a.s.s.FileExchangeRateProvider Reloading exchange rates from file currency.xml
   [junit4]   2> 2115017 INFO  (coreLoadExecutor-6319-thread-1-processing-n:127.0.0.1:60440_) [n:127.0.0.1:60440_ c:tmp_collection   x:collection1] o.a.s.c.ConfigSetProperties Did not find ConfigSet properties, assuming default properties: Can't find resource 'configsetprops.json' in classpath or '/configs/conf1', cwd=C:\Users\jenkins\workspace\Lucene-Solr-master-Windows\solr\build\solr-core\test\J0
   [junit4]   2> 2115017 INFO  (coreLoadExecutor-6319-thread-1-processing-n:127.0.0.1:60440_) [n:127.0.0.1:60440_ c:tmp_collection   x:collection1] o.a.s.c.CoreContainer Creating SolrCore 'collection1' using configuration from collection tmp_collection
   [junit4]   2> 2115017 INFO  (coreLoadExecutor-6319-thread-1-processing-n:127.0.0.1:60440_) [n:127.0.0.1:60440_ c:tmp_collection s:shard1 r:core_node2 x:collection1] o.a.s.c.SolrCore org.apache.solr.core.MockDirectoryFactory
   [junit4]   2> 2115017 INFO  (coreLoadExecutor-6319-thread-1-processing-n:127.0.0.1:60440_) [n:127.0.0.1:60440_ c:tmp_collection s:shard1 r:core_node2 x:collection1] o.a.s.c.SolrCore [[collection1] ] Opening new SolrCore at [C:\Users\jenkins\workspace\Lucene-Solr-master-Windows\solr\build\solr-core\test\J0\temp\solr.cloud.CdcrVersionReplicationTest_8322E4B323714702-001\jetty-002\cores\collection1], dataDir=[C:\Users\jenkins\workspace\Lucene-Solr-master-Windows\solr\build\solr-core\test\J0\temp\solr.cloud.CdcrVersionReplicationTest_8322E4B323714702-001\jetty-002\cores\collection1\data\]
   [junit4]   2> 2115017 INFO  (coreLoadExecutor-6319-thread-1-processing-n:127.0.0.1:60440_) [n:127.0.0.1:60440_ c:tmp_collection s:shard1 r:core_node2 x:collection1] o.a.s.c.JmxMonitoredMap JMX monitoring is enabled. Adding Solr mbeans to JMX Server: com.sun.jmx.mbeanserver.JmxMBeanServer@6e5382cc
   [junit4]   2> 2115017 INFO  (coreLoadExecutor-6319-thread-1-processing-n:127.0.0.1:60440_) [n:127.0.0.1:60440_ c:tmp_collection s:shard1 r:core_node2 x:collection1] o.a.s.c.CachingDirectoryFactory return new directory for C:\Users\jenkins\workspace\Lucene-Solr-master-Windows\solr\build\solr-core\test\J0\temp\solr.cloud.CdcrVersionReplicationTest_8322E4B323714702-001\jetty-002\cores\collection1\data\
   [junit4]   2> 2115017 INFO  (coreLoadExecutor-6319-thread-1-processing-n:127.0.0.1:60440_) [n:127.0.0.1:60440_ c:tmp_collection s:shard1 r:core_node2 x:collection1] o.a.s.c.SolrCore New index directory detected: old=null new=C:\Users\jenkins\workspace\Lucene-Solr-master-Windows\solr\build\solr-core\test\J0\temp\solr.cloud.CdcrVersionReplicationTest_8322E4B323714702-001\jetty-002\cores\collection1\data\index/
   [junit4]   2> 2115019 WARN  (coreLoadExecutor-6319-thread-1-processing-n:127.0.0.1:60440_) [n:127.0.0.1:60440_ c:tmp_collection s:shard1 r:core_node2 x:collection1] o.a.s.c.SolrCore [collection1] Solr index directory 'C:\Users\jenkins\workspace\Lucene-Solr-master-Windows\solr\build\solr-core\test\J0\temp\solr.cloud.CdcrVersionReplicationTest_8322E4B323714702-001\jetty-002\cores\collection1\data\index' doesn't exist. Creating new index...
   [junit4]   2> 2115019 INFO  (coreLoadExecutor-6319-thread-1-processing-n:127.0.0.1:60440_) [n:127.0.0.1:60440_ c:tmp_collection s:shard1 r:core_node2 x:collection1] o.a.s.c.CachingDirectoryFactory return new directory for C:\Users\jenkins\workspace\Lucene-Solr-master-Windows\solr\build\solr-core\test\J0\temp\solr.cloud.CdcrVersionReplicationTest_8322E4B323714702-001\jetty-002\cores\collection1\data\index
   [junit4]   2> 2115019 INFO  (coreLoadExecutor-6319-thread-1-processing-n:127.0.0.1:60440_) [n:127.0.0.1:60440_ c:tmp_collection s:shard1 r:core_node2 x:collection1] o.a.s.u.RandomMergePolicy RandomMergePolicy wrapping class org.apache.lucene.index.TieredMergePolicy: [TieredMergePolicy: maxMergeAtOnce=17, maxMergeAtOnceExplicit=13, maxMergedSegmentMB=3.1240234375, floorSegmentMB=1.4814453125, forceMergeDeletesPctAllowed=26.035615007161816, segmentsPerTier=43.0, maxCFSSegmentSizeMB=8.796093022207999E12, noCFSRatio=0.0
   [junit4]   2> 2115019 INFO  (coreLoadExecutor-6319-thread-1-processing-n:127.0.0.1:60440_) [n:127.0.0.1:60440_ c:tmp_collection s:shard1 r:core_node2 x:collection1] o.a.s.c.SolrDeletionPolicy SolrDeletionPolicy.onCommit: commits: num=1
   [junit4]   2> 	commit{dir=MockDirectoryWrapper(RAMDirectory@5e933cce lockFactory=org.apache.lucene.store.SingleInstanceLockFactory@414ed8c4),segFN=segments_1,generation=1}
   [junit4]   2> 2115019 INFO  (coreLoadExecutor-6319-thread-1-processing-n:127.0.0.1:60440_) [n:127.0.0.1:60440_ c:tmp_collection s:shard1 r:core_node2 x:collection1] o.a.s.c.SolrDeletionPolicy newest commit generation = 1
   [junit4]   2> 2115020 INFO  (OldIndexDirectoryCleanupThreadForCore-collection1) [n:127.0.0.1:60440_ c:tmp_collection s:shard1 r:core_node2 x:collection1] o.a.s.c.SolrCore Looking for old index directories to cleanup for core collection1 in C:\Users\jenkins\workspace\Lucene-Solr-master-Windows\solr\build\solr-core\test\J0\temp\solr.cloud.CdcrVersionReplicationTest_8322E4B323714702-001\jetty-002\cores\collection1\data\
   [junit4]   2> 2115020 WARN  (OldIndexDirectoryCleanupThreadForCore-collection1) [n:127.0.0.1:60440_ c:tmp_collection s:shard1 r:core_node2 x:collection1] o.a.s.c.DirectoryFactory C:\Users\jenkins\workspace\Lucene-Solr-master-Windows\solr\build\solr-core\test\J0\temp\solr.cloud.CdcrVersionReplicationTest_8322E4B323714702-001\jetty-002\cores\collection1\data\ does not point to a valid data directory; skipping clean-up of old index directories.
   [junit4]   2> 2115021 INFO  (coreLoadExecutor-6319-thread-1-processing-n:127.0.0.1:60440_) [n:127.0.0.1:60440_ c:tmp_collection s:shard1 r:core_node2 x:collection1] o.a.s.u.p.UpdateRequestProcessorChain creating updateRequestProcessorChain "cdcr-processor-chain"
   [junit4]   2> 2115022 INFO  (coreLoadExecutor-6319-thread-1-processing-n:127.0.0.1:60440_) [n:127.0.0.1:60440_ c:tmp_collection s:shard1 r:core_node2 x:collection1] o.a.s.c.SolrCore no updateRequestProcessorChain defined

[...truncated too long message...]

> 	17	/solr/aliases.json
   [junit4]   2> 	17	/solr/clusterprops.json
   [junit4]   2> 	8	/solr/configs/conf1
   [junit4]   2> 	4	/solr/collections/tmp_collection/state.json
   [junit4]   2> 	4	/solr/security.json
   [junit4]   2> 	2	/solr/collections/tmp_collection/leaders/shard2/leader
   [junit4]   2> 	2	/solr/collections/tmp_collection/leaders/shard1/leader
   [junit4]   2> 	2	/solr/collections/source_collection/leaders/shard2/leader
   [junit4]   2> 	2	/solr/collections/source_collection/leaders/shard1/leader
   [junit4]   2> 
   [junit4]   2> Maximum concurrent data watches above limit:
   [junit4]   2> 
   [junit4]   2> 	17	/solr/clusterstate.json
   [junit4]   2> 	4	/solr/collections/source_collection/cdcr/state/buffer
   [junit4]   2> 	4	/solr/collections/source_collection/cdcr/state/process
   [junit4]   2> 	4	/solr/collections/tmp_collection/cdcr/state/buffer
   [junit4]   2> 	4	/solr/collections/source_collection/state.json
   [junit4]   2> 	4	/solr/collections/tmp_collection/cdcr/state/process
   [junit4]   2> 
   [junit4]   2> Maximum concurrent children watches above limit:
   [junit4]   2> 
   [junit4]   2> 	43	/solr/overseer/queue
   [junit4]   2> 	25	/solr/overseer/collection-queue-work
   [junit4]   2> 	17	/solr/live_nodes
   [junit4]   2> 	17	/solr/collections
   [junit4]   2> 	4	/solr/overseer/queue-work
   [junit4]   2> 
   [junit4]   2> 2141914 INFO  (SUITE-CdcrVersionReplicationTest-seed#[8322E4B323714702]-worker) [    ] o.a.s.SolrTestCaseJ4 ###deleteCore
   [junit4]   2> ObjectTracker found 1 object(s) that were not released!!! [InternalHttpClient]
   [junit4]   2> org.apache.solr.common.util.ObjectReleaseTracker$ObjectTrackerException
   [junit4]   2> 	at org.apache.solr.common.util.ObjectReleaseTracker.track(ObjectReleaseTracker.java:42)
   [junit4]   2> 	at org.apache.solr.client.solrj.impl.HttpClientUtil.createClient(HttpClientUtil.java:268)
   [junit4]   2> 	at org.apache.solr.client.solrj.impl.HttpClientUtil.createClient(HttpClientUtil.java:211)
   [junit4]   2> 	at org.apache.solr.client.solrj.impl.HttpClientUtil.createClient(HttpClientUtil.java:203)
   [junit4]   2> 	at org.apache.solr.client.solrj.impl.HttpSolrClient.<init>(HttpSolrClient.java:207)
   [junit4]   2> 	at org.apache.solr.client.solrj.impl.HttpSolrClient$Builder.build(HttpSolrClient.java:799)
   [junit4]   2> 	at org.apache.solr.handler.CdcrUpdateLogSynchronizer$UpdateLogSynchronisation.run(CdcrUpdateLogSynchronizer.java:134)
   [junit4]   2> 	at java.util.concurrent.Executors$RunnableAdapter.call(Executors.java:511)
   [junit4]   2> 	at java.util.concurrent.FutureTask.runAndReset(FutureTask.java:308)
   [junit4]   2> 	at java.util.concurrent.ScheduledThreadPoolExecutor$ScheduledFutureTask.access$301(ScheduledThreadPoolExecutor.java:180)
   [junit4]   2> 	at java.util.concurrent.ScheduledThreadPoolExecutor$ScheduledFutureTask.run(ScheduledThreadPoolExecutor.java:294)
   [junit4]   2> 	at java.util.concurrent.ThreadPoolExecutor.runWorker(ThreadPoolExecutor.java:1142)
   [junit4]   2> 	at java.util.concurrent.ThreadPoolExecutor$Worker.run(ThreadPoolExecutor.java:617)
   [junit4]   2> 	at java.lang.Thread.run(Thread.java:745)
   [junit4]   2> 
   [junit4]   2> Jun 21, 2016 10:07:38 AM com.carrotsearch.randomizedtesting.ThreadLeakControl checkThreadLeaks
   [junit4]   2> WARNING: Will linger awaiting termination of 2 leaked thread(s).
   [junit4]   2> 2142765 WARN  (cdcr-update-log-synchronizer-6366-thread-1) [n:127.0.0.1:60440_ c:source_collection s:shard2 r:core_node3 x:source_collection_shard2_replica2] o.a.s.h.CdcrUpdateLogSynchronizer Couldn't get last processed version from leader http://127.0.0.1:60428/source_collection_shard2_replica1/: Server refused connection at: http://127.0.0.1:60428/source_collection_shard2_replica1
   [junit4]   2> NOTE: test params are: codec=Lucene62, sim=RandomSimilarity(queryNorm=false,coord=no): {}, locale=ar-IQ, timezone=Europe/Stockholm
   [junit4]   2> NOTE: Windows 10 10.0 amd64/Oracle Corporation 1.8.0_92 (64-bit)/cpus=3,threads=1,free=140612976,total=452386816
   [junit4]   2> NOTE: All tests run in this JVM: [SimpleCollectionCreateDeleteTest, TestCryptoKeys, ConnectionManagerTest, SolrCoreTest, DirectSolrSpellCheckerTest, ScriptEngineTest, TestJmxMonitoredMap, RecoveryAfterSoftCommitTest, HdfsUnloadDistributedZkTest, DistributedExpandComponentTest, TestHashPartitioner, TestStressReorder, PingRequestHandlerTest, SparseHLLTest, SystemInfoHandlerTest, RegexBoostProcessorTest, TestDownShardTolerantSearch, HdfsCollectionsAPIDistributedZkTest, PreAnalyzedUpdateProcessorTest, BadComponentTest, RankQueryTest, SolrIndexConfigTest, TestQuerySenderNoQuery, CircularListTest, ActionThrottleTest, DeleteShardTest, SimplePostToolTest, ClusterStateUpdateTest, TestFieldCache, WrapperMergePolicyFactoryTest, PeerSyncTest, ZkControllerTest, OverseerStatusTest, DeleteLastCustomShardedReplicaTest, TestSearcherReuse, OverseerCollectionConfigSetProcessorTest, AnalysisErrorHandlingTest, TimeZoneUtilsTest, TestUpdate, TestReqParamsAPI, SolrXmlInZkTest, TriLevelCompositeIdRoutingTest, PreAnalyzedFieldTest, ZkStateReaderTest, TestWordDelimiterFilterFactory, CustomCollectionTest, DocumentAnalysisRequestHandlerTest, TestLFUCache, ChaosMonkeyNothingIsSafeTest, TestExpandComponent, TestRTimerTree, CdcrRequestHandlerTest, TestAnalyzedSuggestions, TestFastLRUCache, TestExceedMaxTermLength, TestSolrDynamicMBean, TestJsonRequest, SimpleMLTQParserTest, TestHashQParserPlugin, SliceStateTest, SharedFSAutoReplicaFailoverTest, TestFunctionQuery, TestDynamicLoading, TestFieldCacheSanityChecker, CurrencyFieldXmlFileTest, AlternateDirectoryTest, DistributedQueryComponentCustomSortTest, InfoHandlerTest, TestFilteredDocIdSet, TestFieldCacheWithThreads, OverseerTest, TestRandomRequestDistribution, DirectoryFactoryTest, TestFreeTextSuggestions, TestTrackingShardHandlerFactory, IndexSchemaTest, TestPerFieldSimilarityWithDefaultOverride, DistributedSuggestComponentTest, SOLR749Test, UUIDFieldTest, TestLRUCache, DocValuesTest, TestPhraseSuggestions, SpatialHeatmapFacetsTest, TestLazyCores, TestPKIAuthenticationPlugin, TestCollectionAPI, TestCollationFieldDocValues, BlockJoinFacetSimpleTest, TestLuceneMatchVersion, SaslZkACLProviderTest, DirectUpdateHandlerTest, AsyncMigrateRouteKeyTest, TestXIncludeConfig, IndexBasedSpellCheckerTest, TestElisionMultitermQuery, HdfsRecoverLeaseTest, MBeansHandlerTest, TestRemoteStreaming, CoreAdminRequestStatusTest, TestMaxScoreQueryParser, HdfsDirectoryFactoryTest, DisMaxRequestHandlerTest, DocumentBuilderTest, RequestLoggingTest, AssignTest, TestTestInjection, SolrRequestParserTest, TestBulkSchemaConcurrent, TestPostingsSolrHighlighter, JSONWriterTest, TestConfigReload, JsonLoaderTest, BufferStoreTest, TestManagedResource, TestStressVersions, TestDistributedSearch, TestSolrQueryParserDefaultOperatorResource, TestReplicationHandler, TestBlendedInfixSuggestions, TestRequestStatusCollectionAPI, RollingRestartTest, TestDFISimilarityFactory, SuggestComponentTest, HdfsBasicDistributedZk2Test, TestSubQueryTransformerCrossCore, SoftAutoCommitTest, AtomicUpdatesTest, ExternalFileFieldSortTest, DistributedFacetPivotLongTailTest, UpdateParamsTest, TestSolrDeletionPolicy1, ReturnFieldsTest, TestRawResponseWriter, TestCursorMarkWithoutUniqueKey, ShardRoutingTest, HighlighterTest, TestCodecSupport, TestConfigSetsAPIExclusivity, TestSolrFieldCacheMBean, UnloadDistributedZkTest, SchemaVersionSpecificBehaviorTest, SolrTestCaseJ4Test, SyncSliceTest, StatelessScriptUpdateProcessorFactoryTest, TestMiniSolrCloudClusterSSL, TestFieldResource, PrimUtilsTest, DateFieldTest, ClusterStateTest, TestDocumentBuilder, TestCrossCoreJoin, TestDistributedMissingSort, TestSimpleTrackingShardHandler, AsyncCallRequestStatusResponseTest, CdcrReplicationDistributedZkTest, CdcrReplicationHandlerTest, CdcrVersionReplicationTest]
   [junit4]   2> NOTE: reproduce with: ant test  -Dtestcase=CdcrVersionReplicationTest -Dtests.seed=8322E4B323714702 -Dtests.slow=true -Dtests.locale=ar-IQ -Dtests.timezone=Europe/Stockholm -Dtests.asserts=true -Dtests.file.encoding=Cp1252
   [junit4] ERROR   0.00s J0 | CdcrVersionReplicationTest (suite) <<<
   [junit4]    > Throwable #1: java.lang.AssertionError: ObjectTracker found 1 object(s) that were not released!!! [InternalHttpClient]
   [junit4]    > 	at __randomizedtesting.SeedInfo.seed([8322E4B323714702]:0)
   [junit4]    > 	at org.apache.solr.SolrTestCaseJ4.teardownTestCases(SolrTestCaseJ4.java:256)
   [junit4]    > 	at java.lang.Thread.run(Thread.java:745)
   [junit4] Completed [438/614 (1!)] on J0 in 32.01s, 1 test, 1 failure <<< FAILURES!

[...truncated 568 lines...]
BUILD FAILED
C:\Users\jenkins\workspace\Lucene-Solr-master-Windows\build.xml:740: The following error occurred while executing this line:
C:\Users\jenkins\workspace\Lucene-Solr-master-Windows\build.xml:684: The following error occurred while executing this line:
C:\Users\jenkins\workspace\Lucene-Solr-master-Windows\build.xml:59: The following error occurred while executing this line:
C:\Users\jenkins\workspace\Lucene-Solr-master-Windows\solr\build.xml:233: The following error occurred while executing this line:
C:\Users\jenkins\workspace\Lucene-Solr-master-Windows\solr\common-build.xml:530: The following error occurred while executing this line:
C:\Users\jenkins\workspace\Lucene-Solr-master-Windows\lucene\common-build.xml:1427: The following error occurred while executing this line:
C:\Users\jenkins\workspace\Lucene-Solr-master-Windows\lucene\common-build.xml:984: There were test failures: 614 suites (10 ignored), 2584 tests, 1 suite-level error, 126 ignored (82 assumptions) [seed: 8322E4B323714702]

Total time: 75 minutes 29 seconds
Build step 'Invoke Ant' marked build as failure
Archiving artifacts
[WARNINGS] Skipping publisher since build result is FAILURE
Recording test results
Email was triggered for: Failure - Any
Sending email for trigger: Failure - Any



Mime
View raw message