lucene-dev mailing list archives

Site index · List index
Message view « Date » · « Thread »
Top « Date » · « Thread »
From Apache Jenkins Server <jenk...@builds.apache.org>
Subject [JENKINS] Lucene-Solr-Tests-6.x - Build # 279 - Failure
Date Mon, 20 Jun 2016 01:29:32 GMT
Build: https://builds.apache.org/job/Lucene-Solr-Tests-6.x/279/

2 tests failed.
FAILED:  junit.framework.TestSuite.org.apache.solr.cloud.TestAuthenticationFramework

Error Message:
1 thread leaked from SUITE scope at org.apache.solr.cloud.TestAuthenticationFramework:     1) Thread[id=12520, name=OverseerHdfsCoreFailoverThread-96101064837169167-127.0.0.1:59759_solr-n_0000000001, state=TIMED_WAITING, group=Overseer Hdfs SolrCore Failover Thread.]         at java.lang.Thread.sleep(Native Method)         at org.apache.solr.cloud.OverseerAutoReplicaFailoverThread.run(OverseerAutoReplicaFailoverThread.java:137)         at java.lang.Thread.run(Thread.java:745)

Stack Trace:
com.carrotsearch.randomizedtesting.ThreadLeakError: 1 thread leaked from SUITE scope at org.apache.solr.cloud.TestAuthenticationFramework: 
   1) Thread[id=12520, name=OverseerHdfsCoreFailoverThread-96101064837169167-127.0.0.1:59759_solr-n_0000000001, state=TIMED_WAITING, group=Overseer Hdfs SolrCore Failover Thread.]
        at java.lang.Thread.sleep(Native Method)
        at org.apache.solr.cloud.OverseerAutoReplicaFailoverThread.run(OverseerAutoReplicaFailoverThread.java:137)
        at java.lang.Thread.run(Thread.java:745)
	at __randomizedtesting.SeedInfo.seed([CD39F69D6564CC3]:0)


FAILED:  junit.framework.TestSuite.org.apache.solr.cloud.TestAuthenticationFramework

Error Message:
There are still zombie threads that couldn't be terminated:    1) Thread[id=12520, name=OverseerHdfsCoreFailoverThread-96101064837169167-127.0.0.1:59759_solr-n_0000000001, state=RUNNABLE, group=Overseer Hdfs SolrCore Failover Thread.]         at java.lang.Throwable.fillInStackTrace(Native Method)         at java.lang.Throwable.fillInStackTrace(Throwable.java:783)         at java.lang.Throwable.<init>(Throwable.java:265)         at java.lang.Exception.<init>(Exception.java:66)         at java.lang.InterruptedException.<init>(InterruptedException.java:67)         at java.lang.Thread.sleep(Native Method)         at org.apache.solr.cloud.OverseerAutoReplicaFailoverThread.run(OverseerAutoReplicaFailoverThread.java:137)         at java.lang.Thread.run(Thread.java:745)

Stack Trace:
com.carrotsearch.randomizedtesting.ThreadLeakError: There are still zombie threads that couldn't be terminated:
   1) Thread[id=12520, name=OverseerHdfsCoreFailoverThread-96101064837169167-127.0.0.1:59759_solr-n_0000000001, state=RUNNABLE, group=Overseer Hdfs SolrCore Failover Thread.]
        at java.lang.Throwable.fillInStackTrace(Native Method)
        at java.lang.Throwable.fillInStackTrace(Throwable.java:783)
        at java.lang.Throwable.<init>(Throwable.java:265)
        at java.lang.Exception.<init>(Exception.java:66)
        at java.lang.InterruptedException.<init>(InterruptedException.java:67)
        at java.lang.Thread.sleep(Native Method)
        at org.apache.solr.cloud.OverseerAutoReplicaFailoverThread.run(OverseerAutoReplicaFailoverThread.java:137)
        at java.lang.Thread.run(Thread.java:745)
	at __randomizedtesting.SeedInfo.seed([CD39F69D6564CC3]:0)




Build Log:
[...truncated 12061 lines...]
   [junit4] Suite: org.apache.solr.cloud.TestAuthenticationFramework
   [junit4]   2> 1687668 INFO  (TEST-TestAuthenticationFramework.testBasics-seed#[CD39F69D6564CC3]) [    ] o.a.s.c.ZkTestServer STARTING ZK TEST SERVER
   [junit4]   2> 1687668 INFO  (Thread-4507) [    ] o.a.s.c.ZkTestServer client port:0.0.0.0/0.0.0.0:0
   [junit4]   2> 1687668 INFO  (Thread-4507) [    ] o.a.s.c.ZkTestServer Starting server
   [junit4]   2> 1687768 INFO  (TEST-TestAuthenticationFramework.testBasics-seed#[CD39F69D6564CC3]) [    ] o.a.s.c.ZkTestServer start zk server on port:56686
   [junit4]   2> 1687768 INFO  (TEST-TestAuthenticationFramework.testBasics-seed#[CD39F69D6564CC3]) [    ] o.a.s.c.c.SolrZkClient Using default ZkCredentialsProvider
   [junit4]   2> 1687769 INFO  (TEST-TestAuthenticationFramework.testBasics-seed#[CD39F69D6564CC3]) [    ] o.a.s.c.c.ConnectionManager Waiting for client to connect to ZooKeeper
   [junit4]   2> 1687774 INFO  (zkCallback-1860-thread-1) [    ] o.a.s.c.c.ConnectionManager Watcher org.apache.solr.common.cloud.ConnectionManager@2c7a25a2 name:ZooKeeperConnection Watcher:127.0.0.1:56686 got event WatchedEvent state:SyncConnected type:None path:null path:null type:None
   [junit4]   2> 1687774 INFO  (TEST-TestAuthenticationFramework.testBasics-seed#[CD39F69D6564CC3]) [    ] o.a.s.c.c.ConnectionManager Client is connected to ZooKeeper
   [junit4]   2> 1687774 INFO  (TEST-TestAuthenticationFramework.testBasics-seed#[CD39F69D6564CC3]) [    ] o.a.s.c.c.SolrZkClient Using default ZkACLProvider
   [junit4]   2> 1687774 INFO  (TEST-TestAuthenticationFramework.testBasics-seed#[CD39F69D6564CC3]) [    ] o.a.s.c.c.SolrZkClient makePath: /solr/solr.xml
   [junit4]   2> 1687782 INFO  (jetty-launcher-1859-thread-2) [    ] o.e.j.s.Server jetty-9.3.8.v20160314
   [junit4]   2> 1687782 INFO  (jetty-launcher-1859-thread-1) [    ] o.e.j.s.Server jetty-9.3.8.v20160314
   [junit4]   2> 1687782 INFO  (jetty-launcher-1859-thread-4) [    ] o.e.j.s.Server jetty-9.3.8.v20160314
   [junit4]   2> 1687783 INFO  (jetty-launcher-1859-thread-5) [    ] o.e.j.s.Server jetty-9.3.8.v20160314
   [junit4]   2> 1687784 INFO  (jetty-launcher-1859-thread-3) [    ] o.e.j.s.Server jetty-9.3.8.v20160314
   [junit4]   2> 1687785 INFO  (jetty-launcher-1859-thread-5) [    ] o.e.j.s.h.ContextHandler Started o.e.j.s.ServletContextHandler@477e303e{/solr,null,AVAILABLE}
   [junit4]   2> 1687785 INFO  (jetty-launcher-1859-thread-2) [    ] o.e.j.s.h.ContextHandler Started o.e.j.s.ServletContextHandler@2f7aa1f1{/solr,null,AVAILABLE}
   [junit4]   2> 1687786 INFO  (jetty-launcher-1859-thread-2) [    ] o.e.j.s.ServerConnector Started ServerConnector@3c4bc335{HTTP/1.1,[http/1.1]}{127.0.0.1:48077}
   [junit4]   2> 1687786 INFO  (jetty-launcher-1859-thread-2) [    ] o.e.j.s.Server Started @1692542ms
   [junit4]   2> 1687786 INFO  (jetty-launcher-1859-thread-2) [    ] o.a.s.c.s.e.JettySolrRunner Jetty properties: {hostContext=/solr, hostPort=48077}
   [junit4]   2> 1687786 INFO  (jetty-launcher-1859-thread-2) [    ] o.a.s.s.SolrDispatchFilter SolrDispatchFilter.init(): sun.misc.Launcher$AppClassLoader@73d16e93
   [junit4]   2> 1687786 INFO  (jetty-launcher-1859-thread-2) [    ] o.a.s.c.SolrResourceLoader new SolrResourceLoader for directory: '/x1/jenkins/jenkins-slave/workspace/Lucene-Solr-Tests-6.x/solr/build/solr-core/test/J0/temp/solr.cloud.TestAuthenticationFramework_CD39F69D6564CC3-001/tempDir-001/node2'
   [junit4]   2> 1687786 INFO  (jetty-launcher-1859-thread-2) [    ] o.a.s.c.SolrResourceLoader JNDI not configured for solr (NoInitialContextEx)
   [junit4]   2> 1687786 INFO  (jetty-launcher-1859-thread-2) [    ] o.a.s.c.SolrResourceLoader solr home defaulted to 'solr/' (could not find system property or JNDI)
   [junit4]   2> 1687786 INFO  (jetty-launcher-1859-thread-2) [    ] o.a.s.c.c.SolrZkClient Using default ZkCredentialsProvider
   [junit4]   2> 1687788 INFO  (jetty-launcher-1859-thread-2) [    ] o.a.s.c.c.ConnectionManager Waiting for client to connect to ZooKeeper
   [junit4]   2> 1687788 INFO  (jetty-launcher-1859-thread-5) [    ] o.e.j.s.ServerConnector Started ServerConnector@432e17e8{HTTP/1.1,[http/1.1]}{127.0.0.1:44802}
   [junit4]   2> 1687788 INFO  (jetty-launcher-1859-thread-5) [    ] o.e.j.s.Server Started @1692544ms
   [junit4]   2> 1687788 INFO  (jetty-launcher-1859-thread-5) [    ] o.a.s.c.s.e.JettySolrRunner Jetty properties: {hostContext=/solr, hostPort=44802}
   [junit4]   2> 1687788 INFO  (jetty-launcher-1859-thread-5) [    ] o.a.s.s.SolrDispatchFilter SolrDispatchFilter.init(): sun.misc.Launcher$AppClassLoader@73d16e93
   [junit4]   2> 1687788 INFO  (jetty-launcher-1859-thread-5) [    ] o.a.s.c.SolrResourceLoader new SolrResourceLoader for directory: '/x1/jenkins/jenkins-slave/workspace/Lucene-Solr-Tests-6.x/solr/build/solr-core/test/J0/temp/solr.cloud.TestAuthenticationFramework_CD39F69D6564CC3-001/tempDir-001/node5'
   [junit4]   2> 1687788 INFO  (jetty-launcher-1859-thread-5) [    ] o.a.s.c.SolrResourceLoader JNDI not configured for solr (NoInitialContextEx)
   [junit4]   2> 1687788 INFO  (jetty-launcher-1859-thread-5) [    ] o.a.s.c.SolrResourceLoader solr home defaulted to 'solr/' (could not find system property or JNDI)
   [junit4]   2> 1687788 INFO  (jetty-launcher-1859-thread-5) [    ] o.a.s.c.c.SolrZkClient Using default ZkCredentialsProvider
   [junit4]   2> 1687789 INFO  (jetty-launcher-1859-thread-5) [    ] o.a.s.c.c.ConnectionManager Waiting for client to connect to ZooKeeper
   [junit4]   2> 1687790 INFO  (jetty-launcher-1859-thread-1) [    ] o.e.j.s.h.ContextHandler Started o.e.j.s.ServletContextHandler@168bbe6c{/solr,null,AVAILABLE}
   [junit4]   2> 1687791 INFO  (jetty-launcher-1859-thread-1) [    ] o.e.j.s.ServerConnector Started ServerConnector@6d32da85{HTTP/1.1,[http/1.1]}{127.0.0.1:36705}
   [junit4]   2> 1687791 INFO  (jetty-launcher-1859-thread-1) [    ] o.e.j.s.Server Started @1692546ms
   [junit4]   2> 1687791 INFO  (jetty-launcher-1859-thread-1) [    ] o.a.s.c.s.e.JettySolrRunner Jetty properties: {hostContext=/solr, hostPort=36705}
   [junit4]   2> 1687791 INFO  (jetty-launcher-1859-thread-1) [    ] o.a.s.s.SolrDispatchFilter SolrDispatchFilter.init(): sun.misc.Launcher$AppClassLoader@73d16e93
   [junit4]   2> 1687791 INFO  (jetty-launcher-1859-thread-1) [    ] o.a.s.c.SolrResourceLoader new SolrResourceLoader for directory: '/x1/jenkins/jenkins-slave/workspace/Lucene-Solr-Tests-6.x/solr/build/solr-core/test/J0/temp/solr.cloud.TestAuthenticationFramework_CD39F69D6564CC3-001/tempDir-001/node1'
   [junit4]   2> 1687791 INFO  (jetty-launcher-1859-thread-1) [    ] o.a.s.c.SolrResourceLoader JNDI not configured for solr (NoInitialContextEx)
   [junit4]   2> 1687791 INFO  (jetty-launcher-1859-thread-1) [    ] o.a.s.c.SolrResourceLoader solr home defaulted to 'solr/' (could not find system property or JNDI)
   [junit4]   2> 1687791 INFO  (jetty-launcher-1859-thread-1) [    ] o.a.s.c.c.SolrZkClient Using default ZkCredentialsProvider
   [junit4]   2> 1687791 INFO  (jetty-launcher-1859-thread-1) [    ] o.a.s.c.c.ConnectionManager Waiting for client to connect to ZooKeeper
   [junit4]   2> 1687792 INFO  (zkCallback-1862-thread-1) [    ] o.a.s.c.c.ConnectionManager Watcher org.apache.solr.common.cloud.ConnectionManager@251e911 name:ZooKeeperConnection Watcher:127.0.0.1:56686/solr got event WatchedEvent state:SyncConnected type:None path:null path:null type:None
   [junit4]   2> 1687792 INFO  (jetty-launcher-1859-thread-5) [    ] o.a.s.c.c.ConnectionManager Client is connected to ZooKeeper
   [junit4]   2> 1687792 INFO  (jetty-launcher-1859-thread-5) [    ] o.a.s.c.c.SolrZkClient Using default ZkACLProvider
   [junit4]   2> 1687793 INFO  (zkCallback-1861-thread-1) [    ] o.a.s.c.c.ConnectionManager Watcher org.apache.solr.common.cloud.ConnectionManager@20e4c55a name:ZooKeeperConnection Watcher:127.0.0.1:56686/solr got event WatchedEvent state:SyncConnected type:None path:null path:null type:None
   [junit4]   2> 1687793 INFO  (jetty-launcher-1859-thread-4) [    ] o.e.j.s.h.ContextHandler Started o.e.j.s.ServletContextHandler@37309a20{/solr,null,AVAILABLE}
   [junit4]   2> 1687793 INFO  (jetty-launcher-1859-thread-5) [    ] o.a.s.s.SolrDispatchFilter solr.xml found in ZooKeeper. Loading...
   [junit4]   2> 1687794 INFO  (jetty-launcher-1859-thread-2) [    ] o.a.s.c.c.ConnectionManager Client is connected to ZooKeeper
   [junit4]   2> 1687794 INFO  (jetty-launcher-1859-thread-2) [    ] o.a.s.c.c.SolrZkClient Using default ZkACLProvider
   [junit4]   2> 1687797 INFO  (jetty-launcher-1859-thread-2) [    ] o.a.s.s.SolrDispatchFilter solr.xml found in ZooKeeper. Loading...
   [junit4]   2> 1687817 INFO  (zkCallback-1863-thread-1) [    ] o.a.s.c.c.ConnectionManager Watcher org.apache.solr.common.cloud.ConnectionManager@627cbf1d name:ZooKeeperConnection Watcher:127.0.0.1:56686/solr got event WatchedEvent state:SyncConnected type:None path:null path:null type:None
   [junit4]   2> 1687818 INFO  (jetty-launcher-1859-thread-4) [    ] o.e.j.s.ServerConnector Started ServerConnector@3e15b055{HTTP/1.1,[http/1.1]}{127.0.0.1:54305}
   [junit4]   2> 1687818 INFO  (jetty-launcher-1859-thread-4) [    ] o.e.j.s.Server Started @1692574ms
   [junit4]   2> 1687818 INFO  (jetty-launcher-1859-thread-4) [    ] o.a.s.c.s.e.JettySolrRunner Jetty properties: {hostContext=/solr, hostPort=54305}
   [junit4]   2> 1687818 INFO  (jetty-launcher-1859-thread-4) [    ] o.a.s.s.SolrDispatchFilter SolrDispatchFilter.init(): sun.misc.Launcher$AppClassLoader@73d16e93
   [junit4]   2> 1687818 INFO  (jetty-launcher-1859-thread-4) [    ] o.a.s.c.SolrResourceLoader new SolrResourceLoader for directory: '/x1/jenkins/jenkins-slave/workspace/Lucene-Solr-Tests-6.x/solr/build/solr-core/test/J0/temp/solr.cloud.TestAuthenticationFramework_CD39F69D6564CC3-001/tempDir-001/node4'
   [junit4]   2> 1687818 INFO  (jetty-launcher-1859-thread-4) [    ] o.a.s.c.SolrResourceLoader JNDI not configured for solr (NoInitialContextEx)
   [junit4]   2> 1687818 INFO  (jetty-launcher-1859-thread-4) [    ] o.a.s.c.SolrResourceLoader solr home defaulted to 'solr/' (could not find system property or JNDI)
   [junit4]   2> 1687818 INFO  (jetty-launcher-1859-thread-4) [    ] o.a.s.c.c.SolrZkClient Using default ZkCredentialsProvider
   [junit4]   2> 1687819 INFO  (jetty-launcher-1859-thread-1) [    ] o.a.s.c.c.ConnectionManager Client is connected to ZooKeeper
   [junit4]   2> 1687819 INFO  (jetty-launcher-1859-thread-1) [    ] o.a.s.c.c.SolrZkClient Using default ZkACLProvider
   [junit4]   2> 1687819 INFO  (jetty-launcher-1859-thread-4) [    ] o.a.s.c.c.ConnectionManager Waiting for client to connect to ZooKeeper
   [junit4]   2> 1687819 INFO  (jetty-launcher-1859-thread-1) [    ] o.a.s.s.SolrDispatchFilter solr.xml found in ZooKeeper. Loading...
   [junit4]   2> 1687820 WARN  (NIOServerCxn.Factory:0.0.0.0/0.0.0.0:0) [    ] o.a.z.s.NIOServerCnxn caught end of stream exception
   [junit4]   2> EndOfStreamException: Unable to read additional data from client sessionid 0x1556b682d340001, likely client has closed socket
   [junit4]   2> 	at org.apache.zookeeper.server.NIOServerCnxn.doIO(NIOServerCnxn.java:228)
   [junit4]   2> 	at org.apache.zookeeper.server.NIOServerCnxnFactory.run(NIOServerCnxnFactory.java:208)
   [junit4]   2> 	at java.lang.Thread.run(Thread.java:745)
   [junit4]   2> 1687822 INFO  (jetty-launcher-1859-thread-5) [    ] o.a.s.c.CorePropertiesLocator Config-defined core root directory: /x1/jenkins/jenkins-slave/workspace/Lucene-Solr-Tests-6.x/solr/build/solr-core/test/J0/temp/solr.cloud.TestAuthenticationFramework_CD39F69D6564CC3-001/tempDir-001/node5/.
   [junit4]   2> 1687822 INFO  (jetty-launcher-1859-thread-5) [    ] o.a.s.c.CoreContainer New CoreContainer 1914901555
   [junit4]   2> 1687822 INFO  (jetty-launcher-1859-thread-5) [    ] o.a.s.c.CoreContainer Loading cores into CoreContainer [instanceDir=/x1/jenkins/jenkins-slave/workspace/Lucene-Solr-Tests-6.x/solr/build/solr-core/test/J0/temp/solr.cloud.TestAuthenticationFramework_CD39F69D6564CC3-001/tempDir-001/node5]
   [junit4]   2> 1687822 WARN  (jetty-launcher-1859-thread-5) [    ] o.a.s.c.CoreContainer Couldn't add files from /x1/jenkins/jenkins-slave/workspace/Lucene-Solr-Tests-6.x/solr/build/solr-core/test/J0/temp/solr.cloud.TestAuthenticationFramework_CD39F69D6564CC3-001/tempDir-001/node5/lib to classpath: /x1/jenkins/jenkins-slave/workspace/Lucene-Solr-Tests-6.x/solr/build/solr-core/test/J0/temp/solr.cloud.TestAuthenticationFramework_CD39F69D6564CC3-001/tempDir-001/node5/lib
   [junit4]   2> 1687822 INFO  (jetty-launcher-1859-thread-5) [    ] o.a.s.h.c.HttpShardHandlerFactory created with socketTimeout : 90000,urlScheme : ,connTimeout : 15000,maxConnectionsPerHost : 20,maxConnections : 10000,corePoolSize : 0,maximumPoolSize : 2147483647,maxThreadIdleTime : 5,sizeOfQueue : -1,fairnessPolicy : false,useRetries : false,
   [junit4]   2> 1687823 INFO  (jetty-launcher-1859-thread-5) [    ] o.a.s.u.UpdateShardHandler Creating UpdateShardHandler HTTP client with params: socketTimeout=340000&connTimeout=45000&retry=true
   [junit4]   2> 1687824 INFO  (jetty-launcher-1859-thread-5) [    ] o.a.s.l.LogWatcher SLF4J impl is org.slf4j.impl.Log4jLoggerFactory
   [junit4]   2> 1687824 INFO  (jetty-launcher-1859-thread-5) [    ] o.a.s.l.LogWatcher Registering Log Listener [Log4j (org.slf4j.impl.Log4jLoggerFactory)]
   [junit4]   2> 1687824 INFO  (jetty-launcher-1859-thread-5) [    ] o.a.s.c.ZkContainer Zookeeper client=127.0.0.1:56686/solr
   [junit4]   2> 1687824 INFO  (jetty-launcher-1859-thread-5) [    ] o.a.s.c.ZkController zkHost includes chroot
   [junit4]   2> 1687824 INFO  (jetty-launcher-1859-thread-5) [    ] o.a.s.c.c.SolrZkClient Using default ZkCredentialsProvider
   [junit4]   2> 1687824 INFO  (jetty-launcher-1859-thread-3) [    ] o.e.j.s.h.ContextHandler Started o.e.j.s.ServletContextHandler@6296c8f{/solr,null,AVAILABLE}
   [junit4]   2> 1687824 INFO  (jetty-launcher-1859-thread-1) [    ] o.a.s.c.CorePropertiesLocator Config-defined core root directory: /x1/jenkins/jenkins-slave/workspace/Lucene-Solr-Tests-6.x/solr/build/solr-core/test/J0/temp/solr.cloud.TestAuthenticationFramework_CD39F69D6564CC3-001/tempDir-001/node1/.
   [junit4]   2> 1687824 INFO  (jetty-launcher-1859-thread-1) [    ] o.a.s.c.CoreContainer New CoreContainer 1153449170
   [junit4]   2> 1687824 INFO  (jetty-launcher-1859-thread-1) [    ] o.a.s.c.CoreContainer Loading cores into CoreContainer [instanceDir=/x1/jenkins/jenkins-slave/workspace/Lucene-Solr-Tests-6.x/solr/build/solr-core/test/J0/temp/solr.cloud.TestAuthenticationFramework_CD39F69D6564CC3-001/tempDir-001/node1]
   [junit4]   2> 1687824 WARN  (jetty-launcher-1859-thread-1) [    ] o.a.s.c.CoreContainer Couldn't add files from /x1/jenkins/jenkins-slave/workspace/Lucene-Solr-Tests-6.x/solr/build/solr-core/test/J0/temp/solr.cloud.TestAuthenticationFramework_CD39F69D6564CC3-001/tempDir-001/node1/lib to classpath: /x1/jenkins/jenkins-slave/workspace/Lucene-Solr-Tests-6.x/solr/build/solr-core/test/J0/temp/solr.cloud.TestAuthenticationFramework_CD39F69D6564CC3-001/tempDir-001/node1/lib
   [junit4]   2> 1687824 INFO  (jetty-launcher-1859-thread-5) [    ] o.a.s.c.c.ConnectionManager Waiting for client to connect to ZooKeeper
   [junit4]   2> 1687824 INFO  (jetty-launcher-1859-thread-1) [    ] o.a.s.h.c.HttpShardHandlerFactory created with socketTimeout : 90000,urlScheme : ,connTimeout : 15000,maxConnectionsPerHost : 20,maxConnections : 10000,corePoolSize : 0,maximumPoolSize : 2147483647,maxThreadIdleTime : 5,sizeOfQueue : -1,fairnessPolicy : false,useRetries : false,
   [junit4]   2> 1687824 INFO  (jetty-launcher-1859-thread-2) [    ] o.a.s.c.CorePropertiesLocator Config-defined core root directory: /x1/jenkins/jenkins-slave/workspace/Lucene-Solr-Tests-6.x/solr/build/solr-core/test/J0/temp/solr.cloud.TestAuthenticationFramework_CD39F69D6564CC3-001/tempDir-001/node2/.
   [junit4]   2> 1687825 INFO  (jetty-launcher-1859-thread-2) [    ] o.a.s.c.CoreContainer New CoreContainer 1117608907
   [junit4]   2> 1687825 INFO  (jetty-launcher-1859-thread-2) [    ] o.a.s.c.CoreContainer Loading cores into CoreContainer [instanceDir=/x1/jenkins/jenkins-slave/workspace/Lucene-Solr-Tests-6.x/solr/build/solr-core/test/J0/temp/solr.cloud.TestAuthenticationFramework_CD39F69D6564CC3-001/tempDir-001/node2]
   [junit4]   2> 1687825 WARN  (jetty-launcher-1859-thread-2) [    ] o.a.s.c.CoreContainer Couldn't add files from /x1/jenkins/jenkins-slave/workspace/Lucene-Solr-Tests-6.x/solr/build/solr-core/test/J0/temp/solr.cloud.TestAuthenticationFramework_CD39F69D6564CC3-001/tempDir-001/node2/lib to classpath: /x1/jenkins/jenkins-slave/workspace/Lucene-Solr-Tests-6.x/solr/build/solr-core/test/J0/temp/solr.cloud.TestAuthenticationFramework_CD39F69D6564CC3-001/tempDir-001/node2/lib
   [junit4]   2> 1687825 INFO  (jetty-launcher-1859-thread-1) [    ] o.a.s.u.UpdateShardHandler Creating UpdateShardHandler HTTP client with params: socketTimeout=340000&connTimeout=45000&retry=true
   [junit4]   2> 1687825 INFO  (jetty-launcher-1859-thread-2) [    ] o.a.s.h.c.HttpShardHandlerFactory created with socketTimeout : 90000,urlScheme : ,connTimeout : 15000,maxConnectionsPerHost : 20,maxConnections : 10000,corePoolSize : 0,maximumPoolSize : 2147483647,maxThreadIdleTime : 5,sizeOfQueue : -1,fairnessPolicy : false,useRetries : false,
   [junit4]   2> 1687825 INFO  (jetty-launcher-1859-thread-1) [    ] o.a.s.l.LogWatcher SLF4J impl is org.slf4j.impl.Log4jLoggerFactory
   [junit4]   2> 1687825 INFO  (jetty-launcher-1859-thread-1) [    ] o.a.s.l.LogWatcher Registering Log Listener [Log4j (org.slf4j.impl.Log4jLoggerFactory)]
   [junit4]   2> 1687825 INFO  (jetty-launcher-1859-thread-1) [    ] o.a.s.c.ZkContainer Zookeeper client=127.0.0.1:56686/solr
   [junit4]   2> 1687825 INFO  (jetty-launcher-1859-thread-2) [    ] o.a.s.u.UpdateShardHandler Creating UpdateShardHandler HTTP client with params: socketTimeout=340000&connTimeout=45000&retry=true
   [junit4]   2> 1687825 INFO  (jetty-launcher-1859-thread-1) [    ] o.a.s.c.ZkController zkHost includes chroot
   [junit4]   2> 1687825 INFO  (jetty-launcher-1859-thread-1) [    ] o.a.s.c.c.SolrZkClient Using default ZkCredentialsProvider
   [junit4]   2> 1687826 INFO  (jetty-launcher-1859-thread-2) [    ] o.a.s.l.LogWatcher SLF4J impl is org.slf4j.impl.Log4jLoggerFactory
   [junit4]   2> 1687826 INFO  (jetty-launcher-1859-thread-2) [    ] o.a.s.l.LogWatcher Registering Log Listener [Log4j (org.slf4j.impl.Log4jLoggerFactory)]
   [junit4]   2> 1687826 INFO  (jetty-launcher-1859-thread-2) [    ] o.a.s.c.ZkContainer Zookeeper client=127.0.0.1:56686/solr
   [junit4]   2> 1687826 INFO  (jetty-launcher-1859-thread-2) [    ] o.a.s.c.ZkController zkHost includes chroot
   [junit4]   2> 1687826 INFO  (jetty-launcher-1859-thread-2) [    ] o.a.s.c.c.SolrZkClient Using default ZkCredentialsProvider
   [junit4]   2> 1687826 INFO  (zkCallback-1864-thread-1) [    ] o.a.s.c.c.ConnectionManager Watcher org.apache.solr.common.cloud.ConnectionManager@4274b45f name:ZooKeeperConnection Watcher:127.0.0.1:56686/solr got event WatchedEvent state:SyncConnected type:None path:null path:null type:None
   [junit4]   2> 1687826 INFO  (jetty-launcher-1859-thread-4) [    ] o.a.s.c.c.ConnectionManager Client is connected to ZooKeeper
   [junit4]   2> 1687826 INFO  (jetty-launcher-1859-thread-4) [    ] o.a.s.c.c.SolrZkClient Using default ZkACLProvider
   [junit4]   2> 1687827 INFO  (jetty-launcher-1859-thread-1) [    ] o.a.s.c.c.ConnectionManager Waiting for client to connect to ZooKeeper
   [junit4]   2> 1687827 INFO  (jetty-launcher-1859-thread-4) [    ] o.a.s.s.SolrDispatchFilter solr.xml found in ZooKeeper. Loading...
   [junit4]   2> 1687830 INFO  (jetty-launcher-1859-thread-2) [    ] o.a.s.c.c.ConnectionManager Waiting for client to connect to ZooKeeper
   [junit4]   2> 1687830 INFO  (zkCallback-1873-thread-1) [    ] o.a.s.c.c.ConnectionManager Watcher org.apache.solr.common.cloud.ConnectionManager@c9d0164 name:ZooKeeperConnection Watcher:127.0.0.1:56686 got event WatchedEvent state:SyncConnected type:None path:null path:null type:None
   [junit4]   2> 1687830 INFO  (jetty-launcher-1859-thread-2) [    ] o.a.s.c.c.ConnectionManager Client is connected to ZooKeeper
   [junit4]   2> 1687830 INFO  (jetty-launcher-1859-thread-2) [    ] o.a.s.c.c.SolrZkClient Using default ZkACLProvider
   [junit4]   2> 1687833 INFO  (jetty-launcher-1859-thread-4) [    ] o.a.s.c.CorePropertiesLocator Config-defined core root directory: /x1/jenkins/jenkins-slave/workspace/Lucene-Solr-Tests-6.x/solr/build/solr-core/test/J0/temp/solr.cloud.TestAuthenticationFramework_CD39F69D6564CC3-001/tempDir-001/node4/.
   [junit4]   2> 1687833 INFO  (jetty-launcher-1859-thread-4) [    ] o.a.s.c.CoreContainer New CoreContainer 1602049739
   [junit4]   2> 1687833 INFO  (jetty-launcher-1859-thread-3) [    ] o.e.j.s.ServerConnector Started ServerConnector@45c194f7{HTTP/1.1,[http/1.1]}{127.0.0.1:49000}
   [junit4]   2> 1687833 INFO  (jetty-launcher-1859-thread-4) [    ] o.a.s.c.CoreContainer Loading cores into CoreContainer [instanceDir=/x1/jenkins/jenkins-slave/workspace/Lucene-Solr-Tests-6.x/solr/build/solr-core/test/J0/temp/solr.cloud.TestAuthenticationFramework_CD39F69D6564CC3-001/tempDir-001/node4]
   [junit4]   2> 1687833 INFO  (jetty-launcher-1859-thread-3) [    ] o.e.j.s.Server Started @1692589ms
   [junit4]   2> 1687834 INFO  (jetty-launcher-1859-thread-3) [    ] o.a.s.c.s.e.JettySolrRunner Jetty properties: {hostContext=/solr, hostPort=49000}
   [junit4]   2> 1687834 INFO  (zkCallback-1872-thread-1) [    ] o.a.s.c.c.ConnectionManager Watcher org.apache.solr.common.cloud.ConnectionManager@6559f820 name:ZooKeeperConnection Watcher:127.0.0.1:56686 got event WatchedEvent state:SyncConnected type:None path:null path:null type:None
   [junit4]   2> 1687834 INFO  (jetty-launcher-1859-thread-3) [    ] o.a.s.s.SolrDispatchFilter SolrDispatchFilter.init(): sun.misc.Launcher$AppClassLoader@73d16e93
   [junit4]   2> 1687834 INFO  (jetty-launcher-1859-thread-2) [n:127.0.0.1:48077_solr    ] o.a.s.c.ZkController Added new OnReconnect listener org.apache.solr.cloud.ZkController$$Lambda$42/935032755@42b6a178
   [junit4]   2> 1687834 INFO  (jetty-launcher-1859-thread-3) [    ] o.a.s.c.SolrResourceLoader new SolrResourceLoader for directory: '/x1/jenkins/jenkins-slave/workspace/Lucene-Solr-Tests-6.x/solr/build/solr-core/test/J0/temp/solr.cloud.TestAuthenticationFramework_CD39F69D6564CC3-001/tempDir-001/node3'
   [junit4]   2> 1687834 INFO  (jetty-launcher-1859-thread-3) [    ] o.a.s.c.SolrResourceLoader JNDI not configured for solr (NoInitialContextEx)
   [junit4]   2> 1687834 INFO  (jetty-launcher-1859-thread-1) [    ] o.a.s.c.c.ConnectionManager Client is connected to ZooKeeper
   [junit4]   2> 1687834 INFO  (jetty-launcher-1859-thread-3) [    ] o.a.s.c.SolrResourceLoader solr home defaulted to 'solr/' (could not find system property or JNDI)
   [junit4]   2> 1687834 INFO  (jetty-launcher-1859-thread-1) [    ] o.a.s.c.c.SolrZkClient Using default ZkACLProvider
   [junit4]   2> 1687834 INFO  (jetty-launcher-1859-thread-3) [    ] o.a.s.c.c.SolrZkClient Using default ZkCredentialsProvider
   [junit4]   2> 1687834 WARN  (jetty-launcher-1859-thread-4) [    ] o.a.s.c.CoreContainer Couldn't add files from /x1/jenkins/jenkins-slave/workspace/Lucene-Solr-Tests-6.x/solr/build/solr-core/test/J0/temp/solr.cloud.TestAuthenticationFramework_CD39F69D6564CC3-001/tempDir-001/node4/lib to classpath: /x1/jenkins/jenkins-slave/workspace/Lucene-Solr-Tests-6.x/solr/build/solr-core/test/J0/temp/solr.cloud.TestAuthenticationFramework_CD39F69D6564CC3-001/tempDir-001/node4/lib
   [junit4]   2> 1687835 INFO  (jetty-launcher-1859-thread-4) [    ] o.a.s.h.c.HttpShardHandlerFactory created with socketTimeout : 90000,urlScheme : ,connTimeout : 15000,maxConnectionsPerHost : 20,maxConnections : 10000,corePoolSize : 0,maximumPoolSize : 2147483647,maxThreadIdleTime : 5,sizeOfQueue : -1,fairnessPolicy : false,useRetries : false,
   [junit4]   2> 1687835 INFO  (jetty-launcher-1859-thread-4) [    ] o.a.s.u.UpdateShardHandler Creating UpdateShardHandler HTTP client with params: socketTimeout=340000&connTimeout=45000&retry=true
   [junit4]   2> 1687835 INFO  (jetty-launcher-1859-thread-2) [n:127.0.0.1:48077_solr    ] o.a.s.c.c.ConnectionManager Waiting for client to connect to ZooKeeper
   [junit4]   2> 1687835 INFO  (jetty-launcher-1859-thread-4) [    ] o.a.s.l.LogWatcher SLF4J impl is org.slf4j.impl.Log4jLoggerFactory
   [junit4]   2> 1687835 INFO  (jetty-launcher-1859-thread-4) [    ] o.a.s.l.LogWatcher Registering Log Listener [Log4j (org.slf4j.impl.Log4jLoggerFactory)]
   [junit4]   2> 1687835 INFO  (jetty-launcher-1859-thread-4) [    ] o.a.s.c.ZkContainer Zookeeper client=127.0.0.1:56686/solr
   [junit4]   2> 1687835 INFO  (zkCallback-1874-thread-1-processing-n:127.0.0.1:48077_solr) [n:127.0.0.1:48077_solr    ] o.a.s.c.c.ConnectionManager Watcher org.apache.solr.common.cloud.ConnectionManager@19aada18 name:ZooKeeperConnection Watcher:127.0.0.1:56686/solr got event WatchedEvent state:SyncConnected type:None path:null path:null type:None
   [junit4]   2> 1687835 INFO  (zkCallback-1867-thread-1) [    ] o.a.s.c.c.ConnectionManager Watcher org.apache.solr.common.cloud.ConnectionManager@609187d4 name:ZooKeeperConnection Watcher:127.0.0.1:56686 got event WatchedEvent state:SyncConnected type:None path:null path:null type:None
   [junit4]   2> 1687836 INFO  (jetty-launcher-1859-thread-5) [    ] o.a.s.c.c.ConnectionManager Client is connected to ZooKeeper
   [junit4]   2> 1687836 INFO  (jetty-launcher-1859-thread-3) [    ] o.a.s.c.c.ConnectionManager Waiting for client to connect to ZooKeeper
   [junit4]   2> 1687836 INFO  (jetty-launcher-1859-thread-5) [    ] o.a.s.c.c.SolrZkClient Using default ZkACLProvider
   [junit4]   2> 1687836 INFO  (jetty-launcher-1859-thread-1) [n:127.0.0.1:36705_solr    ] o.a.s.c.ZkController Added new OnReconnect listener org.apache.solr.cloud.ZkController$$Lambda$42/935032755@55430018
   [junit4]   2> 1687835 INFO  (jetty-launcher-1859-thread-4) [    ] o.a.s.c.ZkController zkHost includes chroot
   [junit4]   2> 1687836 INFO  (jetty-launcher-1859-thread-2) [n:127.0.0.1:48077_solr    ] o.a.s.c.c.ConnectionManager Client is connected to ZooKeeper
   [junit4]   2> 1687837 INFO  (jetty-launcher-1859-thread-4) [    ] o.a.s.c.c.SolrZkClient Using default ZkCredentialsProvider
   [junit4]   2> 1687837 INFO  (jetty-launcher-1859-thread-1) [n:127.0.0.1:36705_solr    ] o.a.s.c.c.ConnectionManager Waiting for client to connect to ZooKeeper
   [junit4]   2> 1687837 INFO  (zkCallback-1875-thread-1) [    ] o.a.s.c.c.ConnectionManager Watcher org.apache.solr.common.cloud.ConnectionManager@6beeca97 name:ZooKeeperConnection Watcher:127.0.0.1:56686/solr got event WatchedEvent state:SyncConnected type:None path:null path:null type:None
   [junit4]   2> 1687838 INFO  (jetty-launcher-1859-thread-3) [    ] o.a.s.c.c.ConnectionManager Client is connected to ZooKeeper
   [junit4]   2> 1687838 INFO  (jetty-launcher-1859-thread-5) [n:127.0.0.1:44802_solr    ] o.a.s.c.ZkController Added new OnReconnect listener org.apache.solr.cloud.ZkController$$Lambda$42/935032755@6e8df9b9
   [junit4]   2> 1687838 INFO  (jetty-launcher-1859-thread-3) [    ] o.a.s.c.c.SolrZkClient Using default ZkACLProvider
   [junit4]   2> 1687838 INFO  (jetty-launcher-1859-thread-3) [    ] o.a.s.s.SolrDispatchFilter solr.xml found in ZooKeeper. Loading...
   [junit4]   2> 1687842 INFO  (jetty-launcher-1859-thread-2) [n:127.0.0.1:48077_solr    ] o.a.s.c.c.SolrZkClient makePath: /overseer/queue
   [junit4]   2> 1687842 INFO  (jetty-launcher-1859-thread-5) [n:127.0.0.1:44802_solr    ] o.a.s.c.c.ConnectionManager Waiting for client to connect to ZooKeeper
   [junit4]   2> 1687844 INFO  (zkCallback-1878-thread-1-processing-n:127.0.0.1:36705_solr) [n:127.0.0.1:36705_solr    ] o.a.s.c.c.ConnectionManager Watcher org.apache.solr.common.cloud.ConnectionManager@743f04f0 name:ZooKeeperConnection Watcher:127.0.0.1:56686/solr got event WatchedEvent state:SyncConnected type:None path:null path:null type:None
   [junit4]   2> 1687844 INFO  (jetty-launcher-1859-thread-1) [n:127.0.0.1:36705_solr    ] o.a.s.c.c.ConnectionManager Client is connected to ZooKeeper
   [junit4]   2> 1687844 INFO  (jetty-launcher-1859-thread-4) [    ] o.a.s.c.c.ConnectionManager Waiting for client to connect to ZooKeeper
   [junit4]   2> 1687845 INFO  (jetty-launcher-1859-thread-3) [    ] o.a.s.c.CorePropertiesLocator Config-defined core root directory: /x1/jenkins/jenkins-slave/workspace/Lucene-Solr-Tests-6.x/solr/build/solr-core/test/J0/temp/solr.cloud.TestAuthenticationFramework_CD39F69D6564CC3-001/tempDir-001/node3/.
   [junit4]   2> 1687845 INFO  (zkCallback-1880-thread-1-processing-n:127.0.0.1:44802_solr) [n:127.0.0.1:44802_solr    ] o.a.s.c.c.ConnectionManager Watcher org.apache.solr.common.cloud.ConnectionManager@f7b902d name:ZooKeeperConnection Watcher:127.0.0.1:56686/solr got event WatchedEvent state:SyncConnected type:None path:null path:null type:None
   [junit4]   2> 1687845 INFO  (jetty-launcher-1859-thread-3) [    ] o.a.s.c.CoreContainer New CoreContainer 1378570071
   [junit4]   2> 1687845 INFO  (jetty-launcher-1859-thread-5) [n:127.0.0.1:44802_solr    ] o.a.s.c.c.ConnectionManager Client is connected to ZooKeeper
   [junit4]   2> 1687845 INFO  (jetty-launcher-1859-thread-3) [    ] o.a.s.c.CoreContainer Loading cores into CoreContainer [instanceDir=/x1/jenkins/jenkins-slave/workspace/Lucene-Solr-Tests-6.x/solr/build/solr-core/test/J0/temp/solr.cloud.TestAuthenticationFramework_CD39F69D6564CC3-001/tempDir-001/node3]
   [junit4]   2> 1687845 WARN  (jetty-launcher-1859-thread-3) [    ] o.a.s.c.CoreContainer Couldn't add files from /x1/jenkins/jenkins-slave/workspace/Lucene-Solr-Tests-6.x/solr/build/solr-core/test/J0/temp/solr.cloud.TestAuthenticationFramework_CD39F69D6564CC3-001/tempDir-001/node3/lib to classpath: /x1/jenkins/jenkins-slave/workspace/Lucene-Solr-Tests-6.x/solr/build/solr-core/test/J0/temp/solr.cloud.TestAuthenticationFramework_CD39F69D6564CC3-001/tempDir-001/node3/lib
   [junit4]   2> 1687845 INFO  (jetty-launcher-1859-thread-3) [    ] o.a.s.h.c.HttpShardHandlerFactory created with socketTimeout : 90000,urlScheme : ,connTimeout : 15000,maxConnectionsPerHost : 20,maxConnections : 10000,corePoolSize : 0,maximumPoolSize : 2147483647,maxThreadIdleTime : 5,sizeOfQueue : -1,fairnessPolicy : false,useRetries : false,
   [junit4]   2> 1687846 INFO  (jetty-launcher-1859-thread-2) [n:127.0.0.1:48077_solr    ] o.a.s.c.c.SolrZkClient makePath: /overseer/collection-queue-work
   [junit4]   2> 1687846 INFO  (jetty-launcher-1859-thread-3) [    ] o.a.s.u.UpdateShardHandler Creating UpdateShardHandler HTTP client with params: socketTimeout=340000&connTimeout=45000&retry=true
   [junit4]   2> 1687846 INFO  (jetty-launcher-1859-thread-3) [    ] o.a.s.l.LogWatcher SLF4J impl is org.slf4j.impl.Log4jLoggerFactory
   [junit4]   2> 1687846 INFO  (jetty-launcher-1859-thread-3) [    ] o.a.s.l.LogWatcher Registering Log Listener [Log4j (org.slf4j.impl.Log4jLoggerFactory)]
   [junit4]   2> 1687846 INFO  (jetty-launcher-1859-thread-3) [    ] o.a.s.c.ZkContainer Zookeeper client=127.0.0.1:56686/solr
   [junit4]   2> 1687846 INFO  (jetty-launcher-1859-thread-3) [    ] o.a.s.c.ZkController zkHost includes chroot
   [junit4]   2> 1687846 INFO  (jetty-launcher-1859-thread-3) [    ] o.a.s.c.c.SolrZkClient Using default ZkCredentialsProvider
   [junit4]   2> 1687847 INFO  (jetty-launcher-1859-thread-3) [    ] o.a.s.c.c.ConnectionManager Waiting for client to connect to ZooKeeper
   [junit4]   2> 1687847 INFO  (zkCallback-1879-thread-1) [    ] o.a.s.c.c.ConnectionManager Watcher org.apache.solr.common.cloud.ConnectionManager@6ee7e123 name:ZooKeeperConnection Watcher:127.0.0.1:56686 got event WatchedEvent state:SyncConnected type:None path:null path:null type:None
   [junit4]   2> 1687847 INFO  (jetty-launcher-1859-thread-4) [    ] o.a.s.c.c.ConnectionManager Client is connected to ZooKeeper
   [junit4]   2> 1687848 INFO  (jetty-launcher-1859-thread-4) [    ] o.a.s.c.c.SolrZkClient Using default ZkACLProvider
   [junit4]   2> 1687848 INFO  (zkCallback-1883-thread-1) [    ] o.a.s.c.c.ConnectionManager Watcher org.apache.solr.common.cloud.ConnectionManager@2710ee10 name:ZooKeeperConnection Watcher:127.0.0.1:56686 got event WatchedEvent state:SyncConnected type:None path:null path:null type:None
   [junit4]   2> 1687848 INFO  (jetty-launcher-1859-thread-3) [    ] o.a.s.c.c.ConnectionManager Client is connected to ZooKeeper
   [junit4]   2> 1687848 INFO  (jetty-launcher-1859-thread-3) [    ] o.a.s.c.c.SolrZkClient Using default ZkACLProvider
   [junit4]   2> 1687850 INFO  (jetty-launcher-1859-thread-4) [n:127.0.0.1:54305_solr    ] o.a.s.c.ZkController Added new OnReconnect listener org.apache.solr.cloud.ZkController$$Lambda$42/935032755@a328d11
   [junit4]   2> 1687850 INFO  (jetty-launcher-1859-thread-2) [n:127.0.0.1:48077_solr    ] o.a.s.c.c.SolrZkClient makePath: /overseer/collection-map-running
   [junit4]   2> 1687850 INFO  (jetty-launcher-1859-thread-4) [n:127.0.0.1:54305_solr    ] o.a.s.c.c.ConnectionManager Waiting for client to connect to ZooKeeper
   [junit4]   2> 1687851 INFO  (jetty-launcher-1859-thread-1) [n:127.0.0.1:36705_solr    ] o.a.s.c.c.SolrZkClient makePath: /overseer/collection-map-running
   [junit4]   2> 1687851 INFO  (jetty-launcher-1859-thread-3) [n:127.0.0.1:49000_solr    ] o.a.s.c.ZkController Added new OnReconnect listener org.apache.solr.cloud.ZkController$$Lambda$42/935032755@190fb924
   [junit4]   2> 1687852 INFO  (jetty-launcher-1859-thread-3) [n:127.0.0.1:49000_solr    ] o.a.s.c.c.ConnectionManager Waiting for client to connect to ZooKeeper
   [junit4]   2> 1687852 INFO  (zkCallback-1884-thread-1-processing-n:127.0.0.1:54305_solr) [n:127.0.0.1:54305_solr    ] o.a.s.c.c.ConnectionManager Watcher org.apache.solr.common.cloud.ConnectionManager@5c81f63e name:ZooKeeperConnection Watcher:127.0.0.1:56686/solr got event WatchedEvent state:SyncConnected type:None path:null path:null type:None
   [junit4]   2> 1687852 INFO  (jetty-launcher-1859-thread-4) [n:127.0.0.1:54305_solr    ] o.a.s.c.c.ConnectionManager Client is connected to ZooKeeper
   [junit4]   2> 1687853 INFO  (zkCallback-1885-thread-1-processing-n:127.0.0.1:49000_solr) [n:127.0.0.1:49000_solr    ] o.a.s.c.c.ConnectionManager Watcher org.apache.solr.common.cloud.ConnectionManager@412ea534 name:ZooKeeperConnection Watcher:127.0.0.1:56686/solr got event WatchedEvent state:SyncConnected type:None path:null path:null type:None
   [junit4]   2> 1687853 INFO  (jetty-launcher-1859-thread-3) [n:127.0.0.1:49000_solr    ] o.a.s.c.c.ConnectionManager Client is connected to ZooKeeper
   [junit4]   2> 1687853 INFO  (jetty-launcher-1859-thread-2) [n:127.0.0.1:48077_solr    ] o.a.s.c.c.SolrZkClient makePath: /overseer/collection-map-completed
   [junit4]   2> 1687854 INFO  (jetty-launcher-1859-thread-1) [n:127.0.0.1:36705_solr    ] o.a.s.c.c.SolrZkClient makePath: /overseer/collection-map-completed
   [junit4]   2> 1687854 INFO  (jetty-launcher-1859-thread-5) [n:127.0.0.1:44802_solr    ] o.a.s.c.c.SolrZkClient makePath: /overseer/collection-map-completed
   [junit4]   2> 1687857 INFO  (jetty-launcher-1859-thread-2) [n:127.0.0.1:48077_solr    ] o.a.s.c.c.SolrZkClient makePath: /overseer/collection-map-failure
   [junit4]   2> 1687857 INFO  (jetty-launcher-1859-thread-1) [n:127.0.0.1:36705_solr    ] o.a.s.c.c.SolrZkClient makePath: /overseer/collection-map-failure
   [junit4]   2> 1687858 INFO  (jetty-launcher-1859-thread-5) [n:127.0.0.1:44802_solr    ] o.a.s.c.c.SolrZkClient makePath: /overseer/collection-map-failure
   [junit4]   2> 1687860 INFO  (jetty-launcher-1859-thread-2) [n:127.0.0.1:48077_solr    ] o.a.s.c.c.SolrZkClient makePath: /live_nodes
   [junit4]   2> 1687860 INFO  (jetty-launcher-1859-thread-1) [n:127.0.0.1:36705_solr    ] o.a.s.c.c.SolrZkClient makePath: /live_nodes
   [junit4]   2> 1687861 INFO  (jetty-launcher-1859-thread-5) [n:127.0.0.1:44802_solr    ] o.a.s.c.c.SolrZkClient makePath: /live_nodes
   [junit4]   2> 1687862 INFO  (jetty-launcher-1859-thread-2) [n:127.0.0.1:48077_solr    ] o.a.s.c.c.SolrZkClient makePath: /collections
   [junit4]   2> 1687862 INFO  (jetty-launcher-1859-thread-1) [n:127.0.0.1:36705_solr    ] o.a.s.c.c.SolrZkClient makePath: /collections
   [junit4]   2> 1687863 INFO  (jetty-launcher-1859-thread-5) [n:127.0.0.1:44802_solr    ] o.a.s.c.c.SolrZkClient makePath: /collections
   [junit4]   2> 1687863 INFO  (jetty-launcher-1859-thread-2) [n:127.0.0.1:48077_solr    ] o.a.s.c.c.SolrZkClient makePath: /aliases.json
   [junit4]   2> 1687863 INFO  (jetty-launcher-1859-thread-1) [n:127.0.0.1:36705_solr    ] o.a.s.c.c.SolrZkClient makePath: /aliases.json
   [junit4]   2> 1687865 INFO  (jetty-launcher-1859-thread-2) [n:127.0.0.1:48077_solr    ] o.a.s.c.c.SolrZkClient makePath: /clusterstate.json
   [junit4]   2> 1687865 INFO  (jetty-launcher-1859-thread-1) [n:127.0.0.1:36705_solr    ] o.a.s.c.c.SolrZkClient makePath: /clusterstate.json
   [junit4]   2> 1687865 INFO  (jetty-launcher-1859-thread-5) [n:127.0.0.1:44802_solr    ] o.a.s.c.c.SolrZkClient makePath: /clusterstate.json
   [junit4]   2> 1687866 INFO  (jetty-launcher-1859-thread-1) [n:127.0.0.1:36705_solr    ] o.a.s.c.c.SolrZkClient makePath: /security.json
   [junit4]   2> 1687866 INFO  (jetty-launcher-1859-thread-2) [n:127.0.0.1:48077_solr    ] o.a.s.c.c.SolrZkClient makePath: /security.json
   [junit4]   2> 1687866 INFO  (jetty-launcher-1859-thread-5) [n:127.0.0.1:44802_solr    ] o.a.s.c.c.SolrZkClient makePath: /security.json
   [junit4]   2> 1687867 INFO  (jetty-launcher-1859-thread-4) [n:127.0.0.1:54305_solr    ] o.a.s.c.c.ZkStateReader Updating cluster state from ZooKeeper... 
   [junit4]   2> 1687867 INFO  (jetty-launcher-1859-thread-1) [n:127.0.0.1:36705_solr    ] o.a.s.c.c.ZkStateReader Updating cluster state from ZooKeeper... 
   [junit4]   2> 1687867 INFO  (jetty-launcher-1859-thread-2) [n:127.0.0.1:48077_solr    ] o.a.s.c.c.ZkStateReader Updating cluster state from ZooKeeper... 
   [junit4]   2> 1687868 INFO  (jetty-launcher-1859-thread-5) [n:127.0.0.1:44802_solr    ] o.a.s.c.c.ZkStateReader Updating cluster state from ZooKeeper... 
   [junit4]   2> 1687868 INFO  (jetty-launcher-1859-thread-1) [n:127.0.0.1:36705_solr    ] o.a.s.c.c.ZkStateReader Loaded empty cluster properties
   [junit4]   2> 1687868 INFO  (jetty-launcher-1859-thread-2) [n:127.0.0.1:48077_solr    ] o.a.s.c.c.ZkStateReader Loaded empty cluster properties
   [junit4]   2> 1687869 INFO  (jetty-launcher-1859-thread-1) [n:127.0.0.1:36705_solr    ] o.a.s.c.c.ZkStateReader Updated live nodes from ZooKeeper... (0) -> (0)
   [junit4]   2> 1687869 INFO  (jetty-launcher-1859-thread-2) [n:127.0.0.1:48077_solr    ] o.a.s.c.c.ZkStateReader Updated live nodes from ZooKeeper... (0) -> (0)
   [junit4]   2> 1687869 INFO  (jetty-launcher-1859-thread-3) [n:127.0.0.1:49000_solr    ] o.a.s.c.c.ZkStateReader Updating cluster state from ZooKeeper... 
   [junit4]   2> 1687869 INFO  (jetty-launcher-1859-thread-5) [n:127.0.0.1:44802_solr    ] o.a.s.c.c.ZkStateReader Loaded empty cluster properties
   [junit4]   2> 1687870 INFO  (jetty-launcher-1859-thread-1) [n:127.0.0.1:36705_solr    ] o.a.s.c.c.SolrZkClient makePath: /overseer_elect
   [junit4]   2> 1687870 INFO  (jetty-launcher-1859-thread-4) [n:127.0.0.1:54305_solr    ] o.a.s.c.c.ZkStateReader Loaded empty cluster properties
   [junit4]   2> 1687871 INFO  (jetty-launcher-1859-thread-1) [n:127.0.0.1:36705_solr    ] o.a.s.c.c.SolrZkClient makePath: /overseer_elect/election
   [junit4]   2> 1687872 INFO  (jetty-launcher-1859-thread-4) [n:127.0.0.1:54305_solr    ] o.a.s.c.c.ZkStateReader Updated live nodes from ZooKeeper... (0) -> (0)
   [junit4]   2> 1687872 INFO  (jetty-launcher-1859-thread-5) [n:127.0.0.1:44802_solr    ] o.a.s.c.c.ZkStateReader Updated live nodes from ZooKeeper... (0) -> (0)
   [junit4]   2> 1687872 INFO  (jetty-launcher-1859-thread-2) [n:127.0.0.1:48077_solr    ] o.a.s.c.Overseer Overseer (id=null) closing
   [junit4]   2> 1687872 INFO  (jetty-launcher-1859-thread-1) [n:127.0.0.1:36705_solr    ] o.a.s.c.Overseer Overseer (id=null) closing
   [junit4]   2> 1687872 INFO  (jetty-launcher-1859-thread-3) [n:127.0.0.1:49000_solr    ] o.a.s.c.c.ZkStateReader Loaded empty cluster properties
   [junit4]   2> 1687873 INFO  (jetty-launcher-1859-thread-1) [n:127.0.0.1:36705_solr    ] o.a.s.c.LeaderElector Joined leadership election with path: /overseer_elect/election/96101062237487114-127.0.0.1:36705_solr-n_0000000000
   [junit4]   2> 1687873 INFO  (jetty-launcher-1859-thread-2) [n:127.0.0.1:48077_solr    ] o.a.s.c.LeaderElector Joined leadership election with path: /overseer_elect/election/96101062237487112-127.0.0.1:48077_solr-n_0000000001
   [junit4]   2> 1687873 INFO  (jetty-launcher-1859-thread-1) [n:127.0.0.1:36705_solr    ] o.a.s.c.OverseerElectionContext I am going to be the leader 127.0.0.1:36705_solr
   [junit4]   2> 1687873 INFO  (jetty-launcher-1859-thread-1) [n:127.0.0.1:36705_solr    ] o.a.s.c.c.SolrZkClient makePath: /overseer_elect/leader
   [junit4]   2> 1687878 INFO  (jetty-launcher-1859-thread-2) [n:127.0.0.1:48077_solr    ] o.a.s.c.LeaderElector Watching path /overseer_elect/election/96101062237487114-127.0.0.1:36705_solr-n_0000000000 to know if I could be the leader
   [junit4]   2> 1687878 INFO  (jetty-launcher-1859-thread-2) [n:127.0.0.1:48077_solr    ] o.a.s.c.ZkController Register node as live in ZooKeeper:/live_nodes/127.0.0.1:48077_solr
   [junit4]   2> 1687882 INFO  (jetty-launcher-1859-thread-1) [n:127.0.0.1:36705_solr    ] o.a.s.c.Overseer Overseer (id=96101062237487114-127.0.0.1:36705_solr-n_0000000000) starting
   [junit4]   2> 1687882 INFO  (jetty-launcher-1859-thread-2) [n:127.0.0.1:48077_solr    ] o.a.s.c.c.SolrZkClient makePath: /live_nodes/127.0.0.1:48077_solr
   [junit4]   2> 1687883 INFO  (jetty-launcher-1859-thread-3) [n:127.0.0.1:49000_solr    ] o.a.s.c.c.ZkStateReader Updated live nodes from ZooKeeper... (0) -> (0)
   [junit4]   2> 1687890 INFO  (zkCallback-1884-thread-1-processing-n:127.0.0.1:54305_solr) [n:127.0.0.1:54305_solr    ] o.a.s.c.c.ZkStateReader A live node change: [WatchedEvent state:SyncConnected type:NodeChildrenChanged path:/live_nodes], has occurred - updating... (live nodes size: [0])
   [junit4]   2> 1687890 INFO  (zkCallback-1878-thread-1-processing-n:127.0.0.1:36705_solr) [n:127.0.0.1:36705_solr    ] o.a.s.c.c.ZkStateReader A live node change: [WatchedEvent state:SyncConnected type:NodeChildrenChanged path:/live_nodes], has occurred - updating... (live nodes size: [0])
   [junit4]   2> 1687890 INFO  (zkCallback-1874-thread-1-processing-n:127.0.0.1:48077_solr) [n:127.0.0.1:48077_solr    ] o.a.s.c.c.ZkStateReader A live node change: [WatchedEvent state:SyncConnected type:NodeChildrenChanged path:/live_nodes], has occurred - updating... (live nodes size: [0])
   [junit4]   2> 1687890 INFO  (zkCallback-1880-thread-1-processing-n:127.0.0.1:44802_solr) [n:127.0.0.1:44802_solr    ] o.a.s.c.c.ZkStateReader A live node change: [WatchedEvent state:SyncConnected type:NodeChildrenChanged path:/live_nodes], has occurred - updating... (live nodes size: [0])
   [junit4]   2> 1687891 INFO  (zkCallback-1878-thread-1-processing-n:127.0.0.1:36705_solr) [n:127.0.0.1:36705_solr    ] o.a.s.c.c.ZkStateReader Updated live nodes from ZooKeeper... (0) -> (1)
   [junit4]   2> 1687891 INFO  (zkCallback-1885-thread-1-processing-n:127.0.0.1:49000_solr) [n:127.0.0.1:49000_solr    ] o.a.s.c.c.ZkStateReader A live node change: [WatchedEvent state:SyncConnected type:NodeChildrenChanged path:/live_nodes], has occurred - updating... (live nodes size: [0])
   [junit4]   2> 1687892 INFO  (zkCallback-1874-thread-1-processing-n:127.0.0.1:48077_solr) [n:127.0.0.1:48077_solr    ] o.a.s.c.c.ZkStateReader Updated live nodes from ZooKeeper... (0) -> (1)
   [junit4]   2> 1687895 INFO  (jetty-launcher-1859-thread-4) [n:127.0.0.1:54305_solr    ] o.a.s.c.Overseer Overseer (id=null) closing
   [junit4]   2> 1687894 INFO  (zkCallback-1884-thread-1-processing-n:127.0.0.1:54305_solr) [n:127.0.0.1:54305_solr    ] o.a.s.c.c.ZkStateReader Updated live nodes from ZooKeeper... (0) -> (1)
   [junit4]   2> 1687896 INFO  (jetty-launcher-1859-thread-4) [n:127.0.0.1:54305_solr    ] o.a.s.c.LeaderElector Joined leadership election with path: /overseer_elect/election/96101062237487118-127.0.0.1:54305_solr-n_0000000002
   [junit4]   2> 1687896 INFO  (jetty-launcher-1859-thread-1) [n:127.0.0.1:36705_solr    ] o.a.s.c.c.SolrZkClient makePath: /overseer/queue-work
   [junit4]   2> 1687898 INFO  (zkCallback-1880-thread-1-processing-n:127.0.0.1:44802_solr) [n:127.0.0.1:44802_solr    ] o.a.s.c.c.ZkStateReader Updated live nodes from ZooKeeper... (0) -> (1)
   [junit4]   2> 1687899 INFO  (zkCallback-1885-thread-1-processing-n:127.0.0.1:49000_solr) [n:127.0.0.1:49000_solr    ] o.a.s.c.c.ZkStateReader Updated live nodes from ZooKeeper... (0) -> (1)
   [junit4]   2> 1687899 INFO  (jetty-launcher-1859-thread-4) [n:127.0.0.1:54305_solr    ] o.a.s.c.LeaderElector Watching path /overseer_elect/election/96101062237487112-127.0.0.1:48077_solr-n_0000000001 to know if I could be the leader
   [junit4]   2> 1687900 INFO  (jetty-launcher-1859-thread-4) [n:127.0.0.1:54305_solr    ] o.a.s.c.ZkController Publish node=127.0.0.1:54305_solr as DOWN
   [junit4]   2> 1687900 INFO  (jetty-launcher-1859-thread-3) [n:127.0.0.1:49000_solr    ] o.a.s.c.Overseer Overseer (id=null) closing
   [junit4]   2> 1687901 INFO  (jetty-launcher-1859-thread-3) [n:127.0.0.1:49000_solr    ] o.a.s.c.LeaderElector Joined leadership election with path: /overseer_elect/election/96101062237487119-127.0.0.1:49000_solr-n_0000000003
   [junit4]   2> 1687902 INFO  (jetty-launcher-1859-thread-3) [n:127.0.0.1:49000_solr    ] o.a.s.c.LeaderElector Watching path /overseer_elect/election/96101062237487118-127.0.0.1:54305_solr-n_0000000002 to know if I could be the leader
   [junit4]   2> 1687902 INFO  (jetty-launcher-1859-thread-3) [n:127.0.0.1:49000_solr    ] o.a.s.c.ZkController Publish node=127.0.0.1:49000_solr as DOWN
   [junit4]   2> 1687906 INFO  (jetty-launcher-1859-thread-2) [n:127.0.0.1:48077_solr    ] o.a.s.c.CoreContainer Security conf doesn't exist. Skipping setup for authorization module.
   [junit4]   2> 1687906 INFO  (jetty-launcher-1859-thread-2) [n:127.0.0.1:48077_solr    ] o.a.s.c.CoreContainer Authentication plugin class obtained from system property 'authenticationPlugin': org.apache.solr.cloud.TestAuthenticationFramework$MockAuthenticationPlugin
   [junit4]   2> 1687907 INFO  (jetty-launcher-1859-thread-2) [n:127.0.0.1:48077_solr    ] o.a.s.c.CoreContainer Reconfiguring the shard handler factory and update shard handler.
   [junit4]   2> 1687907 INFO  (jetty-launcher-1859-thread-2) [n:127.0.0.1:48077_solr    ] o.a.s.h.c.HttpShardHandlerFactory Reconfiguring the default client with: org.apache.solr.cloud.TestAuthenticationFramework$MockAuthenticationPlugin$MockClientConfigurer@5bbdb396
   [junit4]   2> 1687907 INFO  (jetty-launcher-1859-thread-2) [n:127.0.0.1:48077_solr    ] o.a.s.u.UpdateShardHandler Reconfiguring the default client with: org.apache.solr.cloud.TestAuthenticationFramework$MockAuthenticationPlugin$MockClientConfigurer@5bbdb396
   [junit4]   2> 1687908 INFO  (jetty-launcher-1859-thread-2) [n:127.0.0.1:48077_solr    ] o.a.s.c.CorePropertiesLocator Looking for core definitions underneath /x1/jenkins/jenkins-slave/workspace/Lucene-Solr-Tests-6.x/solr/build/solr-core/test/J0/temp/solr.cloud.TestAuthenticationFramework_CD39F69D6564CC3-001/tempDir-001/node2/.
   [junit4]   2> 1687908 INFO  (jetty-launcher-1859-thread-2) [n:127.0.0.1:48077_solr    ] o.a.s.c.CorePropertiesLocator Found 0 core definitions
   [junit4]   2> 1687911 INFO  (jetty-launcher-1859-thread-1) [n:127.0.0.1:36705_solr    ] o.a.s.c.OverseerAutoReplicaFailoverThread Starting OverseerAutoReplicaFailoverThread autoReplicaFailoverWorkLoopDelay=10000 autoReplicaFailoverWaitAfterExpiration=30000 autoReplicaFailoverBadNodeExpiration=60000
   [junit4]   2> 1687911 INFO  (jetty-launcher-1859-thread-2) [n:127.0.0.1:48077_solr    ] o.a.s.s.SolrDispatchFilter user.dir=/x1/jenkins/jenkins-slave/workspace/Lucene-Solr-Tests-6.x/solr/build/solr-core/test/J0
   [junit4]   2> 1687911 INFO  (jetty-launcher-1859-thread-5) [n:127.0.0.1:44802_solr    ] o.a.s.c.Overseer Overseer (id=null) closing
   [junit4]   2> 1687911 INFO  (jetty-launcher-1859-thread-2) [n:127.0.0.1:48077_solr    ] o.a.s.s.SolrDispatchFilter SolrDispatchFilter.init() done
   [junit4]   2> 1687912 INFO  (OverseerCollectionConfigSetProcessor-96101062237487114-127.0.0.1:36705_solr-n_0000000000) [n:127.0.0.1:36705_solr    ] o.a.s.c.OverseerTaskProcessor Process current queue of overseer operations
   [junit4]   2> 1687912 INFO  (jetty-launcher-1859-thread-5) [n:127.0.0.1:44802_solr    ] o.a.s.c.LeaderElector Joined leadership election with path: /overseer_elect/election/96101062237487115-127.0.0.1:44802_solr-n_0000000004
   [junit4]   2> 1687912 INFO  (jetty-launcher-1859-thread-1) [n:127.0.0.1:36705_solr    ] o.a.s.c.ZkController Publish node=127.0.0.1:36705_solr as DOWN
   [junit4]   2> 1687912 INFO  (OverseerStateUpdate-96101062237487114-127.0.0.1:36705_solr-n_0000000000) [n:127.0.0.1:36705_solr    ] o.a.s.c.Overseer Starting to work on the main queue
   [junit4]   2> 1687913 INFO  (jetty-launcher-1859-thread-5) [n:127.0.0.1:44802_solr    ] o.a.s.c.LeaderElector Watching path /overseer_elect/election/96101062237487119-127.0.0.1:49000_solr-n_0000000003 to know if I could be the leader
   [junit4]   2> 1687914 INFO  (jetty-launcher-1859-thread-5) [n:127.0.0.1:44802_solr    ] o.a.s.c.ZkController Publish node=127.0.0.1:44802_solr as DOWN
   [junit4]   2> 1687915 INFO  (OverseerStateUpdate-96101062237487114-127.0.0.1:36705_solr-n_0000000000) [n:127.0.0.1:36705_solr    ] o.a.s.c.c.ZkStateReader Updated live nodes from ZooKeeper... (1) -> (1)
   [junit4]   2> 1687917 INFO  (OverseerStateUpdate-96101062237487114-127.0.0.1:36705_solr-n_0000000000) [n:127.0.0.1:36705_solr    ] o.a.s.c.Overseer processMessage: queueSize: 4, message = {
   [junit4]   2>   "operation":"downnode",
   [junit4]   2>   "node_name":"127.0.0.1:54305_solr"} current state version: 0
   [junit4]   2> 1687917 INFO  (OverseerStateUpdate-96101062237487114-127.0.0.1:36705_solr-n_0000000000) [n:127.0.0.1:36705_solr    ] o.a.s.c.o.NodeMutator DownNode state invoked for node: 127.0.0.1:54305_solr
   [junit4]   2> 1687919 INFO  (OverseerStateUpdate-96101062237487114-127.0.0.1:36705_solr-n_0000000000) [n:127.0.0.1:36705_solr    ] o.a.s.c.Overseer processMessage: queueSize: 3, message = {
   [junit4]   2>   "operation":"downnode",
   [junit4]   2>   "node_name":"127.0.0.1:49000_solr"} current state version: 0
   [junit4]   2> 1687919 INFO  (OverseerStateUpdate-96101062237487114-127.0.0.1:36705_solr-n_0000000000) [n:127.0.0.1:36705_solr    ] o.a.s.c.o.NodeMutator DownNode state invoked for node: 127.0.0.1:49000_solr
   [junit4]   2> 1687920 INFO  (OverseerStateUpdate-96101062237487114-127.0.0.1:36705_solr-n_0000000000) [n:127.0.0.1:36705_solr    ] o.a.s.c.Overseer processMessage: queueSize: 2, message = {
   [junit4]   2>   "operation":"downnode",
   [junit4]   2>   "node_name":"127.0.0.1:36705_solr"} current state version: 0
   [junit4]   2> 1687920 INFO  (OverseerStateUpdate-96101062237487114-127.0.0.1:36705_solr-n_0000000000) [n:127.0.0.1:36705_solr    ] o.a.s.c.o.NodeMutator DownNode state invoked for node: 127.0.0.1:36705_solr
   [junit4]   2> 1687921 INFO  (OverseerStateUpdate-96101062237487114-127.0.0.1:36705_solr-n_0000000000) [n:127.0.0.1:36705_solr    ] o.a.s.c.Overseer processMessage: queueSize: 1, message = {
   [junit4]   2>   "operation":"downnode",
   [junit4]   2>   "node_name":"127.0.0.1:44802_solr"} current state version: 0
   [junit4]   2> 1687921 INFO  (OverseerStateUpdate-96101062237487114-127.0.0.1:36705_solr-n_0000000000) [n:127.0.0.1:36705_solr    ] o.a.s.c.o.NodeMutator DownNode state invoked for node: 127.0.0.1:44802_solr
   [junit4]   2> 1688903 INFO  (jetty-launcher-1859-thread-4) [n:127.0.0.1:54305_solr    ] o.a.s.c.ZkController Register node as live in ZooKeeper:/live_nodes/127.0.0.1:54305_solr
   [junit4]   2> 1688904 INFO  (jetty-launcher-1859-thread-4) [n:127.0.0.1:54305_solr    ] o.a.s.c.c.SolrZkClient makePath: /live_nodes/127.0.0.1:54305_solr
   [junit4]   2> 1688905 INFO  (zkCallback-1884-thread-1-processing-n:127.0.0.1:54305_solr) [n:127.0.0.1:54305_solr    ] o.a.s.c.c.ZkStateReader A live node change: [WatchedEvent state:SyncConnected type:NodeChildrenChanged path:/live_nodes], has occurred - updating... (live nodes size: [1])
   [junit4]   2> 1688905 INFO  (zkCallback-1874-thread-1-processing-n:127.0.0.1:48077_solr) [n:127.0.0.1:48077_solr    ] o.a.s.c.c.ZkStateReader A live node change: [WatchedEvent state:SyncConnected type:NodeChildrenChanged path:/live_nodes], has occurred - updating... (live nodes size: [1])
   [junit4]   2> 1688905 INFO  (zkCallback-1885-thread-1-processing-n:127.0.0.1:49000_solr) [n:127.0.0.1:49000_solr    ] o.a.s.c.c.ZkStateReader A live node change: [WatchedEvent state:SyncConnected type:NodeChildrenChanged path:/live_nodes], has occurred - updating... (live nodes size: [1])
   [junit4]   2> 1688906 INFO  (zkCallback-1880-thread-1-processing-n:127.0.0.1:44802_solr) [n:127.0.0.1:44802_solr    ] o.a.s.c.c.ZkStateReader A live node change: [WatchedEvent state:SyncConnected type:NodeChildrenChanged path:/live_nodes], has occurred - updating... (live nodes size: [1])
   [junit4]   2> 1688906 INFO  (zkCallback-1878-thread-1-processing-n:127.0.0.1:36705_solr) [n:127.0.0.1:36705_solr    ] o.a.s.c.c.ZkStateReader A live node change: [WatchedEvent state:SyncConnected type:NodeChildrenChanged path:/live_nodes], has occurred - updating... (live nodes size: [1])
   [junit4]   2> 1688906 INFO  (zkCallback-1874-thread-1-processing-n:127.0.0.1:48077_solr) [n:127.0.0.1:48077_solr    ] o.a.s.c.c.ZkStateReader Updated live nodes from ZooKeeper... (1) -> (2)
   [junit4]   2> 1688906 INFO  (zkCallback-1884-thread-1-processing-n:127.0.0.1:54305_solr) [n:127.0.0.1:54305_solr    ] o.a.s.c.c.ZkStateReader Updated live nodes from ZooKeeper... (1) -> (2)
   [junit4]   2> 1688906 INFO  (zkCallback-1878-thread-1-processing-n:127.0.0.1:36705_solr) [n:127.0.0.1:36705_solr    ] o.a.s.c.c.ZkStateReader Updated live nodes from ZooKeeper... (1) -> (2)
   [junit4]   2> 1688906 INFO  (zkCallback-1880-thread-1-processing-n:127.0.0.1:44802_solr) [n:127.0.0.1:44802_solr    ] o.a.s.c.c.ZkStateReader Updated live nodes from ZooKeeper... (1) -> (2)
   [junit4]   2> 1688906 INFO  (zkCallback-1885-thread-1-processing-n:127.0.0.1:49000_solr) [n:127.0.0.1:49000_solr    ] o.a.s.c.c.ZkStateReader Updated live nodes from ZooKeeper... (1) -> (2)
   [junit4]   2> 1688911 INFO  (jetty-launcher-1859-thread-3) [n:127.0.0.1:49000_solr    ] o.a.s.c.ZkController Register node as live in ZooKeeper:/live_nodes/127.0.0.1:49000_solr
   [junit4]   2> 1688912 INFO  (jetty-launcher-1859-thread-3) [n:127.0.0.1:49000_solr    ] o.a.s.c.c.SolrZkClient makePath: /live_nodes/127.0.0.1:49000_solr
   [junit4]   2> 1688914 INFO  (zkCallback-1878-thread-1-processing-n:127.0.0.1:36705_solr) [n:127.0.0.1:36705_solr    ] o.a.s.c.c.ZkStateReader A live node change: [WatchedEvent state:SyncConnected type:NodeChildrenChanged path:/live_nodes], has occurred - updating... (live nodes size: [2])
   [junit4]   2> 1688914 INFO  (zkCallback-1874-thread-1-processing-n:127.0.0.1:48077_solr) [n:127.0.0.1:48077_solr    ] o.a.s.c.c.ZkStateReader A live node change: [WatchedEvent state:SyncConnected type:NodeChildrenChanged path:/live_nodes], has occurred - updating... (live nodes size: [2])
   [junit4]   2> 1688914 INFO  (zkCallback-1880-thread-1-processing-n:127.0.0.1:44802_solr) [n:127.0.0.1:44802_solr    ] o.a.s.c.c.ZkStateReader A live node change: [WatchedEvent state:SyncConnected type:NodeChildrenChanged path:/live_nodes], has occurred - updating... (live nodes size: [2])
   [junit4]   2> 1688914 INFO  (zkCallback-1885-thread-1-processing-n:127.0.0.1:49000_solr) [n:127.0.0.1:49000_solr    ] o.a.s.c.c.ZkStateReader A live node change: [WatchedEvent state:SyncConnected type:NodeChildrenChanged path:/live_nodes], has occurred - updating... (live nodes size: [2])
   [junit4]   2> 1688914 INFO  (zkCallback-1884-thread-1-processing-n:127.0.0.1:54305_solr) [n:127.0.0.1:54305_solr    ] o.a.s.c.c.ZkStateReader A live node change: [WatchedEvent state:SyncConnected type:NodeChildrenChanged path:/live_nodes], has occurred - updating... (live nodes size: [2])
   [junit4]   2> 1688915 INFO  (jetty-launcher-1859-thread-1) [n:127.0.0.1:36705_solr    ] o.a.s.c.ZkController Register node as live in ZooKeeper:/live_nodes/127.0.0.1:36705_solr
   [junit4]   2> 1688915 INFO  (zkCallback-1874-thread-1-processing-n:127.0.0.1:48077_solr) [n:127.0.0.1:48077_solr    ] o.a.s.c.c.ZkStateReader Updated live nodes from ZooKeeper... (2) -> (3)
   [junit4]   2> 1688915 INFO  (zkCallback-1880-thread-1-processing-n:127.0.0.1:44802_solr) [n:127.0.0.1:44802_solr    ] o.a.s.c.c.ZkStateReader Updated live nodes from ZooKeeper... (2) -> (3)
   [junit4]   2> 1688915 INFO  (zkCallback-1878-thread-1-processing-n:127.0.0.1:36705_solr) [n:127.0.0.1:36705_solr    ] o.a.s.c.c.ZkStateReader Updated live nodes from ZooKeeper... (2) -> (3)
   [junit4]   2> 1688915 INFO  (jetty-launcher-1859-thread-5) [n:127.0.0.1:44802_solr    ] o.a.s.c.ZkController Register node as live in ZooKeeper:/live_nodes/127.0.0.1:44802_solr
   [junit4]   2> 1688917 INFO  (jetty-launcher-1859-thread-4) [n:127.0.0.1:54305_solr    ] o.a.s.c.CoreContainer Security conf doesn't exist. Skipping setup for authorization module.
   [junit4]   2> 1688917 INFO  (jetty-launcher-1859-thread-4) [n:127.0.0.1:54305_solr    ] o.a.s.c.CoreContainer Authentication plugin class obtained from system property 'authenticationPlugin': org.apache.solr.cloud.TestAuthenticationFramework$MockAuthenticationPlugin
   [junit4]   2> 1688917 INFO  (jetty-launcher-1859-thread-4) [n:127.0.0.1:54305_solr    ] o.a.s.c.CoreContainer Reconfiguring the shard handler factory and update shard handler.
   [junit4]   2> 1688917 INFO  (jetty-launcher-1859-thread-4) [n:127.0.0.1:54305_solr    ] o.a.s.h.c.HttpShardHandlerFactory Reconfiguring the default client with: org.apache.solr.cloud.TestAuthenticationFramework$MockAuthenticationPlugin$MockClientConfigurer@9cd3294
   [junit4]   2> 1688917 INFO  (jetty-launcher-1859-thread-4) [n:127.0.0.1:54305_solr    ] o.a.s.u.UpdateShardHandler Reconfiguring the default client with: org.apache.solr.cloud.TestAuthenticationFramework$MockAuthenticationPlugin$MockClientConfigurer@9cd3294
   [junit4]   2> 1688917 INFO  (jetty-launcher-1859-thread-4) [n:127.0.0.1:54305_solr    ] o.a.s.c.CorePropertiesLocator Looking for core definitions underneath /x1/jenkins/jenkins-slave/workspace/Lucene-Solr-Tests-6.x/solr/build/solr-core/test/J0/temp/solr.cloud.TestAuthenticationFramework_CD39F69D6564CC3-001/tempDir-001/node4/.
   [junit4]   2> 1688917 INFO  (jetty-launcher-1859-thread-4) [n:127.0.0.1:54305_solr    ] o.a.s.c.CorePropertiesLocator Found 0 core definitions
   [junit4]   2> 1688918 INFO  (zkCallback-1885-thread-1-processing-n:127.0.0.1:49000_solr) [n:127.0.0.1:49000_solr    ] o.a.s.c.c.ZkStateReader Updated live nodes from ZooKeeper... (2) -> (3)
   [junit4]   2> 1688918 INFO  (jetty-launcher-1859-thread-1) [n:127.0.0.1:36705_solr    ] o.a.s.c.c.SolrZkClient makePath: /live_nodes/127.0.0.1:36705_solr
   [junit4]   2> 1688918 INFO  (jetty-launcher-1859-thread-5) [n:127.0.0.1:44802_solr    ] o.a.s.c.c.SolrZkClient makePath: /live_nodes/127.0.0.1:44802_solr
   [junit4]   2> 1688919 INFO  (zkCallback-1884-thread-1-processing-n:127.0.0.1:54305_solr) [n:127.0.0.1:54305_solr    ] o.a.s.c.c.ZkStateReader Updated live nodes from ZooKeeper... (2) -> (3)
   [junit4]   2> 1688919 INFO  (zkCallback-1874-thread-1-processing-n:127.0.0.1:48077_solr) [n:127.0.0.1:48077_solr    ] o.a.s.c.c.ZkStateReader A live node change: [WatchedEvent state:SyncConnected type:NodeChildrenChanged path:/live_nodes], has occurred - updating... (live nodes size: [3])
   [junit4]   2> 1688919 INFO  (zkCallback-1878-thread-1-processing-n:127.0.0.1:36705_solr) [n:127.0.0.1:36705_solr    ] o.a.s.c.c.ZkStateReader A live node change: [WatchedEvent state:SyncConnected type:NodeChildrenChanged path:/live_nodes], has occurred - updating... (live nodes size: [3])
   [junit4]   2> 1688920 INFO  (zkCallback-1880-thread-1-processing-n:127.0.0.1:44802_solr) [n:127.0.0.1:44802_solr    ] o.a.s.c.c.ZkStateReader A live node change: [WatchedEvent state:SyncConnected type:NodeChildrenChanged path:/live_nodes], has occurred - updating... (live nodes size: [3])
   [junit4]   2> 1688920 INFO  (zkCallback-1884-thread-1-processing-n:127.0.0.1:54305_solr) [n:127.0.0.1:54305_solr    ] o.a.s.c.c.ZkStateReader A live node change: [WatchedEvent state:SyncConnected type:NodeChildrenChanged path:/live_nodes], has occurred - updating... (live nodes size: [3])
   [junit4]   2> 1688920 INFO  (zkCallback-1885-thread-1-processing-n:127.0.0.1:49000_solr) [n:127.0.0.1:49000_solr    ] o.a.s.c.c.ZkStateReader A live node change: [WatchedEvent state:SyncConnected type:NodeChildrenChanged path:/live_nodes], has occurred - updating... (live nodes size: [3])
   [junit4]   2> 1688920 INFO  (zkCallback-1874-thread-1-processing-n:127.0.0.1:48077_solr) [n:127.0.0.1:48077_solr    ] o.a.s.c.c.ZkStateReader Updated live nodes from ZooKeeper... (3) -> (4)
   [junit4]   2> 1688922 INFO  (zkCallback-1874-thread-1-processing-n:127.0.0.1:48077_solr) [n:127.0.0.1:48077_solr    ] o.a.s.c.c.ZkStateReader A live node change: [WatchedEvent state:SyncConnected type:NodeChildrenChanged path:/live_nodes], has occurred - updating... (live nodes size: [4])
   [junit4]   2> 1688922 INFO  (zkCallback-1878-thread-1-processing-n:127.0.0.1:36705_solr) [n:127.0.0.1:36705_solr    ] o.a.s.c.c.ZkStateReader Updated live nodes from ZooKeeper... (3) -> (5)
   [junit4]   2> 1688926 INFO  (zkCallback-1885-thread-1-processing-n:127.0.0.1:49000_solr) [n:127.0.0.1:49000_solr    ] o.a.s.c.c.ZkStateReader Updated live nodes from ZooKeeper... (3) -> (5)
   [junit4]   2> 1688926 INFO  (zkCallback-1880-thread-1-processing-n:127.0.0.1:44802_solr) [n:127.0.0.1:44802_solr    ] o.a.s.c.c.ZkStateReader Updated live nodes from ZooKeeper... (3) -> (5)
   [junit4]   2> 1688926 INFO  (zkCallback-1884-thread-1-processing-n:127.0.0.1:54305_solr) [n:127.0.0.1:54305_solr    ] o.a.s.c.c.ZkStateReader Updated live nodes from ZooKeeper... (3) -> (5)
   [junit4]   2> 1688926 INFO  (zkCallback-1874-thread-1-processing-n:127.0.0.1:48077_solr) [n:127.0.0.1:48077_solr    ] o.a.s.c.c.ZkStateReader Updated live nodes from ZooKeeper... (4) -> (5)
   [junit4]   2> 1688928 INFO  (jetty-launcher-1859-thread-3) [n:127.0.0.1:49000_solr    ] o.a.s.c.CoreContainer Security conf doesn't exist. Skipping setup for authorization module.
   [junit4]   2> 1688928 INFO  (jetty-launcher-1859-thread-3) [n:127.0.0.1:49000_solr    ] o.a.s.c.CoreContainer Authentication plugin class obtained from system property 'authenticationPlugin': org.apache.solr.cloud.TestAuthenticationFramework$MockAuthenticationPlugin
   [junit4]   2> 1688929 INFO  (jetty-launcher-1859-thread-3) [n:127.0.0.1:49000_solr    ] o.a.s.c.CoreContainer Reconfiguring the shard handler factory and update shard handler.
   [junit4]   2> 1688929 INFO  (jetty-launcher-1859-thread-3) [n:127.0.0.1:49000_solr    ] o.a.s.h.c.HttpShardHandlerFactory Reconfiguring the default client with: org.apache.solr.cloud.TestAuthenticationFramework$MockAuthenticationPlugin$MockClientConfigurer@f0b8be7
   [junit4]   2> 1688929 INFO  (jetty-launcher-1859-thread-3) [n:127.0.0.1:49000_solr    ] o.a.s.u.UpdateShardHandler Reconfiguring the default client with: org.apache.solr.cloud.TestAuthenticationFramework$MockAuthenticationPlugin$MockClientConfigurer@f0b8be7
   [junit4]   2> 1688929 INFO  (jetty-launcher-1859-thread-3) [n:127.0.0.1:49000_solr    ] o.a.s.c.CorePropertiesLocator Looking for core definitions underneath /x1/jenkins/jenkins-slave/workspace/Lucene-Solr-Tests-6.x/solr/build/solr-core/test/J0/temp/solr.cloud.TestAuthenticationFramework_CD39F69D6564CC3-001/tempDir-001/node3/.
   [junit4]   2> 1688929 INFO  (jetty-launcher-1859-thread-3) [n:127.0.0.1:49000_solr    ] o.a.s.c.CorePropertiesLocator Found 0 core definitions
   [junit4]   2> 1688929 INFO  (jetty-launcher-1859-thread-4) [n:127.0.0.1:54305_solr    ] o.a.s.s.SolrDispatchFilter user.dir=/x1/jenkins/jenkins-slave/workspace/Lucene-Solr-Tests-6.x/solr/build/solr-core/test/J0
   [junit4]   2> 1688929 INFO  (jetty-launcher-1859-thread-4) [n:127.0.0.1:54305_solr    ] o.a.s.s.SolrDispatchFilter SolrDispatchFilter.init() done
   [junit4]   2> 1688934 INFO  (jetty-launcher-1859-thread-3) [n:127.0.0.1:49000_solr    ] o.a.s.s.SolrDispatchFilter user.dir=/x1/jenkins/jenkins-slave/workspace/Lucene-Solr-Tests-6.x/solr/build/solr-core/test/J0
   [junit4]   2> 1688934 INFO  (jetty-launcher-1859-thread-3) [n:127.0.0.1:49000_solr    ] o.a.s.s.SolrDispatchFilter SolrDispatchFilter.init() done
   [junit4]   2> 1688934 INFO  (jetty-launcher-1859-thread-1) [n:127.0.0.1:36705_solr    ] o.a.s.c.CoreContainer Security conf doesn't exist. Skipping setup for authorization module.
   [junit4]   2> 1688934 INFO  (jetty-launcher-1859-thread-1) [n:127.0.0.1:36705_solr    ] o.a.s.c.CoreContainer Authentication plugin class obtained from system property 'authenticationPlugin': org.apache.solr.cloud.TestAuthenticationFramework$MockAuthenticationPlugin
   [junit4]   2> 1688934 INFO  (jetty-launcher-1859-thread-1) [n:127.0.0.1:36705_solr    ] o.a.s.c.CoreContainer Reconfiguring the shard handler factory and update shard handler.
   [junit4]   2> 1688934 INFO  (jetty-launcher-1859-thread-1) [n:127.0.0.1:36705_solr    ] o.a.s.h.c.HttpShardHandlerFactory Reconfiguring the default client with: org.apache.solr.cloud.TestAuthenticationFramework$MockAuthenticationPlugin$MockClientConfigurer@179674aa
   [junit4]   2> 1688934 INFO  (jetty-launcher-1859-thread-1) [n:127.0.0.1:36705_solr    ] o.a.s.u.UpdateShardHandler Reconfiguring the default client with: org.apache.solr.cloud.TestAuthenticationFramework$MockAuthenticationPlugin$MockClientConfigurer@179674aa
   [junit4]   2> 1688935 INFO  (jetty-launcher-1859-thread-1) [n:127.0.0.1:36705_solr    ] o.a.s.c.CorePropertiesLocator Looking for core definitions underneath /x1/jenkins/jenkins-slave/workspace/Lucene-Solr-Tests-6.x/solr/build/solr-core/test/J0/temp/solr.cloud.TestAuthenticationFramework_CD39F69D6564CC3-001/tempDir-001/node1/.
   [junit4]   2> 1688935 INFO  (jetty-launcher-1859-thread-1) [n:127.0.0.1:36705_solr    ] o.a.s.c.CorePropertiesLocator Found 0 core definitions
   [junit4]   2> 1688936 INFO  (jetty-launcher-1859-thread-5) [n:127.0.0.1:44802_solr    ] o.a.s.c.CoreContainer Security conf doesn't exist. Skipping setup for authorization module.
   [junit4]   2> 1688936 INFO  (jetty-launcher-1859-thread-5) [n:127.0.0.1:44802_solr    ] o.a.s.c.CoreContainer Authentication plugin class obtained from system property 'authenticationPlugin': org.apache.solr.cloud.TestAuthenticationFramework$MockAuthenticationPlugin
   [junit4]   2> 1688937 INFO  (jetty-launcher-1859-thread-5) [n:127.0.0.1:44802_solr    ] o.a.s.c.CoreContainer Reconfiguring the shard handler factory and update shard handler.
   [junit4]   2> 1688937 INFO  (jetty-launcher-1859-thread-5) [n:127.0.0.1:44802_solr    ] o.a.s.h.c.HttpShardHandlerFactory Reconfiguring the default client with: org.apache.solr.cloud.TestAuthenticationFramework$MockAuthenticationPlugin$MockClientConfigurer@196c1323
   [junit4]   2> 1688937 INFO  (jetty-launcher-1859-thread-5) [n:127.0.0.1:44802_solr    ] o.a.s.u.UpdateShardHandler Reconfiguring the default client with: org.apache.solr.cloud.TestAuthenticationFramework$MockAuthenticationPlugin$MockClientConfigurer@196c1323
   [junit4]   2> 1688937 INFO  (jetty-launcher-1859-thread-5) [n:127.0.0.1:44802_solr    ] o.a.s.c.CorePropertiesLocator Looking for core definitions underneath /x1/jenkins/jenkins-slave/workspace/Lucene-Solr-Tests-6.x/solr/build/solr-core/test/J0/temp/solr.cloud.TestAuthenticationFramework_CD39F69D6564CC3-001/tempDir-001/node5/.
   [junit4]   2> 1688937 INFO  (jetty-launcher-1859-thread-5) [n:127.0.0.1:44802_solr    ] o.a.s.c.CorePropertiesLocator Found 0 core definitions
   [junit4]   2> 1688937 INFO  (jetty-launcher-1859-thread-1) [n:127.0.0.1:36705_solr    ] o.a.s.s.SolrDispatchFilter user.dir=/x1/jenkins/jenkins-slave/workspace/Lucene-Solr-Tests-6.x/solr/build/solr-core/test/J0
   [junit4]   2> 1688938 INFO  (jetty-launcher-1859-thread-1) [n:127.0.0.1:36705_solr    ] o.a.s.s.SolrDispatchFilter SolrDispatchFilter.init() done
   [junit4]   2> 1688938 INFO  (jetty-launcher-1859-thread-5) [n:127.0.0.1:44802_solr    ] o.a.s.s.SolrDispatchFilter user.dir=/x1/jenkins/jenkins-slave/workspace/Lucene-Solr-Tests-6.x/solr/build/solr-core/test/J0
   [junit4]   2> 1688938 INFO  (jetty-launcher-1859-thread-5) [n:127.0.0.1:44802_solr    ] o.a.s.s.SolrDispatchFilter SolrDispatchFilter.init() done
   [junit4]   2> 1688938 INFO  (TEST-TestAuthenticationFramework.testBasics-seed#[CD39F69D6564CC3]) [    ] o.a.s.c.c.SolrZkClient Using default ZkCredentialsProvider
   [junit4]   2> 1688938 INFO  (TEST-TestAuthenticationFramework.testBasics-seed#[CD39F69D6564CC3]) [    ] o.a.s.c.c.ConnectionManager Waiting for client to connect to ZooKeeper
   [junit4]   2> 1688940 INFO  (zkCallback-1891-thread-1) [    ] o.a.s.c.c.ConnectionManager Watcher org.apache.solr.common.cloud.ConnectionManager@4a9f0d1d name:ZooKeeperConnection Watcher:127.0.0.1:56686 got event WatchedEvent state:SyncConnected type:None path:null path:null type:None
   [junit4]   2> 1688940 INFO  (TEST-TestAuthenticationFramework.testBasics-seed#[CD39F69D6564CC3]) [    ] o.a.s.c.c.ConnectionManager Client is connected to ZooKeeper
   [junit4]   2> 1688941 INFO  (TEST-TestAuthenticationFramework.testBasics-seed#[CD39F69D6564CC3]) [    ] o.a.s.c.c.SolrZkClient Using default ZkACLProvider
   [junit4]   2> 1688942 INFO  (TEST-TestAuthenticationFramework.testBasics-seed#[CD39F69D6564CC3]) [    ] o.a.s.c.s.i.CloudSolrClient Final constructed zkHost string: 127.0.0.1:56686/solr
   [junit4]   2> 1688942 INFO  (TEST-TestAuthenticationFramework.testBasics-seed#[CD39F69D6564CC3]) [    ] o.a.s.c.TestMiniSolrCloudCluster #### Stopping a server
   [junit4]   2> 1688950 INFO  (TEST-TestAuthenticationFramework.testBasics-seed#[CD39F69D6564CC3]) [    ] o.e.j.s.ServerConnector Stopped ServerConnector@3c4bc335{HTTP/1.1,[http/1.1]}{127.0.0.1:0}
   [junit4]   2> 1688950 INFO  (TEST-TestAuthenticationFramework.testBasics-seed#[CD39F69D6564CC3]) [    ] o.a.s.c.CoreContainer Shutting down CoreContainer instance=1117608907
   [junit4]   2> 1688950 INFO  (TEST-TestAuthenticationFramework.testBasics-seed#[CD39F69D6564CC3]) [    ] o.a.s.c.ZkController Publish node=127.0.0.1:48077_solr as DOWN
   [junit4]   2> 1688953 INFO  (OverseerStateUpdate-96101062237487114-127.0.0.1:36705_solr-n_0000000000) [n:127.0.0.1:36705_solr    ] o.a.s.c.Overseer processMessage: queueSize: 1, message = {
   [junit4]   2>   "operation":"downnode",
   [junit4]   2>   "node_name":"127.0.0.1:48077_solr"} current state version: 0
   [junit4]   2> 1688953 INFO  (OverseerStateUpdate-96101062237487114-127.0.0.1:36705_solr-n_0000000000) [n:127.0.0.1:36705_solr    ] o.a.s.c.o.NodeMutator DownNode state invoked for node: 127.0.0.1:48077_solr
   [junit4]   2> 1688954 INFO  (zkCallback-1885-thread-1-processing-n:127.0.0.1:49000_solr) [n:127.0.0.1:49000_solr    ] o.a.s.c.c.ZkStateReader A live node change: [WatchedEvent state:SyncConnected type:NodeChildrenChanged path:/live_nodes], has occurred - updating... (live nodes size: [5])
   [junit4]   2> 1688954 INFO  (zkCallback-1880-thread-1-processing-n:127.0.0.1:44802_solr) [n:127.0.0.1:44802_solr    ] o.a.s.c.c.ZkStateReader A live node change: [WatchedEvent state:SyncConnected type:NodeChildrenChanged path:/live_nodes], has occurred - updating... (live nodes size: [5])
   [junit4]   2> 1688954 INFO  (zkCallback-1874-thread-1-processing-n:127.0.0.1:48077_solr) [n:127.0.0.1:48077_solr    ] o.a.s.c.c.ZkStateReader A live node change: [WatchedEvent state:SyncConnected type:NodeChildrenChanged path:/live_nodes], has occurred - updating... (live nodes size: [5])
   [junit4]   2> 1688954 INFO  (zkCallback-1878-thread-2-processing-n:127.0.0.1:36705_solr) [n:127.0.0.1:36705_solr    ] o.a.s.c.c.ZkStateReader A live node change: [WatchedEvent state:SyncConnected type:NodeChildrenChanged path:/live_nodes], has occurred - updating... (live nodes size: [5])
   [junit4]   2> 1688955 INFO  (zkCallback-1880-thread-1-processing-n:127.0.0.1:44802_solr) [n:127.0.0.1:44802_solr    ] o.a.s.c.c.ZkStateReader Updated live nodes from ZooKeeper... (5) -> (4)
   [junit4]   2> 1688955 INFO  (zkCallback-1885-thread-1-processing-n:127.0.0.1:49000_solr) [n:127.0.0.1:49000_solr    ] o.a.s.c.c.ZkStateReader Updated live nodes from ZooKeeper... (5) -> (4)
   [junit4]   2> 1688955 INFO  (zkCallback-1878-thread-2-processing-n:127.0.0.1:36705_solr) [n:127.0.0.1:36705_solr    ] o.a.s.c.c.ZkStateReader Updated live nodes from ZooKeeper... (5) -> (4)
   [junit4]   2> 1688958 INFO  (zkCallback-1884-thread-2-processing-n:127.0.0.1:54305_solr) [n:127.0.0.1:54305_solr    ] o.a.s.c.c.ZkStateReader A live node change: [WatchedEvent state:SyncConnected type:NodeChildrenChanged path:/live_nodes], has occurred - updating... (live nodes size: [5])
   [junit4]   2> 1688958 INFO  (zkCallback-1884-thread-2-processing-n:127.0.0.1:54305_solr) [n:127.0.0.1:54305_solr    ] o.a.s.c.c.ZkStateReader Updated live nodes from ZooKeeper... (5) -> (4)
   [junit4]   2> 1688958 INFO  (zkCallback-1884-thread-1-processing-n:127.0.0.1:54305_solr) [n:127.0.0.1:54305_solr    ] o.a.s.c.LeaderElector Watching path /overseer_elect/election/96101062237487114-127.0.0.1:36705_solr-n_0000000000 to know if I could be the leader
   [junit4]   2> 1690455 WARN  (zkCallback-1874-thread-1-processing-n:127.0.0.1:48077_solr) [n:127.0.0.1:48077_solr    ] o.a.s.c.c.ZkStateReader ZooKeeper watch triggered, but Solr cannot talk to ZK: [KeeperErrorCode = Session expired for /live_nodes]
   [junit4]   2> 1690455 INFO  (TEST-TestAuthenticationFramework.testBasics-seed#[CD39F69D6564CC3]) [    ] o.e.j.s.h.ContextHandler Stopped o.e.j.s.ServletContextHandler@2f7aa1f1{/solr,null,UNAVAILABLE}
   [junit4]   2> 1690456 INFO  (TEST-TestAuthenticationFramework.testBasics-seed#[CD39F69D6564CC3]) [    ] o.a.s.c.TestMiniSolrCloudCluster #### Starting a server
   [junit4]   2> 1690456 INFO  (TEST-TestAuthenticationFramework.testBasics-seed#[CD39F69D6564CC3]) [    ] o.e.j.s.Server jetty-9.3.8.v20160314
   [junit4]   2> 1690457 INFO  (TEST-TestAuthenticationFramework.testBasics-seed#[CD39F69D6564CC3]) [    ] o.e.j.s.h.ContextHandler Started o.e.j.s.ServletContextHandler@e1ed2b3{/solr,null,AVAILABLE}
   [junit4]   2> 1690457 INFO  (TEST-TestAuthenticationFramework.testBasics-seed#[CD39F69D6564CC3]) [    ] o.e.j.s.ServerConnector Started ServerConnector@36637b91{HTTP/1.1,[http/1.1]}{127.0.0.1:53526}
   [junit4]   2> 1690458 INFO  (TEST-TestAuthenticationFramework.testBasics-seed#[CD39F69D6564CC3]) [    ] o.e.j.s.Server Started @1695213ms
   [junit4]   2> 1690458 INFO  (TEST-TestAuthenticationFramework.testBasics-seed#[CD39F69D6564CC3]) [    ] o.a.s.c.s.e.JettySolrRunner Jetty properties: {hostContext=/solr, hostPort=53526}
   [junit4]   2> 1690458 INFO  (TEST-TestAuthenticationFramework.testBasics-seed#[CD39F69D6564CC3]) [    ] o.a.s.s.SolrDispatchFilter SolrDispatchFilter.init(): sun.misc.Launcher$AppClassLoader@73d16e93
   [junit4]   2> 1690458 INFO  (TEST-TestAuthenticationFramework.testBasics-seed#[CD39F69D6564CC3]) [    ] o.a.s.c.SolrResourceLoader new SolrResourceLoader for directory: '/x1/jenkins/jenkins-slave/workspace/Lucene-Solr-Tests-6.x/solr/build/solr-core/test/J0/temp/solr.cloud.TestAuthenticationFramework_CD39F69D6564CC3-001/tempDir-001/node6'
   [junit4]   2> 1690458 INFO  (TEST-TestAuthenticationFramework.testBasics-seed#[CD39F69D6564CC3]) [    ] o.a.s.c.SolrResourceLoader JNDI not configured for solr (NoInitialContextEx)
   [junit4]   2> 1690458 INFO  (TEST-TestAuthenticationFramework.testBasics-seed#[CD39F69D6564CC3]) [    ] o.a.s.c.SolrResourceLoader solr home defaulted to 'solr/' (could not find system property or JNDI)
   [junit4]   2> 1690458 INFO  (TEST-TestAuthenticationFramework.testBasics-seed#[CD39F69D6564CC3]) [    ] o.a.s.c.c.SolrZkClient Using default ZkCredentialsProvider
   [junit4]   2> 1690458 INFO  (TEST-TestAuthenticationFramework.testBasics-seed#[CD39F69D6564CC3]) [    ] o.a.s.c.c.ConnectionManager Waiting for client to connect to ZooKeeper
   [junit4]   2> 1690460 INFO  (zkCallback-1893-thread-1) [    ] o.a.s.c.c.ConnectionManager Watcher org.apache.solr.common.cloud.ConnectionManager@4ca3bbdc name:ZooKeeperConnection Watcher:127.0.0.1:56686/solr got event WatchedEvent state:SyncConnected type:None path:null path:null type:None
   [junit4]   2> 1690460 INFO  (TEST-TestAuthenticationFramework.testBasics-seed#[CD39F69D6564CC3]) [    ] o.a.s.c.c.ConnectionManager Client is connected to ZooKeeper
   [junit4]   2> 1690460 INFO  (TEST-TestAuthenticationFramework.testBasics-seed#[CD39F69D6564CC3]) [    ] o.a.s.c.c.SolrZkClient Using default ZkACLProvider
   [junit4]   2> 1690461 INFO  (TEST-TestAuthenticationFramework.testBasics-seed#[CD39F69D6564CC3]) [    ] o.a.s.s.SolrDispatchFilter solr.xml found in ZooKeeper. Loading...
   [junit4]   2> 1690464 INFO  (TEST-TestAuthenticationFramework.testBasics-seed#[CD39F69D6564CC3]) [    ] o.a.s.c.CorePropertiesLocator Config-defined core root directory: /x1/jenkins/jenkins-slave/workspace/Lucene-Solr-Tests-6.x/solr/build/solr-core/test/J0/temp/solr.cloud.TestAuthenticationFramework_CD39F69D6564CC3-001/tempDir-001/node6/.
   [junit4]   2> 1690464 INFO  (TEST-TestAuthenticationFramework.testBasics-seed#[CD39F69D6564CC3]) [    ] o.a.s.c.CoreContainer New CoreContainer 2021737269
   [junit4]   2> 1690464 INFO  (TEST-TestAuthenticationFramework.testBasics-seed#[CD39F69D6564CC3]) [    ] o.a.s.c.CoreContainer Loading cores into CoreContainer [instanceDir=/x1/jenkins/jenkins-slave/workspace/Lucene-Solr-Tests-6.x/solr/build/solr-core/test/J0/temp/solr.cloud.TestAuthenticationFramework_CD39F69D6564CC3-001/tempDir-001/node6]
   [junit4]   2> 1690464 WARN  (TEST-TestAuthenticationFramework.testBasics-seed#[CD39F69D6564CC3]) [    ] o.a.s.c.CoreContainer Couldn't add files from /x1/jenkins/jenkins-slave/workspace/Lucene-Solr-Tests-6.x/solr/build/solr-core/test/J0/temp/solr.cloud.TestAuthenticationFramework_CD39F69D6564CC3-001/tempDir-001/node6/lib to classpath: /x1/jenkins/jenkins-slave/workspace/Lucene-Solr-Tests-6.x/solr/build/solr-core/test/J0/temp/solr.cloud.TestAuthenticationFramework_CD39F69D6564CC3-001/tempDir-001/node6/lib
   [junit4]   2> 1690465 INFO  (TEST-TestAuthenticationFramework.testBasics-seed#[CD39F69D6564CC3]) [    ] o.a.s.h.c.HttpShardHandlerFactory created with socketTimeout : 90000,urlScheme : ,connTimeout : 15000,maxConnectionsPerHost : 20,maxConnections : 10000,corePoolSize : 0,maximumPoolSize : 2147483647,maxThreadIdleTime : 5,sizeOfQueue : -1,fairnessPolicy : false,useRetries : false,
   [junit4]   2> 1690465 INFO  (TEST-TestAuthenticationFramework.testBasics-seed#[CD39F69D6564CC3]) [    ] o.a.s.u.UpdateShardHandler Creating UpdateShardHandler HTTP client with params: socketTimeout=340000&connTimeout=45000&retry=true
   [junit4]   2> 1690466 INFO  (TEST-TestAuthenticationFramework.testBasics-seed#[CD39F69D6564CC3]) [    ] o.a.s.l.LogWatcher SLF4J impl is org.slf4j.impl.Log4jLoggerFactory
   [junit4]   2> 1690466 INFO  (TEST-TestAuthenticationFramework.testBasics-seed#[CD39F69D6564CC3]) [    ] o.a.s.l.LogWatcher Registering Log Listener [Log4j (org.slf4j.impl.Log4jLoggerFactory)]
   [junit4]   2> 1690466 INFO  (TEST-TestAuthenticationFramework.testBasics-seed#[CD39F69D6564CC3]) [    ] o.a.s.c.ZkContainer Zookeeper client=127.0.0.1:56686/solr
   [junit4]   2> 1690466 INFO  (TEST-TestAuthenticationFramework.testBasics-seed#[CD39F69D6564CC3]) [    ] o.a.s.c.ZkController zkHost includes chroot
   [junit4]   2> 1690466 INFO  (TEST-TestAuthenticationFramework.testBasics-seed#[CD39F69D6564CC3]) [    ] o.a.s.c.c.SolrZkClient Using default ZkCredentialsProvider
   [junit4]   2> 1690467 INFO  (TEST-TestAuthenticationFramework.testBasics-seed#[CD39F69D6564CC3]) [    ] o.a.s.c.c.ConnectionManager Waiting for client to connect to ZooKeeper
   [junit4]   2> 1690467 INFO  (zkCallback-1896-thread-1) [    ] o.a.s.c.c.ConnectionManager Watcher org.apache.solr.common.cloud.ConnectionManager@e6a30f7 name:ZooKeeperConnection Watcher:127.0.0.1:56686 got event WatchedEvent state:SyncConnected type:None path:null path:null type:None
   [junit4]   2> 1690468 INFO  (TEST-TestAuthenticationFramework.testBasics-seed#[CD39F69D6564CC3]) [    ] o.a.s.c.c.ConnectionManager Client is connected to ZooKeeper
   [junit4]   2> 1690468 INFO  (TEST-TestAuthenticationFramework.testBasics-seed#[CD39F69D6564CC3]) [    ] o.a.s.c.c.SolrZkClient Using default ZkACLProvider
   [junit4]   2> 1690469 INFO  (TEST-TestAuthenticationFramework.testBasics-seed#[CD39F69D6564CC3]) [n:127.0.0.1:53526_solr    ] o.a.s.c.ZkController Added new OnReconnect listener org.apache.solr.cloud.ZkController$$Lambda$42/935032755@6477c437
   [junit4]   2> 1690469 INFO  (TEST-TestAuthenticationFramework.testBasics-seed#[CD39F69D6564CC3]) [n:127.0.0.1:53526_solr    ] o.a.s.c.c.ConnectionManager Waiting for client to connect to ZooKeeper
   [junit4]   2> 1690471 INFO  (zkCallback-1897-thread-1-processing-n:127.0.0.1:53526_solr) [n:127.0.0.1:53526_solr    ] o.a.s.c.c.ConnectionManager Watcher org.apache.solr.common.cloud.ConnectionManager@7ade54d9 name:ZooKeeperConnection Watcher:127.0.0.1:56686/solr got event WatchedEvent state:SyncConnected type:None path:null path:null type:None
   [junit4]   2> 1690471 INFO  (TEST-TestAuthenticationFramework.testBasics-seed#[CD39F69D6564CC3]) [n:127.0.0.1:53526_solr    ] o.a.s.c.c.ConnectionManager Client is connected to ZooKeeper
   [junit4]   2> 1690477 INFO  (TEST-TestAuthenticationFramework.testBasics-seed#[CD39F69D6564CC3]) [n:127.0.0.1:53526_solr    ] o.a.s.c.c.ZkStateReader Updating cluster state from ZooKeeper... 
   [junit4]   2> 1690477 INFO  (TEST-TestAuthenticationFramework.testBasics-seed#[CD39F69D6564CC3]) [n:127.0.0.1:53526_solr    ] o.a.s.c.c.ZkStateReader Loaded empty cluster properties
   [junit4]   2> 1690477 INFO  (TEST-TestAuthenticationFramework.testBasics-seed#[CD39F69D6564CC3]) [n:127.0.0.1:53526_solr    ] o.a.s.c.c.ZkStateReader Updated live nodes from ZooKeeper... (0) -> (4)
   [junit4]   2> 1690479 INFO  (TEST-TestAuthenticationFramework.testBasics-seed#[CD39F69D6564CC3]) [n:127.0.0.1:53526_solr    ] o.a.s.c.Overseer Overseer (id=null) closing
   [junit4]   2> 1690479 INFO  (TEST-TestAuthenticationFramework.testBasics-seed#[CD39F69D6564CC3]) [n:127.0.0.1:53526_solr    ] o.a.s.c.LeaderElector Joined leadership election with path: /overseer_elect/election/96101062237487123-127.0.0.1:53526_solr-n_0000000005
   [junit4]   2> 1690480 INFO  (TEST-TestAuthenticationFramework.testBasics-seed#[CD39F69D6564CC3]) [n:127.0.0.1:53526_solr    ] o.a.s.c.LeaderElector Watching path /overseer_elect/election/96101062237487115-127.0.0.1:44802_solr-n_0000000004 to know if I could be the leader
   [junit4]   2> 1690480 INFO  (TEST-TestAuthenticationFramework.testBasics-seed#[CD39F69D6564CC3]) [n:127.0.0.1:53526_solr    ] o.a.s.c.ZkController Publish node=127.0.0.1:53526_solr as DOWN
   [junit4]   2> 1690482 INFO  (OverseerStateUpdate-96101062237487114-127.0.0.1:36705_solr-n_0000000000) [n:127.0.0.1:36705_solr    ] o.a.s.c.Overseer processMessage: queueSize: 1, message = {
   [junit4]   2>   "operation":"downnode",
   [junit4]   2>   "node_name":"127.0.0.1:53526_solr"} current state version: 0
   [junit4]   2> 1690482 INFO  (OverseerStateUpdate-96101062237487114-127.0.0.1:36705_solr-n_0000000000) [n:127.0.0.1:36705_solr    ] o.a.s.c.o.NodeMutator DownNode state invoked for node: 127.0.0.1:53526_solr
   [junit4]   2> 1691482 INFO  (TEST-TestAuthenticationFramework.testBasics-seed#[CD39F69D6564CC3]) [n:127.0.0.1:53526_solr    ] o.a.s.c.ZkController Register node as live in ZooKeeper:/live_nodes/127.0.0.1:53526_solr
   [junit4]   2> 1691483 INFO  (TEST-TestAuthenticationFramework.testBasics-seed#[CD39F69D6564CC3]) [n:127.0.0.1:53526_solr    ] o.a.s.c.c.SolrZkClient makePath: /live_nodes/127.0.0.1:53526_solr
   [junit4]   2> 1691484 INFO  (zkCallback-1880-thread-1-processing-n:127.0.0.1:44802_solr) [n:127.0.0.1:44802_solr    ] o.a.s.c.c.ZkStateReader A live node change: [WatchedEvent state:SyncConnected type:NodeChildrenChanged path:/live_nodes], has occurred - updating... (live nodes size: [4])
   [junit4]   2> 1691484 INFO  (zkCallback-1885-thread-1-processing-n:127.0.0.1:49000_solr) [n:127.0.0.1:49000_solr    ] o.a.s.c.c.ZkStateReader A live node change: [WatchedEvent state:SyncConnected type:NodeChildrenChanged path:/live_nodes], has occurred - updating... (live nodes size: [4])
   [junit4]   2> 1691485 INFO  (zkCallback-1897-thread-1-processing-n:127.0.0.1:53526_solr) [n:127.0.0.1:53526_solr    ] o.a.s.c.c.ZkStateReader A live node change: [WatchedEvent state:SyncConnected type:NodeChildrenChanged path:/live_nodes], has occurred - updating... (live nodes size: [4])
   [junit4]   2> 1691485 INFO  (zkCallback-1878-thread-3-processing-n:127.0.0.1:36705_solr) [n:127.0.0.1:36705_solr    ] o.a.s.c.c.ZkStateReader A live node change: [WatchedEvent state:SyncConnected type:NodeChildrenChanged path:/live_nodes], has occurred - updating... (live nodes size: [4])
   [junit4]   2> 1691485 INFO  (zkCallback-1884-thread-1-processing-n:127.0.0.1:54305_solr) [n:127.0.0.1:54305_solr    ] o.a.s.c.c.ZkStateReader A live node change: [WatchedEvent state:SyncConnected type:NodeChildrenChanged path:/live_nodes], has occurred - updating... (live nodes size: [4])
   [junit4]   2> 1691485 INFO  (zkCallback-1880-thread-1-processing-n:127.0.0.1:44802_solr) [n:127.0.0.1:44802_solr    ] o.a.s.c.c.ZkStateReader Updated live nodes from ZooKeeper... (4) -> (5)
   [junit4]   2> 1691485 INFO  (zkCallback-1885-thread-1-processing-n:127.0.0.1:49000_solr) [n:127.0.0.1:49000_solr    ] o.a.s.c.c.ZkStateReader Updated live nodes from ZooKeeper... (4) -> (5)
   [junit4]   2> 1691485 INFO  (zkCallback-1878-thread-3-processing-n:127.0.0.1:36705_solr) [n:127.0.0.1:36705_solr    ] o.a.s.c.c.ZkStateReader Updated live nodes from ZooKeeper... (4) -> (5)
   [junit4]   2> 1691486 INFO  (zkCallback-1884-thread-1-processing-n:127.0.0.1:54305_solr) [n:127.0.0.1:54305_solr    ] o.a.s.c.c.ZkStateReader Upd

[...truncated too long message...]

zedtesting.ThreadLeakControl checkThreadLeaks
   [junit4]   2> WARNING: Will linger awaiting termination of 2 leaked thread(s).
   [junit4]   2> Jun 20, 2016 1:26:29 AM com.carrotsearch.randomizedtesting.ThreadLeakControl checkThreadLeaks
   [junit4]   2> SEVERE: 1 thread leaked from SUITE scope at org.apache.solr.cloud.TestAuthenticationFramework: 
   [junit4]   2>    1) Thread[id=12520, name=OverseerHdfsCoreFailoverThread-96101064837169167-127.0.0.1:59759_solr-n_0000000001, state=TIMED_WAITING, group=Overseer Hdfs SolrCore Failover Thread.]
   [junit4]   2>         at java.lang.Thread.sleep(Native Method)
   [junit4]   2>         at org.apache.solr.cloud.OverseerAutoReplicaFailoverThread.run(OverseerAutoReplicaFailoverThread.java:137)
   [junit4]   2>         at java.lang.Thread.run(Thread.java:745)
   [junit4]   2> Jun 20, 2016 1:26:29 AM com.carrotsearch.randomizedtesting.ThreadLeakControl tryToInterruptAll
   [junit4]   2> INFO: Starting to interrupt leaked threads:
   [junit4]   2>    1) Thread[id=12520, name=OverseerHdfsCoreFailoverThread-96101064837169167-127.0.0.1:59759_solr-n_0000000001, state=TIMED_WAITING, group=Overseer Hdfs SolrCore Failover Thread.]
   [junit4]   2> Jun 20, 2016 1:26:32 AM com.carrotsearch.randomizedtesting.ThreadLeakControl tryToInterruptAll
   [junit4]   2> SEVERE: There are still zombie threads that couldn't be terminated:
   [junit4]   2>    1) Thread[id=12520, name=OverseerHdfsCoreFailoverThread-96101064837169167-127.0.0.1:59759_solr-n_0000000001, state=RUNNABLE, group=Overseer Hdfs SolrCore Failover Thread.]
   [junit4]   2>         at java.lang.Throwable.fillInStackTrace(Native Method)
   [junit4]   2>         at java.lang.Throwable.fillInStackTrace(Throwable.java:783)
   [junit4]   2>         at java.lang.Throwable.<init>(Throwable.java:265)
   [junit4]   2>         at java.lang.Exception.<init>(Exception.java:66)
   [junit4]   2>         at java.lang.InterruptedException.<init>(InterruptedException.java:67)
   [junit4]   2>         at java.lang.Thread.sleep(Native Method)
   [junit4]   2>         at org.apache.solr.cloud.OverseerAutoReplicaFailoverThread.run(OverseerAutoReplicaFailoverThread.java:137)
   [junit4]   2>         at java.lang.Thread.run(Thread.java:745)
   [junit4]   2> NOTE: test params are: codec=Lucene62, sim=ClassicSimilarity, locale=es-UY, timezone=America/Los_Angeles
   [junit4]   2> NOTE: Linux 3.13.0-85-generic amd64/Oracle Corporation 1.8.0_74 (64-bit)/cpus=4,threads=2,free=143567152,total=522715136
   [junit4]   2> NOTE: All tests run in this JVM: [StandardRequestHandlerTest, DistributedQueryElevationComponentTest, TestDFISimilarityFactory, TestRandomFaceting, TestRandomDVFaceting, TestFieldCacheSortRandom, SolrRequestParserTest, TestDistribDocBasedVersion, CdcrUpdateLogTest, BitVectorTest, ConnectionReuseTest, CursorPagingTest, TestMiniSolrCloudCluster, ReturnFieldsTest, TestBulkSchemaConcurrent, XsltUpdateRequestHandlerTest, SuggestComponentContextFilterQueryTest, MultiThreadedOCPTest, TestLRUCache, TestFieldCollectionResource, TestMissingGroups, DistributedSuggestComponentTest, TestRangeQuery, PeerSyncTest, DefaultValueUpdateProcessorTest, ParsingFieldUpdateProcessorsTest, TestRTGBase, DistributedFacetPivotLongTailTest, TestTestInjection, TestJsonFacets, SharedFSAutoReplicaFailoverTest, HdfsChaosMonkeySafeLeaderTest, CdcrVersionReplicationTest, TestLegacyFieldCache, PrimUtilsTest, TestSha256AuthenticationProvider, TestCloudSchemaless, TolerantUpdateProcessorTest, CoreAdminCreateDiscoverTest, TestFaceting, TestFunctionQuery, JSONWriterTest, BlockDirectoryTest, TestBadConfig, TestSolr4Spatial2, OutputWriterTest, TestBulkSchemaAPI, DisMaxRequestHandlerTest, JsonLoaderTest, SolrCloudExampleTest, CopyFieldTest, TestAtomicUpdateErrorCases, TestRebalanceLeaders, TestGraphMLResponseWriter, LeaderInitiatedRecoveryOnCommitTest, RAMDirectoryFactoryTest, CacheHeaderTest, TestDistributedSearch, TestBinaryField, CreateCollectionCleanupTest, BlockJoinFacetRandomTest, IndexSchemaTest, TestPhraseSuggestions, SynonymTokenizerTest, TestCSVLoader, TestConfigSetsAPIExclusivity, SystemInfoHandlerTest, TestPseudoReturnFields, DeleteStatusTest, TestReplicationHandler, TestReplicationHandlerBackup, RequestLoggingTest, AnalysisAfterCoreReloadTest, CloneFieldUpdateProcessorFactoryTest, TestOmitPositions, ActionThrottleTest, DirectoryFactoryTest, IndexSchemaRuntimeFieldTest, PathHierarchyTokenizerFactoryTest, TestClusterStateMutator, TestMacros, TestCloudPivotFacet, AddSchemaFieldsUpdateProcessorFactoryTest, TestCloudBackupRestore, TestFastOutputStream, SmileWriterTest, CloudMLTQParserTest, SyncSliceTest, TestNRTOpen, TestHighlightDedupGrouping, HdfsRecoverLeaseTest, TestSortByMinMaxFunction, AlternateDirectoryTest, TestCrossCoreJoin, PreAnalyzedFieldTest, TestStressUserVersions, DistributedSpellCheckComponentTest, BooleanFieldTest, TestFieldCacheReopen, PolyFieldTest, HdfsLockFactoryTest, PingRequestHandlerTest, LeaderElectionTest, TestRecovery, TestJoin, DistributedTermsComponentTest, StatsComponentTest, TestIndexSearcher, CurrencyFieldXmlFileTest, SuggesterFSTTest, TestFoldingMultitermQuery, TestStressLucene, SuggesterWFSTTest, DocValuesMultiTest, TestSolrDeletionPolicy1, PrimitiveFieldTypeTest, RequestHandlersTest, TestArbitraryIndexDir, BinaryUpdateRequestHandlerTest, TestComponentsName, HighlighterConfigTest, SOLR749Test, TestQuerySenderListener, UpdateParamsTest, TestSolrIndexConfig, TestQuerySenderNoQuery, ResponseLogComponentTest, BadComponentTest, TestStressRecovery, NumericFieldsTest, TestConfig, ExternalFileFieldSortTest, TestPostingsSolrHighlighter, NotRequiredUniqueKeyTest, SpellPossibilityIteratorTest, TestXIncludeConfig, EchoParamsTest, TestPerFieldSimilarity, TestLMJelinekMercerSimilarityFactory, TimeZoneUtilsTest, ResourceLoaderTest, URLClassifyProcessorTest, TestSuggestSpellingConverter, DateFieldTest, SpellingQueryConverterTest, TestSolrJ, TestUtils, ZkNodePropsTest, SliceStateTest, UUIDFieldTest, FileUtilsTest, CircularListTest, DistributedMLTComponentTest, TestSimpleTrackingShardHandler, TestEmbeddedSolrServerConstructors, AssignTest, AsyncCallRequestStatusResponseTest, CloudExitableDirectoryReaderTest, CollectionReloadTest, CollectionsAPISolrJTest, DeleteLastCustomShardedReplicaTest, DistribCursorPagingTest, DistributedQueueTest, DistributedVersionInfoTest, MigrateRouteKeyTest, OverseerCollectionConfigSetProcessorTest, OverseerRolesTest, OverseerStatusTest, OverseerTaskQueueTest, RecoveryAfterSoftCommitTest, TestAuthenticationFramework]
   [junit4]   2> NOTE: reproduce with: ant test  -Dtestcase=TestAuthenticationFramework -Dtests.seed=CD39F69D6564CC3 -Dtests.multiplier=2 -Dtests.slow=true -Dtests.locale=es-UY -Dtests.timezone=America/Los_Angeles -Dtests.asserts=true -Dtests.file.encoding=US-ASCII
   [junit4] ERROR   0.00s J0 | TestAuthenticationFramework (suite) <<<
   [junit4]    > Throwable #1: com.carrotsearch.randomizedtesting.ThreadLeakError: 1 thread leaked from SUITE scope at org.apache.solr.cloud.TestAuthenticationFramework: 
   [junit4]    >    1) Thread[id=12520, name=OverseerHdfsCoreFailoverThread-96101064837169167-127.0.0.1:59759_solr-n_0000000001, state=TIMED_WAITING, group=Overseer Hdfs SolrCore Failover Thread.]
   [junit4]    >         at java.lang.Thread.sleep(Native Method)
   [junit4]    >         at org.apache.solr.cloud.OverseerAutoReplicaFailoverThread.run(OverseerAutoReplicaFailoverThread.java:137)
   [junit4]    >         at java.lang.Thread.run(Thread.java:745)
   [junit4]    > 	at __randomizedtesting.SeedInfo.seed([CD39F69D6564CC3]:0)Throwable #2: com.carrotsearch.randomizedtesting.ThreadLeakError: There are still zombie threads that couldn't be terminated:
   [junit4]    >    1) Thread[id=12520, name=OverseerHdfsCoreFailoverThread-96101064837169167-127.0.0.1:59759_solr-n_0000000001, state=RUNNABLE, group=Overseer Hdfs SolrCore Failover Thread.]
   [junit4]    >         at java.lang.Throwable.fillInStackTrace(Native Method)
   [junit4]    >         at java.lang.Throwable.fillInStackTrace(Throwable.java:783)
   [junit4]    >         at java.lang.Throwable.<init>(Throwable.java:265)
   [junit4]    >         at java.lang.Exception.<init>(Exception.java:66)
   [junit4]    >         at java.lang.InterruptedException.<init>(InterruptedException.java:67)
   [junit4]    >         at java.lang.Thread.sleep(Native Method)
   [junit4]    >         at org.apache.solr.cloud.OverseerAutoReplicaFailoverThread.run(OverseerAutoReplicaFailoverThread.java:137)
   [junit4]    >         at java.lang.Thread.run(Thread.java:745)
   [junit4]    > 	at __randomizedtesting.SeedInfo.seed([CD39F69D6564CC3]:0)
   [junit4] Completed [473/615 (1!)] on J0 in 155.60s, 8 tests, 2 errors <<< FAILURES!

[...truncated 463 lines...]
BUILD FAILED
/x1/jenkins/jenkins-slave/workspace/Lucene-Solr-Tests-6.x/build.xml:740: The following error occurred while executing this line:
/x1/jenkins/jenkins-slave/workspace/Lucene-Solr-Tests-6.x/build.xml:684: The following error occurred while executing this line:
/x1/jenkins/jenkins-slave/workspace/Lucene-Solr-Tests-6.x/build.xml:59: The following error occurred while executing this line:
/x1/jenkins/jenkins-slave/workspace/Lucene-Solr-Tests-6.x/solr/build.xml:233: The following error occurred while executing this line:
/x1/jenkins/jenkins-slave/workspace/Lucene-Solr-Tests-6.x/solr/common-build.xml:530: The following error occurred while executing this line:
/x1/jenkins/jenkins-slave/workspace/Lucene-Solr-Tests-6.x/lucene/common-build.xml:1427: The following error occurred while executing this line:
/x1/jenkins/jenkins-slave/workspace/Lucene-Solr-Tests-6.x/lucene/common-build.xml:984: There were test failures: 615 suites (10 ignored), 2591 tests, 2 suite-level errors, 583 ignored (67 assumptions) [seed: CD39F69D6564CC3]

Total time: 61 minutes 36 seconds
Build step 'Invoke Ant' marked build as failure
Archiving artifacts
Recording test results
Email was triggered for: Failure - Any
Sending email for trigger: Failure - Any




Mime
View raw message