lucene-dev mailing list archives

Site index · List index
Message view « Date » · « Thread »
Top « Date » · « Thread »
From Policeman Jenkins Server <jenk...@thetaphi.de>
Subject [JENKINS-EA] Lucene-Solr-master-Linux (32bit/jdk-9-ea+122) - Build # 17022 - Failure!
Date Mon, 20 Jun 2016 08:31:51 GMT
Build: http://jenkins.thetaphi.de/job/Lucene-Solr-master-Linux/17022/
Java: 32bit/jdk-9-ea+122 -server -XX:+UseG1GC

1 tests failed.
FAILED:  org.apache.solr.schema.TestManagedSchemaAPI.test

Error Message:
Error from server at http://127.0.0.1:44912/solr/testschemaapi_shard1_replica1: ERROR: [doc=2] unknown field 'myNewField1'

Stack Trace:
org.apache.solr.client.solrj.impl.CloudSolrClient$RouteException: Error from server at http://127.0.0.1:44912/solr/testschemaapi_shard1_replica1: ERROR: [doc=2] unknown field 'myNewField1'
	at __randomizedtesting.SeedInfo.seed([11E92BFFE2F136D4:99BD14254C0D5B2C]:0)
	at org.apache.solr.client.solrj.impl.CloudSolrClient.directUpdate(CloudSolrClient.java:697)
	at org.apache.solr.client.solrj.impl.CloudSolrClient.sendRequest(CloudSolrClient.java:1109)
	at org.apache.solr.client.solrj.impl.CloudSolrClient.requestWithRetryOnStaleState(CloudSolrClient.java:998)
	at org.apache.solr.client.solrj.impl.CloudSolrClient.request(CloudSolrClient.java:934)
	at org.apache.solr.schema.TestManagedSchemaAPI.testAddFieldAndDocument(TestManagedSchemaAPI.java:86)
	at org.apache.solr.schema.TestManagedSchemaAPI.test(TestManagedSchemaAPI.java:55)
	at jdk.internal.reflect.NativeMethodAccessorImpl.invoke0(java.base@9-ea/Native Method)
	at jdk.internal.reflect.NativeMethodAccessorImpl.invoke(java.base@9-ea/NativeMethodAccessorImpl.java:62)
	at jdk.internal.reflect.DelegatingMethodAccessorImpl.invoke(java.base@9-ea/DelegatingMethodAccessorImpl.java:43)
	at java.lang.reflect.Method.invoke(java.base@9-ea/Method.java:531)
	at com.carrotsearch.randomizedtesting.RandomizedRunner.invoke(RandomizedRunner.java:1764)
	at com.carrotsearch.randomizedtesting.RandomizedRunner$8.evaluate(RandomizedRunner.java:871)
	at com.carrotsearch.randomizedtesting.RandomizedRunner$9.evaluate(RandomizedRunner.java:907)
	at com.carrotsearch.randomizedtesting.RandomizedRunner$10.evaluate(RandomizedRunner.java:921)
	at com.carrotsearch.randomizedtesting.rules.SystemPropertiesRestoreRule$1.evaluate(SystemPropertiesRestoreRule.java:57)
	at org.apache.lucene.util.TestRuleSetupTeardownChained$1.evaluate(TestRuleSetupTeardownChained.java:49)
	at org.apache.lucene.util.AbstractBeforeAfterRule$1.evaluate(AbstractBeforeAfterRule.java:45)
	at org.apache.lucene.util.TestRuleThreadAndTestName$1.evaluate(TestRuleThreadAndTestName.java:48)
	at org.apache.lucene.util.TestRuleIgnoreAfterMaxFailures$1.evaluate(TestRuleIgnoreAfterMaxFailures.java:64)
	at org.apache.lucene.util.TestRuleMarkFailure$1.evaluate(TestRuleMarkFailure.java:47)
	at com.carrotsearch.randomizedtesting.rules.StatementAdapter.evaluate(StatementAdapter.java:36)
	at com.carrotsearch.randomizedtesting.ThreadLeakControl$StatementRunner.run(ThreadLeakControl.java:367)
	at com.carrotsearch.randomizedtesting.ThreadLeakControl.forkTimeoutingTask(ThreadLeakControl.java:809)
	at com.carrotsearch.randomizedtesting.ThreadLeakControl$3.evaluate(ThreadLeakControl.java:460)
	at com.carrotsearch.randomizedtesting.RandomizedRunner.runSingleTest(RandomizedRunner.java:880)
	at com.carrotsearch.randomizedtesting.RandomizedRunner$5.evaluate(RandomizedRunner.java:781)
	at com.carrotsearch.randomizedtesting.RandomizedRunner$6.evaluate(RandomizedRunner.java:816)
	at com.carrotsearch.randomizedtesting.RandomizedRunner$7.evaluate(RandomizedRunner.java:827)
	at com.carrotsearch.randomizedtesting.rules.StatementAdapter.evaluate(StatementAdapter.java:36)
	at com.carrotsearch.randomizedtesting.rules.SystemPropertiesRestoreRule$1.evaluate(SystemPropertiesRestoreRule.java:57)
	at org.apache.lucene.util.AbstractBeforeAfterRule$1.evaluate(AbstractBeforeAfterRule.java:45)
	at com.carrotsearch.randomizedtesting.rules.StatementAdapter.evaluate(StatementAdapter.java:36)
	at org.apache.lucene.util.TestRuleStoreClassName$1.evaluate(TestRuleStoreClassName.java:41)
	at com.carrotsearch.randomizedtesting.rules.NoShadowingOrOverridesOnMethodsRule$1.evaluate(NoShadowingOrOverridesOnMethodsRule.java:40)
	at com.carrotsearch.randomizedtesting.rules.NoShadowingOrOverridesOnMethodsRule$1.evaluate(NoShadowingOrOverridesOnMethodsRule.java:40)
	at com.carrotsearch.randomizedtesting.rules.StatementAdapter.evaluate(StatementAdapter.java:36)
	at com.carrotsearch.randomizedtesting.rules.StatementAdapter.evaluate(StatementAdapter.java:36)
	at com.carrotsearch.randomizedtesting.rules.StatementAdapter.evaluate(StatementAdapter.java:36)
	at org.apache.lucene.util.TestRuleAssertionsRequired$1.evaluate(TestRuleAssertionsRequired.java:53)
	at org.apache.lucene.util.TestRuleMarkFailure$1.evaluate(TestRuleMarkFailure.java:47)
	at org.apache.lucene.util.TestRuleIgnoreAfterMaxFailures$1.evaluate(TestRuleIgnoreAfterMaxFailures.java:64)
	at org.apache.lucene.util.TestRuleIgnoreTestSuites$1.evaluate(TestRuleIgnoreTestSuites.java:54)
	at com.carrotsearch.randomizedtesting.rules.StatementAdapter.evaluate(StatementAdapter.java:36)
	at com.carrotsearch.randomizedtesting.ThreadLeakControl$StatementRunner.run(ThreadLeakControl.java:367)
	at java.lang.Thread.run(java.base@9-ea/Thread.java:843)
Caused by: org.apache.solr.client.solrj.impl.HttpSolrClient$RemoteSolrException: Error from server at http://127.0.0.1:44912/solr/testschemaapi_shard1_replica1: ERROR: [doc=2] unknown field 'myNewField1'
	at org.apache.solr.client.solrj.impl.HttpSolrClient.executeMethod(HttpSolrClient.java:606)
	at org.apache.solr.client.solrj.impl.HttpSolrClient.request(HttpSolrClient.java:259)
	at org.apache.solr.client.solrj.impl.HttpSolrClient.request(HttpSolrClient.java:248)
	at org.apache.solr.client.solrj.impl.LBHttpSolrClient.doRequest(LBHttpSolrClient.java:413)
	at org.apache.solr.client.solrj.impl.LBHttpSolrClient.request(LBHttpSolrClient.java:366)
	at org.apache.solr.client.solrj.impl.CloudSolrClient.lambda$directUpdate$0(CloudSolrClient.java:674)
	at java.util.concurrent.FutureTask.run(java.base@9-ea/FutureTask.java:266)
	at org.apache.solr.common.util.ExecutorUtil$MDCAwareThreadPoolExecutor.lambda$execute$0(ExecutorUtil.java:229)
	at java.util.concurrent.ThreadPoolExecutor.runWorker(java.base@9-ea/ThreadPoolExecutor.java:1158)
	at java.util.concurrent.ThreadPoolExecutor$Worker.run(java.base@9-ea/ThreadPoolExecutor.java:632)
	... 1 more




Build Log:
[...truncated 11308 lines...]
   [junit4] Suite: org.apache.solr.schema.TestManagedSchemaAPI
   [junit4]   2> Creating dataDir: /home/jenkins/workspace/Lucene-Solr-master-Linux/solr/build/solr-core/test/J0/temp/solr.schema.TestManagedSchemaAPI_11E92BFFE2F136D4-001/init-core-data-001
   [junit4]   2> 854619 INFO  (SUITE-TestManagedSchemaAPI-seed#[11E92BFFE2F136D4]-worker) [    ] o.a.s.SolrTestCaseJ4 Randomized ssl (false) and clientAuth (true) via: @org.apache.solr.util.RandomizeSSL(reason=, ssl=NaN, value=NaN, clientAuth=NaN)
   [junit4]   2> 854620 INFO  (SUITE-TestManagedSchemaAPI-seed#[11E92BFFE2F136D4]-worker) [    ] o.a.s.c.ZkTestServer STARTING ZK TEST SERVER
   [junit4]   2> 854620 INFO  (Thread-2228) [    ] o.a.s.c.ZkTestServer client port:0.0.0.0/0.0.0.0:0
   [junit4]   2> 854620 INFO  (Thread-2228) [    ] o.a.s.c.ZkTestServer Starting server
   [junit4]   2> 854720 INFO  (SUITE-TestManagedSchemaAPI-seed#[11E92BFFE2F136D4]-worker) [    ] o.a.s.c.ZkTestServer start zk server on port:38158
   [junit4]   2> 854720 INFO  (SUITE-TestManagedSchemaAPI-seed#[11E92BFFE2F136D4]-worker) [    ] o.a.s.c.c.SolrZkClient Using default ZkCredentialsProvider
   [junit4]   2> 854721 INFO  (SUITE-TestManagedSchemaAPI-seed#[11E92BFFE2F136D4]-worker) [    ] o.a.s.c.c.ConnectionManager Waiting for client to connect to ZooKeeper
   [junit4]   2> 854723 INFO  (zkCallback-1126-thread-1) [    ] o.a.s.c.c.ConnectionManager Watcher org.apache.solr.common.cloud.ConnectionManager@a9d839 name:ZooKeeperConnection Watcher:127.0.0.1:38158 got event WatchedEvent state:SyncConnected type:None path:null path:null type:None
   [junit4]   2> 854723 INFO  (SUITE-TestManagedSchemaAPI-seed#[11E92BFFE2F136D4]-worker) [    ] o.a.s.c.c.ConnectionManager Client is connected to ZooKeeper
   [junit4]   2> 854723 INFO  (SUITE-TestManagedSchemaAPI-seed#[11E92BFFE2F136D4]-worker) [    ] o.a.s.c.c.SolrZkClient Using default ZkACLProvider
   [junit4]   2> 854723 INFO  (SUITE-TestManagedSchemaAPI-seed#[11E92BFFE2F136D4]-worker) [    ] o.a.s.c.c.SolrZkClient makePath: /solr/solr.xml
   [junit4]   2> 854726 INFO  (jetty-launcher-1125-thread-1) [    ] o.e.j.s.Server jetty-9.3.8.v20160314
   [junit4]   2> 854727 INFO  (jetty-launcher-1125-thread-2) [    ] o.e.j.s.Server jetty-9.3.8.v20160314
   [junit4]   2> 854727 INFO  (jetty-launcher-1125-thread-1) [    ] o.e.j.s.h.ContextHandler Started o.e.j.s.ServletContextHandler@99ae21{/solr,null,AVAILABLE}
   [junit4]   2> 854728 INFO  (jetty-launcher-1125-thread-2) [    ] o.e.j.s.h.ContextHandler Started o.e.j.s.ServletContextHandler@16728a4{/solr,null,AVAILABLE}
   [junit4]   2> 854728 INFO  (jetty-launcher-1125-thread-1) [    ] o.e.j.s.ServerConnector Started ServerConnector@67d8f5{HTTP/1.1,[http/1.1]}{127.0.0.1:?????}
   [junit4]   2> 854728 INFO  (jetty-launcher-1125-thread-2) [    ] o.e.j.s.ServerConnector Started ServerConnector@12036ce{HTTP/1.1,[http/1.1]}{127.0.0.1:?????}
   [junit4]   2> 854728 INFO  (jetty-launcher-1125-thread-1) [    ] o.e.j.s.Server Started @??????ms
   [junit4]   2> 854728 INFO  (jetty-launcher-1125-thread-2) [    ] o.e.j.s.Server Started @??????ms
   [junit4]   2> 854728 INFO  (jetty-launcher-1125-thread-1) [    ] o.a.s.c.s.e.JettySolrRunner Jetty properties: {hostContext=/solr, hostPort=44912}
   [junit4]   2> 854729 INFO  (jetty-launcher-1125-thread-2) [    ] o.a.s.c.s.e.JettySolrRunner Jetty properties: {hostContext=/solr, hostPort=42051}
   [junit4]   2> 854729 INFO  (jetty-launcher-1125-thread-1) [    ] o.a.s.s.SolrDispatchFilter SolrDispatchFilter.init(): jdk.internal.loader.ClassLoaders$AppClassLoader@1a10788
   [junit4]   2> 854729 INFO  (jetty-launcher-1125-thread-2) [    ] o.a.s.s.SolrDispatchFilter SolrDispatchFilter.init(): jdk.internal.loader.ClassLoaders$AppClassLoader@1a10788
   [junit4]   2> 854729 INFO  (jetty-launcher-1125-thread-1) [    ] o.a.s.c.SolrResourceLoader new SolrResourceLoader for directory: '/home/jenkins/workspace/Lucene-Solr-master-Linux/solr/build/solr-core/test/J0/temp/solr.schema.TestManagedSchemaAPI_11E92BFFE2F136D4-001/tempDir-001/node1'
   [junit4]   2> 854729 INFO  (jetty-launcher-1125-thread-2) [    ] o.a.s.c.SolrResourceLoader new SolrResourceLoader for directory: '/home/jenkins/workspace/Lucene-Solr-master-Linux/solr/build/solr-core/test/J0/temp/solr.schema.TestManagedSchemaAPI_11E92BFFE2F136D4-001/tempDir-001/node2'
   [junit4]   2> 854729 INFO  (jetty-launcher-1125-thread-1) [    ] o.a.s.c.SolrResourceLoader JNDI not configured for solr (NoInitialContextEx)
   [junit4]   2> 854729 INFO  (jetty-launcher-1125-thread-2) [    ] o.a.s.c.SolrResourceLoader JNDI not configured for solr (NoInitialContextEx)
   [junit4]   2> 854729 INFO  (jetty-launcher-1125-thread-2) [    ] o.a.s.c.SolrResourceLoader solr home defaulted to 'solr/' (could not find system property or JNDI)
   [junit4]   2> 854729 INFO  (jetty-launcher-1125-thread-1) [    ] o.a.s.c.SolrResourceLoader solr home defaulted to 'solr/' (could not find system property or JNDI)
   [junit4]   2> 854729 INFO  (jetty-launcher-1125-thread-2) [    ] o.a.s.c.c.SolrZkClient Using default ZkCredentialsProvider
   [junit4]   2> 854729 INFO  (jetty-launcher-1125-thread-1) [    ] o.a.s.c.c.SolrZkClient Using default ZkCredentialsProvider
   [junit4]   2> 854730 INFO  (jetty-launcher-1125-thread-1) [    ] o.a.s.c.c.ConnectionManager Waiting for client to connect to ZooKeeper
   [junit4]   2> 854730 INFO  (jetty-launcher-1125-thread-2) [    ] o.a.s.c.c.ConnectionManager Waiting for client to connect to ZooKeeper
   [junit4]   2> 854731 INFO  (zkCallback-1128-thread-1) [    ] o.a.s.c.c.ConnectionManager Watcher org.apache.solr.common.cloud.ConnectionManager@11f7833 name:ZooKeeperConnection Watcher:127.0.0.1:38158/solr got event WatchedEvent state:SyncConnected type:None path:null path:null type:None
   [junit4]   2> 854731 INFO  (jetty-launcher-1125-thread-1) [    ] o.a.s.c.c.ConnectionManager Client is connected to ZooKeeper
   [junit4]   2> 854731 INFO  (zkCallback-1127-thread-1) [    ] o.a.s.c.c.ConnectionManager Watcher org.apache.solr.common.cloud.ConnectionManager@d18dec name:ZooKeeperConnection Watcher:127.0.0.1:38158/solr got event WatchedEvent state:SyncConnected type:None path:null path:null type:None
   [junit4]   2> 854731 INFO  (jetty-launcher-1125-thread-1) [    ] o.a.s.c.c.SolrZkClient Using default ZkACLProvider
   [junit4]   2> 854731 INFO  (jetty-launcher-1125-thread-2) [    ] o.a.s.c.c.ConnectionManager Client is connected to ZooKeeper
   [junit4]   2> 854731 INFO  (jetty-launcher-1125-thread-2) [    ] o.a.s.c.c.SolrZkClient Using default ZkACLProvider
   [junit4]   2> 854731 INFO  (jetty-launcher-1125-thread-1) [    ] o.a.s.s.SolrDispatchFilter solr.xml found in ZooKeeper. Loading...
   [junit4]   2> 854732 INFO  (jetty-launcher-1125-thread-2) [    ] o.a.s.s.SolrDispatchFilter solr.xml found in ZooKeeper. Loading...
   [junit4]   2> 854738 INFO  (jetty-launcher-1125-thread-2) [    ] o.a.s.c.CorePropertiesLocator Config-defined core root directory: /home/jenkins/workspace/Lucene-Solr-master-Linux/solr/build/solr-core/test/J0/temp/solr.schema.TestManagedSchemaAPI_11E92BFFE2F136D4-001/tempDir-001/node2/.
   [junit4]   2> 854738 INFO  (jetty-launcher-1125-thread-1) [    ] o.a.s.c.CorePropertiesLocator Config-defined core root directory: /home/jenkins/workspace/Lucene-Solr-master-Linux/solr/build/solr-core/test/J0/temp/solr.schema.TestManagedSchemaAPI_11E92BFFE2F136D4-001/tempDir-001/node1/.
   [junit4]   2> 854738 INFO  (jetty-launcher-1125-thread-2) [    ] o.a.s.c.CoreContainer New CoreContainer 2275558
   [junit4]   2> 854738 INFO  (jetty-launcher-1125-thread-1) [    ] o.a.s.c.CoreContainer New CoreContainer 24253499
   [junit4]   2> 854738 INFO  (jetty-launcher-1125-thread-2) [    ] o.a.s.c.CoreContainer Loading cores into CoreContainer [instanceDir=/home/jenkins/workspace/Lucene-Solr-master-Linux/solr/build/solr-core/test/J0/temp/solr.schema.TestManagedSchemaAPI_11E92BFFE2F136D4-001/tempDir-001/node2]
   [junit4]   2> 854738 INFO  (jetty-launcher-1125-thread-1) [    ] o.a.s.c.CoreContainer Loading cores into CoreContainer [instanceDir=/home/jenkins/workspace/Lucene-Solr-master-Linux/solr/build/solr-core/test/J0/temp/solr.schema.TestManagedSchemaAPI_11E92BFFE2F136D4-001/tempDir-001/node1]
   [junit4]   2> 854738 WARN  (jetty-launcher-1125-thread-2) [    ] o.a.s.c.CoreContainer Couldn't add files from /home/jenkins/workspace/Lucene-Solr-master-Linux/solr/build/solr-core/test/J0/temp/solr.schema.TestManagedSchemaAPI_11E92BFFE2F136D4-001/tempDir-001/node2/lib to classpath: /home/jenkins/workspace/Lucene-Solr-master-Linux/solr/build/solr-core/test/J0/temp/solr.schema.TestManagedSchemaAPI_11E92BFFE2F136D4-001/tempDir-001/node2/lib
   [junit4]   2> 854738 WARN  (jetty-launcher-1125-thread-1) [    ] o.a.s.c.CoreContainer Couldn't add files from /home/jenkins/workspace/Lucene-Solr-master-Linux/solr/build/solr-core/test/J0/temp/solr.schema.TestManagedSchemaAPI_11E92BFFE2F136D4-001/tempDir-001/node1/lib to classpath: /home/jenkins/workspace/Lucene-Solr-master-Linux/solr/build/solr-core/test/J0/temp/solr.schema.TestManagedSchemaAPI_11E92BFFE2F136D4-001/tempDir-001/node1/lib
   [junit4]   2> 854738 INFO  (jetty-launcher-1125-thread-2) [    ] o.a.s.h.c.HttpShardHandlerFactory created with socketTimeout : 90000,urlScheme : ,connTimeout : 15000,maxConnectionsPerHost : 20,maxConnections : 10000,corePoolSize : 0,maximumPoolSize : 2147483647,maxThreadIdleTime : 5,sizeOfQueue : -1,fairnessPolicy : false,
   [junit4]   2> 854739 INFO  (jetty-launcher-1125-thread-1) [    ] o.a.s.h.c.HttpShardHandlerFactory created with socketTimeout : 90000,urlScheme : ,connTimeout : 15000,maxConnectionsPerHost : 20,maxConnections : 10000,corePoolSize : 0,maximumPoolSize : 2147483647,maxThreadIdleTime : 5,sizeOfQueue : -1,fairnessPolicy : false,
   [junit4]   2> 854740 INFO  (jetty-launcher-1125-thread-2) [    ] o.a.s.u.UpdateShardHandler Creating UpdateShardHandler HTTP client with params: 
   [junit4]   2> 854740 INFO  (jetty-launcher-1125-thread-1) [    ] o.a.s.u.UpdateShardHandler Creating UpdateShardHandler HTTP client with params: 
   [junit4]   2> 854741 INFO  (jetty-launcher-1125-thread-2) [    ] o.a.s.l.LogWatcher SLF4J impl is org.slf4j.impl.Log4jLoggerFactory
   [junit4]   2> 854741 INFO  (jetty-launcher-1125-thread-2) [    ] o.a.s.l.LogWatcher Registering Log Listener [Log4j (org.slf4j.impl.Log4jLoggerFactory)]
   [junit4]   2> 854741 INFO  (jetty-launcher-1125-thread-1) [    ] o.a.s.l.LogWatcher SLF4J impl is org.slf4j.impl.Log4jLoggerFactory
   [junit4]   2> 854741 INFO  (jetty-launcher-1125-thread-2) [    ] o.a.s.c.ZkContainer Zookeeper client=127.0.0.1:38158/solr
   [junit4]   2> 854741 INFO  (jetty-launcher-1125-thread-1) [    ] o.a.s.l.LogWatcher Registering Log Listener [Log4j (org.slf4j.impl.Log4jLoggerFactory)]
   [junit4]   2> 854741 INFO  (jetty-launcher-1125-thread-2) [    ] o.a.s.c.ZkController zkHost includes chroot
   [junit4]   2> 854741 INFO  (jetty-launcher-1125-thread-2) [    ] o.a.s.c.c.SolrZkClient Using default ZkCredentialsProvider
   [junit4]   2> 854741 INFO  (jetty-launcher-1125-thread-1) [    ] o.a.s.c.ZkContainer Zookeeper client=127.0.0.1:38158/solr
   [junit4]   2> 854741 INFO  (jetty-launcher-1125-thread-1) [    ] o.a.s.c.ZkController zkHost includes chroot
   [junit4]   2> 854742 INFO  (jetty-launcher-1125-thread-1) [    ] o.a.s.c.c.SolrZkClient Using default ZkCredentialsProvider
   [junit4]   2> 854742 INFO  (jetty-launcher-1125-thread-2) [    ] o.a.s.c.c.ConnectionManager Waiting for client to connect to ZooKeeper
   [junit4]   2> 854742 INFO  (jetty-launcher-1125-thread-1) [    ] o.a.s.c.c.ConnectionManager Waiting for client to connect to ZooKeeper
   [junit4]   2> 854742 INFO  (zkCallback-1133-thread-1) [    ] o.a.s.c.c.ConnectionManager Watcher org.apache.solr.common.cloud.ConnectionManager@54e9ab name:ZooKeeperConnection Watcher:127.0.0.1:38158 got event WatchedEvent state:SyncConnected type:None path:null path:null type:None
   [junit4]   2> 854742 INFO  (jetty-launcher-1125-thread-2) [    ] o.a.s.c.c.ConnectionManager Client is connected to ZooKeeper
   [junit4]   2> 854743 INFO  (zkCallback-1134-thread-1) [    ] o.a.s.c.c.ConnectionManager Watcher org.apache.solr.common.cloud.ConnectionManager@1d9de40 name:ZooKeeperConnection Watcher:127.0.0.1:38158 got event WatchedEvent state:SyncConnected type:None path:null path:null type:None
   [junit4]   2> 854743 INFO  (jetty-launcher-1125-thread-1) [    ] o.a.s.c.c.ConnectionManager Client is connected to ZooKeeper
   [junit4]   2> 854743 INFO  (jetty-launcher-1125-thread-2) [    ] o.a.s.c.c.SolrZkClient Using default ZkACLProvider
   [junit4]   2> 854743 INFO  (jetty-launcher-1125-thread-1) [    ] o.a.s.c.c.SolrZkClient Using default ZkACLProvider
   [junit4]   2> 854744 INFO  (jetty-launcher-1125-thread-2) [    ] o.a.s.c.ZkController Added new OnReconnect listener org.apache.solr.cloud.ZkController$$Lambda$181/4866399@19fcbd4
   [junit4]   2> 854744 INFO  (jetty-launcher-1125-thread-1) [    ] o.a.s.c.ZkController Added new OnReconnect listener org.apache.solr.cloud.ZkController$$Lambda$181/4866399@1931fda
   [junit4]   2> 854744 INFO  (jetty-launcher-1125-thread-2) [    ] o.a.s.c.c.ConnectionManager Waiting for client to connect to ZooKeeper
   [junit4]   2> 854744 INFO  (jetty-launcher-1125-thread-1) [    ] o.a.s.c.c.ConnectionManager Waiting for client to connect to ZooKeeper
   [junit4]   2> 854744 INFO  (zkCallback-1135-thread-1) [    ] o.a.s.c.c.ConnectionManager Watcher org.apache.solr.common.cloud.ConnectionManager@1115a95 name:ZooKeeperConnection Watcher:127.0.0.1:38158/solr got event WatchedEvent state:SyncConnected type:None path:null path:null type:None
   [junit4]   2> 854745 INFO  (jetty-launcher-1125-thread-2) [    ] o.a.s.c.c.ConnectionManager Client is connected to ZooKeeper
   [junit4]   2> 854746 INFO  (zkCallback-1136-thread-1) [    ] o.a.s.c.c.ConnectionManager Watcher org.apache.solr.common.cloud.ConnectionManager@1cf14ca name:ZooKeeperConnection Watcher:127.0.0.1:38158/solr got event WatchedEvent state:SyncConnected type:None path:null path:null type:None
   [junit4]   2> 854746 INFO  (jetty-launcher-1125-thread-1) [    ] o.a.s.c.c.ConnectionManager Client is connected to ZooKeeper
   [junit4]   2> 854746 INFO  (jetty-launcher-1125-thread-2) [    ] o.a.s.c.c.SolrZkClient makePath: /overseer/queue
   [junit4]   2> 854746 INFO  (jetty-launcher-1125-thread-1) [    ] o.a.s.c.c.SolrZkClient makePath: /overseer/queue
   [junit4]   2> 854747 INFO  (jetty-launcher-1125-thread-2) [    ] o.a.s.c.c.SolrZkClient makePath: /overseer/collection-queue-work
   [junit4]   2> 854747 INFO  (jetty-launcher-1125-thread-1) [    ] o.a.s.c.c.SolrZkClient makePath: /overseer/collection-queue-work
   [junit4]   2> 854748 INFO  (jetty-launcher-1125-thread-2) [    ] o.a.s.c.c.SolrZkClient makePath: /overseer/collection-map-running
   [junit4]   2> 854748 INFO  (jetty-launcher-1125-thread-1) [    ] o.a.s.c.c.SolrZkClient makePath: /overseer/collection-map-running
   [junit4]   2> 854749 INFO  (jetty-launcher-1125-thread-2) [    ] o.a.s.c.c.SolrZkClient makePath: /overseer/collection-map-completed
   [junit4]   2> 854749 INFO  (jetty-launcher-1125-thread-1) [    ] o.a.s.c.c.SolrZkClient makePath: /overseer/collection-map-completed
   [junit4]   2> 854750 INFO  (jetty-launcher-1125-thread-1) [    ] o.a.s.c.c.SolrZkClient makePath: /overseer/collection-map-failure
   [junit4]   2> 854750 INFO  (jetty-launcher-1125-thread-2) [    ] o.a.s.c.c.SolrZkClient makePath: /overseer/collection-map-failure
   [junit4]   2> 854750 INFO  (jetty-launcher-1125-thread-1) [    ] o.a.s.c.c.SolrZkClient makePath: /live_nodes
   [junit4]   2> 854750 INFO  (jetty-launcher-1125-thread-2) [    ] o.a.s.c.c.SolrZkClient makePath: /live_nodes
   [junit4]   2> 854751 INFO  (jetty-launcher-1125-thread-2) [    ] o.a.s.c.c.SolrZkClient makePath: /collections
   [junit4]   2> 854751 INFO  (jetty-launcher-1125-thread-1) [    ] o.a.s.c.c.SolrZkClient makePath: /collections
   [junit4]   2> 854751 INFO  (jetty-launcher-1125-thread-1) [    ] o.a.s.c.c.SolrZkClient makePath: /aliases.json
   [junit4]   2> 854751 INFO  (jetty-launcher-1125-thread-2) [    ] o.a.s.c.c.SolrZkClient makePath: /aliases.json
   [junit4]   2> 854752 INFO  (jetty-launcher-1125-thread-1) [    ] o.a.s.c.c.SolrZkClient makePath: /clusterstate.json
   [junit4]   2> 854752 INFO  (jetty-launcher-1125-thread-2) [    ] o.a.s.c.c.SolrZkClient makePath: /clusterstate.json
   [junit4]   2> 854752 INFO  (jetty-launcher-1125-thread-2) [    ] o.a.s.c.c.SolrZkClient makePath: /security.json
   [junit4]   2> 854752 INFO  (jetty-launcher-1125-thread-1) [    ] o.a.s.c.c.SolrZkClient makePath: /security.json
   [junit4]   2> 854752 INFO  (jetty-launcher-1125-thread-2) [    ] o.a.s.c.c.ZkStateReader Updating cluster state from ZooKeeper... 
   [junit4]   2> 854752 INFO  (jetty-launcher-1125-thread-1) [    ] o.a.s.c.c.ZkStateReader Updating cluster state from ZooKeeper... 
   [junit4]   2> 854753 INFO  (jetty-launcher-1125-thread-2) [    ] o.a.s.c.c.ZkStateReader Loaded empty cluster properties
   [junit4]   2> 854753 INFO  (jetty-launcher-1125-thread-1) [    ] o.a.s.c.c.ZkStateReader Loaded empty cluster properties
   [junit4]   2> 854753 INFO  (jetty-launcher-1125-thread-2) [    ] o.a.s.c.c.ZkStateReader Updated live nodes from ZooKeeper... (0) -> (0)
   [junit4]   2> 854753 INFO  (jetty-launcher-1125-thread-1) [    ] o.a.s.c.c.ZkStateReader Updated live nodes from ZooKeeper... (0) -> (0)
   [junit4]   2> 854754 INFO  (jetty-launcher-1125-thread-2) [    ] o.a.s.c.c.SolrZkClient makePath: /overseer_elect
   [junit4]   2> 854755 INFO  (jetty-launcher-1125-thread-1) [    ] o.a.s.c.c.SolrZkClient makePath: /overseer_elect
   [junit4]   2> 854755 INFO  (jetty-launcher-1125-thread-1) [    ] o.a.s.c.c.SolrZkClient makePath: /overseer_elect/election
   [junit4]   2> 854755 INFO  (jetty-launcher-1125-thread-2) [    ] o.a.s.c.c.SolrZkClient makePath: /overseer_elect/election
   [junit4]   2> 854756 INFO  (jetty-launcher-1125-thread-2) [    ] o.a.s.c.Overseer Overseer (id=null) closing
   [junit4]   2> 854756 INFO  (jetty-launcher-1125-thread-1) [    ] o.a.s.c.Overseer Overseer (id=null) closing
   [junit4]   2> 854756 INFO  (jetty-launcher-1125-thread-2) [    ] o.a.s.c.LeaderElector Joined leadership election with path: /overseer_elect/election/96102665765191685-127.0.0.1:42051_solr-n_0000000000
   [junit4]   2> 854756 INFO  (jetty-launcher-1125-thread-1) [    ] o.a.s.c.LeaderElector Joined leadership election with path: /overseer_elect/election/96102665765191686-127.0.0.1:44912_solr-n_0000000001
   [junit4]   2> 854756 INFO  (jetty-launcher-1125-thread-2) [    ] o.a.s.c.OverseerElectionContext I am going to be the leader 127.0.0.1:42051_solr
   [junit4]   2> 854756 INFO  (jetty-launcher-1125-thread-2) [    ] o.a.s.c.c.SolrZkClient makePath: /overseer_elect/leader
   [junit4]   2> 854757 INFO  (jetty-launcher-1125-thread-1) [    ] o.a.s.c.LeaderElector Watching path /overseer_elect/election/96102665765191685-127.0.0.1:42051_solr-n_0000000000 to know if I could be the leader
   [junit4]   2> 854758 INFO  (jetty-launcher-1125-thread-1) [    ] o.a.s.c.ZkController Register node as live in ZooKeeper:/live_nodes/127.0.0.1:44912_solr
   [junit4]   2> 854758 INFO  (jetty-launcher-1125-thread-1) [    ] o.a.s.c.c.SolrZkClient makePath: /live_nodes/127.0.0.1:44912_solr
   [junit4]   2> 854758 INFO  (jetty-launcher-1125-thread-2) [    ] o.a.s.c.Overseer Overseer (id=96102665765191685-127.0.0.1:42051_solr-n_0000000000) starting
   [junit4]   2> 854758 INFO  (zkCallback-1135-thread-1) [    ] o.a.s.c.c.ZkStateReader A live node change: [WatchedEvent state:SyncConnected type:NodeChildrenChanged path:/live_nodes], has occurred - updating... (live nodes size: [0])
   [junit4]   2> 854758 INFO  (zkCallback-1136-thread-1) [    ] o.a.s.c.c.ZkStateReader A live node change: [WatchedEvent state:SyncConnected type:NodeChildrenChanged path:/live_nodes], has occurred - updating... (live nodes size: [0])
   [junit4]   2> 854759 INFO  (zkCallback-1135-thread-1) [    ] o.a.s.c.c.ZkStateReader Updated live nodes from ZooKeeper... (0) -> (1)
   [junit4]   2> 854759 INFO  (jetty-launcher-1125-thread-2) [    ] o.a.s.c.c.SolrZkClient makePath: /overseer/queue-work
   [junit4]   2> 854759 INFO  (zkCallback-1136-thread-1) [    ] o.a.s.c.c.ZkStateReader Updated live nodes from ZooKeeper... (0) -> (1)
   [junit4]   2> 854762 INFO  (jetty-launcher-1125-thread-2) [    ] o.a.s.c.OverseerAutoReplicaFailoverThread Starting OverseerAutoReplicaFailoverThread autoReplicaFailoverWorkLoopDelay=10000 autoReplicaFailoverWaitAfterExpiration=30000 autoReplicaFailoverBadNodeExpiration=60000
   [junit4]   2> 854762 INFO  (OverseerCollectionConfigSetProcessor-96102665765191685-127.0.0.1:42051_solr-n_0000000000) [    ] o.a.s.c.OverseerTaskProcessor Process current queue of overseer operations
   [junit4]   2> 854763 INFO  (OverseerStateUpdate-96102665765191685-127.0.0.1:42051_solr-n_0000000000) [    ] o.a.s.c.Overseer Starting to work on the main queue
   [junit4]   2> 854763 INFO  (jetty-launcher-1125-thread-2) [    ] o.a.s.c.ZkController Publish node=127.0.0.1:42051_solr as DOWN
   [junit4]   2> 854764 INFO  (OverseerStateUpdate-96102665765191685-127.0.0.1:42051_solr-n_0000000000) [    ] o.a.s.c.c.ZkStateReader Updated live nodes from ZooKeeper... (1) -> (1)
   [junit4]   2> 854764 INFO  (OverseerStateUpdate-96102665765191685-127.0.0.1:42051_solr-n_0000000000) [    ] o.a.s.c.Overseer processMessage: queueSize: 0, message = {
   [junit4]   2>   "operation":"downnode",
   [junit4]   2>   "node_name":"127.0.0.1:42051_solr"} current state version: 0
   [junit4]   2> 854765 INFO  (OverseerStateUpdate-96102665765191685-127.0.0.1:42051_solr-n_0000000000) [    ] o.a.s.c.o.NodeMutator DownNode state invoked for node: 127.0.0.1:42051_solr
   [junit4]   2> 854782 INFO  (jetty-launcher-1125-thread-1) [    ] o.a.s.c.CoreContainer Security conf doesn't exist. Skipping setup for authorization module.
   [junit4]   2> 854782 INFO  (jetty-launcher-1125-thread-1) [    ] o.a.s.c.CoreContainer No authentication plugin used.
   [junit4]   2> 854783 INFO  (jetty-launcher-1125-thread-1) [    ] o.a.s.c.CorePropertiesLocator Looking for core definitions underneath /home/jenkins/workspace/Lucene-Solr-master-Linux/solr/build/solr-core/test/J0/temp/solr.schema.TestManagedSchemaAPI_11E92BFFE2F136D4-001/tempDir-001/node1/.
   [junit4]   2> 854783 INFO  (jetty-launcher-1125-thread-1) [    ] o.a.s.c.CorePropertiesLocator Found 0 core definitions
   [junit4]   2> 854783 INFO  (jetty-launcher-1125-thread-1) [    ] o.a.s.s.SolrDispatchFilter user.dir=/home/jenkins/workspace/Lucene-Solr-master-Linux/solr/build/solr-core/test/J0
   [junit4]   2> 854783 INFO  (jetty-launcher-1125-thread-1) [    ] o.a.s.s.SolrDispatchFilter SolrDispatchFilter.init() done
   [junit4]   2> 855764 INFO  (jetty-launcher-1125-thread-2) [    ] o.a.s.c.ZkController Register node as live in ZooKeeper:/live_nodes/127.0.0.1:42051_solr
   [junit4]   2> 855765 INFO  (jetty-launcher-1125-thread-2) [    ] o.a.s.c.c.SolrZkClient makePath: /live_nodes/127.0.0.1:42051_solr
   [junit4]   2> 855765 INFO  (zkCallback-1135-thread-1) [    ] o.a.s.c.c.ZkStateReader A live node change: [WatchedEvent state:SyncConnected type:NodeChildrenChanged path:/live_nodes], has occurred - updating... (live nodes size: [1])
   [junit4]   2> 855765 INFO  (zkCallback-1136-thread-1) [    ] o.a.s.c.c.ZkStateReader A live node change: [WatchedEvent state:SyncConnected type:NodeChildrenChanged path:/live_nodes], has occurred - updating... (live nodes size: [1])
   [junit4]   2> 855766 INFO  (zkCallback-1136-thread-1) [    ] o.a.s.c.c.ZkStateReader Updated live nodes from ZooKeeper... (1) -> (2)
   [junit4]   2> 855769 INFO  (zkCallback-1135-thread-1) [    ] o.a.s.c.c.ZkStateReader Updated live nodes from ZooKeeper... (1) -> (2)
   [junit4]   2> 855776 INFO  (jetty-launcher-1125-thread-2) [    ] o.a.s.c.CoreContainer Security conf doesn't exist. Skipping setup for authorization module.
   [junit4]   2> 855776 INFO  (jetty-launcher-1125-thread-2) [    ] o.a.s.c.CoreContainer No authentication plugin used.
   [junit4]   2> 855777 INFO  (jetty-launcher-1125-thread-2) [    ] o.a.s.c.CorePropertiesLocator Looking for core definitions underneath /home/jenkins/workspace/Lucene-Solr-master-Linux/solr/build/solr-core/test/J0/temp/solr.schema.TestManagedSchemaAPI_11E92BFFE2F136D4-001/tempDir-001/node2/.
   [junit4]   2> 855777 INFO  (jetty-launcher-1125-thread-2) [    ] o.a.s.c.CorePropertiesLocator Found 0 core definitions
   [junit4]   2> 855778 INFO  (jetty-launcher-1125-thread-2) [    ] o.a.s.s.SolrDispatchFilter user.dir=/home/jenkins/workspace/Lucene-Solr-master-Linux/solr/build/solr-core/test/J0
   [junit4]   2> 855778 INFO  (jetty-launcher-1125-thread-2) [    ] o.a.s.s.SolrDispatchFilter SolrDispatchFilter.init() done
   [junit4]   2> 855778 INFO  (SUITE-TestManagedSchemaAPI-seed#[11E92BFFE2F136D4]-worker) [    ] o.a.s.c.c.SolrZkClient Using default ZkCredentialsProvider
   [junit4]   2> 855778 INFO  (SUITE-TestManagedSchemaAPI-seed#[11E92BFFE2F136D4]-worker) [    ] o.a.s.c.c.ConnectionManager Waiting for client to connect to ZooKeeper
   [junit4]   2> 855779 INFO  (zkCallback-1139-thread-1) [    ] o.a.s.c.c.ConnectionManager Watcher org.apache.solr.common.cloud.ConnectionManager@a4ea9d name:ZooKeeperConnection Watcher:127.0.0.1:38158 got event WatchedEvent state:SyncConnected type:None path:null path:null type:None
   [junit4]   2> 855779 INFO  (SUITE-TestManagedSchemaAPI-seed#[11E92BFFE2F136D4]-worker) [    ] o.a.s.c.c.ConnectionManager Client is connected to ZooKeeper
   [junit4]   2> 855779 INFO  (SUITE-TestManagedSchemaAPI-seed#[11E92BFFE2F136D4]-worker) [    ] o.a.s.c.c.SolrZkClient Using default ZkACLProvider
   [junit4]   2> 855780 INFO  (SUITE-TestManagedSchemaAPI-seed#[11E92BFFE2F136D4]-worker) [    ] o.a.s.c.s.i.CloudSolrClient Final constructed zkHost string: 127.0.0.1:38158/solr
   [junit4]   2> 855780 INFO  (SUITE-TestManagedSchemaAPI-seed#[11E92BFFE2F136D4]-worker) [    ] o.a.s.c.c.SolrZkClient Using default ZkCredentialsProvider
   [junit4]   2> 855780 INFO  (SUITE-TestManagedSchemaAPI-seed#[11E92BFFE2F136D4]-worker) [    ] o.a.s.c.c.ConnectionManager Waiting for client to connect to ZooKeeper
   [junit4]   2> 855781 INFO  (zkCallback-1142-thread-1) [    ] o.a.s.c.c.ConnectionManager Watcher org.apache.solr.common.cloud.ConnectionManager@4cea05 name:ZooKeeperConnection Watcher:127.0.0.1:38158/solr got event WatchedEvent state:SyncConnected type:None path:null path:null type:None
   [junit4]   2> 855781 INFO  (SUITE-TestManagedSchemaAPI-seed#[11E92BFFE2F136D4]-worker) [    ] o.a.s.c.c.ConnectionManager Client is connected to ZooKeeper
   [junit4]   2> 855781 INFO  (SUITE-TestManagedSchemaAPI-seed#[11E92BFFE2F136D4]-worker) [    ] o.a.s.c.c.SolrZkClient Using default ZkACLProvider
   [junit4]   2> 855781 INFO  (SUITE-TestManagedSchemaAPI-seed#[11E92BFFE2F136D4]-worker) [    ] o.a.s.c.c.ZkStateReader Updating cluster state from ZooKeeper... 
   [junit4]   2> 855782 INFO  (SUITE-TestManagedSchemaAPI-seed#[11E92BFFE2F136D4]-worker) [    ] o.a.s.c.c.ZkStateReader Loaded empty cluster properties
   [junit4]   2> 855782 INFO  (SUITE-TestManagedSchemaAPI-seed#[11E92BFFE2F136D4]-worker) [    ] o.a.s.c.c.ZkStateReader Updated live nodes from ZooKeeper... (0) -> (2)
   [junit4]   2> 855782 INFO  (SUITE-TestManagedSchemaAPI-seed#[11E92BFFE2F136D4]-worker) [    ] o.a.s.c.c.SolrZkClient makePath: /configs/conf1/solrconfig.xml
   [junit4]   2> 855783 INFO  (SUITE-TestManagedSchemaAPI-seed#[11E92BFFE2F136D4]-worker) [    ] o.a.s.c.c.SolrZkClient makePath: /configs/conf1/managed-schema
   [junit4]   2> 855791 INFO  (TEST-TestManagedSchemaAPI.test-seed#[11E92BFFE2F136D4]) [    ] o.a.s.SolrTestCaseJ4 ###Starting test
   [junit4]   2> 855793 INFO  (qtp3574889-7225) [    ] o.a.s.h.a.CollectionsHandler Invoked Collection Action :create with params replicationFactor=2&collection.configName=conf1&name=testschemaapi&action=CREATE&numShards=1&wt=javabin&version=2 and sendToOCPQueue=true
   [junit4]   2> 855794 INFO  (OverseerCollectionConfigSetProcessor-96102665765191685-127.0.0.1:42051_solr-n_0000000000) [    ] o.a.s.c.OverseerTaskProcessor Overseer Collection Message Handler: Get the message id:/overseer/collection-queue-work/qn-0000000000 message:{
   [junit4]   2>   "name":"testschemaapi",
   [junit4]   2>   "fromApi":"true",
   [junit4]   2>   "replicationFactor":"2",
   [junit4]   2>   "collection.configName":"conf1",
   [junit4]   2>   "numShards":"1",
   [junit4]   2>   "stateFormat":"2",
   [junit4]   2>   "operation":"create"}
   [junit4]   2> 855794 INFO  (OverseerThreadFactory-3248-thread-1) [    ] o.a.s.c.OverseerCollectionMessageHandler OverseerCollectionMessageHandler.processMessage : create , {
   [junit4]   2>   "name":"testschemaapi",
   [junit4]   2>   "fromApi":"true",
   [junit4]   2>   "replicationFactor":"2",
   [junit4]   2>   "collection.configName":"conf1",
   [junit4]   2>   "numShards":"1",
   [junit4]   2>   "stateFormat":"2",
   [junit4]   2>   "operation":"create"}
   [junit4]   2> 855795 INFO  (OverseerThreadFactory-3248-thread-1) [    ] o.a.s.c.OverseerCollectionMessageHandler Create collection testschemaapi
   [junit4]   2> 855795 INFO  (OverseerThreadFactory-3248-thread-1) [    ] o.a.s.c.OverseerCollectionMessageHandler creating collections conf node /collections/testschemaapi 
   [junit4]   2> 855795 INFO  (OverseerThreadFactory-3248-thread-1) [    ] o.a.s.c.c.SolrZkClient makePath: /collections/testschemaapi
   [junit4]   2> 855795 INFO  (zkCallback-1135-thread-1) [    ] o.a.s.c.c.ZkStateReader A collections change: [WatchedEvent state:SyncConnected type:NodeChildrenChanged path:/collections], has occurred - updating...
   [junit4]   2> 855795 INFO  (zkCallback-1136-thread-1) [    ] o.a.s.c.c.ZkStateReader A collections change: [WatchedEvent state:SyncConnected type:NodeChildrenChanged path:/collections], has occurred - updating...
   [junit4]   2> 855795 INFO  (zkCallback-1142-thread-1) [    ] o.a.s.c.c.ZkStateReader A collections change: [WatchedEvent state:SyncConnected type:NodeChildrenChanged path:/collections], has occurred - updating...
   [junit4]   2> 855796 INFO  (OverseerStateUpdate-96102665765191685-127.0.0.1:42051_solr-n_0000000000) [    ] o.a.s.c.Overseer processMessage: queueSize: 1, message = {
   [junit4]   2>   "name":"testschemaapi",
   [junit4]   2>   "fromApi":"true",
   [junit4]   2>   "replicationFactor":"2",
   [junit4]   2>   "collection.configName":"conf1",
   [junit4]   2>   "numShards":"1",
   [junit4]   2>   "stateFormat":"2",
   [junit4]   2>   "operation":"create"} current state version: 0
   [junit4]   2> 855796 INFO  (OverseerStateUpdate-96102665765191685-127.0.0.1:42051_solr-n_0000000000) [    ] o.a.s.c.o.ClusterStateMutator building a new cName: testschemaapi
   [junit4]   2> 855797 INFO  (OverseerStateUpdate-96102665765191685-127.0.0.1:42051_solr-n_0000000000) [    ] o.a.s.c.o.ZkStateWriter going to create_collection /collections/testschemaapi/state.json
   [junit4]   2> 855896 INFO  (OverseerThreadFactory-3248-thread-1) [    ] o.a.s.c.OverseerCollectionMessageHandler Creating SolrCores for new collection testschemaapi, shardNames [shard1] , replicationFactor : 2
   [junit4]   2> 855896 INFO  (OverseerThreadFactory-3248-thread-1) [    ] o.a.s.c.OverseerCollectionMessageHandler Creating core testschemaapi_shard1_replica2 as part of shard shard1 of collection testschemaapi on 127.0.0.1:42051_solr
   [junit4]   2> 855897 INFO  (OverseerThreadFactory-3248-thread-1) [    ] o.a.s.c.OverseerCollectionMessageHandler Creating core testschemaapi_shard1_replica1 as part of shard shard1 of collection testschemaapi on 127.0.0.1:44912_solr
   [junit4]   2> 855898 INFO  (qtp3574889-7227) [    ] o.a.s.h.a.CoreAdminOperation core create command qt=/admin/cores&collection.configName=conf1&name=testschemaapi_shard1_replica2&action=CREATE&numShards=1&collection=testschemaapi&shard=shard1&wt=javabin&version=2
   [junit4]   2> 855898 INFO  (qtp3574889-7227) [    ] o.a.s.c.CoreDescriptor Created CoreDescriptor: {schema=schema.xml, dataDir=data/, collection.configName=conf1, collection=testschemaapi, loadOnStartup=true, transient=false, name=testschemaapi_shard1_replica2, numShards=1, shard=shard1, config=solrconfig.xml, configSetProperties=configsetprops.json}
   [junit4]   2> 855898 INFO  (qtp3574889-7227) [    ] o.a.s.c.ZkController publishing state=down
   [junit4]   2> 855899 INFO  (qtp30508440-7216) [    ] o.a.s.h.a.CoreAdminOperation core create command qt=/admin/cores&collection.configName=conf1&name=testschemaapi_shard1_replica1&action=CREATE&numShards=1&collection=testschemaapi&shard=shard1&wt=javabin&version=2
   [junit4]   2> 855899 INFO  (qtp3574889-7227) [    ] o.a.s.c.ZkController Registering watch for collection testschemaapi
   [junit4]   2> 855899 INFO  (OverseerStateUpdate-96102665765191685-127.0.0.1:42051_solr-n_0000000000) [    ] o.a.s.c.Overseer processMessage: queueSize: 1, message = {
   [junit4]   2>   "core":"testschemaapi_shard1_replica2",
   [junit4]   2>   "roles":null,
   [junit4]   2>   "base_url":"http://127.0.0.1:42051/solr",
   [junit4]   2>   "node_name":"127.0.0.1:42051_solr",
   [junit4]   2>   "numShards":"1",
   [junit4]   2>   "state":"down",
   [junit4]   2>   "shard":"shard1",
   [junit4]   2>   "collection":"testschemaapi",
   [junit4]   2>   "operation":"state"} current state version: 0
   [junit4]   2> 855899 INFO  (qtp3574889-7227) [    ] o.a.s.c.c.ZkStateReader Add data for [testschemaapi] ver [0]
   [junit4]   2> 855899 INFO  (OverseerStateUpdate-96102665765191685-127.0.0.1:42051_solr-n_0000000000) [    ] o.a.s.c.o.ReplicaMutator Update state numShards=1 message={
   [junit4]   2>   "core":"testschemaapi_shard1_replica2",
   [junit4]   2>   "roles":null,
   [junit4]   2>   "base_url":"http://127.0.0.1:42051/solr",
   [junit4]   2>   "node_name":"127.0.0.1:42051_solr",
   [junit4]   2>   "numShards":"1",
   [junit4]   2>   "state":"down",
   [junit4]   2>   "shard":"shard1",
   [junit4]   2>   "collection":"testschemaapi",
   [junit4]   2>   "operation":"state"}
   [junit4]   2> 855899 INFO  (qtp30508440-7216) [    ] o.a.s.c.CoreDescriptor Created CoreDescriptor: {schema=schema.xml, dataDir=data/, collection.configName=conf1, collection=testschemaapi, loadOnStartup=true, transient=false, name=testschemaapi_shard1_replica1, numShards=1, shard=shard1, config=solrconfig.xml, configSetProperties=configsetprops.json}
   [junit4]   2> 855899 INFO  (qtp3574889-7227) [    ] o.a.s.c.ZkController look for our core node name
   [junit4]   2> 855899 INFO  (qtp30508440-7216) [    ] o.a.s.c.ZkController publishing state=down
   [junit4]   2> 855900 INFO  (qtp30508440-7216) [    ] o.a.s.c.ZkController Registering watch for collection testschemaapi
   [junit4]   2> 855900 INFO  (OverseerStateUpdate-96102665765191685-127.0.0.1:42051_solr-n_0000000000) [    ] o.a.s.c.Overseer processMessage: queueSize: 1, message = {
   [junit4]   2>   "core":"testschemaapi_shard1_replica1",
   [junit4]   2>   "roles":null,
   [junit4]   2>   "base_url":"http://127.0.0.1:44912/solr",
   [junit4]   2>   "node_name":"127.0.0.1:44912_solr",
   [junit4]   2>   "numShards":"1",
   [junit4]   2>   "state":"down",
   [junit4]   2>   "shard":"shard1",
   [junit4]   2>   "collection":"testschemaapi",
   [junit4]   2>   "operation":"state"} current state version: 0
   [junit4]   2> 855900 INFO  (OverseerStateUpdate-96102665765191685-127.0.0.1:42051_solr-n_0000000000) [    ] o.a.s.c.o.ReplicaMutator Update state numShards=1 message={
   [junit4]   2>   "core":"testschemaapi_shard1_replica1",
   [junit4]   2>   "roles":null,
   [junit4]   2>   "base_url":"http://127.0.0.1:44912/solr",
   [junit4]   2>   "node_name":"127.0.0.1:44912_solr",
   [junit4]   2>   "numShards":"1",
   [junit4]   2>   "state":"down",
   [junit4]   2>   "shard":"shard1",
   [junit4]   2>   "collection":"testschemaapi",
   [junit4]   2>   "operation":"state"}
   [junit4]   2> 855900 INFO  (qtp30508440-7216) [    ] o.a.s.c.c.ZkStateReader Add data for [testschemaapi] ver [0]
   [junit4]   2> 855900 INFO  (qtp30508440-7216) [    ] o.a.s.c.ZkController look for our core node name
   [junit4]   2> 856001 INFO  (OverseerStateUpdate-96102665765191685-127.0.0.1:42051_solr-n_0000000000) [    ] o.a.s.c.o.ZkStateWriter going to update_collection /collections/testschemaapi/state.json version: 0
   [junit4]   2> 856002 INFO  (zkCallback-1135-thread-1) [    ] o.a.s.c.c.ZkStateReader A cluster state change: [WatchedEvent state:SyncConnected type:NodeDataChanged path:/collections/testschemaapi/state.json] for collection [testschemaapi] has occurred - updating... (live nodes size: [2])
   [junit4]   2> 856002 INFO  (zkCallback-1136-thread-1) [    ] o.a.s.c.c.ZkStateReader A cluster state change: [WatchedEvent state:SyncConnected type:NodeDataChanged path:/collections/testschemaapi/state.json] for collection [testschemaapi] has occurred - updating... (live nodes size: [2])
   [junit4]   2> 856002 INFO  (zkCallback-1135-thread-1) [    ] o.a.s.c.c.ZkStateReader Updating data for [testschemaapi] from [0] to [1]
   [junit4]   2> 856002 INFO  (zkCallback-1136-thread-1) [    ] o.a.s.c.c.ZkStateReader Updating data for [testschemaapi] from [0] to [1]
   [junit4]   2> 856899 INFO  (qtp3574889-7227) [    ] o.a.s.c.ZkController waiting to find shard id in clusterstate for testschemaapi_shard1_replica2
   [junit4]   2> 856899 INFO  (qtp3574889-7227) [    ] o.a.s.c.ZkController Check for collection zkNode:testschemaapi
   [junit4]   2> 856900 INFO  (qtp3574889-7227) [    ] o.a.s.c.ZkController Collection zkNode exists
   [junit4]   2> 856900 INFO  (qtp3574889-7227) [    ] o.a.s.c.c.ZkStateReader Load collection config from: [/collections/testschemaapi]
   [junit4]   2> 856900 INFO  (qtp3574889-7227) [    ] o.a.s.c.c.ZkStateReader path=[/collections/testschemaapi] [configName]=[conf1] specified config exists in ZooKeeper
   [junit4]   2> 856900 INFO  (qtp3574889-7227) [    ] o.a.s.c.SolrResourceLoader new SolrResourceLoader for directory: '/home/jenkins/workspace/Lucene-Solr-master-Linux/solr/build/solr-core/test/J0/temp/solr.schema.TestManagedSchemaAPI_11E92BFFE2F136D4-001/tempDir-001/node2/testschemaapi_shard1_replica2'
   [junit4]   2> 856900 INFO  (qtp3574889-7227) [    ] o.a.s.c.SolrResourceLoader JNDI not configured for solr (NoInitialContextEx)
   [junit4]   2> 856900 INFO  (qtp3574889-7227) [    ] o.a.s.c.SolrResourceLoader solr home defaulted to 'solr/' (could not find system property or JNDI)
   [junit4]   2> 856900 INFO  (qtp30508440-7216) [    ] o.a.s.c.ZkController waiting to find shard id in clusterstate for testschemaapi_shard1_replica1
   [junit4]   2> 856900 INFO  (qtp30508440-7216) [    ] o.a.s.c.ZkController Check for collection zkNode:testschemaapi
   [junit4]   2> 856901 INFO  (qtp30508440-7216) [    ] o.a.s.c.ZkController Collection zkNode exists
   [junit4]   2> 856901 INFO  (qtp30508440-7216) [    ] o.a.s.c.c.ZkStateReader Load collection config from: [/collections/testschemaapi]
   [junit4]   2> 856901 INFO  (qtp30508440-7216) [    ] o.a.s.c.c.ZkStateReader path=[/collections/testschemaapi] [configName]=[conf1] specified config exists in ZooKeeper
   [junit4]   2> 856901 INFO  (qtp30508440-7216) [    ] o.a.s.c.SolrResourceLoader new SolrResourceLoader for directory: '/home/jenkins/workspace/Lucene-Solr-master-Linux/solr/build/solr-core/test/J0/temp/solr.schema.TestManagedSchemaAPI_11E92BFFE2F136D4-001/tempDir-001/node1/testschemaapi_shard1_replica1'
   [junit4]   2> 856901 INFO  (qtp30508440-7216) [    ] o.a.s.c.SolrResourceLoader JNDI not configured for solr (NoInitialContextEx)
   [junit4]   2> 856901 INFO  (qtp3574889-7227) [    ] o.a.s.c.Config loaded config solrconfig.xml with version 0 
   [junit4]   2> 856901 INFO  (qtp30508440-7216) [    ] o.a.s.c.SolrResourceLoader solr home defaulted to 'solr/' (could not find system property or JNDI)
   [junit4]   2> 856902 INFO  (qtp30508440-7216) [    ] o.a.s.c.Config loaded config solrconfig.xml with version 0 
   [junit4]   2> 856904 INFO  (qtp30508440-7216) [    ] o.a.s.c.SolrConfig current version of requestparams : -1
   [junit4]   2> 856904 INFO  (qtp3574889-7227) [    ] o.a.s.c.SolrConfig current version of requestparams : -1
   [junit4]   2> 856906 INFO  (qtp30508440-7216) [    ] o.a.s.c.SolrConfig Using Lucene MatchVersion: 7.0.0
   [junit4]   2> 856906 INFO  (qtp3574889-7227) [    ] o.a.s.c.SolrConfig Using Lucene MatchVersion: 7.0.0
   [junit4]   2> 856908 INFO  (qtp30508440-7216) [    ] o.a.s.c.SolrConfig Loaded SolrConfig: solrconfig.xml
   [junit4]   2> 856908 INFO  (qtp3574889-7227) [    ] o.a.s.c.SolrConfig Loaded SolrConfig: solrconfig.xml
   [junit4]   2> 856911 INFO  (qtp30508440-7216) [    ] o.a.s.s.IndexSchema [testschemaapi_shard1_replica1] Schema name=minimal
   [junit4]   2> 856911 INFO  (qtp3574889-7227) [    ] o.a.s.s.IndexSchema [testschemaapi_shard1_replica2] Schema name=minimal
   [junit4]   2> 856914 INFO  (qtp3574889-7227) [    ] o.a.s.s.IndexSchema unique key field: id
   [junit4]   2> 856914 INFO  (qtp30508440-7216) [    ] o.a.s.s.IndexSchema unique key field: id
   [junit4]   2> 856915 INFO  (qtp3574889-7227) [    ] o.a.s.c.ConfigSetProperties Did not find ConfigSet properties, assuming default properties: Can't find resource 'configsetprops.json' in classpath or '/configs/conf1', cwd=/home/jenkins/workspace/Lucene-Solr-master-Linux/solr/build/solr-core/test/J0
   [junit4]   2> 856915 INFO  (qtp30508440-7216) [    ] o.a.s.c.ConfigSetProperties Did not find ConfigSet properties, assuming default properties: Can't find resource 'configsetprops.json' in classpath or '/configs/conf1', cwd=/home/jenkins/workspace/Lucene-Solr-master-Linux/solr/build/solr-core/test/J0
   [junit4]   2> 856915 INFO  (qtp3574889-7227) [    ] o.a.s.c.CoreContainer Creating SolrCore 'testschemaapi_shard1_replica2' using configuration from collection testschemaapi
   [junit4]   2> 856915 INFO  (qtp30508440-7216) [    ] o.a.s.c.CoreContainer Creating SolrCore 'testschemaapi_shard1_replica1' using configuration from collection testschemaapi
   [junit4]   2> 856915 INFO  (qtp30508440-7216) [    ] o.a.s.c.SolrCore org.apache.solr.core.MockDirectoryFactory
   [junit4]   2> 856915 INFO  (qtp3574889-7227) [    ] o.a.s.c.SolrCore org.apache.solr.core.MockDirectoryFactory
   [junit4]   2> 856915 INFO  (qtp30508440-7216) [    ] o.a.s.c.SolrCore [[testschemaapi_shard1_replica1] ] Opening new SolrCore at [/home/jenkins/workspace/Lucene-Solr-master-Linux/solr/build/solr-core/test/J0/temp/solr.schema.TestManagedSchemaAPI_11E92BFFE2F136D4-001/tempDir-001/node1/testschemaapi_shard1_replica1], dataDir=[/home/jenkins/workspace/Lucene-Solr-master-Linux/solr/build/solr-core/test/J0/temp/solr.schema.TestManagedSchemaAPI_11E92BFFE2F136D4-001/tempDir-001/node1/./testschemaapi_shard1_replica1/data/]
   [junit4]   2> 856915 INFO  (qtp3574889-7227) [    ] o.a.s.c.SolrCore [[testschemaapi_shard1_replica2] ] Opening new SolrCore at [/home/jenkins/workspace/Lucene-Solr-master-Linux/solr/build/solr-core/test/J0/temp/solr.schema.TestManagedSchemaAPI_11E92BFFE2F136D4-001/tempDir-001/node2/testschemaapi_shard1_replica2], dataDir=[/home/jenkins/workspace/Lucene-Solr-master-Linux/solr/build/solr-core/test/J0/temp/solr.schema.TestManagedSchemaAPI_11E92BFFE2F136D4-001/tempDir-001/node2/./testschemaapi_shard1_replica2/data/]
   [junit4]   2> 856915 INFO  (qtp30508440-7216) [    ] o.a.s.c.SolrCore JMX monitoring not detected for core: testschemaapi_shard1_replica1
   [junit4]   2> 856916 INFO  (qtp3574889-7227) [    ] o.a.s.c.SolrCore JMX monitoring not detected for core: testschemaapi_shard1_replica2
   [junit4]   2> 856916 INFO  (qtp30508440-7216) [    ] o.a.s.c.CachingDirectoryFactory return new directory for /home/jenkins/workspace/Lucene-Solr-master-Linux/solr/build/solr-core/test/J0/temp/solr.schema.TestManagedSchemaAPI_11E92BFFE2F136D4-001/tempDir-001/node1/./testschemaapi_shard1_replica1/data
   [junit4]   2> 856916 INFO  (qtp30508440-7216) [    ] o.a.s.c.SolrCore New index directory detected: old=null new=/home/jenkins/workspace/Lucene-Solr-master-Linux/solr/build/solr-core/test/J0/temp/solr.schema.TestManagedSchemaAPI_11E92BFFE2F136D4-001/tempDir-001/node1/./testschemaapi_shard1_replica1/data/index/
   [junit4]   2> 856916 INFO  (qtp3574889-7227) [    ] o.a.s.c.CachingDirectoryFactory return new directory for /home/jenkins/workspace/Lucene-Solr-master-Linux/solr/build/solr-core/test/J0/temp/solr.schema.TestManagedSchemaAPI_11E92BFFE2F136D4-001/tempDir-001/node2/./testschemaapi_shard1_replica2/data
   [junit4]   2> 856916 WARN  (qtp30508440-7216) [    ] o.a.s.c.SolrCore [testschemaapi_shard1_replica1] Solr index directory '/home/jenkins/workspace/Lucene-Solr-master-Linux/solr/build/solr-core/test/J0/temp/solr.schema.TestManagedSchemaAPI_11E92BFFE2F136D4-001/tempDir-001/node1/./testschemaapi_shard1_replica1/data/index' doesn't exist. Creating new index...
   [junit4]   2> 856917 INFO  (qtp3574889-7227) [    ] o.a.s.c.SolrCore New index directory detected: old=null new=/home/jenkins/workspace/Lucene-Solr-master-Linux/solr/build/solr-core/test/J0/temp/solr.schema.TestManagedSchemaAPI_11E92BFFE2F136D4-001/tempDir-001/node2/./testschemaapi_shard1_replica2/data/index/
   [junit4]   2> 856917 WARN  (qtp3574889-7227) [    ] o.a.s.c.SolrCore [testschemaapi_shard1_replica2] Solr index directory '/home/jenkins/workspace/Lucene-Solr-master-Linux/solr/build/solr-core/test/J0/temp/solr.schema.TestManagedSchemaAPI_11E92BFFE2F136D4-001/tempDir-001/node2/./testschemaapi_shard1_replica2/data/index' doesn't exist. Creating new index...
   [junit4]   2> 856918 INFO  (qtp30508440-7216) [    ] o.a.s.c.CachingDirectoryFactory return new directory for /home/jenkins/workspace/Lucene-Solr-master-Linux/solr/build/solr-core/test/J0/temp/solr.schema.TestManagedSchemaAPI_11E92BFFE2F136D4-001/tempDir-001/node1/./testschemaapi_shard1_replica1/data/index
   [junit4]   2> 856918 INFO  (qtp3574889-7227) [    ] o.a.s.c.CachingDirectoryFactory return new directory for /home/jenkins/workspace/Lucene-Solr-master-Linux/solr/build/solr-core/test/J0/temp/solr.schema.TestManagedSchemaAPI_11E92BFFE2F136D4-001/tempDir-001/node2/./testschemaapi_shard1_replica2/data/index
   [junit4]   2> 856919 INFO  (qtp3574889-7227) [    ] o.a.s.c.SolrDeletionPolicy SolrDeletionPolicy.onCommit: commits: num=1
   [junit4]   2> 	commit{dir=MockDirectoryWrapper(RAMDirectory@1b245fd lockFactory=org.apache.lucene.store.SingleInstanceLockFactory@fa50fa),segFN=segments_1,generation=1}
   [junit4]   2> 856919 INFO  (qtp30508440-7216) [    ] o.a.s.c.SolrDeletionPolicy SolrDeletionPolicy.onCommit: commits: num=1
   [junit4]   2> 	commit{dir=MockDirectoryWrapper(RAMDirectory@5dfba1 lockFactory=org.apache.lucene.store.SingleInstanceLockFactory@1ccbd34),segFN=segments_1,generation=1}
   [junit4]   2> 856919 INFO  (qtp30508440-7216) [    ] o.a.s.c.SolrDeletionPolicy newest commit generation = 1
   [junit4]   2> 856919 INFO  (qtp3574889-7227) [    ] o.a.s.c.SolrDeletionPolicy newest commit generation = 1
   [junit4]   2> 856919 INFO  (OldIndexDirectoryCleanupThreadForCore-testschemaapi_shard1_replica2) [    ] o.a.s.c.SolrCore Looking for old index directories to cleanup for core testschemaapi_shard1_replica2 in /home/jenkins/workspace/Lucene-Solr-master-Linux/solr/build/solr-core/test/J0/temp/solr.schema.TestManagedSchemaAPI_11E92BFFE2F136D4-001/tempDir-001/node2/./testschemaapi_shard1_replica2/data/
   [junit4]   2> 856920 WARN  (OldIndexDirectoryCleanupThreadForCore-testschemaapi_shard1_replica2) [    ] o.a.s.c.DirectoryFactory /home/jenkins/workspace/Lucene-Solr-master-Linux/solr/build/solr-core/test/J0/temp/solr.schema.TestManagedSchemaAPI_11E92BFFE2F136D4-001/tempDir-001/node2/./testschemaapi_shard1_replica2/data/ does not point to a valid data directory; skipping clean-up of old index directories.
   [junit4]   2> 856920 INFO  (OldIndexDirectoryCleanupThreadForCore-testschemaapi_shard1_replica1) [    ] o.a.s.c.SolrCore Looking for old index directories to cleanup for core testschemaapi_shard1_replica1 in /home/jenkins/workspace/Lucene-Solr-master-Linux/solr/build/solr-core/test/J0/temp/solr.schema.TestManagedSchemaAPI_11E92BFFE2F136D4-001/tempDir-001/node1/./testschemaapi_shard1_replica1/data/
   [junit4]   2> 856920 WARN  (OldIndexDirectoryCleanupThreadForCore-testschemaapi_shard1_replica1) [    ] o.a.s.c.DirectoryFactory /home/jenkins/workspace/Lucene-Solr-master-Linux/solr/build/solr-core/test/J0/temp/solr.schema.TestManagedSchemaAPI_11E92BFFE2F136D4-001/tempDir-001/node1/./testschemaapi_shard1_replica1/data/ does not point to a valid data directory; skipping clean-up of old index directories.
   [junit4]   2> 856920 INFO  (qtp3574889-7227) [    ] o.a.s.c.SolrCore no updateRequestProcessorChain defined as default, creating implicit default
   [junit4]   2> 856920 INFO  (qtp30508440-7216) [    ] o.a.s.c.SolrCore no updateRequestProcessorChain defined as default, creating implicit default
   [junit4]   2> 856923 INFO  (qtp30508440-7216) [    ] o.a.s.h.l.XMLLoader xsltCacheLifetimeSeconds=60
   [junit4]   2> 856923 INFO  (qtp3574889-7227) [    ] o.a.s.h.l.XMLLoader xsltCacheLifetimeSeconds=60
   [junit4]   2> 856924 INFO  (qtp3574889-7227) [    ] o.a.s.h.l.XMLLoader xsltCacheLifetimeSeconds=60
   [junit4]   2> 856924 INFO  (qtp30508440-7216) [    ] o.a.s.h.l.XMLLoader xsltCacheLifetimeSeconds=60
   [junit4]   2> 856924 INFO  (qtp3574889-7227) [    ] o.a.s.h.l.XMLLoader xsltCacheLifetimeSeconds=60
   [junit4]   2> 856924 INFO  (qtp30508440-7216) [    ] o.a.s.h.l.XMLLoader xsltCacheLifetimeSeconds=60
   [junit4]   2> 856925 INFO  (qtp3574889-7227) [    ] o.a.s.h.l.XMLLoader xsltCacheLifetimeSeconds=60
   [junit4]   2> 856925 INFO  (qtp30508440-7216) [    ] o.a.s.h.l.XMLLoader xsltCacheLifetimeSeconds=60
   [junit4]   2> 856927 INFO  (qtp30508440-7216) [    ] o.a.s.c.RequestHandlers Registered paths: /admin/mbeans,/update/csv,/sql,/update/json/docs,/admin/luke,/graph,/export,/select,/admin/segments,/get,/admin/system,/replication,/admin/properties,/config,/stream,/schema,/admin/plugins,/admin/logging,/update/json,/admin/ping,/admin/threads,/update,/admin/file
   [junit4]   2> 856927 INFO  (qtp3574889-7227) [    ] o.a.s.c.RequestHandlers Registered paths: /admin/mbeans,/update/csv,/sql,/update/json/docs,/admin/luke,/graph,/export,/select,/admin/segments,/get,/admin/system,/replication,/admin/properties,/config,/stream,/schema,/admin/plugins,/admin/logging,/update/json,/admin/ping,/admin/threads,/update,/admin/file
   [junit4]   2> 856927 INFO  (qtp30508440-7216) [    ] o.a.s.c.SolrCore Using default statsCache cache: org.apache.solr.search.stats.LocalStatsCache
   [junit4]   2> 856927 INFO  (qtp3574889-7227) [    ] o.a.s.c.SolrCore Using default statsCache cache: org.apache.solr.search.stats.LocalStatsCache
   [junit4]   2> 856927 INFO  (qtp30508440-7216) [    ] o.a.s.u.UpdateHandler Using UpdateLog implementation: org.apache.solr.update.UpdateLog
   [junit4]   2> 856927 INFO  (qtp3574889-7227) [    ] o.a.s.u.UpdateHandler Using UpdateLog implementation: org.apache.solr.update.UpdateLog
   [junit4]   2> 856927 INFO  (qtp30508440-7216) [    ] o.a.s.u.UpdateLog Initializing UpdateLog: dataDir=null defaultSyncLevel=FLUSH numRecordsToKeep=100 maxNumLogsToKeep=10 numVersionBuckets=65536
   [junit4]   2> 856927 INFO  (qtp3574889-7227) [    ] o.a.s.u.UpdateLog Initializing UpdateLog: dataDir=null defaultSyncLevel=FLUSH numRecordsToKeep=100 maxNumLogsToKeep=10 numVersionBuckets=65536
   [junit4]   2> 856928 INFO  (qtp3574889-7227) [    ] o.a.s.u.CommitTracker Hard AutoCommit: disabled
   [junit4]   2> 856928 INFO  (qtp30508440-7216) [    ] o.a.s.u.CommitTracker Hard AutoCommit: disabled
   [junit4]   2> 856928 INFO  (qtp3574889-7227) [    ] o.a.s.u.CommitTracker Soft AutoCommit: disabled
   [junit4]   2> 856928 INFO  (qtp30508440-7216) [    ] o.a.s.u.CommitTracker Soft AutoCommit: disabled
   [junit4]   2> 856930 INFO  (qtp30508440-7216) [    ] o.a.s.c.SolrDeletionPolicy SolrDeletionPolicy.onInit: commits: num=1
   [junit4]   2> 	commit{dir=MockDirectoryWrapper(RAMDirectory@5dfba1 lockFactory=org.apache.lucene.store.SingleInstanceLockFactory@1ccbd34),segFN=segments_1,generation=1}
   [junit4]   2> 856930 INFO  (qtp3574889-7227) [    ] o.a.s.c.SolrDeletionPolicy SolrDeletionPolicy.onInit: commits: num=1
   [junit4]   2> 	commit{dir=MockDirectoryWrapper(RAMDirectory@1b245fd lockFactory=org.apache.lucene.store.SingleInstanceLockFactory@fa50fa),segFN=segments_1,generation=1}
   [junit4]   2> 856930 INFO  (qtp3574889-7227) [    ] o.a.s.c.SolrDeletionPolicy newest commit generation = 1
   [junit4]   2> 856930 INFO  (qtp30508440-7216) [    ] o.a.s.c.SolrDeletionPolicy newest commit generation = 1
   [junit4]   2> 856930 INFO  (qtp3574889-7227) [    ] o.a.s.s.SolrIndexSearcher Opening [Searcher@1b92594[testschemaapi_shard1_replica2] main]
   [junit4]   2> 856930 INFO  (qtp30508440-7216) [    ] o.a.s.s.SolrIndexSearcher Opening [Searcher@b875f1[testschemaapi_shard1_replica1] main]
   [junit4]   2> 856930 INFO  (qtp3574889-7227) [    ] o.a.s.c.c.ZkStateReader Load collection config from: [/collections/testschemaapi]
   [junit4]   2> 856930 INFO  (qtp30508440-7216) [    ] o.a.s.c.c.ZkStateReader Load collection config from: [/collections/testschemaapi]
   [junit4]   2> 856930 INFO  (qtp3574889-7227) [    ] o.a.s.c.c.ZkStateReader path=[/collections/testschemaapi] [configName]=[conf1] specified config exists in ZooKeeper
   [junit4]   2> 856930 INFO  (qtp30508440-7216) [    ] o.a.s.c.c.ZkStateReader path=[/collections/testschemaapi] [configName]=[conf1] specified config exists in ZooKeeper
   [junit4]   2> 856930 INFO  (qtp30508440-7216) [    ] o.a.s.r.ManagedResourceStorage Setting up ZooKeeper-based storage for the RestManager with znodeBase: /configs/conf1
   [junit4]   2> 856930 INFO  (qtp3574889-7227) [    ] o.a.s.r.ManagedResourceStorage Setting up ZooKeeper-based storage for the RestManager with znodeBase: /configs/conf1
   [junit4]   2> 856931 INFO  (qtp30508440-7216) [    ] o.a.s.r.ManagedResourceStorage Configured ZooKeeperStorageIO with znodeBase: /configs/conf1
   [junit4]   2> 856931 INFO  (qtp3574889-7227) [    ] o.a.s.r.ManagedResourceStorage Configured ZooKeeperStorageIO with znodeBase: /configs/conf1
   [junit4]   2> 856931 INFO  (qtp30508440-7216) [    ] o.a.s.r.RestManager Initializing RestManager with initArgs: {}
   [junit4]   2> 856931 INFO  (qtp3574889-7227) [    ] o.a.s.r.RestManager Initializing RestManager with initArgs: {}
   [junit4]   2> 856931 INFO  (qtp3574889-7227) [    ] o.a.s.r.ManagedResourceStorage Reading _rest_managed.json using ZooKeeperStorageIO:path=/configs/conf1
   [junit4]   2> 856931 INFO  (qtp30508440-7216) [    ] o.a.s.r.ManagedResourceStorage Reading _rest_managed.json using ZooKeeperStorageIO:path=/configs/conf1
   [junit4]   2> 856931 INFO  (qtp3574889-7227) [    ] o.a.s.r.ManagedResourceStorage No data found for znode /configs/conf1/_rest_managed.json
   [junit4]   2> 856931 INFO  (qtp30508440-7216) [    ] o.a.s.r.ManagedResourceStorage No data found for znode /configs/conf1/_rest_managed.json
   [junit4]   2> 856931 INFO  (qtp3574889-7227) [    ] o.a.s.r.ManagedResourceStorage Loaded null at path _rest_managed.json using ZooKeeperStorageIO:path=/configs/conf1
   [junit4]   2> 856931 INFO  (qtp30508440-7216) [    ] o.a.s.r.ManagedResourceStorage Loaded null at path _rest_managed.json using ZooKeeperStorageIO:path=/configs/conf1
   [junit4]   2> 856931 INFO  (qtp3574889-7227) [    ] o.a.s.r.RestManager Initializing 0 registered ManagedResources
   [junit4]   2> 856931 INFO  (qtp30508440-7216) [    ] o.a.s.r.RestManager Initializing 0 registered ManagedResources
   [junit4]   2> 856931 INFO  (qtp3574889-7227) [    ] o.a.s.s.ZkIndexSchemaReader Creating ZooKeeper watch for the managed schema at /configs/conf1/managed-schema
   [junit4]   2> 856931 INFO  (qtp30508440-7216) [    ] o.a.s.s.ZkIndexSchemaReader Creating ZooKeeper watch for the managed schema at /configs/conf1/managed-schema
   [junit4]   2> 856932 INFO  (qtp3574889-7227) [    ] o.a.s.c.ZkController Added new OnReconnect listener ZkIndexSchemaReader: /configs/conf1/managed-schema, uniqueCoreId: testschemaapi_shard1_replica2:642049338371788
   [junit4]   2> 856932 INFO  (qtp30508440-7216) [    ] o.a.s.c.ZkController Added new OnReconnect listener ZkIndexSchemaReader: /configs/conf1/managed-schema, uniqueCoreId: testschemaapi_shard1_replica1:642049338402027
   [junit4]   2> 856932 INFO  (qtp3574889-7227) [    ] o.a.s.h.ReplicationHandler Commits will be reserved for  10000
   [junit4]   2> 856932 INFO  (qtp30508440-7216) [    ] o.a.s.h.ReplicationHandler Commits will be reserved for  10000
   [junit4]   2> 856932 INFO  (searcherExecutor-3253-thread-1) [    ] o.a.s.c.SolrCore [testschemaapi_shard1_replica2] Registered new searcher Searcher@1b92594[testschemaapi_shard1_replica2] main{ExitableDirectoryReader(UninvertingDirectoryReader())}
   [junit4]   2> 856932 INFO  (searcherExecutor-3254-thread-1) [    ] o.a.s.c.SolrCore [testschemaapi_shard1_replica1] Registered new searcher Searcher@b875f1[testschemaapi_shard1_replica1] main{ExitableDirectoryReader(UninvertingDirectoryReader())}
   [junit4]   2> 856932 INFO  (qtp3574889-7227) [    ] o.a.s.u.UpdateLog Looking up max value of version field to seed version buckets
   [junit4]   2> 856932 INFO  (qtp30508440-7216) [    ] o.a.s.u.UpdateLog Looking up max value of version field to seed version buckets
   [junit4]   2> 856932 INFO  (qtp3574889-7227) [    ] o.a.s.u.VersionInfo Refreshing highest value of _version_ for 65536 version buckets from index
   [junit4]   2> 856932 INFO  (qtp30508440-7216) [    ] o.a.s.u.VersionInfo Refreshing highest value of _version_ for 65536 version buckets from index
   [junit4]   2> 856932 INFO  (qtp3574889-7227) [    ] o.a.s.u.VersionInfo No terms found for _version_, cannot seed version bucket highest value from index
   [junit4]   2> 856932 INFO  (qtp30508440-7216) [    ] o.a.s.u.VersionInfo No terms found for _version_, cannot seed version bucket highest value from index
   [junit4]   2> 856932 INFO  (qtp3574889-7227) [    ] o.a.s.u.UpdateLog Could not find max version in index or recent updates, using new clock 1537642654667374592
   [junit4]   2> 856932 INFO  (qtp30508440-7216) [    ] o.a.s.u.UpdateLog Could not find max version in index or recent updates, using new clock 1537642654667374592
   [junit4]   2> 856934 INFO  (qtp3574889-7227) [    ] o.a.s.u.UpdateLog Took 1.0ms to seed version buckets with highest version 1537642654667374592
   [junit4]   2> 856934 INFO  (qtp30508440-7216) [    ] o.a.s.u.UpdateLog Took 1.0ms to seed version buckets with highest version 1537642654667374592
   [junit4]   2> 856934 INFO  (qtp3574889-7227) [    ] o.a.s.c.ZkController watch zkdir /configs/conf1
   [junit4]   2> 856934 INFO  (qtp30508440-7216) [    ] o.a.s.c.ZkController watch zkdir /configs/conf1
   [junit4]   2> 856934 INFO  (qtp30508440-7216) [    ] o.a.s.c.CoreContainer registering core: testschemaapi_shard1_replica1
   [junit4]   2> 856934 INFO  (qtp3574889-7227) [    ] o.a.s.c.CoreContainer registering core: testschemaapi_shard1_replica2
   [junit4]   2> 856934 INFO  (qtp30508440-7216) [    ] o.a.s.c.ZkController Register replica - core:testschemaapi_shard1_replica1 address:http://127.0.0.1:44912/solr collection:testschemaapi shard:shard1
   [junit4]   2> 856935 INFO  (qtp3574889-7227) [    ] o.a.s.c.ZkController Register replica - core:testschemaapi_shard1_replica2 address:http://127.0.0.1:42051/solr collection:testschemaapi shard:shard1
   [junit4]   2> 856935 INFO  (qtp30508440-7216) [    ] o.a.s.c.c.SolrZkClient makePath: /collections/testschemaapi/leader_elect/shard1/election
   [junit4]   2> 856935 INFO  (qtp3574889-7227) [    ] o.a.s.c.c.SolrZkClient makePath: /collections/testschemaapi/leader_elect/shard1/election
   [junit4]   2> 856936 INFO  (qtp30508440-7216) [    ] o.a.s.c.LeaderElector Joined leadership election with path: /collections/testschemaapi/leader_elect/shard1/election/96102665765191686-core_node2-n_0000000000
   [junit4]   2> 856936 INFO  (qtp3574889-7227) [    ] o.a.s.c.LeaderElector Joined leadership election with path: /collections/testschemaapi/leader_elect/shard1/election/96102665765191685-core_node1-n_0000000001
   [junit4]   2> 856936 INFO  (qtp30508440-7216) [    ] o.a.s.c.ShardLeaderElectionContext Running the leader process for shard=shard1 and weAreReplacement=false and leaderVoteWait=10000
   [junit4]   2> 856936 INFO  (qtp3574889-7227) [    ] o.a.s.c.LeaderElector Watching path /collections/testschemaapi/leader_elect/shard1/election/96102665765191686-core_node2-n_0000000000 to know if I could be the leader
   [junit4]   2> 856937 INFO  (qtp30508440-7216) [    ] o.a.s.c.ShardLeaderElectionContext Enough replicas found to continue.
   [junit4]   2> 856937 INFO  (qtp30508440-7216) [    ] o.a.s.c.ShardLeaderElectionContext I may be the new leader - try and sync
   [junit4]   2> 856937 INFO  (qtp30508440-7216) [    ] o.a.s.c.SyncStrategy Sync replicas to http://127.0.0.1:44912/solr/testschemaapi_shard1_replica1/
   [junit4]   2> 856937 INFO  (qtp30508440-7216) [    ] o.a.s.u.PeerSync PeerSync: core=testschemaapi_shard1_replica1 url=http://127.0.0.1:44912/solr START replicas=[http://127.0.0.1:42051/solr/testschemaapi_shard1_replica2/] nUpdates=100
   [junit4]   2> 856937 INFO  (OverseerStateUpdate-96102665765191685-127.0.0.1:42051_solr-n_0000000000) [    ] o.a.s.c.Overseer processMessage: queueSize: 1, message = {
   [junit4]   2>   "operation":"leader",
   [junit4]   2>   "shard":"shard1",
   [junit4]   2>   "collection":"testschemaapi"} current state version: 0
   [junit4]   2> 856937 INFO  (qtp30508440-7216) [    ] o.a.s.u.PeerSync PeerSync: core=testschemaapi_shard1_replica1 url=http://127.0.0.1:44912/solr DONE.  We have no versions.  sync failed.
   [junit4]   2> 856937 INFO  (qtp30508440-7216) [    ] o.a.s.c.SyncStrategy Leader's attempt to sync with shard failed, moving to the next candidate
   [junit4]   2> 856937 INFO  (qtp30508440-7216) [    ] o.a.s.c.ShardLeaderElectionContext We failed sync, but we have no versions - we can't sync in that case - we were active before, so become leader anyway
   [junit4]   2> 856937 INFO  (qtp30508440-7216) [    ] o.a.s.c.c.SolrZkClient makePath: /collections/testschemaapi/leaders/shard1
   [junit4]   2> 856938 INFO  (qtp3574889-7220) [    ] o.a.s.c.S.Request [testschemaapi_shard1_replica2]  webapp=/solr path=/get params={distrib=false&qt=/get&fingerprint=false&getVersions=100&wt=javabin&version=2} status=0 QTime=0
   [junit4]   2> 856938 INFO  (qtp30508440-7216) [    ] o.a.s.c.ShardLeaderElectionContextBase Creating leader registration node /collections/testschemaapi/leaders/shard1/leader after winning as /collections/testschemaapi/leader_elect/shard1/election/96102665765191686-core_node2-n_0000000000
   [junit4]   2> 856939 INFO  (qtp30508440-7216) [    ] o.a.s.c.ShardLeaderElectionContext I am the new leader: http://127.0.0.1:44912/solr/testschemaapi_shard1_replica1/ shard1
   [junit4]   2> 856939 INFO  (OverseerStateUpdate-96102665765191685-127.0.0.1:42051_solr-n_0000000000) [    ] o.a.s.c.Overseer processMessage: queueSize: 1, message = {
   [junit4]   2>   "operation":"leader",
   [junit4]   2>   "shard":"shard1",
   [junit4]   2>   "collection":"testschemaapi",
   [junit4]   2>   "base_url":"http://127.0.0.1:44912/solr",
   [junit4]   2>   "core":"testschemaapi_shard1_replica1",
   [junit4]   2>   "state":"active"} current state version: 0
   [junit4]   2> 857040 INFO  (OverseerStateUpdate-96102665765191685-127.0.0.1:42051_solr-n_0000000000) [    ] o.a.s.c.o.ZkStateWriter going to update_collection /collections/testschemaapi/state.json version: 1
   [junit4]   2> 857041 INFO  (zkCallback-1136-thread-1) [    ] o.a.s.c.c.ZkStateReader A cluster state change: [WatchedEvent state:SyncConnected type:NodeDataChanged path:/collections/testschemaapi/state.json] for collection [testschemaapi] has occurred - updating... (live nodes size: [2])
   [junit4]   2> 857041 INFO  (zkCallback-1135-thread-1) [    ] o.a.s.c.c.ZkStateReader A cluster state change: [WatchedEvent state:SyncConnected type:NodeDataChanged path:/collections/testschemaapi/state.json] for collection [testschemaapi] has occurred - updating... (live nodes size: [2])
   [junit4]   2> 857041 INFO  (zkCallback-1136-thread-1) [    ] o.a.s.c.c.ZkStateReader Updating data for [testschemaapi] from [1] to [2]
   [junit4]   2> 857041 INFO  (zkCallback-1135-thread-1) [    ] o.a.s.c.c.ZkStateReader Updating data for [testschemaapi] from [1] to [2]
   [junit4]   2> 857090 INFO  (qtp30508440-7216) [    ] o.a.s.c.ZkController We are http://127.0.0.1:44912/solr/testschemaapi_shard1_replica1/ and leader is http://127.0.0.1:44912/solr/testschemaapi_shard1_replica1/
   [junit4]   2> 857090 INFO  (qtp30508440-7216) [    ] o.a.s.c.ZkController No LogReplay needed for core=testschemaapi_shard1_replica1 baseURL=http://127.0.0.1:44912/solr
   [junit4]   2> 857090 INFO  (qtp30508440-7216) [    ] o.a.s.c.ZkController I am the leader, no recovery necessary
   [junit4]   2> 857090 INFO  (qtp30508440-7216) [    ] o.a.s.c.ZkController publishing state=active
   [junit4]   2> 857091 INFO  (OverseerStateUpdate-96102665765191685-127.0.0.1:42051_solr-n_0000000000) [    ] o.a.s.c.Overseer processMessage: queueSize: 1, message = {
   [junit4]   2>   "core":"testschemaapi_shard1_replica1",
   [junit4]   2>   "core_node_name":"core_node2",
   [junit4]   2>   "roles":null,
   [junit4]   2>   "base_url":"http://127.0.0.1:44912/solr",
   [junit4]   2>   "node_name":"127.0.0.1:44912_solr",
   [junit4]   2>   "numShards":"1",
   [junit4]   2>   "state":"active",
   [junit4]   2>   "shard":"shard1",
   [junit4]   2>   "collection":"testschemaapi",
   [junit4]   2>   "operation":"state"} current state version: 0
   [junit4]   2> 857091 INFO  (OverseerStateUpdate-96102665765191685-127.0.0.1:42051_solr-n_0000000000) [    ] o.a.s.c.o.ReplicaMutator Update state numShards=1 message={
   [junit4]   2>   "core":"testschemaapi_shard1_replica1",
   [junit4]   2>   "core_node_name":"core_node2",
   [junit4]   2>   "roles":null,
   [junit4]   2>   "base_url":"http://127.0.0.1:44912/solr",
   [junit4]   2>   "node_name":"127.0.0.1:44912_solr",
   [junit4]   2>   "numShards":"1",
   [junit4]   2>   "state":"active",
   [junit4]   2>   "shard":"shard1",
   [junit4]   2>   "collection":"testschemaapi",
   [junit4]   2>   "operation":"state"}
   [junit4]   2> 857091 INFO  (qtp30508440-7216) [    ] o.a.s.s.HttpSolrCall [admin] webapp=null path=/admin/cores params={qt=/admin/cores&collection.configName=conf1&name=testschemaapi_shard1_replica1&action=CREATE&numShards=1&collection=testschemaapi&shard=shard1&wt=javabin&version=2} status=0 QTime=1192
   [junit4]   2> 857192 INFO  (OverseerStateUpdate-96102665765191685-127.0.0.1:42051_solr-n_0000000000) [    ] o.a.s.c.o.ZkStateWriter going to update_collection /collections/testschemaapi/state.json version: 2
   [junit4]   2> 857192 INFO  (zkCallback-1135-thread-1) [    ] o.a.s.c.c.ZkStateReader A cluster state change: [WatchedEvent state:SyncConnected type:NodeDataChanged path:/collections/testschemaapi/state.json] for collection [testschemaapi] has occurred - updating... (live nodes size: [2])
   [junit4]   2> 857192 INFO  (zkCallback-1136-thread-1) [    ] o.a.s.c.c.ZkStateReader A cluster state change: [WatchedEvent state:SyncConnected type:NodeDataChanged path:/collections/testschemaapi/state.json] for collection [testschemaapi] has occurred - updating... (live nodes size: [2])
   [junit4]   2> 857192 INFO  (zkCallback-1135-thread-1) [    ] o.a.s.c.c.ZkStateReader Updating data for [testschemaapi] from [2] to [3]
   [junit4]   2> 857192 INFO  (zkCallback-1136-thread-1) [    ] o.a.s.c.c.ZkStateReader Updating data for [testschemaapi] from [2] to [3]
   [junit4]   2> 857937 INFO  (qtp3574889-7227) [    ] o.a.s.c.ZkController We are http://127.0.0.1:42051/solr/testschemaapi_shard1_replica2/ and leader is http://127.0.0.1:44912/solr/testschemaapi_shard1_replica1/
   [junit4]   2> 857937 INFO  (qtp3574889-7227) [    ] o.a.s.c.ZkController No LogReplay needed for core=testschemaapi_shard1_replica2 baseURL=http://127.0.0.1:42051/solr
   [junit4]   2> 857937 INFO  (qtp3574889-7227) [    ] o.a.s.c.ZkController Core needs to recover:testschemaapi_shard1_replica2
   [junit4]   2> 857937 INFO  (updateExecutor-1129-thread-1) [    ] o.a.s.u.DefaultSolrCoreState Running recovery
   [junit4]   2> 857937 INFO  (recoveryExecutor-1131-thread-1) [    ] o.a.s.c.RecoveryStrategy Starting recovery process. recoveringAfterStartup=true
   [junit4]   2> 857937 INFO  (recoveryExecutor-1131-thread-1) [    ] o.a.s.c.RecoveryStrategy ###### startupVersions=[[]]
   [junit4]   2> 857937 INFO  (recoveryExecutor-1131-thread-1) [    ] o.a.s.c.RecoveryStrategy Begin buffering updates. core=[testschemaapi_shard1_replica2]
   [junit4]   2> 857937 INFO  (recoveryExecutor-1131-thread-1) [    ] o.a.s.u.UpdateLog Starting to buffer updates. FSUpdateLog{state=ACTIVE, tlog=null}
   [junit4]   2> 857937 INFO  (recoveryExecutor-1131-thread-1) [    ] o.a.s.c.RecoveryStrategy Publishing state of core [testschemaapi_shard1_replica2] as recovering, leader is [http://127.0.0.1:44912/solr/testschemaapi_shard1_replica1/] and I am [http://127.0.0.1:42051/solr/testschemaapi_shard1_replica2/]
   [junit4]   2> 857938 INFO  (recoveryExecutor-1131-thread-1) [    ] o.a.s.c.ZkController publishing state=recovering
   [junit4]   2> 857938 INFO  (qtp3574889-7227) [    ] o.a.s.s.HttpSolrCall [admin] webapp=null path=/admin/cores params={qt=/admin/cores&collection.configName=conf1&name=testschemaapi_shard1_replica2&action=CREATE&numShards=1&collection=testschemaapi&shard=shard1&wt=javabin&version=2} status=0 QTime=2039
   [junit4]   2> 857938 INFO  (OverseerStateUpdate-96102665765191685-127.0.0.1:42051_solr-n_0000000000) [    ] o.a.s.c.Overseer processMessage: queueSize: 1, message = {
   [junit4]   2>   "core":"testschemaapi_shard1_replica2",
   [junit4]   2>   "core_node_name":"core_node1",
   [junit4]   2>   "roles":null,
   [junit4]   2>   "base_url":"http://127.0.0.1:42051/solr",
   [junit4]   2>   "node_name":"127.0.0.1:42051_solr",
   [junit4]   2>   "numShards":"1",
   [junit4]   2>   "state":"recovering",
   [junit4]   2>   "shard":"shard1",
   [junit4]   2>   "collection":"testschemaapi",
   [junit4]   2>   "operation":"state"} current state version: 0
   [junit4]   2> 857939 INFO  (OverseerStateUpdate-96102665765191685-127.0.0.1:42051_solr-n_0000000000) [    ] o.a.s.c.o.ReplicaMutator Update state numShards=1 message={
   [junit4]   2>   "core":"testschemaapi_shard1_replica2",
   [junit4]   2>   "core_node_name":"core_node1",
   [junit4]   2>   "roles":null,
   [junit4]   2>   "base_url":"http://127.0.0.1:42051/solr",
   [junit4]   2>   "node_name":"127.0.0.1:42051_solr",
   [junit4]   2>   "numShards":"1",
   [junit4]   2>   "state":"recovering",
   [junit4]   2>   "shard":"shard1",
   [junit4]   2>   "collection":"testschemaapi",
   [junit4]   2>   "operation":"state"}
   [junit4]   2> 857939 INFO  (zkCallback-1135-thread-2) [    ] o.a.s.c.OverseerTaskQueue NodeDataChanged fired on path /overseer/collection-queue-work/qnr-0000000000 state SyncConnected latchEventType null
   [junit4]   2> 857939 INFO  (OverseerThreadFactory-3248-thread-1) [    ] o.a.s.c.OverseerTaskProcessor Overseer Collection Message Handler: Message id:/overseer/collection-queue-work/qn-0000000000 complete, response:{success={127.0.0.1:44912_solr={responseHeader={status=0,QTime=1192},core=testschemaapi_shard1_replica1},127.0.0.1:42051_solr={responseHeader={status=0,QTime=2039},core=testschemaapi_shard1_replica2}}}
   [junit4]   2> 857939 INFO  (recoveryExecutor-1131-thread-1) [    ] o.a.s.c.RecoveryStrategy Sending prep recovery command to [http://127.0.0.1:44912/solr]; [WaitForState: action=PREPRECOVERY&core=testschemaapi_shard1_replica1&nodeName=127.0.0.1:42051_solr&coreNodeName=core_node1&state=recovering&checkLive=true&onlyIfLeader=true&onlyIfLeaderActive=true]
   [junit4]   2> 857940 INFO  (qtp3574889-7225) [    ] o.a.s.h.a.CollectionsHandler Wait for new collection to be active for at most 30 seconds. Check all shard replicas
   [junit4]   2> 857940 INFO  (qtp30508440-7218) [    ] o.a.s.h.a.CoreAdminOperation Going to wait for coreNodeName: core_node1, state: recovering, checkLive: true, onlyIfLeader: true, onlyIfLeaderActive: true
   [junit4]   2> 857940 INFO  (qtp30508440-7218) [    ] o.a.s.h.a.CoreAdminOperation Will wait a max of 183 seconds to see testschemaapi_shard1_replica1 (shard1 of testschemaapi) have state: recovering
   [junit4]   2> 857940 INFO  (qtp30508440-7218) [    ] o.a.s.h.a.CoreAdminOperation In WaitForState(recovering): collection=testschemaapi, shard=shard1, thisCore=testschemaapi_shard1_replica1, leaderDoesNotNeedRecovery=false, isLeader? true, live=true, checkLive=true, currentState=down, localState=active, nodeName=127.0.0.1:42051_solr, coreNodeName=core_node1, onlyIfActiveCheckResult=false, nodeProps: core_node1:{"core":"testschemaapi_shard1_replica2","base_url":"http://127.0.0.1:42051/solr","node_name":"127.0.0.1:42051_solr","state":"down"}
   [junit4]   2> 858040 INFO  (OverseerStateUpdate-96102665765191685-127.0.0.1:42051_solr-n_0000000000) [    ] o.a.s.c.o.ZkStateWriter going to update_collection /collections/testschemaapi/state.json version: 3
   [junit4]   2> 858040 INFO  (zkCallback-1135-thread-2) [    ] o.a.s.c.c.ZkStateReader A cluster state change: [WatchedEvent state:SyncConnected type:NodeDataChanged path:/collections/testschemaapi/state.json] for collection [testschemaapi] has occurred - updating... (live nodes size: [2])
   [junit4]   2> 858040 INFO  (zkCallback-1136-thread-1) [    ] o.a.s.c.c.ZkStateReader A cluster state change: [WatchedEvent state:SyncConnected type:NodeDataChanged path:/collections/testschemaapi/state.json] for collection [testschemaapi] has occurred - updating... (live nodes size: [2])
   [junit4]   2> 858040 INFO  (zkCallback-1135-thread-2) [    ] o.a.s.c.c.ZkStateReader Updating data for [testschemaapi] from [3] to [4]
   [junit4]   2> 858041 INFO  (zkCallback-1136-thread-1) [    ] o.a.s.c.c.ZkStateReader Updating data for [testschemaapi] from [3] to [4]
   [junit4]   2> 858940 INFO  (qtp30508440-7218) [    ] o.a.s.h.a.CoreAdminOperation In WaitForState(recovering): collection=testschemaapi, shard=shard1, thisCore=testschemaapi_shard1_replica1, leaderDoesNotNeedRecovery=false, isLeader? true, live=true, checkLive=true, currentState=recovering, localState=active, nodeName=127.0.0.1:42051_solr, coreNodeName=core_node1, onlyIfActiveCheckResult=false, nodeProps: core_node1:{"core":"testschemaapi_shard1_replica2","base_url":"http://127.0.0.1:42051/solr","node_name":"127.0.0.1:42051_solr","state":"recovering"}
   [junit4]   2> 858940 INFO  (qtp30508440-7218) [    ] o.a.s.h.a.CoreAdminOperation Waited coreNodeName: core_node1, state: recovering, checkLive: true, onlyIfLeader: true for: 1 seconds.
   [junit4]   2> 858940 INFO  (qtp30508440-7218) [    ] o.a.s.s.HttpSolrCall [admin] webapp=null path=/admin/cores params={nodeName=127.0.0.1:42051_solr&onlyIfLeaderActive=true&core=testschemaapi_shard1_replica1&coreNodeName=core_node1&action=PREPRECOVERY&checkLive=true&state=recovering&onlyIfLeader=true&wt=javabin&version=2} status=0 QTime=1000
   [junit4]   2> 859796 INFO  (OverseerCollectionConfigSetProcessor-96102665765191685-127.0.0.1:42051_solr-n_0000000000) [    ] o.a.s.c.OverseerTaskQueue Response ZK path: /overseer/collection-queue-work/qnr-0000000000 doesn't exist.  Requestor may have disconnected from ZooKeeper
   [junit4]   2> 865941 INFO  (recoveryExecutor-1131-thread-1) [    ] o.a.s.c.RecoveryStrategy Attempting to PeerSync from [http://127.0.0.1:44912/solr/testschemaapi_shard1_replica1/] - recoveringAfterStartup=[true]
   [junit4]   2> 865941 INFO  (recoveryExecutor-1131-thread-1) [    ] o.a.s.u.PeerSync PeerSync: core=testschemaapi_shard1_replica2 url=http://127.0.0.1:42051/solr START replicas=[http://127.0.0.1:44912/solr/testschemaapi_shard1_replica1/] nUpdates=100
   [junit4]   2> 865941 WARN  (recoveryExecutor-1131-thread-1) [    ] o.a.s.u.PeerSync no frame of reference to tell if we've missed updates
   [junit4]   2> 865941 INFO  (recoveryExecutor-1131-thread-1) [    ] o.a.s.c.RecoveryStrategy PeerSync Recovery was not successful - trying replication.
   [junit4]   2> 865941 INFO  (recoveryExecutor-1131-thread-1) [    ] o.a.s.c.RecoveryStrategy Starting Replication Recovery.
   [junit4]   2> 865941 INFO  (recoveryExecutor-1131-thread-1) [    ] o.a.s.c.RecoveryStrategy Attempting to replicate from [http://127.0.0.1:44912/solr/testschemaapi_shard1_replica1/].
   [junit4]   2> 865943 INFO  (qtp30508440-7218) [    ] o.a.s.u.IndexFingerprint IndexFingerprint millis:0.0 result:{maxVersionSpecified=9223372036854775807, maxVersionEncountered=0, maxInHash=0, versionsHash=0, numVersions=0, numDocs=0, maxDoc=0}
   [junit4]   2> 865943 INFO  (qtp30508440-7218) [    ] o.a.s.c.S.Request [testschemaapi_shard1_replica1]  webapp=/solr path=/get params={distrib=false&qt=/get&fingerprint=true&getVersions=100&wt=javabin&version=2} status=0 QTime=0
   [junit4]   2> 865943 INFO  (qtp30508440-7212) [    ] o.a.s.u.DirectUpdateHandler2 start commit{,optimize=false,openSearcher=false,waitSearcher=true,expungeDeletes=false,softCommit=false,prepareCommit=false}
   [junit4]   2> 865943 INFO  (qtp30508440-7212) [    ] o.a.s.u.DirectUpdateHandler2 No uncommitted changes. Skipping IW.commit.
   [junit4]   2> 865943 INFO  (qtp30508440-7212) [    ] o.a.s.u.DirectUpdateHandler2 end_commit_flush
   [junit4]   2> 865944 INFO  (qtp30508440-7212) [    ] o.a.s.u.p.LogUpdateProcessorFactory [testschemaapi_shard1_replica1]  webapp=/solr path=/update params={waitSearcher=true&openSearcher=false&commit=true&softCommit=false&commit_end_point=true&wt=javabin&version=2}{commit=} 0 0
   [junit4]   2> 865944 INFO  (qtp30508440-7211) [    ] o.a.s.c.S.Request [testschemaapi_shard1_replica1]  webapp=/solr path=/replication params={qt=/replication&wt=javabin&version=2&command=indexversion} status=0 QTime=0
   [junit4]   2> 865945 INFO  (recoveryExecutor-1131-thread-1) [    ] o.a.s.c.RecoveryStrategy No replay needed.
   [junit4]   2> 865945 INFO  (recoveryExecutor-1131-thread-1) [    ] o.a.s.c.RecoveryStrategy Replication Recovery was successful.
   [junit4]   2> 865945 INFO  (recoveryExecutor-1131-thread-1) [    ] o.a.s.c.RecoveryStrategy Registering as Active after recovery.
   [junit4]   2> 865945 INFO  (recoveryExecutor-1131-thread-1) [    ] o.a.s.c.ZkController publishing state=active
   [junit4]   2> 865946 INFO  (recoveryExecutor-1131-thread-1) [    ] o.a.s.c.RecoveryStrategy Updating version bucket highest from index after successful recovery.
   [junit4]   2> 865946 INFO  (recoveryExecutor-1131-thread-1) [    ] o.a.s.u.UpdateLog Looking up max value of version field to seed version buckets
   [junit4]   2> 865946 INFO  (recoveryExecutor-1131-thread-1) [    ] o.a.s.u.VersionInfo Refreshing highest value of _version_ for 65536 version buckets from index
   [junit4]   2> 865946 INFO  (recoveryExecutor-1131-thread-1) [    ] o.a.s.u.VersionInfo No terms found for _version_, cannot seed version bucket highest value from index
   [junit4]   2> 865946 INFO  (recoveryExecutor-1131-thread-1) [    ] o.a.s.u.UpdateLog Could not find max version in index or recent updates, using new clock 1537642664119238656
   [junit4]   2> 865946 INFO  (OverseerStateUpdate-96102665765191685-127.0.0.1:42051_solr-n_0000000000) [    ] o.a.s.c.Overseer processMessage: queueSize: 1, message = {
   [junit4]   2>   "core":"testschemaapi_shard1_replica2",
   [junit4]   2>   "core_node_name":"core_node1",
   [junit4]   2>   "roles":null,
   [junit4]   2>   "base_url":"http://127.0.0.1:42051/solr",
   [junit4]   2>   "node_name":"127.0.0.1:42051_solr",
   [junit4]   2>   "numShards":"1",
   [junit4]   2>   "state":"active",
   [junit4]   2>   "shard":"shard1",
   [junit4]   2>   "collection":"testschemaapi",
   [junit4]   2>   "operation":"state"} current state version: 0
   [junit4]   2> 865946 INFO  (OverseerStateUpdate-96102665765191685-127.0.0.1:42051_solr-n_0000000000) [    ] o.a.s.c.o.ReplicaMutator Update state numShards=1 message={
   [junit4]   2>   "core":"testschemaapi_shard1_replica2",
   [junit4]   2>   "core_node_name":"core_node1",
   [junit4]   2>   "roles":null,
   [junit4]   2>   "base_url":"http://127.0.0.1:42051/solr",
   [junit4]   2>   "node_name":"127.0.0.1:42051_solr",
   [junit4]   2>   "numShards":"1",
   [junit4]   2>   "state":"active",
   [junit4]   2>   "shard":"shard1",
   [junit4]   2>   "collection":"testschemaapi",
   [junit4]   2>   "operation":"state"}
   [junit4]   2> 865946 INFO  (OverseerStateUpdate-96102665765191685-127.0.0.1:42051_solr-n_0000000000) [    ] o.a.s.c.o.ZkStateWriter going to update_collection /collections/testschemaapi/state.json version: 4
   [junit4]   2> 865946 INFO  (zkCallback-1135-thread-1) [    ] o.a.s.c.c.ZkStateReader A cluster state change: [WatchedEvent state:SyncConnected type:NodeDataChanged path:/collections/testschemaapi/state.json] for collection [testschemaapi] has occurred - updating... (live nodes size: [2])
   [junit4]   2> 865947 INFO  (zkCallback-1136-thread-1) [    ] o.a.s.c.c.ZkStateReader A cluster state change: [WatchedEvent state:SyncConnected type:NodeDataChanged path:/collections/testschemaapi/state.json] for collection [testschemaapi] has occurred - updating... (live nodes size: [2])
   [junit4]   2> 865947 INFO  (zkCallback-1135-thread-1) [    ] o.a.s.c.c.ZkStateReader Updating data for [testschemaapi] from [4] to [5]
   [junit4]   2> 865947 INFO  (zkCallback-1136-thread-1) [    ] o.a.s.c.c.ZkStateReader Updating data for [testschemaapi] from [4] to [5]
   [junit4]   2> 865947 INFO  (recoveryExecutor-1131-thread-1) [    ] o.a.s.u.UpdateLog Took 1.0ms to seed version buckets with highest version 1537642664119238656
   [junit4]   2> 865947 INFO  (recoveryExecutor-1131-thread-1) [    ] o.a.s.c.RecoveryStrategy Finished recovery process, successful=[true]
   [junit4]   2> 866941 INFO  (qtp3574889-7225) [    ] o.a.s.s.HttpSolrCall [admin] webapp=null path=/admin/collections params={replicationFactor=2&collection.configName=conf1&name=testschemaapi&action=CREATE&numShards=1&wt=javabin&version=2} status=0 QTime=11147
   [junit4]   2> 866954 INFO  (qtp3574889-7226) [    ] o.a.s.s.SchemaManager managed schema loaded . version : 0 
   [junit4]   2> 866956 INFO  (qtp3574889-7226) [    ] o.a.s.s.IndexSchema [testschemaapi_shard1_replica2] Schema name=minimal
   [junit4]   2> 866957 INFO  (qtp3574889-7226) [    ] o.a.s.s.IndexSchema unique key field: id
   [junit4]   2> 866958 INFO  (zkCallback-1135-thread-1) [    ] o.a.s.s.ZkIndexSchemaReader A schema change: WatchedEvent state:SyncConnected type:NodeDataChanged path:/configs/conf1/managed-schema, has occurred - updating schema from ZooKeeper ...
   [junit4]   2> 866958 INFO  (zkCallback-1136-thread-1) [    ] o.a.s.s.ZkIndexSchemaReader A schema change: WatchedEvent state:SyncConnected type:NodeDataChanged path:/configs/conf1/managed-schema, has occurred - updating schema from ZooKeeper ...
   [junit4]   2> 866958 INFO  (qtp3574889-7226) [    ] o.a.s.c.ZkController Persisted config data to node /configs/conf1/managed-schema 
   [junit4]   2> 866958 INFO  (zkCallback-1136-thread-1) [    ] o.a.s.s.ZkIndexSchemaReader Retrieved schema version 1 from ZooKeeper
   [junit4]   2> 866958 INFO  (qtp3574889-7226) [    ] o.a.s.s.ManagedIndexSchema Wa

[...truncated too long message...]

oud.LeaderElector$ElectionWatcher.process(LeaderElector.java:348)
   [junit4]   2> 	at org.apache.solr.common.cloud.SolrZkClient$3.lambda$process$0(SolrZkClient.java:265)
   [junit4]   2> 	at java.util.concurrent.Executors$RunnableAdapter.call(java.base@9-ea/Executors.java:514)
   [junit4]   2> 	at java.util.concurrent.FutureTask.run(java.base@9-ea/FutureTask.java:266)
   [junit4]   2> 	at org.apache.solr.common.util.ExecutorUtil$MDCAwareThreadPoolExecutor.lambda$execute$0(ExecutorUtil.java:229)
   [junit4]   2> 	at java.util.concurrent.ThreadPoolExecutor.runWorker(java.base@9-ea/ThreadPoolExecutor.java:1158)
   [junit4]   2> 	at java.util.concurrent.ThreadPoolExecutor$Worker.run(java.base@9-ea/ThreadPoolExecutor.java:632)
   [junit4]   2> 	at java.lang.Thread.run(java.base@9-ea/Thread.java:843)
   [junit4]   2> 868607 WARN  (zkCallback-1136-thread-1) [    ] o.a.s.c.c.ZkStateReader ZooKeeper watch triggered, but Solr cannot talk to ZK: [KeeperErrorCode = Session expired for /live_nodes]
   [junit4]   2> 868607 WARN  (zkCallback-1135-thread-4) [    ] o.a.s.c.c.ZkStateReader ZooKeeper watch triggered, but Solr cannot talk to ZK: [KeeperErrorCode = Session expired for /live_nodes]
   [junit4]   2> 868607 INFO  (jetty-launcher-1125-thread-2) [    ] o.e.j.s.h.ContextHandler Stopped o.e.j.s.ServletContextHandler@99ae21{/solr,null,UNAVAILABLE}
   [junit4]   2> 868607 INFO  (jetty-launcher-1125-thread-1) [    ] o.e.j.s.h.ContextHandler Stopped o.e.j.s.ServletContextHandler@16728a4{/solr,null,UNAVAILABLE}
   [junit4]   2> 868608 INFO  (SUITE-TestManagedSchemaAPI-seed#[11E92BFFE2F136D4]-worker) [    ] o.a.s.c.ZkTestServer connecting to 127.0.0.1:38158 38158
   [junit4]   2> 873627 INFO  (Thread-2228) [    ] o.a.s.c.ZkTestServer connecting to 127.0.0.1:38158 38158
   [junit4]   2> 873627 WARN  (Thread-2228) [    ] o.a.s.c.ZkTestServer Watch limit violations: 
   [junit4]   2> Maximum concurrent create/delete watches above limit:
   [junit4]   2> 
   [junit4]   2> 	6	/solr/configs/conf1/managed-schema
   [junit4]   2> 	6	/solr/configs/conf1
   [junit4]   2> 	3	/solr/aliases.json
   [junit4]   2> 	3	/solr/clusterprops.json
   [junit4]   2> 	2	/solr/security.json
   [junit4]   2> 
   [junit4]   2> Maximum concurrent data watches above limit:
   [junit4]   2> 
   [junit4]   2> 	3	/solr/clusterstate.json
   [junit4]   2> 	2	/solr/collections/testschemaapi/state.json
   [junit4]   2> 
   [junit4]   2> Maximum concurrent children watches above limit:
   [junit4]   2> 
   [junit4]   2> 	9	/solr/overseer/collection-queue-work
   [junit4]   2> 	8	/solr/overseer/queue
   [junit4]   2> 	4	/solr/overseer/queue-work
   [junit4]   2> 	3	/solr/live_nodes
   [junit4]   2> 	3	/solr/collections
   [junit4]   2> 
   [junit4]   2> 873627 INFO  (SUITE-TestManagedSchemaAPI-seed#[11E92BFFE2F136D4]-worker) [    ] o.a.s.SolrTestCaseJ4 ###deleteCore
   [junit4]   2> NOTE: leaving temporary files on disk at: /home/jenkins/workspace/Lucene-Solr-master-Linux/solr/build/solr-core/test/J0/temp/solr.schema.TestManagedSchemaAPI_11E92BFFE2F136D4-001
   [junit4]   2> Jun 20, 2016 8:12:04 AM com.carrotsearch.randomizedtesting.ThreadLeakControl checkThreadLeaks
   [junit4]   2> WARNING: Will linger awaiting termination of 1 leaked thread(s).
   [junit4]   2> 877110 WARN  (Thread-2264) [    ] o.a.s.c.ZkController listener throws error
   [junit4]   2> org.apache.solr.common.SolrException: Unable to reload core [testschemaapi_shard1_replica2]
   [junit4]   2> 	at org.apache.solr.core.CoreContainer.reload(CoreContainer.java:943)
   [junit4]   2> 	at org.apache.solr.core.SolrCore.lambda$getConfListener$6(SolrCore.java:2509)
   [junit4]   2> 	at org.apache.solr.cloud.ZkController$4.run(ZkController.java:2405)
   [junit4]   2> Caused by: org.apache.solr.common.SolrException: Could not load conf for core testschemaapi_shard1_replica2: Unable to load reader for ConfigSet properties: configsetprops.json
   [junit4]   2> 	at org.apache.solr.core.ConfigSetService.getConfig(ConfigSetService.java:85)
   [junit4]   2> 	at org.apache.solr.core.CoreContainer.reload(CoreContainer.java:935)
   [junit4]   2> 	... 2 more
   [junit4]   2> Caused by: org.apache.solr.common.SolrException: Unable to load reader for ConfigSet properties: configsetprops.json
   [junit4]   2> 	at org.apache.solr.core.ConfigSetProperties.readFromResourceLoader(ConfigSetProperties.java:57)
   [junit4]   2> 	at org.apache.solr.core.ConfigSetService.createConfigSetProperties(ConfigSetService.java:117)
   [junit4]   2> 	at org.apache.solr.core.ConfigSetService.getConfig(ConfigSetService.java:79)
   [junit4]   2> 	... 3 more
   [junit4]   2> Caused by: java.io.IOException: We re-tried 10 times but was still unable to fetch resource=configsetprops.json from ZK
   [junit4]   2> 	at org.apache.solr.cloud.ZkSolrResourceLoader.openResource(ZkSolrResourceLoader.java:116)
   [junit4]   2> 	at org.apache.solr.core.ConfigSetProperties.readFromResourceLoader(ConfigSetProperties.java:52)
   [junit4]   2> 	... 5 more
   [junit4]   2> Caused by: org.apache.zookeeper.KeeperException$SessionExpiredException: KeeperErrorCode = Session expired for /configs/conf1/configsetprops.json
   [junit4]   2> 	at org.apache.zookeeper.KeeperException.create(KeeperException.java:127)
   [junit4]   2> 	at org.apache.zookeeper.KeeperException.create(KeeperException.java:51)
   [junit4]   2> 	at org.apache.zookeeper.ZooKeeper.exists(ZooKeeper.java:1045)
   [junit4]   2> 	at org.apache.solr.common.cloud.SolrZkClient$5.execute(SolrZkClient.java:313)
   [junit4]   2> 	at org.apache.solr.common.cloud.SolrZkClient$5.execute(SolrZkClient.java:310)
   [junit4]   2> 	at org.apache.solr.common.cloud.ZkCmdExecutor.retryOperation(ZkCmdExecutor.java:60)
   [junit4]   2> 	at org.apache.solr.common.cloud.SolrZkClient.exists(SolrZkClient.java:310)
   [junit4]   2> 	at org.apache.solr.cloud.ZkController.pathExists(ZkController.java:793)
   [junit4]   2> 	at org.apache.solr.cloud.ZkSolrResourceLoader.openResource(ZkSolrResourceLoader.java:89)
   [junit4]   2> 	... 6 more
   [junit4]   2> NOTE: test params are: codec=Asserting(Lucene62): {_version_=PostingsFormat(name=Memory doPackFST= false), id=PostingsFormat(name=LuceneFixedGap), myNewField=BlockTreeOrds(blocksize=128)}, docValues:{}, maxPointsInLeafNode=225, maxMBSortInHeap=7.159556681499619, sim=RandomSimilarity(queryNorm=false,coord=no): {}, locale=dz-BT, timezone=America/Argentina/Jujuy
   [junit4]   2> NOTE: Linux 4.4.0-24-generic i386/Oracle Corporation 9-ea (32-bit)/cpus=12,threads=1,free=245812256,total=464519168
   [junit4]   2> NOTE: All tests run in this JVM: [TestNRTOpen, URLClassifyProcessorTest, HdfsUnloadDistributedZkTest, QueryResultKeyTest, TestArbitraryIndexDir, SolrCoreTest, TestFoldingMultitermQuery, SmileWriterTest, TestCSVLoader, TestStressUserVersions, DeleteLastCustomShardedReplicaTest, TestAnalyzedSuggestions, CdcrReplicationDistributedZkTest, TestMiniSolrCloudClusterSSL, CursorPagingTest, TestConfig, TestMiniSolrCloudCluster, ExternalFileFieldSortTest, DefaultValueUpdateProcessorTest, TestBulkSchemaConcurrent, AnalysisAfterCoreReloadTest, DistributedFacetPivotLongTailTest, TestSolr4Spatial, QueryElevationComponentTest, TestReplicationHandlerBackup, TlogReplayBufferedWhileIndexingTest, SharedFSAutoReplicaFailoverTest, DeleteStatusTest, TestDefaultSearchFieldResource, AlternateDirectoryTest, LeaderElectionIntegrationTest, BufferStoreTest, TestCrossCoreJoin, TestRangeQuery, TestIBSimilarityFactory, DistribJoinFromCollectionTest, AsyncCallRequestStatusResponseTest, TestConfigSetsAPIExclusivity, TestJoin, ActionThrottleTest, SolrRequestParserTest, CreateCollectionCleanupTest, StandardRequestHandlerTest, CloudMLTQParserTest, TestPKIAuthenticationPlugin, PathHierarchyTokenizerFactoryTest, BlockJoinFacetRandomTest, TestDocTermOrds, JavabinLoaderTest, DistributedDebugComponentTest, TestAtomicUpdateErrorCases, DocumentAnalysisRequestHandlerTest, TestOmitPositions, TestLRUCache, IndexSchemaRuntimeFieldTest, CoreAdminCreateDiscoverTest, DataDrivenBlockJoinTest, BasicAuthIntegrationTest, LeaderInitiatedRecoveryOnCommitTest, TestLMDirichletSimilarityFactory, ForceLeaderTest, SyncSliceTest, TestFieldCollectionResource, TestSolr4Spatial2, UUIDFieldTest, QueryEqualityTest, SignatureUpdateProcessorFactoryTest, TestCollapseQParserPlugin, SystemInfoHandlerTest, TestMergePolicyConfig, ResourceLoaderTest, TestValueSourceCache, OverseerTaskQueueTest, TestDFISimilarityFactory, TestSolrQueryResponse, TestCloudBackupRestore, RequestLoggingTest, TestLazyCores, DisMaxRequestHandlerTest, TestSubQueryTransformer, MultiThreadedOCPTest, TestHighlightDedupGrouping, TestManagedSchemaAPI]
   [junit4] Completed [233/614 (1!)] on J0 in 22.53s, 1 test, 1 error <<< FAILURES!

[...truncated 1206 lines...]
BUILD FAILED
/home/jenkins/workspace/Lucene-Solr-master-Linux/build.xml:740: The following error occurred while executing this line:
/home/jenkins/workspace/Lucene-Solr-master-Linux/build.xml:684: The following error occurred while executing this line:
/home/jenkins/workspace/Lucene-Solr-master-Linux/build.xml:59: The following error occurred while executing this line:
/home/jenkins/workspace/Lucene-Solr-master-Linux/solr/build.xml:233: The following error occurred while executing this line:
/home/jenkins/workspace/Lucene-Solr-master-Linux/solr/common-build.xml:530: The following error occurred while executing this line:
/home/jenkins/workspace/Lucene-Solr-master-Linux/lucene/common-build.xml:1427: The following error occurred while executing this line:
/home/jenkins/workspace/Lucene-Solr-master-Linux/lucene/common-build.xml:984: There were test failures: 614 suites (10 ignored), 2584 tests, 1 error, 118 ignored (72 assumptions) [seed: 11E92BFFE2F136D4]

Total time: 60 minutes 42 seconds
Build step 'Invoke Ant' marked build as failure
Archiving artifacts
[WARNINGS] Skipping publisher since build result is FAILURE
Recording test results
Email was triggered for: Failure - Any
Sending email for trigger: Failure - Any



Mime
View raw message