lucene-dev mailing list archives

Site index · List index
Message view « Date » · « Thread »
Top « Date » · « Thread »
From Apache Jenkins Server <jenk...@builds.apache.org>
Subject [JENKINS] Lucene-Solr-NightlyTests-master - Build # 1043 - Still Failing
Date Thu, 16 Jun 2016 09:09:14 GMT
Build: https://builds.apache.org/job/Lucene-Solr-NightlyTests-master/1043/

5 tests failed.
FAILED:  org.apache.solr.cloud.hdfs.HdfsCollectionsAPIDistributedZkTest.test

Error Message:
Timeout occured while waiting response from server at: http://127.0.0.1:44424

Stack Trace:
org.apache.solr.client.solrj.SolrServerException: Timeout occured while waiting response from server at: http://127.0.0.1:44424
	at org.apache.solr.client.solrj.impl.HttpSolrClient.executeMethod(HttpSolrClient.java:617)
	at org.apache.solr.client.solrj.impl.HttpSolrClient.request(HttpSolrClient.java:259)
	at org.apache.solr.client.solrj.impl.HttpSolrClient.request(HttpSolrClient.java:248)
	at org.apache.solr.client.solrj.SolrClient.request(SolrClient.java:1219)
	at org.apache.solr.cloud.CollectionsAPIDistributedZkTest.makeRequest(CollectionsAPIDistributedZkTest.java:400)
	at org.apache.solr.cloud.CollectionsAPIDistributedZkTest.testErrorHandling(CollectionsAPIDistributedZkTest.java:458)
	at org.apache.solr.cloud.CollectionsAPIDistributedZkTest.test(CollectionsAPIDistributedZkTest.java:180)
	at sun.reflect.NativeMethodAccessorImpl.invoke0(Native Method)
	at sun.reflect.NativeMethodAccessorImpl.invoke(NativeMethodAccessorImpl.java:62)
	at sun.reflect.DelegatingMethodAccessorImpl.invoke(DelegatingMethodAccessorImpl.java:43)
	at java.lang.reflect.Method.invoke(Method.java:498)
	at com.carrotsearch.randomizedtesting.RandomizedRunner.invoke(RandomizedRunner.java:1764)
	at com.carrotsearch.randomizedtesting.RandomizedRunner$8.evaluate(RandomizedRunner.java:871)
	at com.carrotsearch.randomizedtesting.RandomizedRunner$9.evaluate(RandomizedRunner.java:907)
	at com.carrotsearch.randomizedtesting.RandomizedRunner$10.evaluate(RandomizedRunner.java:921)
	at org.apache.solr.BaseDistributedSearchTestCase$ShardsRepeatRule$ShardsFixedStatement.callStatement(BaseDistributedSearchTestCase.java:985)
	at org.apache.solr.BaseDistributedSearchTestCase$ShardsRepeatRule$ShardsStatement.evaluate(BaseDistributedSearchTestCase.java:960)
	at com.carrotsearch.randomizedtesting.rules.SystemPropertiesRestoreRule$1.evaluate(SystemPropertiesRestoreRule.java:57)
	at org.apache.lucene.util.TestRuleSetupTeardownChained$1.evaluate(TestRuleSetupTeardownChained.java:49)
	at org.apache.lucene.util.AbstractBeforeAfterRule$1.evaluate(AbstractBeforeAfterRule.java:45)
	at org.apache.lucene.util.TestRuleThreadAndTestName$1.evaluate(TestRuleThreadAndTestName.java:48)
	at org.apache.lucene.util.TestRuleIgnoreAfterMaxFailures$1.evaluate(TestRuleIgnoreAfterMaxFailures.java:64)
	at org.apache.lucene.util.TestRuleMarkFailure$1.evaluate(TestRuleMarkFailure.java:47)
	at com.carrotsearch.randomizedtesting.rules.StatementAdapter.evaluate(StatementAdapter.java:36)
	at com.carrotsearch.randomizedtesting.ThreadLeakControl$StatementRunner.run(ThreadLeakControl.java:367)
	at com.carrotsearch.randomizedtesting.ThreadLeakControl.forkTimeoutingTask(ThreadLeakControl.java:809)
	at com.carrotsearch.randomizedtesting.ThreadLeakControl$3.evaluate(ThreadLeakControl.java:460)
	at com.carrotsearch.randomizedtesting.RandomizedRunner.runSingleTest(RandomizedRunner.java:880)
	at com.carrotsearch.randomizedtesting.RandomizedRunner$5.evaluate(RandomizedRunner.java:781)
	at com.carrotsearch.randomizedtesting.RandomizedRunner$6.evaluate(RandomizedRunner.java:816)
	at com.carrotsearch.randomizedtesting.RandomizedRunner$7.evaluate(RandomizedRunner.java:827)
	at com.carrotsearch.randomizedtesting.rules.StatementAdapter.evaluate(StatementAdapter.java:36)
	at com.carrotsearch.randomizedtesting.rules.SystemPropertiesRestoreRule$1.evaluate(SystemPropertiesRestoreRule.java:57)
	at org.apache.lucene.util.AbstractBeforeAfterRule$1.evaluate(AbstractBeforeAfterRule.java:45)
	at com.carrotsearch.randomizedtesting.rules.StatementAdapter.evaluate(StatementAdapter.java:36)
	at org.apache.lucene.util.TestRuleStoreClassName$1.evaluate(TestRuleStoreClassName.java:41)
	at com.carrotsearch.randomizedtesting.rules.NoShadowingOrOverridesOnMethodsRule$1.evaluate(NoShadowingOrOverridesOnMethodsRule.java:40)
	at com.carrotsearch.randomizedtesting.rules.NoShadowingOrOverridesOnMethodsRule$1.evaluate(NoShadowingOrOverridesOnMethodsRule.java:40)
	at com.carrotsearch.randomizedtesting.rules.StatementAdapter.evaluate(StatementAdapter.java:36)
	at com.carrotsearch.randomizedtesting.rules.StatementAdapter.evaluate(StatementAdapter.java:36)
	at com.carrotsearch.randomizedtesting.rules.StatementAdapter.evaluate(StatementAdapter.java:36)
	at org.apache.lucene.util.TestRuleAssertionsRequired$1.evaluate(TestRuleAssertionsRequired.java:53)
	at org.apache.lucene.util.TestRuleMarkFailure$1.evaluate(TestRuleMarkFailure.java:47)
	at org.apache.lucene.util.TestRuleIgnoreAfterMaxFailures$1.evaluate(TestRuleIgnoreAfterMaxFailures.java:64)
	at org.apache.lucene.util.TestRuleIgnoreTestSuites$1.evaluate(TestRuleIgnoreTestSuites.java:54)
	at com.carrotsearch.randomizedtesting.rules.StatementAdapter.evaluate(StatementAdapter.java:36)
	at com.carrotsearch.randomizedtesting.ThreadLeakControl$StatementRunner.run(ThreadLeakControl.java:367)
	at java.lang.Thread.run(Thread.java:745)
Caused by: java.net.SocketTimeoutException: Read timed out
	at java.net.SocketInputStream.socketRead0(Native Method)
	at java.net.SocketInputStream.socketRead(SocketInputStream.java:116)
	at java.net.SocketInputStream.read(SocketInputStream.java:170)
	at java.net.SocketInputStream.read(SocketInputStream.java:141)
	at org.apache.http.impl.io.SessionInputBufferImpl.streamRead(SessionInputBufferImpl.java:139)
	at org.apache.http.impl.io.SessionInputBufferImpl.fillBuffer(SessionInputBufferImpl.java:155)
	at org.apache.http.impl.io.SessionInputBufferImpl.readLine(SessionInputBufferImpl.java:284)
	at org.apache.http.impl.conn.DefaultHttpResponseParser.parseHead(DefaultHttpResponseParser.java:140)
	at org.apache.http.impl.conn.DefaultHttpResponseParser.parseHead(DefaultHttpResponseParser.java:57)
	at org.apache.http.impl.io.AbstractMessageParser.parse(AbstractMessageParser.java:261)
	at org.apache.http.impl.DefaultBHttpClientConnection.receiveResponseHeader(DefaultBHttpClientConnection.java:165)
	at org.apache.http.impl.conn.CPoolProxy.receiveResponseHeader(CPoolProxy.java:167)
	at org.apache.http.protocol.HttpRequestExecutor.doReceiveResponse(HttpRequestExecutor.java:272)
	at org.apache.http.protocol.HttpRequestExecutor.execute(HttpRequestExecutor.java:124)
	at org.apache.http.impl.execchain.MainClientExec.execute(MainClientExec.java:271)
	at org.apache.http.impl.execchain.ProtocolExec.execute(ProtocolExec.java:184)
	at org.apache.http.impl.execchain.RetryExec.execute(RetryExec.java:88)
	at org.apache.http.impl.execchain.RedirectExec.execute(RedirectExec.java:110)
	at org.apache.http.impl.client.InternalHttpClient.doExecute(InternalHttpClient.java:184)
	at org.apache.http.impl.client.CloseableHttpClient.execute(CloseableHttpClient.java:82)
	at org.apache.http.impl.client.CloseableHttpClient.execute(CloseableHttpClient.java:55)
	at org.apache.solr.client.solrj.impl.HttpSolrClient.executeMethod(HttpSolrClient.java:511)
	... 47 more


FAILED:  org.apache.solr.cloud.hdfs.HdfsRestartWhileUpdatingTest.test

Error Message:
Captured an uncaught exception in thread: Thread[id=35022, name=StoppableIndexingThread, state=RUNNABLE, group=TGRP-HdfsRestartWhileUpdatingTest]

Stack Trace:
com.carrotsearch.randomizedtesting.UncaughtExceptionError: Captured an uncaught exception in thread: Thread[id=35022, name=StoppableIndexingThread, state=RUNNABLE, group=TGRP-HdfsRestartWhileUpdatingTest]
Caused by: java.lang.OutOfMemoryError: GC overhead limit exceeded


FAILED:  junit.framework.TestSuite.org.apache.solr.core.TestLazyCores

Error Message:
ObjectTracker found 4 object(s) that were not released!!! [MDCAwareThreadPoolExecutor, MockDirectoryWrapper, MockDirectoryWrapper, SolrCore]

Stack Trace:
java.lang.AssertionError: ObjectTracker found 4 object(s) that were not released!!! [MDCAwareThreadPoolExecutor, MockDirectoryWrapper, MockDirectoryWrapper, SolrCore]
	at __randomizedtesting.SeedInfo.seed([9F2407C2F73BD43]:0)
	at org.junit.Assert.fail(Assert.java:93)
	at org.junit.Assert.assertTrue(Assert.java:43)
	at org.junit.Assert.assertNull(Assert.java:551)
	at org.apache.solr.SolrTestCaseJ4.teardownTestCases(SolrTestCaseJ4.java:256)
	at sun.reflect.NativeMethodAccessorImpl.invoke0(Native Method)
	at sun.reflect.NativeMethodAccessorImpl.invoke(NativeMethodAccessorImpl.java:62)
	at sun.reflect.DelegatingMethodAccessorImpl.invoke(DelegatingMethodAccessorImpl.java:43)
	at java.lang.reflect.Method.invoke(Method.java:498)
	at com.carrotsearch.randomizedtesting.RandomizedRunner.invoke(RandomizedRunner.java:1764)
	at com.carrotsearch.randomizedtesting.RandomizedRunner$7.evaluate(RandomizedRunner.java:834)
	at com.carrotsearch.randomizedtesting.rules.StatementAdapter.evaluate(StatementAdapter.java:36)
	at com.carrotsearch.randomizedtesting.rules.SystemPropertiesRestoreRule$1.evaluate(SystemPropertiesRestoreRule.java:57)
	at org.apache.lucene.util.AbstractBeforeAfterRule$1.evaluate(AbstractBeforeAfterRule.java:45)
	at com.carrotsearch.randomizedtesting.rules.StatementAdapter.evaluate(StatementAdapter.java:36)
	at org.apache.lucene.util.TestRuleStoreClassName$1.evaluate(TestRuleStoreClassName.java:41)
	at com.carrotsearch.randomizedtesting.rules.NoShadowingOrOverridesOnMethodsRule$1.evaluate(NoShadowingOrOverridesOnMethodsRule.java:40)
	at com.carrotsearch.randomizedtesting.rules.NoShadowingOrOverridesOnMethodsRule$1.evaluate(NoShadowingOrOverridesOnMethodsRule.java:40)
	at com.carrotsearch.randomizedtesting.rules.StatementAdapter.evaluate(StatementAdapter.java:36)
	at com.carrotsearch.randomizedtesting.rules.StatementAdapter.evaluate(StatementAdapter.java:36)
	at com.carrotsearch.randomizedtesting.rules.StatementAdapter.evaluate(StatementAdapter.java:36)
	at org.apache.lucene.util.TestRuleAssertionsRequired$1.evaluate(TestRuleAssertionsRequired.java:53)
	at org.apache.lucene.util.TestRuleMarkFailure$1.evaluate(TestRuleMarkFailure.java:47)
	at org.apache.lucene.util.TestRuleIgnoreAfterMaxFailures$1.evaluate(TestRuleIgnoreAfterMaxFailures.java:64)
	at org.apache.lucene.util.TestRuleIgnoreTestSuites$1.evaluate(TestRuleIgnoreTestSuites.java:54)
	at com.carrotsearch.randomizedtesting.rules.StatementAdapter.evaluate(StatementAdapter.java:36)
	at com.carrotsearch.randomizedtesting.ThreadLeakControl$StatementRunner.run(ThreadLeakControl.java:367)
	at java.lang.Thread.run(Thread.java:745)


FAILED:  junit.framework.TestSuite.org.apache.solr.core.TestLazyCores

Error Message:
1 thread leaked from SUITE scope at org.apache.solr.core.TestLazyCores:     1) Thread[id=2614, name=searcherExecutor-850-thread-1, state=WAITING, group=TGRP-TestLazyCores]         at sun.misc.Unsafe.park(Native Method)         at java.util.concurrent.locks.LockSupport.park(LockSupport.java:175)         at java.util.concurrent.locks.AbstractQueuedSynchronizer$ConditionObject.await(AbstractQueuedSynchronizer.java:2039)         at java.util.concurrent.LinkedBlockingQueue.take(LinkedBlockingQueue.java:442)         at java.util.concurrent.ThreadPoolExecutor.getTask(ThreadPoolExecutor.java:1067)         at java.util.concurrent.ThreadPoolExecutor.runWorker(ThreadPoolExecutor.java:1127)         at java.util.concurrent.ThreadPoolExecutor$Worker.run(ThreadPoolExecutor.java:617)         at java.lang.Thread.run(Thread.java:745)

Stack Trace:
com.carrotsearch.randomizedtesting.ThreadLeakError: 1 thread leaked from SUITE scope at org.apache.solr.core.TestLazyCores: 
   1) Thread[id=2614, name=searcherExecutor-850-thread-1, state=WAITING, group=TGRP-TestLazyCores]
        at sun.misc.Unsafe.park(Native Method)
        at java.util.concurrent.locks.LockSupport.park(LockSupport.java:175)
        at java.util.concurrent.locks.AbstractQueuedSynchronizer$ConditionObject.await(AbstractQueuedSynchronizer.java:2039)
        at java.util.concurrent.LinkedBlockingQueue.take(LinkedBlockingQueue.java:442)
        at java.util.concurrent.ThreadPoolExecutor.getTask(ThreadPoolExecutor.java:1067)
        at java.util.concurrent.ThreadPoolExecutor.runWorker(ThreadPoolExecutor.java:1127)
        at java.util.concurrent.ThreadPoolExecutor$Worker.run(ThreadPoolExecutor.java:617)
        at java.lang.Thread.run(Thread.java:745)
	at __randomizedtesting.SeedInfo.seed([9F2407C2F73BD43]:0)


FAILED:  junit.framework.TestSuite.org.apache.solr.core.TestLazyCores

Error Message:
There are still zombie threads that couldn't be terminated:    1) Thread[id=2614, name=searcherExecutor-850-thread-1, state=WAITING, group=TGRP-TestLazyCores]         at sun.misc.Unsafe.park(Native Method)         at java.util.concurrent.locks.LockSupport.park(LockSupport.java:175)         at java.util.concurrent.locks.AbstractQueuedSynchronizer$ConditionObject.await(AbstractQueuedSynchronizer.java:2039)         at java.util.concurrent.LinkedBlockingQueue.take(LinkedBlockingQueue.java:442)         at java.util.concurrent.ThreadPoolExecutor.getTask(ThreadPoolExecutor.java:1067)         at java.util.concurrent.ThreadPoolExecutor.runWorker(ThreadPoolExecutor.java:1127)         at java.util.concurrent.ThreadPoolExecutor$Worker.run(ThreadPoolExecutor.java:617)         at java.lang.Thread.run(Thread.java:745)

Stack Trace:
com.carrotsearch.randomizedtesting.ThreadLeakError: There are still zombie threads that couldn't be terminated:
   1) Thread[id=2614, name=searcherExecutor-850-thread-1, state=WAITING, group=TGRP-TestLazyCores]
        at sun.misc.Unsafe.park(Native Method)
        at java.util.concurrent.locks.LockSupport.park(LockSupport.java:175)
        at java.util.concurrent.locks.AbstractQueuedSynchronizer$ConditionObject.await(AbstractQueuedSynchronizer.java:2039)
        at java.util.concurrent.LinkedBlockingQueue.take(LinkedBlockingQueue.java:442)
        at java.util.concurrent.ThreadPoolExecutor.getTask(ThreadPoolExecutor.java:1067)
        at java.util.concurrent.ThreadPoolExecutor.runWorker(ThreadPoolExecutor.java:1127)
        at java.util.concurrent.ThreadPoolExecutor$Worker.run(ThreadPoolExecutor.java:617)
        at java.lang.Thread.run(Thread.java:745)
	at __randomizedtesting.SeedInfo.seed([9F2407C2F73BD43]:0)




Build Log:
[...truncated 11410 lines...]
   [junit4] Suite: org.apache.solr.core.TestLazyCores
   [junit4]   2> Creating dataDir: /x1/jenkins/jenkins-slave/workspace/Lucene-Solr-NightlyTests-master/solr/build/solr-core/test/J0/temp/solr.core.TestLazyCores_9F2407C2F73BD43-001/init-core-data-001
   [junit4]   2> 1007616 INFO  (SUITE-TestLazyCores-seed#[9F2407C2F73BD43]-worker) [    ] o.a.s.SolrTestCaseJ4 Randomized ssl (false) and clientAuth (false) via: @org.apache.solr.util.RandomizeSSL(reason=, value=NaN, ssl=NaN, clientAuth=NaN)
   [junit4]   2> 1007618 INFO  (TEST-TestLazyCores.testRace-seed#[9F2407C2F73BD43]) [    ] o.a.s.SolrTestCaseJ4 ###Starting testRace
   [junit4]   2> 1007677 INFO  (TEST-TestLazyCores.testRace-seed#[9F2407C2F73BD43]) [    ] o.a.s.c.SolrResourceLoader new SolrResourceLoader for directory: '/x1/jenkins/jenkins-slave/workspace/Lucene-Solr-NightlyTests-master/solr/build/solr-core/test/J0/temp/solr.core.TestLazyCores_9F2407C2F73BD43-001/tempDir-001'
   [junit4]   2> 1007678 INFO  (TEST-TestLazyCores.testRace-seed#[9F2407C2F73BD43]) [    ] o.a.s.c.SolrResourceLoader JNDI not configured for solr (NoInitialContextEx)
   [junit4]   2> 1007678 INFO  (TEST-TestLazyCores.testRace-seed#[9F2407C2F73BD43]) [    ] o.a.s.c.SolrResourceLoader solr home defaulted to 'solr/' (could not find system property or JNDI)
   [junit4]   2> 1007678 INFO  (TEST-TestLazyCores.testRace-seed#[9F2407C2F73BD43]) [    ] o.a.s.c.CoreContainer New CoreContainer 1977215895
   [junit4]   2> 1007678 INFO  (TEST-TestLazyCores.testRace-seed#[9F2407C2F73BD43]) [    ] o.a.s.c.CoreContainer Loading cores into CoreContainer [instanceDir=/x1/jenkins/jenkins-slave/workspace/Lucene-Solr-NightlyTests-master/solr/build/solr-core/test/J0/temp/solr.core.TestLazyCores_9F2407C2F73BD43-001/tempDir-001]
   [junit4]   2> 1007678 WARN  (TEST-TestLazyCores.testRace-seed#[9F2407C2F73BD43]) [    ] o.a.s.c.CoreContainer Couldn't add files from /x1/jenkins/jenkins-slave/workspace/Lucene-Solr-NightlyTests-master/solr/build/solr-core/test/J0/temp/solr.core.TestLazyCores_9F2407C2F73BD43-001/tempDir-001/lib to classpath: /x1/jenkins/jenkins-slave/workspace/Lucene-Solr-NightlyTests-master/solr/build/solr-core/test/J0/temp/solr.core.TestLazyCores_9F2407C2F73BD43-001/tempDir-001/lib
   [junit4]   2> 1007678 INFO  (TEST-TestLazyCores.testRace-seed#[9F2407C2F73BD43]) [    ] o.a.s.h.c.HttpShardHandlerFactory created with socketTimeout : 600000,connTimeout : 60000,maxConnectionsPerHost : 20,maxConnections : 10000,corePoolSize : 0,maximumPoolSize : 2147483647,maxThreadIdleTime : 5,sizeOfQueue : -1,fairnessPolicy : false,
   [junit4]   2> 1007697 INFO  (TEST-TestLazyCores.testRace-seed#[9F2407C2F73BD43]) [    ] o.a.s.u.UpdateShardHandler Creating UpdateShardHandler HTTP client with params: 
   [junit4]   2> 1007698 INFO  (TEST-TestLazyCores.testRace-seed#[9F2407C2F73BD43]) [    ] o.a.s.c.SolrCores Allocating transient cache for 4 transient cores
   [junit4]   2> 1007699 INFO  (TEST-TestLazyCores.testRace-seed#[9F2407C2F73BD43]) [    ] o.a.s.l.LogWatcher SLF4J impl is org.slf4j.impl.Log4jLoggerFactory
   [junit4]   2> 1007699 INFO  (TEST-TestLazyCores.testRace-seed#[9F2407C2F73BD43]) [    ] o.a.s.l.LogWatcher Registering Log Listener [Log4j (org.slf4j.impl.Log4jLoggerFactory)]
   [junit4]   2> 1007699 INFO  (TEST-TestLazyCores.testRace-seed#[9F2407C2F73BD43]) [    ] o.a.s.c.CoreContainer Security conf doesn't exist. Skipping setup for authorization module.
   [junit4]   2> 1007699 INFO  (TEST-TestLazyCores.testRace-seed#[9F2407C2F73BD43]) [    ] o.a.s.c.CoreContainer No authentication plugin used.
   [junit4]   2> 1007700 INFO  (TEST-TestLazyCores.testRace-seed#[9F2407C2F73BD43]) [    ] o.a.s.c.CoreDescriptor Created CoreDescriptor: {name=collection1, config=solrconfig.xml, loadOnStartup=true, schema=schema.xml, configSetProperties=configsetprops.json, transient=false, dataDir=data/}
   [junit4]   2> 1007700 INFO  (TEST-TestLazyCores.testRace-seed#[9F2407C2F73BD43]) [    ] o.a.s.c.CoreDescriptor Created CoreDescriptor: {name=collection2, config=solrconfig.xml, loadOnStartup=true, schema=schema.xml, configSetProperties=configsetprops.json, transient=true, dataDir=data/}
   [junit4]   2> 1007700 INFO  (TEST-TestLazyCores.testRace-seed#[9F2407C2F73BD43]) [    ] o.a.s.c.CoreDescriptor Created CoreDescriptor: {name=collection3, config=solrconfig.xml, loadOnStartup=false, schema=schema.xml, configSetProperties=configsetprops.json, transient=on, dataDir=data/}
   [junit4]   2> 1007700 INFO  (TEST-TestLazyCores.testRace-seed#[9F2407C2F73BD43]) [    ] o.a.s.c.CoreDescriptor Created CoreDescriptor: {name=collection4, config=solrconfig.xml, loadOnStartup=false, schema=schema.xml, configSetProperties=configsetprops.json, transient=false, dataDir=data/}
   [junit4]   2> 1007700 INFO  (TEST-TestLazyCores.testRace-seed#[9F2407C2F73BD43]) [    ] o.a.s.c.CoreDescriptor Created CoreDescriptor: {name=collection5, config=solrconfig.xml, loadOnStartup=true, schema=schema.xml, configSetProperties=configsetprops.json, transient=false, dataDir=data/}
   [junit4]   2> 1007701 INFO  (TEST-TestLazyCores.testRace-seed#[9F2407C2F73BD43]) [    ] o.a.s.c.CoreDescriptor Created CoreDescriptor: {name=collection6, config=solrconfig.xml, loadOnStartup=false, schema=schema.xml, configSetProperties=configsetprops.json, transient=true, dataDir=data/}
   [junit4]   2> 1007701 INFO  (TEST-TestLazyCores.testRace-seed#[9F2407C2F73BD43]) [    ] o.a.s.c.CoreDescriptor Created CoreDescriptor: {name=collection7, config=solrconfig.xml, loadOnStartup=false, schema=schema.xml, configSetProperties=configsetprops.json, transient=true, dataDir=data/}
   [junit4]   2> 1007701 INFO  (TEST-TestLazyCores.testRace-seed#[9F2407C2F73BD43]) [    ] o.a.s.c.CoreDescriptor Created CoreDescriptor: {name=collection8, config=solrconfig.xml, loadOnStartup=false, schema=schema.xml, configSetProperties=configsetprops.json, transient=true, dataDir=data/}
   [junit4]   2> 1007701 INFO  (TEST-TestLazyCores.testRace-seed#[9F2407C2F73BD43]) [    ] o.a.s.c.CoreDescriptor Created CoreDescriptor: {name=collection9, config=solrconfig.xml, loadOnStartup=false, schema=schema.xml, configSetProperties=configsetprops.json, transient=true, dataDir=data/}
   [junit4]   2> 1007705 INFO  (coreLoadExecutor-825-thread-1) [    ] o.a.s.c.SolrResourceLoader new SolrResourceLoader for directory: '/x1/jenkins/jenkins-slave/workspace/Lucene-Solr-NightlyTests-master/solr/build/solr-core/test/J0/temp/solr.core.TestLazyCores_9F2407C2F73BD43-001/tempDir-001/collection1'
   [junit4]   2> 1007715 INFO  (coreLoadExecutor-825-thread-1) [    ] o.a.s.c.SolrResourceLoader JNDI not configured for solr (NoInitialContextEx)
   [junit4]   2> 1007715 INFO  (coreLoadExecutor-825-thread-1) [    ] o.a.s.c.SolrResourceLoader solr home defaulted to 'solr/' (could not find system property or JNDI)
   [junit4]   2> 1007705 INFO  (coreLoadExecutor-825-thread-3) [    ] o.a.s.c.SolrResourceLoader new SolrResourceLoader for directory: '/x1/jenkins/jenkins-slave/workspace/Lucene-Solr-NightlyTests-master/solr/build/solr-core/test/J0/temp/solr.core.TestLazyCores_9F2407C2F73BD43-001/tempDir-001/collection5'
   [junit4]   2> 1007705 INFO  (coreLoadExecutor-825-thread-2) [    ] o.a.s.c.SolrResourceLoader new SolrResourceLoader for directory: '/x1/jenkins/jenkins-slave/workspace/Lucene-Solr-NightlyTests-master/solr/build/solr-core/test/J0/temp/solr.core.TestLazyCores_9F2407C2F73BD43-001/tempDir-001/collection2'
   [junit4]   2> 1007722 INFO  (coreLoadExecutor-825-thread-2) [    ] o.a.s.c.SolrResourceLoader JNDI not configured for solr (NoInitialContextEx)
   [junit4]   2> 1007722 INFO  (coreLoadExecutor-825-thread-2) [    ] o.a.s.c.SolrResourceLoader solr home defaulted to 'solr/' (could not find system property or JNDI)
   [junit4]   2> 1007725 INFO  (coreLoadExecutor-825-thread-3) [    ] o.a.s.c.SolrResourceLoader JNDI not configured for solr (NoInitialContextEx)
   [junit4]   2> 1007725 INFO  (coreLoadExecutor-825-thread-3) [    ] o.a.s.c.SolrResourceLoader solr home defaulted to 'solr/' (could not find system property or JNDI)
   [junit4]   2> 1007722 INFO  (coreLoadExecutor-825-thread-1) [    ] o.a.s.c.SolrConfig current version of requestparams : -1
   [junit4]   2> 1007732 WARN  (coreLoadExecutor-825-thread-1) [    ] o.a.s.c.Config Beginning with Solr 5.5, <mergePolicy> is deprecated, use <mergePolicyFactory> instead.
   [junit4]   2> 1007737 INFO  (coreLoadExecutor-825-thread-2) [    ] o.a.s.c.SolrConfig current version of requestparams : -1
   [junit4]   2> 1007740 WARN  (coreLoadExecutor-825-thread-2) [    ] o.a.s.c.Config Beginning with Solr 5.5, <mergePolicy> is deprecated, use <mergePolicyFactory> instead.
   [junit4]   2> 1007743 INFO  (coreLoadExecutor-825-thread-2) [    ] o.a.s.c.SolrConfig Using Lucene MatchVersion: 7.0.0
   [junit4]   2> 1007767 INFO  (coreLoadExecutor-825-thread-1) [    ] o.a.s.c.SolrConfig Using Lucene MatchVersion: 7.0.0
   [junit4]   2> 1007776 INFO  (coreLoadExecutor-825-thread-3) [    ] o.a.s.c.SolrConfig current version of requestparams : -1
   [junit4]   2> 1007777 WARN  (coreLoadExecutor-825-thread-3) [    ] o.a.s.c.Config Beginning with Solr 5.5, <mergePolicy> is deprecated, use <mergePolicyFactory> instead.
   [junit4]   2> 1007778 INFO  (coreLoadExecutor-825-thread-3) [    ] o.a.s.c.SolrConfig Using Lucene MatchVersion: 7.0.0
   [junit4]   2> 1007763 INFO  (coreLoadExecutor-825-thread-2) [    ] o.a.s.c.SolrConfig Loaded SolrConfig: solrconfig.xml
   [junit4]   2> 1007787 INFO  (coreLoadExecutor-825-thread-2) [    ] o.a.s.s.IndexSchema [collection2] Schema name=tiny
   [junit4]   2> 1007787 INFO  (coreLoadExecutor-825-thread-1) [    ] o.a.s.c.SolrConfig Loaded SolrConfig: solrconfig.xml
   [junit4]   2> 1007792 INFO  (coreLoadExecutor-825-thread-2) [    ] o.a.s.s.IndexSchema unique key field: id
   [junit4]   2> 1007794 INFO  (coreLoadExecutor-825-thread-1) [    ] o.a.s.s.IndexSchema [collection1] Schema name=tiny
   [junit4]   2> 1007803 INFO  (coreLoadExecutor-825-thread-2) [    ] o.a.s.c.ConfigSetProperties Did not find ConfigSet properties, assuming default properties: Can't find resource 'configsetprops.json' in classpath or '/x1/jenkins/jenkins-slave/workspace/Lucene-Solr-NightlyTests-master/solr/build/solr-core/test/J0/temp/solr.core.TestLazyCores_9F2407C2F73BD43-001/tempDir-001/collection2'
   [junit4]   2> 1007803 INFO  (coreLoadExecutor-825-thread-2) [    ] o.a.s.c.CoreContainer Creating SolrCore 'collection2' using configuration from instancedir /x1/jenkins/jenkins-slave/workspace/Lucene-Solr-NightlyTests-master/solr/build/solr-core/test/J0/temp/solr.core.TestLazyCores_9F2407C2F73BD43-001/tempDir-001/collection2
   [junit4]   2> 1007803 INFO  (coreLoadExecutor-825-thread-2) [    x:collection2] o.a.s.c.SolrCore org.apache.solr.core.MockDirectoryFactory
   [junit4]   2> 1007803 INFO  (coreLoadExecutor-825-thread-2) [    x:collection2] o.a.s.c.SolrCore [[collection2] ] Opening new SolrCore at [/x1/jenkins/jenkins-slave/workspace/Lucene-Solr-NightlyTests-master/solr/build/solr-core/test/J0/temp/solr.core.TestLazyCores_9F2407C2F73BD43-001/tempDir-001/collection2], dataDir=[/x1/jenkins/jenkins-slave/workspace/Lucene-Solr-NightlyTests-master/solr/build/solr-core/test/J0/temp/solr.core.TestLazyCores_9F2407C2F73BD43-001/tempDir-001/collection2/data/]
   [junit4]   2> 1007803 INFO  (coreLoadExecutor-825-thread-2) [    x:collection2] o.a.s.c.SolrCore JMX monitoring not detected for core: collection2
   [junit4]   2> 1007804 INFO  (coreLoadExecutor-825-thread-2) [    x:collection2] o.a.s.c.CachingDirectoryFactory return new directory for /x1/jenkins/jenkins-slave/workspace/Lucene-Solr-NightlyTests-master/solr/build/solr-core/test/J0/temp/solr.core.TestLazyCores_9F2407C2F73BD43-001/tempDir-001/collection2/data
   [junit4]   2> 1007817 INFO  (coreLoadExecutor-825-thread-2) [    x:collection2] o.a.s.c.SolrCore New index directory detected: old=null new=/x1/jenkins/jenkins-slave/workspace/Lucene-Solr-NightlyTests-master/solr/build/solr-core/test/J0/temp/solr.core.TestLazyCores_9F2407C2F73BD43-001/tempDir-001/collection2/data/index/
   [junit4]   2> 1007817 WARN  (coreLoadExecutor-825-thread-2) [    x:collection2] o.a.s.c.SolrCore [collection2] Solr index directory '/x1/jenkins/jenkins-slave/workspace/Lucene-Solr-NightlyTests-master/solr/build/solr-core/test/J0/temp/solr.core.TestLazyCores_9F2407C2F73BD43-001/tempDir-001/collection2/data/index' doesn't exist. Creating new index...
   [junit4]   2> 1007818 INFO  (coreLoadExecutor-825-thread-2) [    x:collection2] o.a.s.c.CachingDirectoryFactory return new directory for /x1/jenkins/jenkins-slave/workspace/Lucene-Solr-NightlyTests-master/solr/build/solr-core/test/J0/temp/solr.core.TestLazyCores_9F2407C2F73BD43-001/tempDir-001/collection2/data/index
   [junit4]   2> 1007819 INFO  (coreLoadExecutor-825-thread-2) [    x:collection2] o.a.s.u.RandomMergePolicy RandomMergePolicy wrapping class org.apache.lucene.index.LogByteSizeMergePolicy: [LogByteSizeMergePolicy: minMergeSize=1677721, mergeFactor=36, maxMergeSize=2147483648, maxMergeSizeForForcedMerge=9223372036854775807, calibrateSizeByDeletes=false, maxMergeDocs=2147483647, maxCFSSegmentSizeMB=8.796093022207999E12, noCFSRatio=0.12777455999098164]
   [junit4]   2> 1007819 INFO  (coreLoadExecutor-825-thread-3) [    ] o.a.s.c.SolrConfig Loaded SolrConfig: solrconfig.xml
   [junit4]   2> 1007820 INFO  (coreLoadExecutor-825-thread-1) [    ] o.a.s.s.IndexSchema unique key field: id
   [junit4]   2> 1007822 INFO  (coreLoadExecutor-825-thread-3) [    ] o.a.s.s.IndexSchema [collection5] Schema name=tiny
   [junit4]   2> 1007823 INFO  (coreLoadExecutor-825-thread-1) [    ] o.a.s.c.ConfigSetProperties Did not find ConfigSet properties, assuming default properties: Can't find resource 'configsetprops.json' in classpath or '/x1/jenkins/jenkins-slave/workspace/Lucene-Solr-NightlyTests-master/solr/build/solr-core/test/J0/temp/solr.core.TestLazyCores_9F2407C2F73BD43-001/tempDir-001/collection1'
   [junit4]   2> 1007823 INFO  (coreLoadExecutor-825-thread-1) [    ] o.a.s.c.CoreContainer Creating SolrCore 'collection1' using configuration from instancedir /x1/jenkins/jenkins-slave/workspace/Lucene-Solr-NightlyTests-master/solr/build/solr-core/test/J0/temp/solr.core.TestLazyCores_9F2407C2F73BD43-001/tempDir-001/collection1
   [junit4]   2> 1007823 INFO  (coreLoadExecutor-825-thread-1) [    x:collection1] o.a.s.c.SolrCore org.apache.solr.core.MockDirectoryFactory
   [junit4]   2> 1007823 INFO  (coreLoadExecutor-825-thread-1) [    x:collection1] o.a.s.c.SolrCore [[collection1] ] Opening new SolrCore at [/x1/jenkins/jenkins-slave/workspace/Lucene-Solr-NightlyTests-master/solr/build/solr-core/test/J0/temp/solr.core.TestLazyCores_9F2407C2F73BD43-001/tempDir-001/collection1], dataDir=[/x1/jenkins/jenkins-slave/workspace/Lucene-Solr-NightlyTests-master/solr/build/solr-core/test/J0/temp/solr.core.TestLazyCores_9F2407C2F73BD43-001/tempDir-001/collection1/data/]
   [junit4]   2> 1007823 INFO  (coreLoadExecutor-825-thread-1) [    x:collection1] o.a.s.c.SolrCore JMX monitoring not detected for core: collection1
   [junit4]   2> 1007823 INFO  (coreLoadExecutor-825-thread-1) [    x:collection1] o.a.s.c.CachingDirectoryFactory return new directory for /x1/jenkins/jenkins-slave/workspace/Lucene-Solr-NightlyTests-master/solr/build/solr-core/test/J0/temp/solr.core.TestLazyCores_9F2407C2F73BD43-001/tempDir-001/collection1/data
   [junit4]   2> 1007823 INFO  (coreLoadExecutor-825-thread-1) [    x:collection1] o.a.s.c.SolrCore New index directory detected: old=null new=/x1/jenkins/jenkins-slave/workspace/Lucene-Solr-NightlyTests-master/solr/build/solr-core/test/J0/temp/solr.core.TestLazyCores_9F2407C2F73BD43-001/tempDir-001/collection1/data/index/
   [junit4]   2> 1007823 WARN  (coreLoadExecutor-825-thread-1) [    x:collection1] o.a.s.c.SolrCore [collection1] Solr index directory '/x1/jenkins/jenkins-slave/workspace/Lucene-Solr-NightlyTests-master/solr/build/solr-core/test/J0/temp/solr.core.TestLazyCores_9F2407C2F73BD43-001/tempDir-001/collection1/data/index' doesn't exist. Creating new index...
   [junit4]   2> 1007829 INFO  (coreLoadExecutor-825-thread-1) [    x:collection1] o.a.s.c.CachingDirectoryFactory return new directory for /x1/jenkins/jenkins-slave/workspace/Lucene-Solr-NightlyTests-master/solr/build/solr-core/test/J0/temp/solr.core.TestLazyCores_9F2407C2F73BD43-001/tempDir-001/collection1/data/index
   [junit4]   2> 1007829 INFO  (coreLoadExecutor-825-thread-1) [    x:collection1] o.a.s.u.RandomMergePolicy RandomMergePolicy wrapping class org.apache.lucene.index.LogByteSizeMergePolicy: [LogByteSizeMergePolicy: minMergeSize=1677721, mergeFactor=36, maxMergeSize=2147483648, maxMergeSizeForForcedMerge=9223372036854775807, calibrateSizeByDeletes=false, maxMergeDocs=2147483647, maxCFSSegmentSizeMB=8.796093022207999E12, noCFSRatio=0.12777455999098164]
   [junit4]   2> 1007830 INFO  (coreLoadExecutor-825-thread-2) [    x:collection2] o.a.s.c.SolrDeletionPolicy SolrDeletionPolicy.onCommit: commits: num=1
   [junit4]   2> 	commit{dir=MockDirectoryWrapper(RAMDirectory@3f7aaca2 lockFactory=org.apache.lucene.store.SingleInstanceLockFactory@5f03ecb2),segFN=segments_1,generation=1}
   [junit4]   2> 1007830 INFO  (coreLoadExecutor-825-thread-2) [    x:collection2] o.a.s.c.SolrDeletionPolicy newest commit generation = 1
   [junit4]   2> 1007831 INFO  (coreLoadExecutor-825-thread-3) [    ] o.a.s.s.IndexSchema unique key field: id
   [junit4]   2> 1007832 INFO  (coreLoadExecutor-825-thread-3) [    ] o.a.s.c.ConfigSetProperties Did not find ConfigSet properties, assuming default properties: Can't find resource 'configsetprops.json' in classpath or '/x1/jenkins/jenkins-slave/workspace/Lucene-Solr-NightlyTests-master/solr/build/solr-core/test/J0/temp/solr.core.TestLazyCores_9F2407C2F73BD43-001/tempDir-001/collection5'
   [junit4]   2> 1007832 INFO  (coreLoadExecutor-825-thread-3) [    ] o.a.s.c.CoreContainer Creating SolrCore 'collection5' using configuration from instancedir /x1/jenkins/jenkins-slave/workspace/Lucene-Solr-NightlyTests-master/solr/build/solr-core/test/J0/temp/solr.core.TestLazyCores_9F2407C2F73BD43-001/tempDir-001/collection5
   [junit4]   2> 1007832 INFO  (coreLoadExecutor-825-thread-3) [    x:collection5] o.a.s.c.SolrCore org.apache.solr.core.MockDirectoryFactory
   [junit4]   2> 1007832 INFO  (coreLoadExecutor-825-thread-3) [    x:collection5] o.a.s.c.SolrCore [[collection5] ] Opening new SolrCore at [/x1/jenkins/jenkins-slave/workspace/Lucene-Solr-NightlyTests-master/solr/build/solr-core/test/J0/temp/solr.core.TestLazyCores_9F2407C2F73BD43-001/tempDir-001/collection5], dataDir=[/x1/jenkins/jenkins-slave/workspace/Lucene-Solr-NightlyTests-master/solr/build/solr-core/test/J0/temp/solr.core.TestLazyCores_9F2407C2F73BD43-001/tempDir-001/collection5/data/]
   [junit4]   2> 1007832 INFO  (coreLoadExecutor-825-thread-3) [    x:collection5] o.a.s.c.SolrCore JMX monitoring not detected for core: collection5
   [junit4]   2> 1007832 INFO  (coreLoadExecutor-825-thread-3) [    x:collection5] o.a.s.c.CachingDirectoryFactory return new directory for /x1/jenkins/jenkins-slave/workspace/Lucene-Solr-NightlyTests-master/solr/build/solr-core/test/J0/temp/solr.core.TestLazyCores_9F2407C2F73BD43-001/tempDir-001/collection5/data
   [junit4]   2> 1007832 INFO  (coreLoadExecutor-825-thread-1) [    x:collection1] o.a.s.c.SolrDeletionPolicy SolrDeletionPolicy.onCommit: commits: num=1
   [junit4]   2> 	commit{dir=MockDirectoryWrapper(RAMDirectory@6f790cd lockFactory=org.apache.lucene.store.SingleInstanceLockFactory@1a33e1b0),segFN=segments_1,generation=1}
   [junit4]   2> 1007832 INFO  (coreLoadExecutor-825-thread-1) [    x:collection1] o.a.s.c.SolrDeletionPolicy newest commit generation = 1
   [junit4]   2> 1007833 INFO  (coreLoadExecutor-825-thread-2) [    x:collection2] o.a.s.c.SolrCore no updateRequestProcessorChain defined as default, creating implicit default
   [junit4]   2> 1007834 INFO  (coreLoadExecutor-825-thread-2) [    x:collection2] o.a.s.h.l.XMLLoader xsltCacheLifetimeSeconds=60
   [junit4]   2> 1007835 INFO  (coreLoadExecutor-825-thread-2) [    x:collection2] o.a.s.h.l.XMLLoader xsltCacheLifetimeSeconds=60
   [junit4]   2> 1007835 INFO  (coreLoadExecutor-825-thread-2) [    x:collection2] o.a.s.h.l.XMLLoader xsltCacheLifetimeSeconds=60
   [junit4]   2> 1007836 INFO  (coreLoadExecutor-825-thread-2) [    x:collection2] o.a.s.h.l.XMLLoader xsltCacheLifetimeSeconds=60
   [junit4]   2> 1007837 INFO  (coreLoadExecutor-825-thread-2) [    x:collection2] o.a.s.c.RequestHandlers Registered paths: /admin/mbeans,/update/csv,/sql,/update/json/docs,/admin/luke,/graph,/export,/select,/admin/segments,/get,/admin/system,/replication,/admin/properties,/config,/stream,/schema,/admin/plugins,/admin/logging,/update/json,/admin/ping,/admin/threads,/update,/admin/file
   [junit4]   2> 1007837 INFO  (coreLoadExecutor-825-thread-2) [    x:collection2] o.a.s.c.SolrCore Using default statsCache cache: org.apache.solr.search.stats.LocalStatsCache
   [junit4]   2> 1007837 INFO  (OldIndexDirectoryCleanupThreadForCore-collection2) [    x:collection2] o.a.s.c.SolrCore Looking for old index directories to cleanup for core collection2 in /x1/jenkins/jenkins-slave/workspace/Lucene-Solr-NightlyTests-master/solr/build/solr-core/test/J0/temp/solr.core.TestLazyCores_9F2407C2F73BD43-001/tempDir-001/collection2/data/
   [junit4]   2> 1007837 WARN  (OldIndexDirectoryCleanupThreadForCore-collection2) [    x:collection2] o.a.s.c.DirectoryFactory /x1/jenkins/jenkins-slave/workspace/Lucene-Solr-NightlyTests-master/solr/build/solr-core/test/J0/temp/solr.core.TestLazyCores_9F2407C2F73BD43-001/tempDir-001/collection2/data/ does not point to a valid data directory; skipping clean-up of old index directories.
   [junit4]   2> 1007837 INFO  (coreLoadExecutor-825-thread-3) [    x:collection5] o.a.s.c.SolrCore New index directory detected: old=null new=/x1/jenkins/jenkins-slave/workspace/Lucene-Solr-NightlyTests-master/solr/build/solr-core/test/J0/temp/solr.core.TestLazyCores_9F2407C2F73BD43-001/tempDir-001/collection5/data/index/
   [junit4]   2> 1007837 WARN  (coreLoadExecutor-825-thread-3) [    x:collection5] o.a.s.c.SolrCore [collection5] Solr index directory '/x1/jenkins/jenkins-slave/workspace/Lucene-Solr-NightlyTests-master/solr/build/solr-core/test/J0/temp/solr.core.TestLazyCores_9F2407C2F73BD43-001/tempDir-001/collection5/data/index' doesn't exist. Creating new index...
   [junit4]   2> 1007837 INFO  (coreLoadExecutor-825-thread-3) [    x:collection5] o.a.s.c.CachingDirectoryFactory return new directory for /x1/jenkins/jenkins-slave/workspace/Lucene-Solr-NightlyTests-master/solr/build/solr-core/test/J0/temp/solr.core.TestLazyCores_9F2407C2F73BD43-001/tempDir-001/collection5/data/index
   [junit4]   2> 1007837 INFO  (coreLoadExecutor-825-thread-3) [    x:collection5] o.a.s.u.RandomMergePolicy RandomMergePolicy wrapping class org.apache.lucene.index.LogByteSizeMergePolicy: [LogByteSizeMergePolicy: minMergeSize=1677721, mergeFactor=36, maxMergeSize=2147483648, maxMergeSizeForForcedMerge=9223372036854775807, calibrateSizeByDeletes=false, maxMergeDocs=2147483647, maxCFSSegmentSizeMB=8.796093022207999E12, noCFSRatio=0.12777455999098164]
   [junit4]   2> 1007838 INFO  (coreLoadExecutor-825-thread-3) [    x:collection5] o.a.s.c.SolrDeletionPolicy SolrDeletionPolicy.onCommit: commits: num=1
   [junit4]   2> 	commit{dir=MockDirectoryWrapper(RAMDirectory@9d378c9 lockFactory=org.apache.lucene.store.SingleInstanceLockFactory@446f221e),segFN=segments_1,generation=1}
   [junit4]   2> 1007838 INFO  (coreLoadExecutor-825-thread-3) [    x:collection5] o.a.s.c.SolrDeletionPolicy newest commit generation = 1
   [junit4]   2> 1007855 INFO  (coreLoadExecutor-825-thread-1) [    x:collection1] o.a.s.c.SolrCore no updateRequestProcessorChain defined as default, creating implicit default
   [junit4]   2> 1007855 INFO  (coreLoadExecutor-825-thread-1) [    x:collection1] o.a.s.h.l.XMLLoader xsltCacheLifetimeSeconds=60
   [junit4]   2> 1007856 INFO  (coreLoadExecutor-825-thread-1) [    x:collection1] o.a.s.h.l.XMLLoader xsltCacheLifetimeSeconds=60
   [junit4]   2> 1007856 INFO  (coreLoadExecutor-825-thread-1) [    x:collection1] o.a.s.h.l.XMLLoader xsltCacheLifetimeSeconds=60
   [junit4]   2> 1007857 INFO  (coreLoadExecutor-825-thread-1) [    x:collection1] o.a.s.h.l.XMLLoader xsltCacheLifetimeSeconds=60
   [junit4]   2> 1007857 INFO  (coreLoadExecutor-825-thread-1) [    x:collection1] o.a.s.c.RequestHandlers Registered paths: /admin/mbeans,/update/csv,/sql,/update/json/docs,/admin/luke,/graph,/export,/select,/admin/segments,/get,/admin/system,/replication,/admin/properties,/config,/stream,/schema,/admin/plugins,/admin/logging,/update/json,/admin/ping,/admin/threads,/update,/admin/file
   [junit4]   2> 1007857 INFO  (coreLoadExecutor-825-thread-1) [    x:collection1] o.a.s.c.SolrCore Using default statsCache cache: org.apache.solr.search.stats.LocalStatsCache
   [junit4]   2> 1007862 INFO  (coreLoadExecutor-825-thread-2) [    x:collection2] o.a.s.u.CommitTracker Hard AutoCommit: disabled
   [junit4]   2> 1007862 INFO  (coreLoadExecutor-825-thread-2) [    x:collection2] o.a.s.u.CommitTracker Soft AutoCommit: disabled
   [junit4]   2> 1007862 INFO  (coreLoadExecutor-825-thread-2) [    x:collection2] o.a.s.u.RandomMergePolicy RandomMergePolicy wrapping class org.apache.lucene.index.TieredMergePolicy: [TieredMergePolicy: maxMergeAtOnce=25, maxMergeAtOnceExplicit=18, maxMergedSegmentMB=59.7578125, floorSegmentMB=1.0859375, forceMergeDeletesPctAllowed=14.477674756977915, segmentsPerTier=24.0, maxCFSSegmentSizeMB=8.796093022207999E12, noCFSRatio=1.0
   [junit4]   2> 1007863 INFO  (coreLoadExecutor-825-thread-2) [    x:collection2] o.a.s.c.SolrDeletionPolicy SolrDeletionPolicy.onInit: commits: num=1
   [junit4]   2> 	commit{dir=MockDirectoryWrapper(RAMDirectory@3f7aaca2 lockFactory=org.apache.lucene.store.SingleInstanceLockFactory@5f03ecb2),segFN=segments_1,generation=1}
   [junit4]   2> 1007863 INFO  (coreLoadExecutor-825-thread-2) [    x:collection2] o.a.s.c.SolrDeletionPolicy newest commit generation = 1
   [junit4]   2> 1007863 INFO  (coreLoadExecutor-825-thread-2) [    x:collection2] o.a.s.s.SolrIndexSearcher Opening [Searcher@3d095f7f[collection2] main]
   [junit4]   2> 1007863 INFO  (coreLoadExecutor-825-thread-2) [    x:collection2] o.a.s.r.ManagedResourceStorage File-based storage initialized to use dir: /x1/jenkins/jenkins-slave/workspace/Lucene-Solr-NightlyTests-master/solr/build/solr-core/test/J0/temp/solr.core.TestLazyCores_9F2407C2F73BD43-001/tempDir-001/collection2/conf
   [junit4]   2> 1007863 INFO  (coreLoadExecutor-825-thread-2) [    x:collection2] o.a.s.r.RestManager Initializing RestManager with initArgs: {storageDir=/x1/jenkins/jenkins-slave/workspace/Lucene-Solr-NightlyTests-master/solr/build/solr-core/test/J0/temp/solr.core.TestLazyCores_9F2407C2F73BD43-001/tempDir-001/collection2/conf}
   [junit4]   2> 1007863 INFO  (coreLoadExecutor-825-thread-2) [    x:collection2] o.a.s.r.ManagedResourceStorage Reading _rest_managed.json using file:dir=/x1/jenkins/jenkins-slave/workspace/Lucene-Solr-NightlyTests-master/solr/build/solr-core/test/J0/temp/solr.core.TestLazyCores_9F2407C2F73BD43-001/tempDir-001/collection2/conf
   [junit4]   2> 1007863 INFO  (coreLoadExecutor-825-thread-2) [    x:collection2] o.a.s.r.RestManager Initializing 0 registered ManagedResources
   [junit4]   2> 1007864 INFO  (coreLoadExecutor-825-thread-2) [    x:collection2] o.a.s.h.ReplicationHandler Commits will be reserved for  10000
   [junit4]   2> 1007864 INFO  (coreLoadExecutor-825-thread-2) [    x:collection2] o.a.s.c.SolrCores Opening transient core collection2
   [junit4]   2> 1007864 INFO  (coreLoadExecutor-825-thread-2) [    x:collection2] o.a.s.c.CoreContainer registering core: collection2
   [junit4]   2> 1007866 INFO  (coreLoadExecutor-825-thread-1) [    x:collection1] o.a.s.u.CommitTracker Hard AutoCommit: disabled
   [junit4]   2> 1007866 INFO  (coreLoadExecutor-825-thread-1) [    x:collection1] o.a.s.u.CommitTracker Soft AutoCommit: disabled
   [junit4]   2> 1007866 INFO  (coreLoadExecutor-825-thread-1) [    x:collection1] o.a.s.u.RandomMergePolicy RandomMergePolicy wrapping class org.apache.lucene.index.TieredMergePolicy: [TieredMergePolicy: maxMergeAtOnce=25, maxMergeAtOnceExplicit=18, maxMergedSegmentMB=59.7578125, floorSegmentMB=1.0859375, forceMergeDeletesPctAllowed=14.477674756977915, segmentsPerTier=24.0, maxCFSSegmentSizeMB=8.796093022207999E12, noCFSRatio=1.0
   [junit4]   2> 1007866 INFO  (searcherExecutor-826-thread-1-processing-x:collection2) [    x:collection2] o.a.s.c.SolrCore [collection2] Registered new searcher Searcher@3d095f7f[collection2] main{ExitableDirectoryReader(UninvertingDirectoryReader())}
   [junit4]   2> 1007868 INFO  (coreLoadExecutor-825-thread-1) [    x:collection1] o.a.s.c.SolrDeletionPolicy SolrDeletionPolicy.onInit: commits: num=1
   [junit4]   2> 	commit{dir=MockDirectoryWrapper(RAMDirectory@6f790cd lockFactory=org.apache.lucene.store.SingleInstanceLockFactory@1a33e1b0),segFN=segments_1,generation=1}
   [junit4]   2> 1007868 INFO  (coreLoadExecutor-825-thread-1) [    x:collection1] o.a.s.c.SolrDeletionPolicy newest commit generation = 1
   [junit4]   2> 1007868 INFO  (coreLoadExecutor-825-thread-1) [    x:collection1] o.a.s.s.SolrIndexSearcher Opening [Searcher@208b3370[collection1] main]
   [junit4]   2> 1007868 INFO  (coreLoadExecutor-825-thread-1) [    x:collection1] o.a.s.r.ManagedResourceStorage File-based storage initialized to use dir: /x1/jenkins/jenkins-slave/workspace/Lucene-Solr-NightlyTests-master/solr/build/solr-core/test/J0/temp/solr.core.TestLazyCores_9F2407C2F73BD43-001/tempDir-001/collection1/conf
   [junit4]   2> 1007868 INFO  (coreLoadExecutor-825-thread-1) [    x:collection1] o.a.s.r.RestManager Initializing RestManager with initArgs: {storageDir=/x1/jenkins/jenkins-slave/workspace/Lucene-Solr-NightlyTests-master/solr/build/solr-core/test/J0/temp/solr.core.TestLazyCores_9F2407C2F73BD43-001/tempDir-001/collection1/conf}
   [junit4]   2> 1007868 INFO  (coreLoadExecutor-825-thread-1) [    x:collection1] o.a.s.r.ManagedResourceStorage Reading _rest_managed.json using file:dir=/x1/jenkins/jenkins-slave/workspace/Lucene-Solr-NightlyTests-master/solr/build/solr-core/test/J0/temp/solr.core.TestLazyCores_9F2407C2F73BD43-001/tempDir-001/collection1/conf
   [junit4]   2> 1007868 INFO  (coreLoadExecutor-825-thread-1) [    x:collection1] o.a.s.r.RestManager Initializing 0 registered ManagedResources
   [junit4]   2> 1007868 INFO  (coreLoadExecutor-825-thread-1) [    x:collection1] o.a.s.h.ReplicationHandler Commits will be reserved for  10000
   [junit4]   2> 1007868 INFO  (coreLoadExecutor-825-thread-1) [    x:collection1] o.a.s.c.CoreContainer registering core: collection1
   [junit4]   2> 1007868 INFO  (OldIndexDirectoryCleanupThreadForCore-collection1) [    x:collection1] o.a.s.c.SolrCore Looking for old index directories to cleanup for core collection1 in /x1/jenkins/jenkins-slave/workspace/Lucene-Solr-NightlyTests-master/solr/build/solr-core/test/J0/temp/solr.core.TestLazyCores_9F2407C2F73BD43-001/tempDir-001/collection1/data/
   [junit4]   2> 1007868 WARN  (OldIndexDirectoryCleanupThreadForCore-collection1) [    x:collection1] o.a.s.c.DirectoryFactory /x1/jenkins/jenkins-slave/workspace/Lucene-Solr-NightlyTests-master/solr/build/solr-core/test/J0/temp/solr.core.TestLazyCores_9F2407C2F73BD43-001/tempDir-001/collection1/data/ does not point to a valid data directory; skipping clean-up of old index directories.
   [junit4]   2> 1007869 INFO  (searcherExecutor-827-thread-1-processing-x:collection1) [    x:collection1] o.a.s.c.SolrCore [collection1] Registered new searcher Searcher@208b3370[collection1] main{ExitableDirectoryReader(UninvertingDirectoryReader())}
   [junit4]   2> 1007869 INFO  (coreLoadExecutor-825-thread-3) [    x:collection5] o.a.s.c.SolrCore no updateRequestProcessorChain defined as default, creating implicit default
   [junit4]   2> 1007870 INFO  (coreLoadExecutor-825-thread-3) [    x:collection5] o.a.s.h.l.XMLLoader xsltCacheLifetimeSeconds=60
   [junit4]   2> 1007870 INFO  (coreLoadExecutor-825-thread-3) [    x:collection5] o.a.s.h.l.XMLLoader xsltCacheLifetimeSeconds=60
   [junit4]   2> 1007871 INFO  (coreLoadExecutor-825-thread-3) [    x:collection5] o.a.s.h.l.XMLLoader xsltCacheLifetimeSeconds=60
   [junit4]   2> 1007871 INFO  (coreLoadExecutor-825-thread-3) [    x:collection5] o.a.s.h.l.XMLLoader xsltCacheLifetimeSeconds=60
   [junit4]   2> 1007887 INFO  (coreLoadExecutor-825-thread-3) [    x:collection5] o.a.s.c.RequestHandlers Registered paths: /admin/mbeans,/update/csv,/sql,/update/json/docs,/admin/luke,/graph,/export,/select,/admin/segments,/get,/admin/system,/replication,/admin/properties,/config,/stream,/schema,/admin/plugins,/admin/logging,/update/json,/admin/ping,/admin/threads,/update,/admin/file
   [junit4]   2> 1007887 INFO  (coreLoadExecutor-825-thread-3) [    x:collection5] o.a.s.c.SolrCore Using default statsCache cache: org.apache.solr.search.stats.LocalStatsCache
   [junit4]   2> 1007888 INFO  (OldIndexDirectoryCleanupThreadForCore-collection5) [    x:collection5] o.a.s.c.SolrCore Looking for old index directories to cleanup for core collection5 in /x1/jenkins/jenkins-slave/workspace/Lucene-Solr-NightlyTests-master/solr/build/solr-core/test/J0/temp/solr.core.TestLazyCores_9F2407C2F73BD43-001/tempDir-001/collection5/data/
   [junit4]   2> 1007888 INFO  (coreLoadExecutor-825-thread-3) [    x:collection5] o.a.s.u.CommitTracker Hard AutoCommit: disabled
   [junit4]   2> 1007888 INFO  (coreLoadExecutor-825-thread-3) [    x:collection5] o.a.s.u.CommitTracker Soft AutoCommit: disabled
   [junit4]   2> 1007888 WARN  (OldIndexDirectoryCleanupThreadForCore-collection5) [    x:collection5] o.a.s.c.DirectoryFactory /x1/jenkins/jenkins-slave/workspace/Lucene-Solr-NightlyTests-master/solr/build/solr-core/test/J0/temp/solr.core.TestLazyCores_9F2407C2F73BD43-001/tempDir-001/collection5/data/ does not point to a valid data directory; skipping clean-up of old index directories.
   [junit4]   2> 1007888 INFO  (coreLoadExecutor-825-thread-3) [    x:collection5] o.a.s.u.RandomMergePolicy RandomMergePolicy wrapping class org.apache.lucene.index.TieredMergePolicy: [TieredMergePolicy: maxMergeAtOnce=25, maxMergeAtOnceExplicit=18, maxMergedSegmentMB=59.7578125, floorSegmentMB=1.0859375, forceMergeDeletesPctAllowed=14.477674756977915, segmentsPerTier=24.0, maxCFSSegmentSizeMB=8.796093022207999E12, noCFSRatio=1.0
   [junit4]   2> 1007888 INFO  (coreLoadExecutor-825-thread-3) [    x:collection5] o.a.s.c.SolrDeletionPolicy SolrDeletionPolicy.onInit: commits: num=1
   [junit4]   2> 	commit{dir=MockDirectoryWrapper(RAMDirectory@9d378c9 lockFactory=org.apache.lucene.store.SingleInstanceLockFactory@446f221e),segFN=segments_1,generation=1}
   [junit4]   2> 1007888 INFO  (coreLoadExecutor-825-thread-3) [    x:collection5] o.a.s.c.SolrDeletionPolicy newest commit generation = 1
   [junit4]   2> 1007888 INFO  (coreLoadExecutor-825-thread-3) [    x:collection5] o.a.s.s.SolrIndexSearcher Opening [Searcher@45df91aa[collection5] main]
   [junit4]   2> 1007889 INFO  (coreLoadExecutor-825-thread-3) [    x:collection5] o.a.s.r.ManagedResourceStorage File-based storage initialized to use dir: /x1/jenkins/jenkins-slave/workspace/Lucene-Solr-NightlyTests-master/solr/build/solr-core/test/J0/temp/solr.core.TestLazyCores_9F2407C2F73BD43-001/tempDir-001/collection5/conf
   [junit4]   2> 1007889 INFO  (coreLoadExecutor-825-thread-3) [    x:collection5] o.a.s.r.RestManager Initializing RestManager with initArgs: {storageDir=/x1/jenkins/jenkins-slave/workspace/Lucene-Solr-NightlyTests-master/solr/build/solr-core/test/J0/temp/solr.core.TestLazyCores_9F2407C2F73BD43-001/tempDir-001/collection5/conf}
   [junit4]   2> 1007889 INFO  (coreLoadExecutor-825-thread-3) [    x:collection5] o.a.s.r.ManagedResourceStorage Reading _rest_managed.json using file:dir=/x1/jenkins/jenkins-slave/workspace/Lucene-Solr-NightlyTests-master/solr/build/solr-core/test/J0/temp/solr.core.TestLazyCores_9F2407C2F73BD43-001/tempDir-001/collection5/conf
   [junit4]   2> 1007889 INFO  (coreLoadExecutor-825-thread-3) [    x:collection5] o.a.s.r.RestManager Initializing 0 registered ManagedResources
   [junit4]   2> 1007889 INFO  (coreLoadExecutor-825-thread-3) [    x:collection5] o.a.s.h.ReplicationHandler Commits will be reserved for  10000
   [junit4]   2> 1007889 INFO  (coreLoadExecutor-825-thread-3) [    x:collection5] o.a.s.c.CoreContainer registering core: collection5
   [junit4]   2> 1007891 INFO  (searcherExecutor-828-thread-1-processing-x:collection5) [    x:collection5] o.a.s.c.SolrCore [collection5] Registered new searcher Searcher@45df91aa[collection5] main{ExitableDirectoryReader(UninvertingDirectoryReader())}
   [junit4]   2> 1007892 INFO  (Thread-987) [    ] o.a.s.c.SolrResourceLoader new SolrResourceLoader for directory: '/x1/jenkins/jenkins-slave/workspace/Lucene-Solr-NightlyTests-master/solr/build/solr-core/test/J0/temp/solr.core.TestLazyCores_9F2407C2F73BD43-001/tempDir-001/collection3'
   [junit4]   2> 1007892 INFO  (Thread-987) [    ] o.a.s.c.SolrResourceLoader JNDI not configured for solr (NoInitialContextEx)
   [junit4]   2> 1007893 INFO  (Thread-987) [    ] o.a.s.c.SolrResourceLoader solr home defaulted to 'solr/' (could not find system property or JNDI)
   [junit4]   2> 1008005 INFO  (Thread-987) [    ] o.a.s.c.SolrConfig current version of requestparams : -1
   [junit4]   2> 1008007 WARN  (Thread-987) [    ] o.a.s.c.Config Beginning with Solr 5.5, <mergePolicy> is deprecated, use <mergePolicyFactory> instead.
   [junit4]   2> 1008010 INFO  (Thread-987) [    ] o.a.s.c.SolrConfig Using Lucene MatchVersion: 7.0.0
   [junit4]   2> 1008017 INFO  (Thread-987) [    ] o.a.s.c.SolrConfig Loaded SolrConfig: solrconfig.xml
   [junit4]   2> 1008019 INFO  (Thread-987) [    ] o.a.s.s.IndexSchema [collection3] Schema name=tiny
   [junit4]   2> 1008020 INFO  (Thread-987) [    ] o.a.s.s.IndexSchema unique key field: id
   [junit4]   2> 1008021 INFO  (Thread-987) [    ] o.a.s.c.ConfigSetProperties Did not find ConfigSet properties, assuming default properties: Can't find resource 'configsetprops.json' in classpath or '/x1/jenkins/jenkins-slave/workspace/Lucene-Solr-NightlyTests-master/solr/build/solr-core/test/J0/temp/solr.core.TestLazyCores_9F2407C2F73BD43-001/tempDir-001/collection3'
   [junit4]   2> 1008021 INFO  (Thread-987) [    ] o.a.s.c.CoreContainer Creating SolrCore 'collection3' using configuration from instancedir /x1/jenkins/jenkins-slave/workspace/Lucene-Solr-NightlyTests-master/solr/build/solr-core/test/J0/temp/solr.core.TestLazyCores_9F2407C2F73BD43-001/tempDir-001/collection3
   [junit4]   2> 1008021 INFO  (Thread-987) [    x:collection3] o.a.s.c.SolrCore org.apache.solr.core.MockDirectoryFactory
   [junit4]   2> 1008021 INFO  (Thread-987) [    x:collection3] o.a.s.c.SolrCore [[collection3] ] Opening new SolrCore at [/x1/jenkins/jenkins-slave/workspace/Lucene-Solr-NightlyTests-master/solr/build/solr-core/test/J0/temp/solr.core.TestLazyCores_9F2407C2F73BD43-001/tempDir-001/collection3], dataDir=[/x1/jenkins/jenkins-slave/workspace/Lucene-Solr-NightlyTests-master/solr/build/solr-core/test/J0/temp/solr.core.TestLazyCores_9F2407C2F73BD43-001/tempDir-001/collection3/data/]
   [junit4]   2> 1008021 INFO  (Thread-987) [    x:collection3] o.a.s.c.SolrCore JMX monitoring not detected for core: collection3
   [junit4]   2> 1008022 INFO  (Thread-987) [    x:collection3] o.a.s.c.CachingDirectoryFactory return new directory for /x1/jenkins/jenkins-slave/workspace/Lucene-Solr-NightlyTests-master/solr/build/solr-core/test/J0/temp/solr.core.TestLazyCores_9F2407C2F73BD43-001/tempDir-001/collection3/data
   [junit4]   2> 1008023 INFO  (Thread-987) [    x:collection3] o.a.s.c.SolrCore New index directory detected: old=null new=/x1/jenkins/jenkins-slave/workspace/Lucene-Solr-NightlyTests-master/solr/build/solr-core/test/J0/temp/solr.core.TestLazyCores_9F2407C2F73BD43-001/tempDir-001/collection3/data/index/
   [junit4]   2> 1008023 WARN  (Thread-987) [    x:collection3] o.a.s.c.SolrCore [collection3] Solr index directory '/x1/jenkins/jenkins-slave/workspace/Lucene-Solr-NightlyTests-master/solr/build/solr-core/test/J0/temp/solr.core.TestLazyCores_9F2407C2F73BD43-001/tempDir-001/collection3/data/index' doesn't exist. Creating new index...
   [junit4]   2> 1008023 INFO  (Thread-987) [    x:collection3] o.a.s.c.CachingDirectoryFactory return new directory for /x1/jenkins/jenkins-slave/workspace/Lucene-Solr-NightlyTests-master/solr/build/solr-core/test/J0/temp/solr.core.TestLazyCores_9F2407C2F73BD43-001/tempDir-001/collection3/data/index
   [junit4]   2> 1008023 INFO  (Thread-987) [    x:collection3] o.a.s.u.RandomMergePolicy RandomMergePolicy wrapping class org.apache.lucene.index.LogByteSizeMergePolicy: [LogByteSizeMergePolicy: minMergeSize=1677721, mergeFactor=36, maxMergeSize=2147483648, maxMergeSizeForForcedMerge=9223372036854775807, calibrateSizeByDeletes=false, maxMergeDocs=2147483647, maxCFSSegmentSizeMB=8.796093022207999E12, noCFSRatio=0.12777455999098164]
   [junit4]   2> 1008023 INFO  (Thread-987) [    x:collection3] o.a.s.c.SolrDeletionPolicy SolrDeletionPolicy.onCommit: commits: num=1
   [junit4]   2> 	commit{dir=MockDirectoryWrapper(RAMDirectory@595bf05a lockFactory=org.apache.lucene.store.SingleInstanceLockFactory@69a21ec3),segFN=segments_1,generation=1}
   [junit4]   2> 1008023 INFO  (Thread-987) [    x:collection3] o.a.s.c.SolrDeletionPolicy newest commit generation = 1
   [junit4]   2> 1008024 INFO  (Thread-987) [    x:collection3] o.a.s.c.SolrCore no updateRequestProcessorChain defined as default, creating implicit default
   [junit4]   2> 1008025 INFO  (Thread-987) [    x:collection3] o.a.s.h.l.XMLLoader xsltCacheLifetimeSeconds=60
   [junit4]   2> 1008025 INFO  (Thread-987) [    x:collection3] o.a.s.h.l.XMLLoader xsltCacheLifetimeSeconds=60
   [junit4]   2> 1008026 INFO  (Thread-987) [    x:collection3] o.a.s.h.l.XMLLoader xsltCacheLifetimeSeconds=60
   [junit4]   2> 1008026 INFO  (Thread-987) [    x:collection3] o.a.s.h.l.XMLLoader xsltCacheLifetimeSeconds=60
   [junit4]   2> 1008027 INFO  (Thread-987) [    x:collection3] o.a.s.c.RequestHandlers Registered paths: /admin/mbeans,/update/csv,/sql,/update/json/docs,/admin/luke,/graph,/export,/select,/admin/segments,/get,/admin/system,/replication,/admin/properties,/config,/stream,/schema,/admin/plugins,/admin/logging,/update/json,/admin/ping,/admin/threads,/update,/admin/file
   [junit4]   2> 1008027 INFO  (Thread-987) [    x:collection3] o.a.s.c.SolrCore Using default statsCache cache: org.apache.solr.search.stats.LocalStatsCache
   [junit4]   2> 1008027 INFO  (Thread-987) [    x:collection3] o.a.s.u.CommitTracker Hard AutoCommit: disabled
   [junit4]   2> 1008027 INFO  (Thread-987) [    x:collection3] o.a.s.u.CommitTracker Soft AutoCommit: disabled
   [junit4]   2> 1008027 INFO  (Thread-987) [    x:collection3] o.a.s.u.RandomMergePolicy RandomMergePolicy wrapping class org.apache.lucene.index.TieredMergePolicy: [TieredMergePolicy: maxMergeAtOnce=25, maxMergeAtOnceExplicit=18, maxMergedSegmentMB=59.7578125, floorSegmentMB=1.0859375, forceMergeDeletesPctAllowed=14.477674756977915, segmentsPerTier=24.0, maxCFSSegmentSizeMB=8.796093022207999E12, noCFSRatio=1.0
   [junit4]   2> 1008027 INFO  (Thread-987) [    x:collection3] o.a.s.c.SolrDeletionPolicy SolrDeletionPolicy.onInit: commits: num=1
   [junit4]   2> 	commit{dir=MockDirectoryWrapper(RAMDirectory@595bf05a lockFactory=org.apache.lucene.store.SingleInstanceLockFactory@69a21ec3),segFN=segments_1,generation=1}
   [junit4]   2> 1008027 INFO  (Thread-987) [    x:collection3] o.a.s.c.SolrDeletionPolicy newest commit generation = 1
   [junit4]   2> 1008028 INFO  (Thread-987) [    x:collection3] o.a.s.s.SolrIndexSearcher Opening [Searcher@1f237b65[collection3] main]
   [junit4]   2> 1008028 INFO  (Thread-987) [    x:collection3] o.a.s.r.ManagedResourceStorage File-based storage initialized to use dir: /x1/jenkins/jenkins-slave/workspace/Lucene-Solr-NightlyTests-master/solr/build/solr-core/test/J0/temp/solr.core.TestLazyCores_9F2407C2F73BD43-001/tempDir-001/collection3/conf
   [junit4]   2> 1008028 INFO  (Thread-987) [    x:collection3] o.a.s.r.RestManager Initializing RestManager with initArgs: {storageDir=/x1/jenkins/jenkins-slave/workspace/Lucene-Solr-NightlyTests-master/solr/build/solr-core/test/J0/temp/solr.core.TestLazyCores_9F2407C2F73BD43-001/tempDir-001/collection3/conf}
   [junit4]   2> 1008028 INFO  (Thread-987) [    x:collection3] o.a.s.r.ManagedResourceStorage Reading _rest_managed.json using file:dir=/x1/jenkins/jenkins-slave/workspace/Lucene-Solr-NightlyTests-master/solr/build/solr-core/test/J0/temp/solr.core.TestLazyCores_9F2407C2F73BD43-001/tempDir-001/collection3/conf
   [junit4]   2> 1008028 INFO  (Thread-987) [    x:collection3] o.a.s.r.RestManager Initializing 0 registered ManagedResources
   [junit4]   2> 1008028 INFO  (Thread-987) [    x:collection3] o.a.s.h.ReplicationHandler Commits will be reserved for  10000
   [junit4]   2> 1008035 INFO  (Thread-987) [    x:collection3] o.a.s.c.SolrCores Opening transient core collection3
   [junit4]   2> 1008035 INFO  (Thread-987) [    x:collection3] o.a.s.c.CoreContainer registering core: collection3
   [junit4]   2> 1008044 INFO  (searcherExecutor-838-thread-1-processing-x:collection3) [    x:collection3] o.a.s.c.SolrCore [collection3] Registered new searcher Searcher@1f237b65[collection3] main{ExitableDirectoryReader(UninvertingDirectoryReader())}
   [junit4]   2> 1008051 INFO  (TEST-TestLazyCores.testRace-seed#[9F2407C2F73BD43]) [    ] o.a.s.c.CoreContainer Shutting down CoreContainer instance=1977215895
   [junit4]   2> 1008056 INFO  (coreCloseExecutor-842-thread-1) [    x:collection1] o.a.s.c.SolrCore [collection1]  CLOSING SolrCore org.apache.solr.core.SolrCore@28479f18
   [junit4]   2> 1008232 INFO  (coreCloseExecutor-842-thread-1) [    x:collection1] o.a.s.u.DirectUpdateHandler2 closing DirectUpdateHandler2{commits=0,autocommits=0,soft autocommits=0,optimizes=0,rollbacks=0,expungeDeletes=0,docsPending=0,adds=0,deletesById=0,deletesByQuery=0,errors=0,cumulative_adds=0,cumulative_deletesById=0,cumulative_deletesByQuery=0,cumulative_errors=0}
   [junit4]   2> 1008237 INFO  (OldIndexDirectoryCleanupThreadForCore-collection3) [    x:collection3] o.a.s.c.SolrCore Looking for old index directories to cleanup for core collection3 in /x1/jenkins/jenkins-slave/workspace/Lucene-Solr-NightlyTests-master/solr/build/solr-core/test/J0/temp/solr.core.TestLazyCores_9F2407C2F73BD43-001/tempDir-001/collection3/data/
   [junit4]   2> 1008237 WARN  (OldIndexDirectoryCleanupThreadForCore-collection3) [    x:collection3] o.a.s.c.DirectoryFactory /x1/jenkins/jenkins-slave/workspace/Lucene-Solr-NightlyTests-master/solr/build/solr-core/test/J0/temp/solr.core.TestLazyCores_9F2407C2F73BD43-001/tempDir-001/collection3/data/ does not point to a valid data directory; skipping clean-up of old index directories.
   [junit4]   2> 1008238 INFO  (coreCloseExecutor-842-thread-2) [    x:collection5] o.a.s.c.SolrCore [collection5]  CLOSING SolrCore org.apache.solr.core.SolrCore@5ac05985
   [junit4]   2> 1008238 INFO  (coreCloseExecutor-842-thread-3) [    x:collection2] o.a.s.c.SolrCore [collection2]  CLOSING SolrCore org.apache.solr.core.SolrCore@5ad3c332
   [junit4]   2> 1008243 INFO  (coreCloseExecutor-842-thread-1) [    x:collection1] o.a.s.u.SolrCoreState Closing SolrCoreState
   [junit4]   2> 1008243 INFO  (coreCloseExecutor-842-thread-1) [    x:collection1] o.a.s.u.DefaultSolrCoreState SolrCoreState ref count has reached 0 - closing IndexWriter
   [junit4]   2> 1008243 INFO  (coreCloseExecutor-842-thread-1) [    x:collection1] o.a.s.u.DefaultSolrCoreState closing IndexWriter with IndexWriterCloser
   [junit4]   2> 1008243 INFO  (coreCloseExecutor-842-thread-1) [    x:collection1] o.a.s.c.SolrCore [collection1] Closing main searcher on request.
   [junit4]   2> 1008243 INFO  (coreCloseExecutor-842-thread-4) [    x:collection3] o.a.s.c.SolrCore [collection3]  CLOSING SolrCore org.apache.solr.core.SolrCore@9f7c731
   [junit4]   2> 1008243 INFO  (coreCloseExecutor-842-thread-2) [    x:collection5] o.a.s.u.DirectUpdateHandler2 closing DirectUpdateHandler2{commits=0,autocommits=0,soft autocommits=0,optimizes=0,rollbacks=0,expungeDeletes=0,docsPending=0,adds=0,deletesById=0,deletesByQuery=0,errors=0,cumulative_adds=0,cumulative_deletesById=0,cumulative_deletesByQuery=0,cumulative_errors=0}
   [junit4]   2> 1008243 INFO  (coreCloseExecutor-842-thread-2) [    x:collection5] o.a.s.u.SolrCoreState Closing SolrCoreState
   [junit4]   2> 1008243 INFO  (coreCloseExecutor-842-thread-2) [    x:collection5] o.a.s.u.DefaultSolrCoreState SolrCoreState ref count has reached 0 - closing IndexWriter
   [junit4]   2> 1008243 INFO  (coreCloseExecutor-842-thread-2) [    x:collection5] o.a.s.u.DefaultSolrCoreState closing IndexWriter with IndexWriterCloser
   [junit4]   2> 1008244 INFO  (coreCloseExecutor-842-thread-4) [    x:collection3] o.a.s.u.DirectUpdateHandler2 closing DirectUpdateHandler2{commits=0,autocommits=0,soft autocommits=0,optimizes=0,rollbacks=0,expungeDeletes=0,docsPending=0,adds=0,deletesById=0,deletesByQuery=0,errors=0,cumulative_adds=0,cumulative_deletesById=0,cumulative_deletesByQuery=0,cumulative_errors=0}
   [junit4]   2> 1008244 INFO  (coreCloseExecutor-842-thread-1) [    x:collection1] o.a.s.c.CachingDirectoryFactory Closing MockDirectoryFactory - 2 directories currently being tracked
   [junit4]   2> 1008244 INFO  (coreCloseExecutor-842-thread-1) [    x:collection1] o.a.s.c.CachingDirectoryFactory looking to close /x1/jenkins/jenkins-slave/workspace/Lucene-Solr-NightlyTests-master/solr/build/solr-core/test/J0/temp/solr.core.TestLazyCores_9F2407C2F73BD43-001/tempDir-001/collection1/data [CachedDir<<refCount=0;path=/x1/jenkins/jenkins-slave/workspace/Lucene-Solr-NightlyTests-master/solr/build/solr-core/test/J0/temp/solr.core.TestLazyCores_9F2407C2F73BD43-001/tempDir-001/collection1/data;done=false>>]
   [junit4]   2> 1008244 INFO  (coreCloseExecutor-842-thread-1) [    x:collection1] o.a.s.c.CachingDirectoryFactory Closing directory, CoreContainer#isShutdown=true
   [junit4]   2> 1008244 INFO  (coreCloseExecutor-842-thread-1) [    x:collection1] o.a.s.c.CachingDirectoryFactory Closing directory: /x1/jenkins/jenkins-slave/workspace/Lucene-Solr-NightlyTests-master/solr/build/solr-core/test/J0/temp/solr.core.TestLazyCores_9F2407C2F73BD43-001/tempDir-001/collection1/data
   [junit4]   2> 1008244 INFO  (coreCloseExecutor-842-thread-1) [    x:collection1] o.a.s.c.CachingDirectoryFactory looking to close /x1/jenkins/jenkins-slave/workspace/Lucene-Solr-NightlyTests-master/solr/build/solr-core/test/J0/temp/solr.core.TestLazyCores_9F2407C2F73BD43-001/tempDir-001/collection1/data/index [CachedDir<<refCount=0;path=/x1/jenkins/jenkins-slave/workspace/Lucene-Solr-NightlyTests-master/solr/build/solr-core/test/J0/temp/solr.core.TestLazyCores_9F2407C2F73BD43-001/tempDir-001/collection1/data/index;done=false>>]
   [junit4]   2> 1008244 INFO  (coreCloseExecutor-842-thread-1) [    x:collection1] o.a.s.c.CachingDirectoryFactory Closing directory, CoreContainer#isShutdown=true
   [junit4]   2> 1008244 INFO  (coreCloseExecutor-842-thread-1) [    x:collection1] o.a.s.c.CachingDirectoryFactory Closing directory: /x1/jenkins/jenkins-slave/workspace/Lucene-Solr-NightlyTests-master/solr/build/solr-core/test/J0/temp/solr.core.TestLazyCores_9F2407C2F73BD43-001/tempDir-001/collection1/data/index
   [junit4]   2> 1008245 INFO  (coreCloseExecutor-842-thread-4) [    x:collection3] o.a.s.u.SolrCoreState Closing SolrCoreState
   [junit4]   2> 1008245 INFO  (coreCloseExecutor-842-thread-4) [    x:collection3] o.a.s.u.DefaultSolrCoreState SolrCoreState ref count has reached 0 - closing IndexWriter
   [junit4]   2> 1008245 INFO  (coreCloseExecutor-842-thread-4) [    x:collection3] o.a.s.u.DefaultSolrCoreState closing IndexWriter with IndexWriterCloser
   [junit4]   2> 1008245 INFO  (coreCloseExecutor-842-thread-2) [    x:collection5] o.a.s.c.SolrCore [collection5] Closing main searcher on request.
   [junit4]   2> 1008245 INFO  (coreCloseExecutor-842-thread-2) [    x:collection5] o.a.s.c.CachingDirectoryFactory Closing MockDirectoryFactory - 2 directories currently being tracked
   [junit4]   2> 1008245 INFO  (coreCloseExecutor-842-thread-2) [    x:collection5] o.a.s.c.CachingDirectoryFactory looking to close /x1/jenkins/jenkins-slave/workspace/Lucene-Solr-NightlyTests-master/solr/build/solr-core/test/J0/temp/solr.core.TestLazyCores_9F2407C2F73BD43-001/tempDir-001/collection5/data/index [CachedDir<<refCount=0;path=/x1/jenkins/jenkins-slave/workspace/Lucene-Solr-NightlyTests-master/solr/build/solr-core/test/J0/temp/solr.core.TestLazyCores_9F2407C2F73BD43-001/tempDir-001/collection5/data/index;done=false>>]
   [junit4]   2> 1008245 INFO  (coreCloseExecutor-842-thread-2) [    x:collection5] o.a.s.c.CachingDirectoryFactory Closing directory, CoreContainer#isShutdown=true
   [junit4]   2> 1008245 INFO  (coreCloseExecutor-842-thread-2) [    x:collection5] o.a.s.c.CachingDirectoryFactory Closing directory: /x1/jenkins/jenkins-slave/workspace/Lucene-Solr-NightlyTests-master/solr/build/solr-core/test/J0/temp/solr.core.TestLazyCores_9F2407C2F73BD43-001/tempDir-001/collection5/data/index
   [junit4]   2> 1008246 INFO  (coreCloseExecutor-842-thread-3) [    x:collection2] o.a.s.u.DirectUpdateHandler2 closing DirectUpdateHandler2{commits=0,autocommits=0,soft autocommits=0,optimizes=0,rollbacks=0,expungeDeletes=0,docsPending=0,adds=0,deletesById=0,deletesByQuery=0,errors=0,cumulative_adds=0,cumulative_deletesById=0,cumulative_deletesByQuery=0,cumulative_errors=0}
   [junit4]   2> 1008246 INFO  (coreCloseExecutor-842-thread-3) [    x:collection2] o.a.s.u.SolrCoreState Closing SolrCoreState
   [junit4]   2> 1008246 INFO  (coreCloseExecutor-842-thread-3) [    x:collection2] o.a.s.u.DefaultSolrCoreState SolrCoreState ref count has reached 0 - closing IndexWriter
   [junit4]   2> 1008246 INFO  (coreCloseExecutor-842-thread-3) [    x:collection2] o.a.s.u.DefaultSolrCoreState closing IndexWriter with IndexWriterCloser
   [junit4]   2> 1008247 INFO  (coreCloseExecutor-842-thread-3) [    x:collection2] o.a.s.c.SolrCore [collection2] Closing main searcher on request.
   [junit4]   2> 1008247 INFO  (coreCloseExecutor-842-thread-3) [    x:collection2] o.a.s.c.CachingDirectoryFactory Closing MockDirectoryFactory - 2 directories currently being tracked
   [junit4]   2> 1008247 INFO  (coreCloseExecutor-842-thread-3) [    x:collection2] o.a.s.c.CachingDirectoryFactory looking to close /x1/jenkins/jenkins-slave/workspace/Lucene-Solr-NightlyTests-master/solr/build/solr-core/test/J0/temp/solr.core.TestLazyCores_9F2407C2F73BD43-001/tempDir-001/collection2/data/index [CachedDir<<refCount=0;path=/x1/jenkins/jenkins-slave/workspace/Lucene-Solr-NightlyTests-master/solr/build/solr-core/test/J0/temp/solr.core.TestLazyCores_9F2407C2F73BD43-001/tempDir-001/collection2/data/index;done=false>>]
   [junit4]   2> 1008247 INFO  (coreCloseExecutor-842-thread-3) [    x:collection2] o.a.s.c.CachingDirectoryFactory Closing directory, CoreContainer#isShutdown=true
   [junit4]   2> 1008247 INFO  (coreCloseExecutor-842-thread-3) [    x:collection2] o.a.s.c.CachingDirectoryFactory Closing directory: /x1/jenkins/jenkins-slave/workspace/Lucene-Solr-NightlyTests-master/solr/build/solr-core/test/J0/temp/solr.core.TestLazyCores_9F2407C2F73BD43-001/tempDir-001/collection2/data/index
   [junit4]   2> 1008247 INFO  (coreCloseExecutor-842-thread-3) [    x:collection2] o.a.s.c.CachingDirectoryFactory looking to close /x1/jenkins/jenkins-slave/workspace/Lucene-Solr-NightlyTests-master/solr/build/solr-core/test/J0/temp/solr.core.TestLazyCores_9F2407C2F73BD43-001/tempDir-001/collection2/data [CachedDir<<refCount=0;path=/x1/jenkins/jenkins-slave/workspace/Lucene-Solr-NightlyTests-master/solr/build/solr-core/test/J0/temp/solr.core.TestLazyCores_9F2407C2F73BD43-001/tempDir-001/collection2/data;done=false>>]
   [junit4]   2> 1008247 INFO  (coreCloseExecutor-842-thread-3) [    x:collection2] o.a.s.c.CachingDirectoryFactory Closing directory, CoreContainer#isShutdown=true
   [junit4]   2> 1008247 INFO  (coreCloseExecutor-842-thread-3) [    x:collection2] o.a.s.c.CachingDirectoryFactory Closing directory: /x1/jenkins/jenkins-slave/workspace/Lucene-Solr-NightlyTests-master/solr/build/solr-core/test/J0/temp/solr.core.TestLazyCores_9F2407C2F73BD43-001/tempDir-001/collection2/data
   [junit4]   2> 1008247 INFO  (coreCloseExecutor-842-thread-2) [    x:collection5] o.a.s.c.CachingDirectoryFactory looking to close /x1/jenkins/jenkins-slave/workspace/Lucene-Solr-NightlyTests-master/solr/build/solr-core/test/J0/temp/solr.core.TestLazyCores_9F2407C2F73BD43-001/tempDir-001/collection5/data [CachedDir<<refCount=0;path=/x1/jenkins/jenkins-slave/workspace/Lucene-Solr-NightlyTests-master/solr/build/solr-core/test/J0/temp/solr.core.TestLazyCores_9F2407C2F73BD43-001/tempDir-001/collection5/data;done=false>>]
   [junit4]   2> 1008247 INFO  (coreCloseExecutor-842-thread-2) [    x:collection5] o.a.s.c.CachingDirectoryFactory Closing directory, CoreContainer#isShutdown=true
   [junit4]   2> 1008248 INFO  (coreCloseExecutor-842-thread-2) [    x:collection5] o.a.s.c.CachingDirectoryFactory Closing directory: /x1/jenkins/jenkins-slave/workspace/Lucene-Solr-NightlyTests-master/solr/build/solr-core/test/J0/temp/solr.core.TestLazyCores_9F2407C2F73BD43-001/tempDir-001/collection5/data
   [junit4]   2> 1008249 INFO  (coreCloseExecutor-842-thread-4) [    x:collection3] o.a.s.c.SolrCore [collection3] Closing main searcher on request.
   [junit4]   2> 1008250 INFO  (coreCloseExecutor-842-thread-4) [    x:collection3] o.a.s.c.CachingDirectoryFactory Closing MockDirectoryFactory - 2 directories currently being tracked
   [junit4]   2> 1008250 INFO  (coreCloseExecutor-842-thread-4) [    x:collection3] o.a.s.c.CachingDirectoryFactory looking to close /x1/jenkins/jenkins-slave/workspace/Lucene-Solr-NightlyTests-master/solr/build/solr-core/test/J0/temp/solr.core.TestLazyCores_9F2407C2F73BD43-001/tempDir-001/collection3/data [CachedDir<<refCount=0;path=/x1/jenkins/jenkins-slave/workspace/Lucene-Solr-NightlyTests-master/solr/build/solr-core/test/J0/temp/solr.core.TestLazyCores_9F2407C2F73BD43-001/tempDir-001/collection3/data;done=false>>]
   [junit4]   2> 1008250 INFO  (coreCloseExecutor-842-thread-4) [    x:collection3] o.a.s.c.CachingDirectoryFactory Closing directory, CoreContainer#isShutdown=true
   [junit4]   2> 1008250 INFO  (coreCloseExecutor-842-thread-4) [    x:collection3] o.a.s.c.CachingDirectoryFactory Closing directory: /x1/jenkins/jenkins-slave/workspace/Lucene-Solr-NightlyTests-master/solr/build/solr-core/test/J0/temp/solr.core.TestLazyCores_9F2407C2F73BD43-001/tempDir-001/collection3/data
   [junit4]   2> 1008250 INFO  (coreCloseExecutor-842-thread-4) [    x:collection3] o.a.s.c.CachingDirectoryFactory looking to close /x1/jenkins/jenkins-slave/workspace/Lucene-Solr-NightlyTests-master/solr/build/solr-core/test/J0/temp/solr.core.TestLazyCores_9F2407C2F73BD43-001/tempDir-001/collection3/data/index [CachedDir<<refCount=0;path=/x1/jenkins/jenkins-slave/workspace/Lucene-Solr-NightlyTests-master/solr/build/solr-core/test/J0/temp/solr.core.TestLazyCores_9F2407C2F73BD43-001/tempDir-001/collection3/data/index;done=false>>]
   [junit4]   2> 1008250 INFO  (coreCloseExecutor-842-thread-4) [    x:collection3] o.a.s.c.CachingDirectoryFactory Closing directory, CoreContainer#isShutdown=true
   [junit4]   2> 1008250 INFO  (coreCloseExecutor-842-thread-4) [    x:collection3] o.a.s.c.CachingDirectoryFactory Closing directory: /x1/jenkins/jenkins-slave/workspace/Lucene-Solr-NightlyTests-master/solr/build/solr-core/test/J0/temp/solr.core.TestLazyCores_9F2407C2F73BD43-001/tempDir-001/collection3/data/index
   [junit4]   2> 1008250 INFO  (TEST-TestLazyCores.testRace-seed#[9F2407C2F73BD43]) [    ] o.a.s.SolrTestCaseJ4 ###Ending testRace
   [junit4]   2> 1008256 INFO  (TEST-TestLazyCores.testCachingLimit-seed#[9F2407C2F73BD43]) [    ] o.a.s.SolrTestCaseJ4 ###Starting testCachingLimit
   [junit4]   2> 1008281 INFO  (TEST-TestLazyCores.testCachingLimit-seed#[9F2407C2F73BD43]) [    ] o.a.s.c.SolrResourceLoader new SolrResourceLoader for directory: '/x1/jenkins/jenkins-slave/workspace/Lucene-Solr-NightlyTests-master/solr/build/solr-core/test/J0/temp/solr.core.TestLazyCores_9F2407C2F73BD43-001/tempDir-002'
   [junit4]   2> 1008281 INFO  (TEST-TestLazyCores.testCachingLimit-seed#[9F2407C2F73BD43]) [    ] o.a.s.c.SolrResourceLoader JNDI not configured for solr (NoInitialContextEx)
   [junit4]   2> 1008281 INFO  (TEST-TestLazyCores.testCachingLimit-seed#[9F2407C2F73BD43]) [    ] o.a.s.c.SolrResourceLoader solr home defaulted to 'solr/' (could not find system property or JNDI)
   [junit4]   2> 1008281 INFO  (TEST-TestLazyCores.testCachingLimit-seed#[9F2407C2F73BD43]) [    ] o.a.s.c.CoreContainer New CoreContainer 1165908014
   [junit4]   2> 1008281 INFO  (TEST-TestLazyCores.testCachingLimit-seed#[9F2407C2F73BD43]) [    ] o.a.s.c.CoreContainer Loading cores into CoreContainer [instanceDir=/x1/jenkins/jenkins-slave/workspace/Lucene-Solr-NightlyTests-master/solr/build/solr-core/test/J0/temp/solr.core.TestLazyCores_9F2407C2F73BD43-001/tempDir-002]
   [junit4]   2> 1008281 WARN  (TEST-TestLazyCores.testCachingLimit-seed#[9F2407C2F73BD43]) [    ] o.a.s.c.CoreContainer Couldn't add files from /x1/jenkins/jenkins-slave/workspace/Lucene-Solr-NightlyTests-master/solr/build/solr-core/test/J0/temp/solr.core.TestLazyCores_9F2407C2F73BD43-001/tempDir-002/lib to classpath: /x1/jenkins/jenkins-slave/workspace/Lucene-Solr-NightlyTests-master/solr/build/solr-core/test/J0/temp/solr.core.TestLazyCores_9F2407C2F73BD43-001/tempDir-002/lib
   [junit4]   2> 1008282 INFO  (TEST-TestLazyCores.testCachingLimit-seed#[9F2407C2F73BD43]) [    ] o.a.s.h.c.HttpShardHandlerFactory created with socketTimeout : 600000,connTimeout : 60000,maxConnectionsPerHost : 20,maxConnections : 10000,corePoolSize : 0,maximumPoolSize : 2147483647,maxThreadIdleTime : 5,sizeOfQueue : -1,fairnessPolicy : false,
   [junit4]   2> 1008283 INFO  (TEST-TestLazyCores.testCachingLimit-seed#[9F2407C2F73BD43]) [    ] o.a.s.u.UpdateShardHandler Creating UpdateShardHandler HTTP client with params: 
   [junit4]   2> 1008285 INFO  (TEST-TestLazyCores.testCachingLimit-seed#[9F2407C2F73BD43]) [    ] o.a.s.c.SolrCores Allocating transient cache for 4 transient cores
   [junit4]   2> 1008285 INFO  (TEST-TestLazyCores.testCachingLimit-seed#[9F2407C2F73BD43]) [    ] o.a.s.l.LogWatcher SLF4J impl is org.slf4j.impl.Log4jLoggerFactory
   [junit4]   2> 1008285 INFO  (TEST-TestLazyCores.testCachingLimit-seed#[9F2407C2F73BD43]) [    ] o.a.s.l.LogWatcher Registering Log Listener [Log4j (org.slf4j.impl.Log4jLoggerFactory)]
   [junit4]   2> 1008285 INFO  (TEST-TestLazyCores.testCachingLimit-seed#[9F2407C2F73BD43]) [    ] o.a.s.c.CoreContainer Security conf doesn't exist. Skipping setup for authorization module.
   [junit4]   2> 1008285 INFO  (TEST-TestLazyCores.testCachingLimit-seed#[9F2407C2F73BD43]) [    ] o.a.s.c.CoreContainer No authentication plugin used.
   [junit4]   2> 1008285 INFO  (TEST-TestLazyCores.testCachingLimit-seed#[9F2407C2F73BD43]) [    ] o.a.s.c.CoreDescriptor Created CoreDescriptor: {name=collection1, config=solrconfig.xml, loadOnStartup=true, schema=schema.xml, configSetProperties=configsetprops.json, transient=false, dataDir=data/}
   [junit4]   2> 1008285 INFO  (TEST-TestLazyCores.testCachingLimit-seed#[9F2407C2F73BD43]) [    ] o.a.s.c.CoreDescriptor Created CoreDescriptor: {name=collection2, config=solrconfig.xml, loadOnStartup=true, schema=schema.xml, configSetProperties=configsetprops.json, transient=true, dataDir=data/}
   [junit4]   2> 1008285 INFO  (TEST-TestLazyCores.testCachingLimit-seed#[9F2407C2F73BD43]) [    ] o.a.s.c.CoreDescriptor Created CoreDescriptor: {name=collection3, config=solrconfig.xml, loadOnStartup=false, schema=schema.xml, configSetProperties=configsetprops.json, transient=on, dataDir=data/}
   [junit4]   2> 1008286 INFO  (TEST-TestLazyCores.testCachingLimit-seed#[9F2407C2F73BD43]) [    ] o.a.s.c.CoreDescriptor Created CoreDescriptor: {name=collection4, config=solrconfig.xml, loadOnStartup=false, schema=schema.xml, configSetProperties=configsetprops.json, transient=false, dataDir=data/}
   [junit4]   2> 1008286 INFO  (TEST-TestLazyCores.testCachingLimit-seed#[9F2407C2F73BD43]) [    ] o.a.s.c.CoreDescriptor Created CoreDescriptor: {name=collection5, config=solrconfig.xml, loadOnStartup=true, schema=schema.xml, configSetProperties=configsetprops.json, transient=false, dataDir=data/}
   [junit4]   2> 1008286 INFO  (TEST-TestLazyCores.testCachingLimit-seed#[9F2407C2F73BD43]) [    ] o.a.s.c.CoreDescriptor Created CoreDescriptor: {name=collection6, config=solrconfig.xml, loadOnStartup=false, schema=schema.xml, configSetProperties=configsetprops.json, transient=true, dataDir=data/}
   [junit4]   2> 1008286 INFO  (TEST-TestLazyCores.testCachingLimit-seed#[9F2407C2F73BD43]) [    ] o.a.s.c.CoreDescriptor Created CoreDescriptor: {name=collection7, config=solrconfig.xml, loadOnStartup=false, schema=schema.xml, configSetProperties=configsetprops.json, transient=true, dataDir=data/}
   [junit4]   2> 1008286 INFO  (TEST-TestLazyCores.testCachingLimit-seed#[9F2407C2F73BD43]) [    ] o.a.s.c.CoreDescriptor Created CoreDescriptor: {name=collection8, config=solrconfig.xml, loadOnStartup=false, schema=schema.xml, configSetProperties=configsetprops.json, transient=true, dataDir=data/}
   [junit4]   2> 1008286 INFO  (TEST-TestLazyCores.testCachingLimit-seed#[9F2407C2F73BD43]) [    ] o.a.s.c.CoreDescriptor Created CoreDescriptor: {name=collection9, config=solrconfig.xml, loadOnStartup=false, schema=schema.xml, configSetProperties=configsetprops.json, transient=true, dataDir=data/}
   [junit4]   2> 1008287 INFO  (coreLoadExecutor-849-thread-1) [    ] o.a.s.c.SolrResourceLoader new SolrResourceLoader for directory: '/x1/jenkins/jenkins-slave/workspace/Lucene-Solr-NightlyTests-master/solr/build/solr-core/test/J0/temp/solr.core.TestLazyCores_9F2407C2F73BD43-001/tempDir-002/collection1'
   [junit4]   2> 1008299 INFO  (coreLoadExecutor-849-thread-1) [    ] o.a.s.c.SolrResourceLoader JNDI not configured for solr (NoInitialContextEx)
   [junit4]   2> 1008299 INFO  (coreLoadExecutor-849-thread-1) [    ] o.a.s.c.SolrResourceLoader solr home defaulted to 'solr/' (could not find system property or JNDI)
   [junit4]   2> 1008288 INFO  (coreLoadExecutor-849-thread-3) [    ] o.a.s.c.SolrResourceLoader new SolrResourceLoader for directory: '/x1/jenkins/jenkins-slave/workspace/Lucene-Solr-NightlyTests-master/solr/build/solr-core/test/J0/temp/solr.core.TestLazyCores_9F2407C2F73BD43-001/tempDir-002/collection5'
   [junit4]   2> 1008288 INFO  (coreLoadExecutor-849-thread-2) [    ] o.a.s.c.SolrResourceLoader new SolrResourceLoader for directory: '/x1/jenkins/jenkins-slave/workspace/Lucene-Solr-NightlyTests-master/solr/build/solr-core/test/J0/temp/solr.core.TestLazyCores_9F2407C2F73BD43-001/tempDir-002/collection2'
   [junit4]   2> 1008310 INFO  (coreLoadExecutor-849-thread-2) [    ] o.a.s.c.SolrResourceLoader JNDI not configured for solr (NoInitialContextEx)
   [junit4]   2> 1008310 INFO  (coreLoadExecutor-849-thread-2) [    ] o.a.s.c.SolrResourceLoader solr home defaulted to 'solr/' (could not find system property or JNDI)
   [junit4]   2> 1008315 INFO  (coreLoadExecutor-849-thread-3) [    ] o.a.s.c.SolrResourceLoader JNDI not configured for solr (NoInitialContextEx)
   [junit4]   2> 1008316 INFO  (coreLoadExecutor-849-thread-3) [    ] o.a.s.c.SolrResourceLoader solr home defaulted to 'solr/' (could not find system property or JNDI)
   [junit4]   2> 1008324 INFO  (coreLoadExecutor-849-thread-2) [    ] o.a.s.c.SolrConfig current version of requestparams : -1
   [junit4]   2> 1008326 INFO  (coreLoadExecutor-849-thread-1) [    ] o.a.s.c.SolrConfig current version of requestparams : -1
   [junit4]   2> 1008327 WARN  (coreLoadExecutor-849-thread-2) [    ] o.a.s.c.Config Beginning with Solr 5.5, <mergePolicy> is deprecated, use <mergePolicyFactory> instead.
   [junit4]   2> 1008328 WARN  (coreLoadExecutor-849-thread-1) [    ] o.a.s.c.Config Beginning with Solr 5.5, <mergePolicy> is deprecated, use <mergePolicyFactory> instead.
   [junit4]   2> 1008341 INFO  (coreLoadExecutor-849-thread-1) [    ] o.a.s.c.SolrConfig Using Lucene MatchVersion: 7.0.0
   [junit4]   2> 1008345 INFO  (coreLoadExecutor-849-thread-2) [    ] o.a.s.c.SolrConfig Using Lucene MatchVersion: 7.0.0
   [junit4]   2> 1008371 INFO  (coreLoadExecutor-849-thread-3) [    ] o.a.s.c.SolrConfig current version of requestparams : -1
   [junit4]   2> 1008378 WARN  (coreLoadExecutor-849-thread-3) [    ] o.a.s.c.Config Beginning with Solr 5.5, <mergePolicy> is deprecated, use <mergePolicyFactory> instead.
   [junit4]   2> 1008379 INFO  (coreLoadExecutor-849-thread-2) [    ] o.a.s.c.SolrConfig Loaded SolrConfig: solrconfig.xml
   [junit4]   2> 1008379 INFO  (coreLoadExecutor-849-thread-3) [    ] o.a.s.c.SolrConfig Using Lucene MatchVersion: 7.0.0
   [junit4]   2> 1008379 INFO  (coreLoadExecutor-849-thread-1) [    ] o.a.s.c.SolrConfig Loaded SolrConfig: solrconfig.xml
   [junit4]   2> 1008387 INFO  (coreLoadExecutor-849-thread-3) [    ] o.a.s.c.SolrConfig Loaded SolrConfig: solrconfig.xml
   [junit4]   2> 1008388 INFO  (coreLoadExecutor-849-thread-2) [    ] o.a.s.s.IndexSchema [collection2] Schema name=tiny
   [junit4]   2> 1008390 INFO  (coreLoadExecutor-849-thread-1) [    ] o.a.s.s.IndexSchema [collection1] Schema name=tiny
   [junit4]   2> 1008390 INFO  (coreLoadExecutor-849-thread-2) [    ] o.a.s.s.IndexSchema unique key field: id
   [junit4]   2> 1008397 INFO  (coreLoadExecutor-849-thread-1) [    ] o.a.s.s.IndexSchema unique key field: id
   [junit4]   2> 1008416 INFO  (coreLoadExecutor-849-thread-3) [    ] o.a.s.s.IndexSchema [collection5] Schema name=tiny
   [junit4]   2> 1008426 INFO  (coreLoadExecutor-849-thread-3) [    ] o.a.s.s.IndexSchema unique key field: id
   [junit4]   2> 1008435 INFO  (coreLoadExecutor-849-thread-2) [    ] o.a.s.c.ConfigSetProperties Did not find ConfigSet properties, assuming default properties: Can't find resource 'configsetprops.json' in classpath or '/x1/jenkins/jenkins-slave/workspace/Lucene-Solr-NightlyTests-master/solr/build/solr-core/test/J0/temp/solr.core.TestLazyCores_9F2407C2F73BD43-001/tempDir-002/collection2'
   [junit4]   2> 1008435 INFO  (coreLoadExecutor-849-thread-2) [    ] o.a.s.c.CoreContainer Creating SolrCore 'collection2' using configuration from instancedir /x1/jenkins/jenkins-slave/workspace/Lucene-Solr-NightlyTests-master/solr/build/solr-core/test/J0/temp/solr.core.TestLazyCores_9F2407C2F73BD43-001/tempDir-002/collection2
   [junit4]   2> 1008435 INFO  (coreLoadExecutor-849-thread-2) [    x:collection2] o.a.s.c.SolrCore org.apache.solr.core.MockDirectoryFactory
   [junit4]   2> 1008435 INFO  (coreLoadExecutor-849-thread-2) [    x:collection2] o.a.s.c.SolrCore [[collection2] ] Opening new SolrCore at [/x1/jenkins/jenkins-slave/workspace/Lucene-Solr-NightlyTests-master/solr/build/solr-core/test/J0/temp/solr.core.TestLazyCores_9F2407C2F73BD43-001/tempDir-002/collection2], dataDir=[/x1/jenkins/jenkins-slave/workspace/Lucene-Solr-NightlyTests-master/solr/build/solr-core/test/J0/temp/solr.core.TestLazyCores_9F2407C2F73BD43-001/tempDir-002/collection2/data/]
   [junit4]   2> 1008435 INFO  (coreLoadExecutor-849-thread-2) [    x:collection2] o.a.s.c.SolrCore JMX monitoring not detected for core: collection2
   [junit4]   2> 1008436 INFO  (coreLoadExecutor-849-thread-2) [    x:collection2] o.a.s.c.CachingDirectoryFactory return new directory for /x1/jenkins/jenkins-slave/workspace/Lucene-Solr-NightlyTests-master/solr/build/solr-core/test/J0/temp/solr.core.TestLazyCores_9F2407C2F73BD43-001/tempDir-002/collection2/data
   [junit4]   2> 1008441 INFO  (coreLoadExecutor-849-thread-3) [    ] o.a.s.c.ConfigSetProperties Did not find ConfigSet properties, assuming default properties: Can't find resource 'configsetprops.json' in classpath or '/x1/jenkins/jenkins-slave/workspace/Lucene-Solr-NightlyTests-master/solr/build/solr-core/test/J0/temp/solr.core.TestLazyCores_9F2407C2F73BD43-001/tempDir-002/collection5'
   [junit4]   2> 1008441 INFO  (coreLoadExecutor-849-thread-3) [    ] o.a.s.c.CoreContainer Creating SolrCore 'collection5' using configuration from instancedir /x1/jenkins/jenkins-slave/workspace/Lucene-Solr-NightlyTests-master/solr/build/solr-core/test/J0/temp/solr.core.TestLazyCores_9F2407C2F73BD43-001/tempDir-002/collection5
   [junit4]   2> 1008441 INFO  (coreLoadExecutor-849-thread-3) [    x:collection5] o.a.s.c.SolrCore org.apache.solr.core.MockDirectoryFactory
   [junit4]   2> 1008441 INFO  (coreLoadExecutor-849-thread-3) [    x:collection5] o.a.s.c.SolrCore [[collection5] ] Opening new SolrCore at [/x1/jenkins/jenkins-slave/workspace/Lucene-Solr-NightlyTests-master/solr/build/solr-core/test/J0/temp/solr.core.TestLazyCores_9F2407C2F73BD43-001/tempDir-002/collection5], dataDir=[/x1/jenkins/jenkins-slave/workspace/Lucene-Solr-NightlyTests-master/solr/build/solr-core/test/J0/temp/solr.core.TestLazyCores_9F2407C2F73BD43-001/tempDir-002/collection5/data/]
   [junit4]   2> 1008441 INFO  (coreLoadExecutor-849-thread-3) [    x:collection5] o.a.s.c.SolrCore JMX monitoring not detected for core: collection5
   [junit4]   2> 1008441 INFO  (coreLoadExecutor-849-thread-3) [    x:collection5] o.a.s.c.CachingDirectoryFactory return new directory for /x1/jenkins/jenkins-slave/workspace/Lucene-Solr-NightlyTests-master/solr/build/solr-core/test/J0/temp/solr.core.TestLazyCores_9F2407C2F73BD43-001/tempDir-002/collection5/data
   [junit4]   2> 1008446 INFO  (coreLoadExecutor-849-thread-3) [    x:collection5] o.a.s.c.SolrCore New index directory detected: old=null new=/x1/jenkins/jenkins-slave/workspace/Lucene-Solr-NightlyTests-master/solr/build/solr-core/test/J0/temp/solr.core.TestLazyCores_9F2407C2F73BD43-001/tempDir-002/collection5/data/index/
   [junit4]   2> 1008446 WARN  (coreLoadExecutor-849-thread-3) [    x:collection5] o.a.s.c.SolrCore [collection5] Solr index directory '/x1/jenkins/jenkins-slave/workspace/Lucene-Solr-NightlyTests-master/solr/build/solr-core/test/J0/temp/solr.core.TestLazyCores_9F2407C2F73BD43-001/tempDir-002/collection5/data/index' doesn't exist. Creating new index...
   [junit4]   2> 1008447 INFO  (coreLoadExecutor-849-thread-3) [    x:collection5] o.a.s.c.CachingDirectoryFactory return new directory for /x1/jenkins/jenkins-slave/workspace/Lucene-Solr-NightlyTests-master/solr/build/solr-core/test/J0/temp/solr.core.TestLazyCores_9F2407C2F73BD43-001/tempDir-002/collection5/data/index
   [junit4]   2> 1008450 INFO  (coreLoadExecutor-849-thread-2) [    x:collection2] o.a.s.c.SolrCore New index directory detected: old=null new=/x1/jenkins/jenkins-slave/workspace/Lucene-Solr-NightlyTests-master/solr/build/solr-core/test/J0/temp/solr.core.TestLazyCores_9F2407C2F73BD43-001/tempDir-002/collection2/data/index/
   [junit4]   2> 1008450 WARN  (coreLoadExecutor-849-thread-2) [    x:collection2] o.a.s.c.SolrCore [collection2] Solr index directory '/x1/jenkins/jenkins-slave/workspace/Lucene-Solr-NightlyTests-master/solr/build/solr-core/test/J0/temp/solr.core.TestLazyCores_9F2407C2F73BD43-001/tempDir-002/collection2/data/index' doesn't exist. Creating new index...
   [junit4]   2> 1008450 INFO  (coreLoadExecutor-849-thread-2) [    x:collection2] o.a.s.c.CachingDirectoryFactory return new directory for /x1/jenkins/jenkins-slave/workspace/Lucene-Solr-NightlyTests-master/solr/build/solr-core/test/J0/temp/solr.core.T

[...truncated too long message...]

ns/jenkins-slave/workspace/Lucene-Solr-NightlyTests-master/solr/core/test-lib/apacheds-interceptors-event-2.0.0-M15.jar:/x1/jenkins/jenkins-slave/workspace/Lucene-Solr-NightlyTests-master/solr/core/test-lib/apacheds-interceptors-exception-2.0.0-M15.jar:/x1/jenkins/jenkins-slave/workspace/Lucene-Solr-NightlyTests-master/solr/core/test-lib/apacheds-interceptors-journal-2.0.0-M15.jar:/x1/jenkins/jenkins-slave/workspace/Lucene-Solr-NightlyTests-master/solr/core/test-lib/apacheds-interceptors-normalization-2.0.0-M15.jar:/x1/jenkins/jenkins-slave/workspace/Lucene-Solr-NightlyTests-master/solr/core/test-lib/apacheds-interceptors-operational-2.0.0-M15.jar:/x1/jenkins/jenkins-slave/workspace/Lucene-Solr-NightlyTests-master/solr/core/test-lib/apacheds-interceptors-referral-2.0.0-M15.jar:/x1/jenkins/jenkins-slave/workspace/Lucene-Solr-NightlyTests-master/solr/core/test-lib/apacheds-interceptors-schema-2.0.0-M15.jar:/x1/jenkins/jenkins-slave/workspace/Lucene-Solr-NightlyTests-master/solr/core/test-lib/apacheds-interceptors-subtree-2.0.0-M15.jar:/x1/jenkins/jenkins-slave/workspace/Lucene-Solr-NightlyTests-master/solr/core/test-lib/apacheds-interceptors-trigger-2.0.0-M15.jar:/x1/jenkins/jenkins-slave/workspace/Lucene-Solr-NightlyTests-master/solr/core/test-lib/apacheds-jdbm-partition-2.0.0-M15.jar:/x1/jenkins/jenkins-slave/workspace/Lucene-Solr-NightlyTests-master/solr/core/test-lib/apacheds-jdbm1-2.0.0-M2.jar:/x1/jenkins/jenkins-slave/workspace/Lucene-Solr-NightlyTests-master/solr/core/test-lib/apacheds-kerberos-codec-2.0.0-M15.jar:/x1/jenkins/jenkins-slave/workspace/Lucene-Solr-NightlyTests-master/solr/core/test-lib/apacheds-ldif-partition-2.0.0-M15.jar:/x1/jenkins/jenkins-slave/workspace/Lucene-Solr-NightlyTests-master/solr/core/test-lib/apacheds-mavibot-partition-2.0.0-M15.jar:/x1/jenkins/jenkins-slave/workspace/Lucene-Solr-NightlyTests-master/solr/core/test-lib/apacheds-protocol-kerberos-2.0.0-M15.jar:/x1/jenkins/jenkins-slave/workspace/Lucene-Solr-NightlyTests-master/solr/core/test-lib/apacheds-protocol-ldap-2.0.0-M15.jar:/x1/jenkins/jenkins-slave/workspace/Lucene-Solr-NightlyTests-master/solr/core/test-lib/apacheds-protocol-shared-2.0.0-M15.jar:/x1/jenkins/jenkins-slave/workspace/Lucene-Solr-NightlyTests-master/solr/core/test-lib/apacheds-xdbm-partition-2.0.0-M15.jar:/x1/jenkins/jenkins-slave/workspace/Lucene-Solr-NightlyTests-master/solr/core/test-lib/api-all-1.0.0-M20.jar:/x1/jenkins/jenkins-slave/workspace/Lucene-Solr-NightlyTests-master/solr/core/test-lib/bcprov-jdk15-1.45.jar:/x1/jenkins/jenkins-slave/workspace/Lucene-Solr-NightlyTests-master/solr/core/test-lib/cglib-nodep-2.2.jar:/x1/jenkins/jenkins-slave/workspace/Lucene-Solr-NightlyTests-master/solr/core/test-lib/commons-collections-3.2.2.jar:/x1/jenkins/jenkins-slave/workspace/Lucene-Solr-NightlyTests-master/solr/core/test-lib/commons-math3-3.4.1.jar:/x1/jenkins/jenkins-slave/workspace/Lucene-Solr-NightlyTests-master/solr/core/test-lib/easymock-3.0.jar:/x1/jenkins/jenkins-slave/workspace/Lucene-Solr-NightlyTests-master/solr/core/test-lib/ehcache-core-2.4.4.jar:/x1/jenkins/jenkins-slave/workspace/Lucene-Solr-NightlyTests-master/solr/core/test-lib/hadoop-common-2.6.0-tests.jar:/x1/jenkins/jenkins-slave/workspace/Lucene-Solr-NightlyTests-master/solr/core/test-lib/hadoop-hdfs-2.6.0-tests.jar:/x1/jenkins/jenkins-slave/workspace/Lucene-Solr-NightlyTests-master/solr/core/test-lib/hadoop-minikdc-2.6.0.jar:/x1/jenkins/jenkins-slave/workspace/Lucene-Solr-NightlyTests-master/solr/core/test-lib/jackson-annotations-2.5.4.jar:/x1/jenkins/jenkins-slave/workspace/Lucene-Solr-NightlyTests-master/solr/core/test-lib/jackson-databind-2.5.4.jar:/x1/jenkins/jenkins-slave/workspace/Lucene-Solr-NightlyTests-master/solr/core/test-lib/jersey-core-1.9.jar:/x1/jenkins/jenkins-slave/workspace/Lucene-Solr-NightlyTests-master/solr/core/test-lib/jersey-server-1.9.jar:/x1/jenkins/jenkins-slave/workspace/Lucene-Solr-NightlyTests-master/solr/core/test-lib/jetty-6.1.26.jar:/x1/jenkins/jenkins-slave/workspace/Lucene-Solr-NightlyTests-master/solr/core/test-lib/jetty-util-6.1.26.jar:/x1/jenkins/jenkins-slave/workspace/Lucene-Solr-NightlyTests-master/solr/core/test-lib/mina-core-2.0.0-M5.jar:/x1/jenkins/jenkins-slave/workspace/Lucene-Solr-NightlyTests-master/solr/core/test-lib/mockito-core-1.9.5.jar:/x1/jenkins/jenkins-slave/workspace/Lucene-Solr-NightlyTests-master/solr/core/test-lib/objenesis-1.2.jar:/x1/jenkins/jenkins-slave/workspace/Lucene-Solr-NightlyTests-master/solr/core/test-lib/presto-parser-0.122.jar:/x1/jenkins/jenkins-slave/workspace/Lucene-Solr-NightlyTests-master/solr/core/test-lib/slice-0.10.jar:/x1/jenkins/jenkins-slave/workspace/Lucene-Solr-NightlyTests-master/lucene/build/analysis/icu/lucene-analyzers-icu-7.0.0-SNAPSHOT.jar:/x1/jenkins/jenkins-slave/workspace/Lucene-Solr-NightlyTests-master/solr/build/contrib/solr-analysis-extras/classes/java:/x1/jenkins/jenkins-slave/workspace/Lucene-Solr-NightlyTests-master/lucene/build/queryparser/classes/test:/x1/jenkins/jenkins-slave/workspace/Lucene-Solr-NightlyTests-master/solr/contrib/analysis-extras/lib/icu4j-56.1.jar:/home/jenkins/jenkins-slave/tools/hudson.tasks.Ant_AntInstallation/ant-1.8.2/lib/ant-launcher.jar:/x1/jenkins/.ant/lib/ivy-2.3.0.jar:/home/jenkins/jenkins-slave/tools/hudson.tasks.Ant_AntInstallation/ant-1.8.2/lib/ant-antlr.jar:/home/jenkins/jenkins-slave/tools/hudson.tasks.Ant_AntInstallation/ant-1.8.2/lib/ant-apache-regexp.jar:/home/jenkins/jenkins-slave/tools/hudson.tasks.Ant_AntInstallation/ant-1.8.2/lib/ant-apache-resolver.jar:/home/jenkins/jenkins-slave/tools/hudson.tasks.Ant_AntInstallation/ant-1.8.2/lib/ant-commons-net.jar:/home/jenkins/jenkins-slave/tools/hudson.tasks.Ant_AntInstallation/ant-1.8.2/lib/ant-jmf.jar:/home/jenkins/jenkins-slave/tools/hudson.tasks.Ant_AntInstallation/ant-1.8.2/lib/ant-apache-oro.jar:/home/jenkins/jenkins-slave/tools/hudson.tasks.Ant_AntInstallation/ant-1.8.2/lib/ant-apache-xalan2.jar:/home/jenkins/jenkins-slave/tools/hudson.tasks.Ant_AntInstallation/ant-1.8.2/lib/ant-commons-logging.jar:/home/jenkins/jenkins-slave/tools/hudson.tasks.Ant_AntInstallation/ant-1.8.2/lib/ant-jsch.jar:/home/jenkins/jenkins-slave/tools/hudson.tasks.Ant_AntInstallation/ant-1.8.2/lib/ant-junit4.jar:/home/jenkins/jenkins-slave/tools/hudson.tasks.Ant_AntInstallation/ant-1.8.2/lib/ant-javamail.jar:/home/jenkins/jenkins-slave/tools/hudson.tasks.Ant_AntInstallation/ant-1.8.2/lib/ant-jai.jar:/home/jenkins/jenkins-slave/tools/hudson.tasks.Ant_AntInstallation/ant-1.8.2/lib/ant-jdepend.jar:/home/jenkins/jenkins-slave/tools/hudson.tasks.Ant_AntInstallation/ant-1.8.2/lib/ant-junit.jar:/home/jenkins/jenkins-slave/tools/hudson.tasks.Ant_AntInstallation/ant-1.8.2/lib/ant-apache-bsf.jar:/home/jenkins/jenkins-slave/tools/hudson.tasks.Ant_AntInstallation/ant-1.8.2/lib/ant-swing.jar:/home/jenkins/jenkins-slave/tools/hudson.tasks.Ant_AntInstallation/ant-1.8.2/lib/ant.jar:/home/jenkins/jenkins-slave/tools/hudson.tasks.Ant_AntInstallation/ant-1.8.2/lib/ant-netrexx.jar:/home/jenkins/jenkins-slave/tools/hudson.tasks.Ant_AntInstallation/ant-1.8.2/lib/ant-apache-bcel.jar:/home/jenkins/jenkins-slave/tools/hudson.tasks.Ant_AntInstallation/ant-1.8.2/lib/ant-testutil.jar:/home/jenkins/jenkins-slave/tools/hudson.tasks.Ant_AntInstallation/ant-1.8.2/lib/ant-apache-log4j.jar:/x1/jenkins/jenkins-slave/tools/hudson.model.JDK/latest1.8/lib/tools.jar:/x1/jenkins/.ivy2/cache/com.carrotsearch.randomizedtesting/junit4-ant/jars/junit4-ant-2.3.4.jar com.carrotsearch.ant.tasks.junit4.slave.SlaveMainSafe -eventsfile /x1/jenkins/jenkins-slave/workspace/Lucene-Solr-NightlyTests-master/solr/build/solr-core/test/temp/junit4-J1-20160616_081207_706.events @/x1/jenkins/jenkins-slave/workspace/Lucene-Solr-NightlyTests-master/solr/build/solr-core/test/temp/junit4-J1-20160616_081207_706.suites -stdin
   [junit4] ERROR: JVM J1 ended with an exception: Quit event not received from the forked process? This may indicate JVM crash or runner bugs.
   [junit4] 	at com.carrotsearch.ant.tasks.junit4.JUnit4.executeSlave(JUnit4.java:1501)
   [junit4] 	at com.carrotsearch.ant.tasks.junit4.JUnit4.access$000(JUnit4.java:121)
   [junit4] 	at com.carrotsearch.ant.tasks.junit4.JUnit4$2.call(JUnit4.java:955)
   [junit4] 	at com.carrotsearch.ant.tasks.junit4.JUnit4$2.call(JUnit4.java:952)
   [junit4] 	at java.util.concurrent.FutureTask.run(FutureTask.java:266)
   [junit4] 	at java.util.concurrent.ThreadPoolExecutor.runWorker(ThreadPoolExecutor.java:1142)
   [junit4] 	at java.util.concurrent.ThreadPoolExecutor$Worker.run(ThreadPoolExecutor.java:617)
   [junit4] 	at java.lang.Thread.run(Thread.java:745)

BUILD FAILED
/x1/jenkins/jenkins-slave/workspace/Lucene-Solr-NightlyTests-master/build.xml:747: The following error occurred while executing this line:
/x1/jenkins/jenkins-slave/workspace/Lucene-Solr-NightlyTests-master/build.xml:684: The following error occurred while executing this line:
/x1/jenkins/jenkins-slave/workspace/Lucene-Solr-NightlyTests-master/build.xml:59: The following error occurred while executing this line:
/x1/jenkins/jenkins-slave/workspace/Lucene-Solr-NightlyTests-master/solr/build.xml:233: The following error occurred while executing this line:
/x1/jenkins/jenkins-slave/workspace/Lucene-Solr-NightlyTests-master/solr/common-build.xml:531: The following error occurred while executing this line:
/x1/jenkins/jenkins-slave/workspace/Lucene-Solr-NightlyTests-master/lucene/common-build.xml:1427: The following error occurred while executing this line:
/x1/jenkins/jenkins-slave/workspace/Lucene-Solr-NightlyTests-master/lucene/common-build.xml:984: At least one slave process threw an exception, first: Quit event not received from the forked process? This may indicate JVM crash or runner bugs.

Total time: 217 minutes 31 seconds
Build step 'Invoke Ant' marked build as failure
Archiving artifacts
No prior successful build to compare, so performing full copy of artifacts
Recording test results
Email was triggered for: Failure - Any
Sending email for trigger: Failure - Any




Mime
View raw message