lucene-dev mailing list archives

Site index · List index
Message view « Date » · « Thread »
Top « Date » · « Thread »
From Policeman Jenkins Server <jenk...@thetaphi.de>
Subject [JENKINS] Lucene-Solr-6.x-Windows (32bit/jdk1.8.0_92) - Build # 240 - Still Failing!
Date Fri, 10 Jun 2016 15:05:35 GMT
Build: http://jenkins.thetaphi.de/job/Lucene-Solr-6.x-Windows/240/
Java: 32bit/jdk1.8.0_92 -server -XX:+UseParallelGC

2 tests failed.
FAILED:  org.apache.solr.security.BasicAuthIntegrationTest.testBasics

Error Message:
Test abandoned because suite timeout was reached.

Stack Trace:
java.lang.Exception: Test abandoned because suite timeout was reached.
	at __randomizedtesting.SeedInfo.seed([F20A57DBA1E1200]:0)


FAILED:  junit.framework.TestSuite.org.apache.solr.security.BasicAuthIntegrationTest

Error Message:
Suite timeout exceeded (>= 7200000 msec).

Stack Trace:
java.lang.Exception: Suite timeout exceeded (>= 7200000 msec).
	at __randomizedtesting.SeedInfo.seed([F20A57DBA1E1200]:0)




Build Log:
[...truncated 12665 lines...]
   [junit4] Suite: org.apache.solr.security.BasicAuthIntegrationTest
   [junit4]   2> 2910987 INFO  (TEST-BasicAuthIntegrationTest.testBasics-seed#[F20A57DBA1E1200]) [    ] o.a.s.c.ZkTestServer STARTING ZK TEST SERVER
   [junit4]   2> 2910991 INFO  (Thread-8119) [    ] o.a.s.c.ZkTestServer client port:0.0.0.0/0.0.0.0:0
   [junit4]   2> 2910991 INFO  (Thread-8119) [    ] o.a.s.c.ZkTestServer Starting server
   [junit4]   2> 2911088 INFO  (TEST-BasicAuthIntegrationTest.testBasics-seed#[F20A57DBA1E1200]) [    ] o.a.s.c.ZkTestServer start zk server on port:62580
   [junit4]   2> 2911088 INFO  (TEST-BasicAuthIntegrationTest.testBasics-seed#[F20A57DBA1E1200]) [    ] o.a.s.c.c.SolrZkClient Using default ZkCredentialsProvider
   [junit4]   2> 2911089 INFO  (TEST-BasicAuthIntegrationTest.testBasics-seed#[F20A57DBA1E1200]) [    ] o.a.s.c.c.ConnectionManager Waiting for client to connect to ZooKeeper
   [junit4]   2> 2911092 INFO  (zkCallback-11217-thread-1) [    ] o.a.s.c.c.ConnectionManager Watcher org.apache.solr.common.cloud.ConnectionManager@2970f3 name:ZooKeeperConnection Watcher:127.0.0.1:62580 got event WatchedEvent state:SyncConnected type:None path:null path:null type:None
   [junit4]   2> 2911092 INFO  (TEST-BasicAuthIntegrationTest.testBasics-seed#[F20A57DBA1E1200]) [    ] o.a.s.c.c.ConnectionManager Client is connected to ZooKeeper
   [junit4]   2> 2911093 INFO  (TEST-BasicAuthIntegrationTest.testBasics-seed#[F20A57DBA1E1200]) [    ] o.a.s.c.c.SolrZkClient Using default ZkACLProvider
   [junit4]   2> 2911093 INFO  (TEST-BasicAuthIntegrationTest.testBasics-seed#[F20A57DBA1E1200]) [    ] o.a.s.c.c.SolrZkClient makePath: /solr/solr.xml
   [junit4]   2> 2911117 INFO  (jetty-launcher-11216-thread-1) [    ] o.e.j.s.Server jetty-9.3.8.v20160314
   [junit4]   2> 2911118 INFO  (jetty-launcher-11216-thread-2) [    ] o.e.j.s.Server jetty-9.3.8.v20160314
   [junit4]   2> 2911119 INFO  (jetty-launcher-11216-thread-2) [    ] o.e.j.s.h.ContextHandler Started o.e.j.s.ServletContextHandler@18d27dd{/solr,null,AVAILABLE}
   [junit4]   2> 2911119 INFO  (jetty-launcher-11216-thread-3) [    ] o.e.j.s.Server jetty-9.3.8.v20160314
   [junit4]   2> 2911120 INFO  (jetty-launcher-11216-thread-3) [    ] o.e.j.s.h.ContextHandler Started o.e.j.s.ServletContextHandler@409d69{/solr,null,AVAILABLE}
   [junit4]   2> 2911120 INFO  (jetty-launcher-11216-thread-2) [    ] o.e.j.s.ServerConnector Started ServerConnector@52ed28{HTTP/1.1,[http/1.1]}{127.0.0.1:62584}
   [junit4]   2> 2911120 INFO  (jetty-launcher-11216-thread-2) [    ] o.e.j.s.Server Started @2915227ms
   [junit4]   2> 2911120 INFO  (jetty-launcher-11216-thread-2) [    ] o.a.s.c.s.e.JettySolrRunner Jetty properties: {hostContext=/solr, hostPort=62584}
   [junit4]   2> 2911120 INFO  (jetty-launcher-11216-thread-2) [    ] o.a.s.s.SolrDispatchFilter SolrDispatchFilter.init(): sun.misc.Launcher$AppClassLoader@1d16e93
   [junit4]   2> 2911120 INFO  (jetty-launcher-11216-thread-2) [    ] o.a.s.c.SolrResourceLoader new SolrResourceLoader for directory: 'C:\Users\jenkins\workspace\Lucene-Solr-6.x-Windows\solr\build\solr-core\test\J0\temp\solr.security.BasicAuthIntegrationTest_F20A57DBA1E1200-001\tempDir-001\node2'
   [junit4]   2> 2911120 INFO  (jetty-launcher-11216-thread-3) [    ] o.e.j.s.ServerConnector Started ServerConnector@1a73c10{HTTP/1.1,[http/1.1]}{127.0.0.1:62587}
   [junit4]   2> 2911120 INFO  (jetty-launcher-11216-thread-2) [    ] o.a.s.c.SolrResourceLoader JNDI not configured for solr (NoInitialContextEx)
   [junit4]   2> 2911120 INFO  (jetty-launcher-11216-thread-3) [    ] o.e.j.s.Server Started @2915227ms
   [junit4]   2> 2911120 INFO  (jetty-launcher-11216-thread-2) [    ] o.a.s.c.SolrResourceLoader solr home defaulted to 'solr/' (could not find system property or JNDI)
   [junit4]   2> 2911121 INFO  (jetty-launcher-11216-thread-1) [    ] o.e.j.s.h.ContextHandler Started o.e.j.s.ServletContextHandler@1985ea8{/solr,null,AVAILABLE}
   [junit4]   2> 2911121 INFO  (jetty-launcher-11216-thread-2) [    ] o.a.s.c.c.SolrZkClient Using default ZkCredentialsProvider
   [junit4]   2> 2911122 INFO  (jetty-launcher-11216-thread-1) [    ] o.e.j.s.ServerConnector Started ServerConnector@15f4888{HTTP/1.1,[http/1.1]}{127.0.0.1:62590}
   [junit4]   2> 2911122 INFO  (jetty-launcher-11216-thread-1) [    ] o.e.j.s.Server Started @2915229ms
   [junit4]   2> 2911122 INFO  (jetty-launcher-11216-thread-1) [    ] o.a.s.c.s.e.JettySolrRunner Jetty properties: {hostContext=/solr, hostPort=62590}
   [junit4]   2> 2911122 INFO  (jetty-launcher-11216-thread-1) [    ] o.a.s.s.SolrDispatchFilter SolrDispatchFilter.init(): sun.misc.Launcher$AppClassLoader@1d16e93
   [junit4]   2> 2911122 INFO  (jetty-launcher-11216-thread-2) [    ] o.a.s.c.c.ConnectionManager Waiting for client to connect to ZooKeeper
   [junit4]   2> 2911122 INFO  (jetty-launcher-11216-thread-1) [    ] o.a.s.c.SolrResourceLoader new SolrResourceLoader for directory: 'C:\Users\jenkins\workspace\Lucene-Solr-6.x-Windows\solr\build\solr-core\test\J0\temp\solr.security.BasicAuthIntegrationTest_F20A57DBA1E1200-001\tempDir-001\node1'
   [junit4]   2> 2911121 INFO  (jetty-launcher-11216-thread-3) [    ] o.a.s.c.s.e.JettySolrRunner Jetty properties: {hostContext=/solr, hostPort=62587}
   [junit4]   2> 2911122 INFO  (jetty-launcher-11216-thread-1) [    ] o.a.s.c.SolrResourceLoader JNDI not configured for solr (NoInitialContextEx)
   [junit4]   2> 2911122 INFO  (jetty-launcher-11216-thread-3) [    ] o.a.s.s.SolrDispatchFilter SolrDispatchFilter.init(): sun.misc.Launcher$AppClassLoader@1d16e93
   [junit4]   2> 2911122 INFO  (jetty-launcher-11216-thread-3) [    ] o.a.s.c.SolrResourceLoader new SolrResourceLoader for directory: 'C:\Users\jenkins\workspace\Lucene-Solr-6.x-Windows\solr\build\solr-core\test\J0\temp\solr.security.BasicAuthIntegrationTest_F20A57DBA1E1200-001\tempDir-001\node3'
   [junit4]   2> 2911122 INFO  (jetty-launcher-11216-thread-1) [    ] o.a.s.c.SolrResourceLoader solr home defaulted to 'solr/' (could not find system property or JNDI)
   [junit4]   2> 2911122 INFO  (jetty-launcher-11216-thread-3) [    ] o.a.s.c.SolrResourceLoader JNDI not configured for solr (NoInitialContextEx)
   [junit4]   2> 2911123 INFO  (jetty-launcher-11216-thread-3) [    ] o.a.s.c.SolrResourceLoader solr home defaulted to 'solr/' (could not find system property or JNDI)
   [junit4]   2> 2911123 INFO  (jetty-launcher-11216-thread-1) [    ] o.a.s.c.c.SolrZkClient Using default ZkCredentialsProvider
   [junit4]   2> 2911123 INFO  (jetty-launcher-11216-thread-3) [    ] o.a.s.c.c.SolrZkClient Using default ZkCredentialsProvider
   [junit4]   2> 2911124 INFO  (jetty-launcher-11216-thread-1) [    ] o.a.s.c.c.ConnectionManager Waiting for client to connect to ZooKeeper
   [junit4]   2> 2911124 INFO  (jetty-launcher-11216-thread-3) [    ] o.a.s.c.c.ConnectionManager Waiting for client to connect to ZooKeeper
   [junit4]   2> 2911126 INFO  (jetty-launcher-11216-thread-4) [    ] o.e.j.s.Server jetty-9.3.8.v20160314
   [junit4]   2> 2911127 INFO  (jetty-launcher-11216-thread-4) [    ] o.e.j.s.h.ContextHandler Started o.e.j.s.ServletContextHandler@14086d9{/solr,null,AVAILABLE}
   [junit4]   2> 2911127 INFO  (jetty-launcher-11216-thread-4) [    ] o.e.j.s.ServerConnector Started ServerConnector@99128d{HTTP/1.1,[http/1.1]}{127.0.0.1:62599}
   [junit4]   2> 2911127 INFO  (jetty-launcher-11216-thread-4) [    ] o.e.j.s.Server Started @2915234ms
   [junit4]   2> 2911127 INFO  (jetty-launcher-11216-thread-4) [    ] o.a.s.c.s.e.JettySolrRunner Jetty properties: {hostContext=/solr, hostPort=62599}
   [junit4]   2> 2911127 INFO  (jetty-launcher-11216-thread-4) [    ] o.a.s.s.SolrDispatchFilter SolrDispatchFilter.init(): sun.misc.Launcher$AppClassLoader@1d16e93
   [junit4]   2> 2911127 INFO  (jetty-launcher-11216-thread-4) [    ] o.a.s.c.SolrResourceLoader new SolrResourceLoader for directory: 'C:\Users\jenkins\workspace\Lucene-Solr-6.x-Windows\solr\build\solr-core\test\J0\temp\solr.security.BasicAuthIntegrationTest_F20A57DBA1E1200-001\tempDir-001\node4'
   [junit4]   2> 2911128 INFO  (jetty-launcher-11216-thread-4) [    ] o.a.s.c.SolrResourceLoader JNDI not configured for solr (NoInitialContextEx)
   [junit4]   2> 2911128 INFO  (jetty-launcher-11216-thread-4) [    ] o.a.s.c.SolrResourceLoader solr home defaulted to 'solr/' (could not find system property or JNDI)
   [junit4]   2> 2911129 INFO  (jetty-launcher-11216-thread-4) [    ] o.a.s.c.c.SolrZkClient Using default ZkCredentialsProvider
   [junit4]   2> 2911130 INFO  (jetty-launcher-11216-thread-4) [    ] o.a.s.c.c.ConnectionManager Waiting for client to connect to ZooKeeper
   [junit4]   2> 2911130 INFO  (jetty-launcher-11216-thread-5) [    ] o.e.j.s.Server jetty-9.3.8.v20160314
   [junit4]   2> 2911130 INFO  (jetty-launcher-11216-thread-5) [    ] o.e.j.s.h.ContextHandler Started o.e.j.s.ServletContextHandler@563416{/solr,null,AVAILABLE}
   [junit4]   2> 2911131 INFO  (jetty-launcher-11216-thread-5) [    ] o.e.j.s.ServerConnector Started ServerConnector@77b52c{HTTP/1.1,[http/1.1]}{127.0.0.1:62604}
   [junit4]   2> 2911131 INFO  (jetty-launcher-11216-thread-5) [    ] o.e.j.s.Server Started @2915237ms
   [junit4]   2> 2911131 INFO  (jetty-launcher-11216-thread-5) [    ] o.a.s.c.s.e.JettySolrRunner Jetty properties: {hostContext=/solr, hostPort=62604}
   [junit4]   2> 2911131 INFO  (jetty-launcher-11216-thread-5) [    ] o.a.s.s.SolrDispatchFilter SolrDispatchFilter.init(): sun.misc.Launcher$AppClassLoader@1d16e93
   [junit4]   2> 2911131 INFO  (jetty-launcher-11216-thread-5) [    ] o.a.s.c.SolrResourceLoader new SolrResourceLoader for directory: 'C:\Users\jenkins\workspace\Lucene-Solr-6.x-Windows\solr\build\solr-core\test\J0\temp\solr.security.BasicAuthIntegrationTest_F20A57DBA1E1200-001\tempDir-001\node5'
   [junit4]   2> 2911132 INFO  (jetty-launcher-11216-thread-5) [    ] o.a.s.c.SolrResourceLoader JNDI not configured for solr (NoInitialContextEx)
   [junit4]   2> 2911132 INFO  (jetty-launcher-11216-thread-5) [    ] o.a.s.c.SolrResourceLoader solr home defaulted to 'solr/' (could not find system property or JNDI)
   [junit4]   2> 2911132 INFO  (jetty-launcher-11216-thread-5) [    ] o.a.s.c.c.SolrZkClient Using default ZkCredentialsProvider
   [junit4]   2> 2911133 INFO  (jetty-launcher-11216-thread-5) [    ] o.a.s.c.c.ConnectionManager Waiting for client to connect to ZooKeeper
   [junit4]   2> 2911145 INFO  (zkCallback-11219-thread-1) [    ] o.a.s.c.c.ConnectionManager Watcher org.apache.solr.common.cloud.ConnectionManager@1a291f0 name:ZooKeeperConnection Watcher:127.0.0.1:62580/solr got event WatchedEvent state:SyncConnected type:None path:null path:null type:None
   [junit4]   2> 2911145 INFO  (jetty-launcher-11216-thread-1) [    ] o.a.s.c.c.ConnectionManager Client is connected to ZooKeeper
   [junit4]   2> 2911145 INFO  (jetty-launcher-11216-thread-1) [    ] o.a.s.c.c.SolrZkClient Using default ZkACLProvider
   [junit4]   2> 2911147 INFO  (jetty-launcher-11216-thread-1) [    ] o.a.s.s.SolrDispatchFilter solr.xml found in ZooKeeper. Loading...
   [junit4]   2> 2911148 INFO  (zkCallback-11218-thread-1) [    ] o.a.s.c.c.ConnectionManager Watcher org.apache.solr.common.cloud.ConnectionManager@314433 name:ZooKeeperConnection Watcher:127.0.0.1:62580/solr got event WatchedEvent state:SyncConnected type:None path:null path:null type:None
   [junit4]   2> 2911148 INFO  (jetty-launcher-11216-thread-2) [    ] o.a.s.c.c.ConnectionManager Client is connected to ZooKeeper
   [junit4]   2> 2911148 INFO  (jetty-launcher-11216-thread-2) [    ] o.a.s.c.c.SolrZkClient Using default ZkACLProvider
   [junit4]   2> 2911149 INFO  (jetty-launcher-11216-thread-2) [    ] o.a.s.s.SolrDispatchFilter solr.xml found in ZooKeeper. Loading...
   [junit4]   2> 2911152 INFO  (zkCallback-11220-thread-1) [    ] o.a.s.c.c.ConnectionManager Watcher org.apache.solr.common.cloud.ConnectionManager@163e375 name:ZooKeeperConnection Watcher:127.0.0.1:62580/solr got event WatchedEvent state:SyncConnected type:None path:null path:null type:None
   [junit4]   2> 2911153 INFO  (jetty-launcher-11216-thread-3) [    ] o.a.s.c.c.ConnectionManager Client is connected to ZooKeeper
   [junit4]   2> 2911153 INFO  (jetty-launcher-11216-thread-3) [    ] o.a.s.c.c.SolrZkClient Using default ZkACLProvider
   [junit4]   2> 2911155 INFO  (jetty-launcher-11216-thread-3) [    ] o.a.s.s.SolrDispatchFilter solr.xml found in ZooKeeper. Loading...
   [junit4]   2> 2911158 INFO  (zkCallback-11221-thread-1) [    ] o.a.s.c.c.ConnectionManager Watcher org.apache.solr.common.cloud.ConnectionManager@1f38ca7 name:ZooKeeperConnection Watcher:127.0.0.1:62580/solr got event WatchedEvent state:SyncConnected type:None path:null path:null type:None
   [junit4]   2> 2911158 INFO  (jetty-launcher-11216-thread-4) [    ] o.a.s.c.c.ConnectionManager Client is connected to ZooKeeper
   [junit4]   2> 2911158 INFO  (jetty-launcher-11216-thread-4) [    ] o.a.s.c.c.SolrZkClient Using default ZkACLProvider
   [junit4]   2> 2911159 INFO  (zkCallback-11222-thread-1) [    ] o.a.s.c.c.ConnectionManager Watcher org.apache.solr.common.cloud.ConnectionManager@1b97035 name:ZooKeeperConnection Watcher:127.0.0.1:62580/solr got event WatchedEvent state:SyncConnected type:None path:null path:null type:None
   [junit4]   2> 2911159 INFO  (jetty-launcher-11216-thread-5) [    ] o.a.s.c.c.ConnectionManager Client is connected to ZooKeeper
   [junit4]   2> 2911159 INFO  (jetty-launcher-11216-thread-5) [    ] o.a.s.c.c.SolrZkClient Using default ZkACLProvider
   [junit4]   2> 2911162 INFO  (jetty-launcher-11216-thread-2) [    ] o.a.s.c.CorePropertiesLocator Config-defined core root directory: C:\Users\jenkins\workspace\Lucene-Solr-6.x-Windows\solr\build\solr-core\test\J0\temp\solr.security.BasicAuthIntegrationTest_F20A57DBA1E1200-001\tempDir-001\node2\.
   [junit4]   2> 2911162 INFO  (jetty-launcher-11216-thread-2) [    ] o.a.s.c.CoreContainer New CoreContainer 23065998
   [junit4]   2> 2911162 INFO  (jetty-launcher-11216-thread-2) [    ] o.a.s.c.CoreContainer Loading cores into CoreContainer [instanceDir=C:\Users\jenkins\workspace\Lucene-Solr-6.x-Windows\solr\build\solr-core\test\J0\temp\solr.security.BasicAuthIntegrationTest_F20A57DBA1E1200-001\tempDir-001\node2]
   [junit4]   2> 2911162 WARN  (jetty-launcher-11216-thread-2) [    ] o.a.s.c.CoreContainer Couldn't add files from C:\Users\jenkins\workspace\Lucene-Solr-6.x-Windows\solr\build\solr-core\test\J0\temp\solr.security.BasicAuthIntegrationTest_F20A57DBA1E1200-001\tempDir-001\node2\lib to classpath: C:\Users\jenkins\workspace\Lucene-Solr-6.x-Windows\solr\build\solr-core\test\J0\temp\solr.security.BasicAuthIntegrationTest_F20A57DBA1E1200-001\tempDir-001\node2\lib
   [junit4]   2> 2911162 INFO  (jetty-launcher-11216-thread-2) [    ] o.a.s.h.c.HttpShardHandlerFactory created with socketTimeout : 90000,urlScheme : ,connTimeout : 15000,maxConnectionsPerHost : 20,maxConnections : 10000,corePoolSize : 0,maximumPoolSize : 2147483647,maxThreadIdleTime : 5,sizeOfQueue : -1,fairnessPolicy : false,useRetries : false,
   [junit4]   2> 2911164 INFO  (jetty-launcher-11216-thread-4) [    ] o.a.s.s.SolrDispatchFilter solr.xml found in ZooKeeper. Loading...
   [junit4]   2> 2911165 INFO  (jetty-launcher-11216-thread-5) [    ] o.a.s.s.SolrDispatchFilter solr.xml found in ZooKeeper. Loading...
   [junit4]   2> 2911166 INFO  (jetty-launcher-11216-thread-2) [    ] o.a.s.u.UpdateShardHandler Creating UpdateShardHandler HTTP client with params: socketTimeout=340000&connTimeout=45000&retry=true
   [junit4]   2> 2911167 INFO  (jetty-launcher-11216-thread-1) [    ] o.a.s.c.CorePropertiesLocator Config-defined core root directory: C:\Users\jenkins\workspace\Lucene-Solr-6.x-Windows\solr\build\solr-core\test\J0\temp\solr.security.BasicAuthIntegrationTest_F20A57DBA1E1200-001\tempDir-001\node1\.
   [junit4]   2> 2911167 INFO  (jetty-launcher-11216-thread-2) [    ] o.a.s.l.LogWatcher SLF4J impl is org.slf4j.impl.Log4jLoggerFactory
   [junit4]   2> 2911167 INFO  (jetty-launcher-11216-thread-1) [    ] o.a.s.c.CoreContainer New CoreContainer 6403166
   [junit4]   2> 2911167 INFO  (jetty-launcher-11216-thread-1) [    ] o.a.s.c.CoreContainer Loading cores into CoreContainer [instanceDir=C:\Users\jenkins\workspace\Lucene-Solr-6.x-Windows\solr\build\solr-core\test\J0\temp\solr.security.BasicAuthIntegrationTest_F20A57DBA1E1200-001\tempDir-001\node1]
   [junit4]   2> 2911167 INFO  (jetty-launcher-11216-thread-2) [    ] o.a.s.l.LogWatcher Registering Log Listener [Log4j (org.slf4j.impl.Log4jLoggerFactory)]
   [junit4]   2> 2911167 INFO  (jetty-launcher-11216-thread-2) [    ] o.a.s.c.ZkContainer Zookeeper client=127.0.0.1:62580/solr
   [junit4]   2> 2911167 WARN  (jetty-launcher-11216-thread-1) [    ] o.a.s.c.CoreContainer Couldn't add files from C:\Users\jenkins\workspace\Lucene-Solr-6.x-Windows\solr\build\solr-core\test\J0\temp\solr.security.BasicAuthIntegrationTest_F20A57DBA1E1200-001\tempDir-001\node1\lib to classpath: C:\Users\jenkins\workspace\Lucene-Solr-6.x-Windows\solr\build\solr-core\test\J0\temp\solr.security.BasicAuthIntegrationTest_F20A57DBA1E1200-001\tempDir-001\node1\lib
   [junit4]   2> 2911167 INFO  (jetty-launcher-11216-thread-2) [    ] o.a.s.c.ZkController zkHost includes chroot
   [junit4]   2> 2911167 INFO  (jetty-launcher-11216-thread-1) [    ] o.a.s.h.c.HttpShardHandlerFactory created with socketTimeout : 90000,urlScheme : ,connTimeout : 15000,maxConnectionsPerHost : 20,maxConnections : 10000,corePoolSize : 0,maximumPoolSize : 2147483647,maxThreadIdleTime : 5,sizeOfQueue : -1,fairnessPolicy : false,useRetries : false,
   [junit4]   2> 2911167 INFO  (jetty-launcher-11216-thread-2) [    ] o.a.s.c.c.SolrZkClient Using default ZkCredentialsProvider
   [junit4]   2> 2911168 INFO  (jetty-launcher-11216-thread-1) [    ] o.a.s.u.UpdateShardHandler Creating UpdateShardHandler HTTP client with params: socketTimeout=340000&connTimeout=45000&retry=true
   [junit4]   2> 2911168 INFO  (jetty-launcher-11216-thread-2) [    ] o.a.s.c.c.ConnectionManager Waiting for client to connect to ZooKeeper
   [junit4]   2> 2911168 INFO  (jetty-launcher-11216-thread-1) [    ] o.a.s.l.LogWatcher SLF4J impl is org.slf4j.impl.Log4jLoggerFactory
   [junit4]   2> 2911168 INFO  (jetty-launcher-11216-thread-1) [    ] o.a.s.l.LogWatcher Registering Log Listener [Log4j (org.slf4j.impl.Log4jLoggerFactory)]
   [junit4]   2> 2911169 INFO  (jetty-launcher-11216-thread-1) [    ] o.a.s.c.ZkContainer Zookeeper client=127.0.0.1:62580/solr
   [junit4]   2> 2911169 INFO  (jetty-launcher-11216-thread-1) [    ] o.a.s.c.ZkController zkHost includes chroot
   [junit4]   2> 2911169 INFO  (jetty-launcher-11216-thread-1) [    ] o.a.s.c.c.SolrZkClient Using default ZkCredentialsProvider
   [junit4]   2> 2911169 INFO  (jetty-launcher-11216-thread-1) [    ] o.a.s.c.c.ConnectionManager Waiting for client to connect to ZooKeeper
   [junit4]   2> 2911172 INFO  (jetty-launcher-11216-thread-3) [    ] o.a.s.c.CorePropertiesLocator Config-defined core root directory: C:\Users\jenkins\workspace\Lucene-Solr-6.x-Windows\solr\build\solr-core\test\J0\temp\solr.security.BasicAuthIntegrationTest_F20A57DBA1E1200-001\tempDir-001\node3\.
   [junit4]   2> 2911172 INFO  (jetty-launcher-11216-thread-3) [    ] o.a.s.c.CoreContainer New CoreContainer 19098942
   [junit4]   2> 2911172 INFO  (jetty-launcher-11216-thread-3) [    ] o.a.s.c.CoreContainer Loading cores into CoreContainer [instanceDir=C:\Users\jenkins\workspace\Lucene-Solr-6.x-Windows\solr\build\solr-core\test\J0\temp\solr.security.BasicAuthIntegrationTest_F20A57DBA1E1200-001\tempDir-001\node3]
   [junit4]   2> 2911172 WARN  (jetty-launcher-11216-thread-3) [    ] o.a.s.c.CoreContainer Couldn't add files from C:\Users\jenkins\workspace\Lucene-Solr-6.x-Windows\solr\build\solr-core\test\J0\temp\solr.security.BasicAuthIntegrationTest_F20A57DBA1E1200-001\tempDir-001\node3\lib to classpath: C:\Users\jenkins\workspace\Lucene-Solr-6.x-Windows\solr\build\solr-core\test\J0\temp\solr.security.BasicAuthIntegrationTest_F20A57DBA1E1200-001\tempDir-001\node3\lib
   [junit4]   2> 2911172 INFO  (jetty-launcher-11216-thread-3) [    ] o.a.s.h.c.HttpShardHandlerFactory created with socketTimeout : 90000,urlScheme : ,connTimeout : 15000,maxConnectionsPerHost : 20,maxConnections : 10000,corePoolSize : 0,maximumPoolSize : 2147483647,maxThreadIdleTime : 5,sizeOfQueue : -1,fairnessPolicy : false,useRetries : false,
   [junit4]   2> 2911173 INFO  (jetty-launcher-11216-thread-3) [    ] o.a.s.u.UpdateShardHandler Creating UpdateShardHandler HTTP client with params: socketTimeout=340000&connTimeout=45000&retry=true
   [junit4]   2> 2911174 INFO  (jetty-launcher-11216-thread-4) [    ] o.a.s.c.CorePropertiesLocator Config-defined core root directory: C:\Users\jenkins\workspace\Lucene-Solr-6.x-Windows\solr\build\solr-core\test\J0\temp\solr.security.BasicAuthIntegrationTest_F20A57DBA1E1200-001\tempDir-001\node4\.
   [junit4]   2> 2911174 INFO  (jetty-launcher-11216-thread-3) [    ] o.a.s.l.LogWatcher SLF4J impl is org.slf4j.impl.Log4jLoggerFactory
   [junit4]   2> 2911174 INFO  (jetty-launcher-11216-thread-4) [    ] o.a.s.c.CoreContainer New CoreContainer 15134233
   [junit4]   2> 2911174 INFO  (jetty-launcher-11216-thread-3) [    ] o.a.s.l.LogWatcher Registering Log Listener [Log4j (org.slf4j.impl.Log4jLoggerFactory)]
   [junit4]   2> 2911174 INFO  (jetty-launcher-11216-thread-4) [    ] o.a.s.c.CoreContainer Loading cores into CoreContainer [instanceDir=C:\Users\jenkins\workspace\Lucene-Solr-6.x-Windows\solr\build\solr-core\test\J0\temp\solr.security.BasicAuthIntegrationTest_F20A57DBA1E1200-001\tempDir-001\node4]
   [junit4]   2> 2911174 INFO  (jetty-launcher-11216-thread-3) [    ] o.a.s.c.ZkContainer Zookeeper client=127.0.0.1:62580/solr
   [junit4]   2> 2911174 INFO  (jetty-launcher-11216-thread-3) [    ] o.a.s.c.ZkController zkHost includes chroot
   [junit4]   2> 2911174 WARN  (jetty-launcher-11216-thread-4) [    ] o.a.s.c.CoreContainer Couldn't add files from C:\Users\jenkins\workspace\Lucene-Solr-6.x-Windows\solr\build\solr-core\test\J0\temp\solr.security.BasicAuthIntegrationTest_F20A57DBA1E1200-001\tempDir-001\node4\lib to classpath: C:\Users\jenkins\workspace\Lucene-Solr-6.x-Windows\solr\build\solr-core\test\J0\temp\solr.security.BasicAuthIntegrationTest_F20A57DBA1E1200-001\tempDir-001\node4\lib
   [junit4]   2> 2911174 INFO  (jetty-launcher-11216-thread-3) [    ] o.a.s.c.c.SolrZkClient Using default ZkCredentialsProvider
   [junit4]   2> 2911174 INFO  (jetty-launcher-11216-thread-4) [    ] o.a.s.h.c.HttpShardHandlerFactory created with socketTimeout : 90000,urlScheme : ,connTimeout : 15000,maxConnectionsPerHost : 20,maxConnections : 10000,corePoolSize : 0,maximumPoolSize : 2147483647,maxThreadIdleTime : 5,sizeOfQueue : -1,fairnessPolicy : false,useRetries : false,
   [junit4]   2> 2911175 INFO  (jetty-launcher-11216-thread-3) [    ] o.a.s.c.c.ConnectionManager Waiting for client to connect to ZooKeeper
   [junit4]   2> 2911175 INFO  (jetty-launcher-11216-thread-5) [    ] o.a.s.c.CorePropertiesLocator Config-defined core root directory: C:\Users\jenkins\workspace\Lucene-Solr-6.x-Windows\solr\build\solr-core\test\J0\temp\solr.security.BasicAuthIntegrationTest_F20A57DBA1E1200-001\tempDir-001\node5\.
   [junit4]   2> 2911175 INFO  (jetty-launcher-11216-thread-4) [    ] o.a.s.u.UpdateShardHandler Creating UpdateShardHandler HTTP client with params: socketTimeout=340000&connTimeout=45000&retry=true
   [junit4]   2> 2911175 INFO  (jetty-launcher-11216-thread-5) [    ] o.a.s.c.CoreContainer New CoreContainer 2381445
   [junit4]   2> 2911176 INFO  (jetty-launcher-11216-thread-5) [    ] o.a.s.c.CoreContainer Loading cores into CoreContainer [instanceDir=C:\Users\jenkins\workspace\Lucene-Solr-6.x-Windows\solr\build\solr-core\test\J0\temp\solr.security.BasicAuthIntegrationTest_F20A57DBA1E1200-001\tempDir-001\node5]
   [junit4]   2> 2911176 WARN  (jetty-launcher-11216-thread-5) [    ] o.a.s.c.CoreContainer Couldn't add files from C:\Users\jenkins\workspace\Lucene-Solr-6.x-Windows\solr\build\solr-core\test\J0\temp\solr.security.BasicAuthIntegrationTest_F20A57DBA1E1200-001\tempDir-001\node5\lib to classpath: C:\Users\jenkins\workspace\Lucene-Solr-6.x-Windows\solr\build\solr-core\test\J0\temp\solr.security.BasicAuthIntegrationTest_F20A57DBA1E1200-001\tempDir-001\node5\lib
   [junit4]   2> 2911176 INFO  (jetty-launcher-11216-thread-5) [    ] o.a.s.h.c.HttpShardHandlerFactory created with socketTimeout : 90000,urlScheme : ,connTimeout : 15000,maxConnectionsPerHost : 20,maxConnections : 10000,corePoolSize : 0,maximumPoolSize : 2147483647,maxThreadIdleTime : 5,sizeOfQueue : -1,fairnessPolicy : false,useRetries : false,
   [junit4]   2> 2911176 INFO  (jetty-launcher-11216-thread-4) [    ] o.a.s.l.LogWatcher SLF4J impl is org.slf4j.impl.Log4jLoggerFactory
   [junit4]   2> 2911176 INFO  (jetty-launcher-11216-thread-4) [    ] o.a.s.l.LogWatcher Registering Log Listener [Log4j (org.slf4j.impl.Log4jLoggerFactory)]
   [junit4]   2> 2911176 INFO  (jetty-launcher-11216-thread-4) [    ] o.a.s.c.ZkContainer Zookeeper client=127.0.0.1:62580/solr
   [junit4]   2> 2911176 INFO  (jetty-launcher-11216-thread-4) [    ] o.a.s.c.ZkController zkHost includes chroot
   [junit4]   2> 2911176 INFO  (jetty-launcher-11216-thread-4) [    ] o.a.s.c.c.SolrZkClient Using default ZkCredentialsProvider
   [junit4]   2> 2911177 INFO  (jetty-launcher-11216-thread-5) [    ] o.a.s.u.UpdateShardHandler Creating UpdateShardHandler HTTP client with params: socketTimeout=340000&connTimeout=45000&retry=true
   [junit4]   2> 2911177 INFO  (jetty-launcher-11216-thread-5) [    ] o.a.s.l.LogWatcher SLF4J impl is org.slf4j.impl.Log4jLoggerFactory
   [junit4]   2> 2911177 INFO  (jetty-launcher-11216-thread-5) [    ] o.a.s.l.LogWatcher Registering Log Listener [Log4j (org.slf4j.impl.Log4jLoggerFactory)]
   [junit4]   2> 2911177 INFO  (jetty-launcher-11216-thread-5) [    ] o.a.s.c.ZkContainer Zookeeper client=127.0.0.1:62580/solr
   [junit4]   2> 2911177 INFO  (jetty-launcher-11216-thread-5) [    ] o.a.s.c.ZkController zkHost includes chroot
   [junit4]   2> 2911177 INFO  (jetty-launcher-11216-thread-5) [    ] o.a.s.c.c.SolrZkClient Using default ZkCredentialsProvider
   [junit4]   2> 2911178 INFO  (jetty-launcher-11216-thread-4) [    ] o.a.s.c.c.ConnectionManager Waiting for client to connect to ZooKeeper
   [junit4]   2> 2911178 INFO  (jetty-launcher-11216-thread-5) [    ] o.a.s.c.c.ConnectionManager Waiting for client to connect to ZooKeeper
   [junit4]   2> 2911180 INFO  (zkCallback-11225-thread-1) [    ] o.a.s.c.c.ConnectionManager Watcher org.apache.solr.common.cloud.ConnectionManager@502623 name:ZooKeeperConnection Watcher:127.0.0.1:62580 got event WatchedEvent state:SyncConnected type:None path:null path:null type:None
   [junit4]   2> 2911181 INFO  (jetty-launcher-11216-thread-2) [    ] o.a.s.c.c.ConnectionManager Client is connected to ZooKeeper
   [junit4]   2> 2911181 INFO  (jetty-launcher-11216-thread-2) [    ] o.a.s.c.c.SolrZkClient Using default ZkACLProvider
   [junit4]   2> 2911182 INFO  (zkCallback-11228-thread-1) [    ] o.a.s.c.c.ConnectionManager Watcher org.apache.solr.common.cloud.ConnectionManager@ecc9d8 name:ZooKeeperConnection Watcher:127.0.0.1:62580 got event WatchedEvent state:SyncConnected type:None path:null path:null type:None
   [junit4]   2> 2911182 INFO  (jetty-launcher-11216-thread-1) [    ] o.a.s.c.c.ConnectionManager Client is connected to ZooKeeper
   [junit4]   2> 2911182 INFO  (jetty-launcher-11216-thread-1) [    ] o.a.s.c.c.SolrZkClient Using default ZkACLProvider
   [junit4]   2> 2911183 INFO  (zkCallback-11231-thread-1) [    ] o.a.s.c.c.ConnectionManager Watcher org.apache.solr.common.cloud.ConnectionManager@c425d6 name:ZooKeeperConnection Watcher:127.0.0.1:62580 got event WatchedEvent state:SyncConnected type:None path:null path:null type:None
   [junit4]   2> 2911183 INFO  (jetty-launcher-11216-thread-3) [    ] o.a.s.c.c.ConnectionManager Client is connected to ZooKeeper
   [junit4]   2> 2911183 INFO  (jetty-launcher-11216-thread-3) [    ] o.a.s.c.c.SolrZkClient Using default ZkACLProvider
   [junit4]   2> 2911183 INFO  (zkCallback-11237-thread-1) [    ] o.a.s.c.c.ConnectionManager Watcher org.apache.solr.common.cloud.ConnectionManager@1723d30 name:ZooKeeperConnection Watcher:127.0.0.1:62580 got event WatchedEvent state:SyncConnected type:None path:null path:null type:None
   [junit4]   2> 2911183 INFO  (zkCallback-11234-thread-1) [    ] o.a.s.c.c.ConnectionManager Watcher org.apache.solr.common.cloud.ConnectionManager@1770b27 name:ZooKeeperConnection Watcher:127.0.0.1:62580 got event WatchedEvent state:SyncConnected type:None path:null path:null type:None
   [junit4]   2> 2911183 INFO  (jetty-launcher-11216-thread-4) [    ] o.a.s.c.c.ConnectionManager Client is connected to ZooKeeper
   [junit4]   2> 2911183 INFO  (jetty-launcher-11216-thread-5) [    ] o.a.s.c.c.ConnectionManager Client is connected to ZooKeeper
   [junit4]   2> 2911183 INFO  (jetty-launcher-11216-thread-4) [    ] o.a.s.c.c.SolrZkClient Using default ZkACLProvider
   [junit4]   2> 2911183 INFO  (jetty-launcher-11216-thread-5) [    ] o.a.s.c.c.SolrZkClient Using default ZkACLProvider
   [junit4]   2> 2911184 WARN  (NIOServerCxn.Factory:0.0.0.0/0.0.0.0:0) [    ] o.a.z.s.NIOServerCnxn caught end of stream exception
   [junit4]   2> EndOfStreamException: Unable to read additional data from client sessionid 0x1553a6a2dc80007, likely client has closed socket
   [junit4]   2> 	at org.apache.zookeeper.server.NIOServerCnxn.doIO(NIOServerCnxn.java:228)
   [junit4]   2> 	at org.apache.zookeeper.server.NIOServerCnxnFactory.run(NIOServerCnxnFactory.java:208)
   [junit4]   2> 	at java.lang.Thread.run(Thread.java:745)
   [junit4]   2> 2911184 INFO  (jetty-launcher-11216-thread-1) [n:127.0.0.1:62590_solr    ] o.a.s.c.ZkController Added new OnReconnect listener org.apache.solr.cloud.ZkController$$Lambda$10/27941871@8fea4f
   [junit4]   2> 2911185 INFO  (jetty-launcher-11216-thread-1) [n:127.0.0.1:62590_solr    ] o.a.s.c.c.ConnectionManager Waiting for client to connect to ZooKeeper
   [junit4]   2> 2911186 INFO  (jetty-launcher-11216-thread-2) [n:127.0.0.1:62584_solr    ] o.a.s.c.ZkController Added new OnReconnect listener org.apache.solr.cloud.ZkController$$Lambda$10/27941871@a12893
   [junit4]   2> 2911188 INFO  (jetty-launcher-11216-thread-2) [n:127.0.0.1:62584_solr    ] o.a.s.c.c.ConnectionManager Waiting for client to connect to ZooKeeper
   [junit4]   2> 2911188 INFO  (jetty-launcher-11216-thread-5) [n:127.0.0.1:62604_solr    ] o.a.s.c.ZkController Added new OnReconnect listener org.apache.solr.cloud.ZkController$$Lambda$10/27941871@f00b1a
   [junit4]   2> 2911189 INFO  (jetty-launcher-11216-thread-3) [n:127.0.0.1:62587_solr    ] o.a.s.c.ZkController Added new OnReconnect listener org.apache.solr.cloud.ZkController$$Lambda$10/27941871@3a0c71
   [junit4]   2> 2911191 INFO  (jetty-launcher-11216-thread-4) [n:127.0.0.1:62599_solr    ] o.a.s.c.ZkController Added new OnReconnect listener org.apache.solr.cloud.ZkController$$Lambda$10/27941871@198259f
   [junit4]   2> 2911196 INFO  (jetty-launcher-11216-thread-4) [n:127.0.0.1:62599_solr    ] o.a.s.c.c.ConnectionManager Waiting for client to connect to ZooKeeper
   [junit4]   2> 2911196 INFO  (jetty-launcher-11216-thread-3) [n:127.0.0.1:62587_solr    ] o.a.s.c.c.ConnectionManager Waiting for client to connect to ZooKeeper
   [junit4]   2> 2911196 INFO  (jetty-launcher-11216-thread-5) [n:127.0.0.1:62604_solr    ] o.a.s.c.c.ConnectionManager Waiting for client to connect to ZooKeeper
   [junit4]   2> 2911198 INFO  (zkCallback-11238-thread-1-processing-n:127.0.0.1:62590_solr) [n:127.0.0.1:62590_solr    ] o.a.s.c.c.ConnectionManager Watcher org.apache.solr.common.cloud.ConnectionManager@a9f330 name:ZooKeeperConnection Watcher:127.0.0.1:62580/solr got event WatchedEvent state:SyncConnected type:None path:null path:null type:None
   [junit4]   2> 2911198 INFO  (jetty-launcher-11216-thread-1) [n:127.0.0.1:62590_solr    ] o.a.s.c.c.ConnectionManager Client is connected to ZooKeeper
   [junit4]   2> 2911199 INFO  (zkCallback-11241-thread-1-processing-n:127.0.0.1:62587_solr) [n:127.0.0.1:62587_solr    ] o.a.s.c.c.ConnectionManager Watcher org.apache.solr.common.cloud.ConnectionManager@1252ff1 name:ZooKeeperConnection Watcher:127.0.0.1:62580/solr got event WatchedEvent state:SyncConnected type:None path:null path:null type:None
   [junit4]   2> 2911200 INFO  (jetty-launcher-11216-thread-3) [n:127.0.0.1:62587_solr    ] o.a.s.c.c.ConnectionManager Client is connected to ZooKeeper
   [junit4]   2> 2911200 INFO  (zkCallback-11242-thread-1-processing-n:127.0.0.1:62599_solr) [n:127.0.0.1:62599_solr    ] o.a.s.c.c.ConnectionManager Watcher org.apache.solr.common.cloud.ConnectionManager@1010c2b name:ZooKeeperConnection Watcher:127.0.0.1:62580/solr got event WatchedEvent state:SyncConnected type:None path:null path:null type:None
   [junit4]   2> 2911200 INFO  (jetty-launcher-11216-thread-4) [n:127.0.0.1:62599_solr    ] o.a.s.c.c.ConnectionManager Client is connected to ZooKeeper
   [junit4]   2> 2911201 INFO  (zkCallback-11240-thread-1-processing-n:127.0.0.1:62604_solr) [n:127.0.0.1:62604_solr    ] o.a.s.c.c.ConnectionManager Watcher org.apache.solr.common.cloud.ConnectionManager@a178f6 name:ZooKeeperConnection Watcher:127.0.0.1:62580/solr got event WatchedEvent state:SyncConnected type:None path:null path:null type:None
   [junit4]   2> 2911201 INFO  (zkCallback-11239-thread-1-processing-n:127.0.0.1:62584_solr) [n:127.0.0.1:62584_solr    ] o.a.s.c.c.ConnectionManager Watcher org.apache.solr.common.cloud.ConnectionManager@1e07738 name:ZooKeeperConnection Watcher:127.0.0.1:62580/solr got event WatchedEvent state:SyncConnected type:None path:null path:null type:None
   [junit4]   2> 2911201 INFO  (jetty-launcher-11216-thread-5) [n:127.0.0.1:62604_solr    ] o.a.s.c.c.ConnectionManager Client is connected to ZooKeeper
   [junit4]   2> 2911201 INFO  (jetty-launcher-11216-thread-2) [n:127.0.0.1:62584_solr    ] o.a.s.c.c.ConnectionManager Client is connected to ZooKeeper
   [junit4]   2> 2911202 INFO  (jetty-launcher-11216-thread-1) [n:127.0.0.1:62590_solr    ] o.a.s.c.c.SolrZkClient makePath: /overseer/queue
   [junit4]   2> 2911203 INFO  (jetty-launcher-11216-thread-4) [n:127.0.0.1:62599_solr    ] o.a.s.c.c.SolrZkClient makePath: /overseer/queue
   [junit4]   2> 2911203 INFO  (jetty-launcher-11216-thread-3) [n:127.0.0.1:62587_solr    ] o.a.s.c.c.SolrZkClient makePath: /overseer/queue
   [junit4]   2> 2911203 INFO  (jetty-launcher-11216-thread-5) [n:127.0.0.1:62604_solr    ] o.a.s.c.c.SolrZkClient makePath: /overseer/queue
   [junit4]   2> 2911203 INFO  (jetty-launcher-11216-thread-2) [n:127.0.0.1:62584_solr    ] o.a.s.c.c.SolrZkClient makePath: /overseer/queue
   [junit4]   2> 2911211 INFO  (jetty-launcher-11216-thread-1) [n:127.0.0.1:62590_solr    ] o.a.s.c.c.SolrZkClient makePath: /overseer/collection-queue-work
   [junit4]   2> 2911211 INFO  (jetty-launcher-11216-thread-5) [n:127.0.0.1:62604_solr    ] o.a.s.c.c.SolrZkClient makePath: /overseer/collection-queue-work
   [junit4]   2> 2911211 INFO  (jetty-launcher-11216-thread-4) [n:127.0.0.1:62599_solr    ] o.a.s.c.c.SolrZkClient makePath: /overseer/collection-queue-work
   [junit4]   2> 2911212 INFO  (jetty-launcher-11216-thread-2) [n:127.0.0.1:62584_solr    ] o.a.s.c.c.SolrZkClient makePath: /overseer/collection-queue-work
   [junit4]   2> 2911212 INFO  (jetty-launcher-11216-thread-3) [n:127.0.0.1:62587_solr    ] o.a.s.c.c.SolrZkClient makePath: /overseer/collection-queue-work
   [junit4]   2> 2911226 INFO  (jetty-launcher-11216-thread-2) [n:127.0.0.1:62584_solr    ] o.a.s.c.c.SolrZkClient makePath: /overseer/collection-map-running
   [junit4]   2> 2911226 INFO  (jetty-launcher-11216-thread-5) [n:127.0.0.1:62604_solr    ] o.a.s.c.c.SolrZkClient makePath: /overseer/collection-map-running
   [junit4]   2> 2911226 INFO  (jetty-launcher-11216-thread-1) [n:127.0.0.1:62590_solr    ] o.a.s.c.c.SolrZkClient makePath: /overseer/collection-map-running
   [junit4]   2> 2911227 INFO  (jetty-launcher-11216-thread-4) [n:127.0.0.1:62599_solr    ] o.a.s.c.c.SolrZkClient makePath: /overseer/collection-map-running
   [junit4]   2> 2911228 INFO  (jetty-launcher-11216-thread-3) [n:127.0.0.1:62587_solr    ] o.a.s.c.c.SolrZkClient makePath: /overseer/collection-map-running
   [junit4]   2> 2911235 INFO  (jetty-launcher-11216-thread-5) [n:127.0.0.1:62604_solr    ] o.a.s.c.c.SolrZkClient makePath: /overseer/collection-map-completed
   [junit4]   2> 2911235 INFO  (jetty-launcher-11216-thread-1) [n:127.0.0.1:62590_solr    ] o.a.s.c.c.SolrZkClient makePath: /overseer/collection-map-completed
   [junit4]   2> 2911237 INFO  (jetty-launcher-11216-thread-2) [n:127.0.0.1:62584_solr    ] o.a.s.c.c.SolrZkClient makePath: /overseer/collection-map-completed
   [junit4]   2> 2911237 INFO  (jetty-launcher-11216-thread-4) [n:127.0.0.1:62599_solr    ] o.a.s.c.c.SolrZkClient makePath: /overseer/collection-map-completed
   [junit4]   2> 2911243 INFO  (jetty-launcher-11216-thread-1) [n:127.0.0.1:62590_solr    ] o.a.s.c.c.SolrZkClient makePath: /overseer/collection-map-failure
   [junit4]   2> 2911243 INFO  (jetty-launcher-11216-thread-2) [n:127.0.0.1:62584_solr    ] o.a.s.c.c.SolrZkClient makePath: /overseer/collection-map-failure
   [junit4]   2> 2911243 INFO  (jetty-launcher-11216-thread-3) [n:127.0.0.1:62587_solr    ] o.a.s.c.c.SolrZkClient makePath: /overseer/collection-map-failure
   [junit4]   2> 2911243 INFO  (jetty-launcher-11216-thread-4) [n:127.0.0.1:62599_solr    ] o.a.s.c.c.SolrZkClient makePath: /overseer/collection-map-failure
   [junit4]   2> 2911243 INFO  (jetty-launcher-11216-thread-5) [n:127.0.0.1:62604_solr    ] o.a.s.c.c.SolrZkClient makePath: /overseer/collection-map-failure
   [junit4]   2> 2911247 INFO  (jetty-launcher-11216-thread-1) [n:127.0.0.1:62590_solr    ] o.a.s.c.c.SolrZkClient makePath: /live_nodes
   [junit4]   2> 2911247 INFO  (jetty-launcher-11216-thread-4) [n:127.0.0.1:62599_solr    ] o.a.s.c.c.SolrZkClient makePath: /live_nodes
   [junit4]   2> 2911247 INFO  (jetty-launcher-11216-thread-3) [n:127.0.0.1:62587_solr    ] o.a.s.c.c.SolrZkClient makePath: /live_nodes
   [junit4]   2> 2911247 INFO  (jetty-launcher-11216-thread-2) [n:127.0.0.1:62584_solr    ] o.a.s.c.c.SolrZkClient makePath: /live_nodes
   [junit4]   2> 2911247 INFO  (jetty-launcher-11216-thread-5) [n:127.0.0.1:62604_solr    ] o.a.s.c.c.SolrZkClient makePath: /live_nodes
   [junit4]   2> 2911251 INFO  (jetty-launcher-11216-thread-1) [n:127.0.0.1:62590_solr    ] o.a.s.c.c.SolrZkClient makePath: /collections
   [junit4]   2> 2911251 INFO  (jetty-launcher-11216-thread-3) [n:127.0.0.1:62587_solr    ] o.a.s.c.c.SolrZkClient makePath: /collections
   [junit4]   2> 2911251 INFO  (jetty-launcher-11216-thread-2) [n:127.0.0.1:62584_solr    ] o.a.s.c.c.SolrZkClient makePath: /collections
   [junit4]   2> 2911252 INFO  (jetty-launcher-11216-thread-5) [n:127.0.0.1:62604_solr    ] o.a.s.c.c.SolrZkClient makePath: /collections
   [junit4]   2> 2911252 INFO  (jetty-launcher-11216-thread-4) [n:127.0.0.1:62599_solr    ] o.a.s.c.c.SolrZkClient makePath: /collections
   [junit4]   2> 2911254 INFO  (jetty-launcher-11216-thread-4) [n:127.0.0.1:62599_solr    ] o.a.s.c.c.SolrZkClient makePath: /aliases.json
   [junit4]   2> 2911254 INFO  (jetty-launcher-11216-thread-3) [n:127.0.0.1:62587_solr    ] o.a.s.c.c.SolrZkClient makePath: /aliases.json
   [junit4]   2> 2911254 INFO  (jetty-launcher-11216-thread-2) [n:127.0.0.1:62584_solr    ] o.a.s.c.c.SolrZkClient makePath: /aliases.json
   [junit4]   2> 2911254 INFO  (jetty-launcher-11216-thread-1) [n:127.0.0.1:62590_solr    ] o.a.s.c.c.SolrZkClient makePath: /aliases.json
   [junit4]   2> 2911255 INFO  (jetty-launcher-11216-thread-5) [n:127.0.0.1:62604_solr    ] o.a.s.c.c.SolrZkClient makePath: /aliases.json
   [junit4]   2> 2911257 INFO  (jetty-launcher-11216-thread-1) [n:127.0.0.1:62590_solr    ] o.a.s.c.c.SolrZkClient makePath: /clusterstate.json
   [junit4]   2> 2911257 INFO  (jetty-launcher-11216-thread-2) [n:127.0.0.1:62584_solr    ] o.a.s.c.c.SolrZkClient makePath: /clusterstate.json
   [junit4]   2> 2911257 INFO  (jetty-launcher-11216-thread-4) [n:127.0.0.1:62599_solr    ] o.a.s.c.c.SolrZkClient makePath: /clusterstate.json
   [junit4]   2> 2911257 INFO  (jetty-launcher-11216-thread-5) [n:127.0.0.1:62604_solr    ] o.a.s.c.c.SolrZkClient makePath: /clusterstate.json
   [junit4]   2> 2911257 INFO  (jetty-launcher-11216-thread-3) [n:127.0.0.1:62587_solr    ] o.a.s.c.c.SolrZkClient makePath: /clusterstate.json
   [junit4]   2> 2911262 INFO  (jetty-launcher-11216-thread-2) [n:127.0.0.1:62584_solr    ] o.a.s.c.c.SolrZkClient makePath: /security.json
   [junit4]   2> 2911262 INFO  (jetty-launcher-11216-thread-4) [n:127.0.0.1:62599_solr    ] o.a.s.c.c.SolrZkClient makePath: /security.json
   [junit4]   2> 2911262 INFO  (jetty-launcher-11216-thread-1) [n:127.0.0.1:62590_solr    ] o.a.s.c.c.SolrZkClient makePath: /security.json
   [junit4]   2> 2911262 INFO  (jetty-launcher-11216-thread-5) [n:127.0.0.1:62604_solr    ] o.a.s.c.c.SolrZkClient makePath: /security.json
   [junit4]   2> 2911264 INFO  (jetty-launcher-11216-thread-3) [n:127.0.0.1:62587_solr    ] o.a.s.c.c.ZkStateReader Updating cluster state from ZooKeeper... 
   [junit4]   2> 2911266 INFO  (jetty-launcher-11216-thread-4) [n:127.0.0.1:62599_solr    ] o.a.s.c.c.ZkStateReader Updating cluster state from ZooKeeper... 
   [junit4]   2> 2911267 INFO  (jetty-launcher-11216-thread-1) [n:127.0.0.1:62590_solr    ] o.a.s.c.c.ZkStateReader Updating cluster state from ZooKeeper... 
   [junit4]   2> 2911267 INFO  (jetty-launcher-11216-thread-5) [n:127.0.0.1:62604_solr    ] o.a.s.c.c.ZkStateReader Updating cluster state from ZooKeeper... 
   [junit4]   2> 2911267 INFO  (jetty-launcher-11216-thread-2) [n:127.0.0.1:62584_solr    ] o.a.s.c.c.ZkStateReader Updating cluster state from ZooKeeper... 
   [junit4]   2> 2911267 INFO  (jetty-launcher-11216-thread-3) [n:127.0.0.1:62587_solr    ] o.a.s.c.c.ZkStateReader Loaded empty cluster properties
   [junit4]   2> 2911267 INFO  (jetty-launcher-11216-thread-4) [n:127.0.0.1:62599_solr    ] o.a.s.c.c.ZkStateReader Loaded empty cluster properties
   [junit4]   2> 2911268 INFO  (jetty-launcher-11216-thread-1) [n:127.0.0.1:62590_solr    ] o.a.s.c.c.ZkStateReader Loaded empty cluster properties
   [junit4]   2> 2911268 INFO  (jetty-launcher-11216-thread-2) [n:127.0.0.1:62584_solr    ] o.a.s.c.c.ZkStateReader Loaded empty cluster properties
   [junit4]   2> 2911268 INFO  (jetty-launcher-11216-thread-5) [n:127.0.0.1:62604_solr    ] o.a.s.c.c.ZkStateReader Loaded empty cluster properties
   [junit4]   2> 2911268 INFO  (jetty-launcher-11216-thread-4) [n:127.0.0.1:62599_solr    ] o.a.s.c.c.ZkStateReader Updated live nodes from ZooKeeper... (0) -> (0)
   [junit4]   2> 2911268 INFO  (jetty-launcher-11216-thread-3) [n:127.0.0.1:62587_solr    ] o.a.s.c.c.ZkStateReader Updated live nodes from ZooKeeper... (0) -> (0)
   [junit4]   2> 2911269 INFO  (jetty-launcher-11216-thread-1) [n:127.0.0.1:62590_solr    ] o.a.s.c.c.ZkStateReader Updated live nodes from ZooKeeper... (0) -> (0)
   [junit4]   2> 2911269 INFO  (jetty-launcher-11216-thread-5) [n:127.0.0.1:62604_solr    ] o.a.s.c.c.ZkStateReader Updated live nodes from ZooKeeper... (0) -> (0)
   [junit4]   2> 2911269 INFO  (jetty-launcher-11216-thread-2) [n:127.0.0.1:62584_solr    ] o.a.s.c.c.ZkStateReader Updated live nodes from ZooKeeper... (0) -> (0)
   [junit4]   2> 2911273 INFO  (jetty-launcher-11216-thread-4) [n:127.0.0.1:62599_solr    ] o.a.s.c.c.SolrZkClient makePath: /overseer_elect
   [junit4]   2> 2911273 INFO  (jetty-launcher-11216-thread-2) [n:127.0.0.1:62584_solr    ] o.a.s.c.c.SolrZkClient makePath: /overseer_elect
   [junit4]   2> 2911273 INFO  (jetty-launcher-11216-thread-1) [n:127.0.0.1:62590_solr    ] o.a.s.c.c.SolrZkClient makePath: /overseer_elect
   [junit4]   2> 2911274 INFO  (jetty-launcher-11216-thread-5) [n:127.0.0.1:62604_solr    ] o.a.s.c.c.SolrZkClient makePath: /overseer_elect
   [junit4]   2> 2911276 INFO  (jetty-launcher-11216-thread-3) [n:127.0.0.1:62587_solr    ] o.a.s.c.c.SolrZkClient makePath: /overseer_elect/election
   [junit4]   2> 2911276 INFO  (jetty-launcher-11216-thread-2) [n:127.0.0.1:62584_solr    ] o.a.s.c.c.SolrZkClient makePath: /overseer_elect/election
   [junit4]   2> 2911276 INFO  (jetty-launcher-11216-thread-4) [n:127.0.0.1:62599_solr    ] o.a.s.c.c.SolrZkClient makePath: /overseer_elect/election
   [junit4]   2> 2911276 INFO  (jetty-launcher-11216-thread-5) [n:127.0.0.1:62604_solr    ] o.a.s.c.c.SolrZkClient makePath: /overseer_elect/election
   [junit4]   2> 2911276 INFO  (jetty-launcher-11216-thread-1) [n:127.0.0.1:62590_solr    ] o.a.s.c.c.SolrZkClient makePath: /overseer_elect/election
   [junit4]   2> 2911279 INFO  (jetty-launcher-11216-thread-4) [n:127.0.0.1:62599_solr    ] o.a.s.c.Overseer Overseer (id=null) closing
   [junit4]   2> 2911279 INFO  (jetty-launcher-11216-thread-5) [n:127.0.0.1:62604_solr    ] o.a.s.c.Overseer Overseer (id=null) closing
   [junit4]   2> 2911279 INFO  (jetty-launcher-11216-thread-3) [n:127.0.0.1:62587_solr    ] o.a.s.c.Overseer Overseer (id=null) closing
   [junit4]   2> 2911280 INFO  (jetty-launcher-11216-thread-1) [n:127.0.0.1:62590_solr    ] o.a.s.c.Overseer Overseer (id=null) closing
   [junit4]   2> 2911280 INFO  (jetty-launcher-11216-thread-2) [n:127.0.0.1:62584_solr    ] o.a.s.c.Overseer Overseer (id=null) closing
   [junit4]   2> 2911280 INFO  (jetty-launcher-11216-thread-4) [n:127.0.0.1:62599_solr    ] o.a.s.c.LeaderElector Joined leadership election with path: /overseer_elect/election/96047194767360013-127.0.0.1:62599_solr-n_0000000000
   [junit4]   2> 2911280 INFO  (jetty-launcher-11216-thread-5) [n:127.0.0.1:62604_solr    ] o.a.s.c.LeaderElector Joined leadership election with path: /overseer_elect/election/96047194767360014-127.0.0.1:62604_solr-n_0000000001
   [junit4]   2> 2911282 INFO  (jetty-launcher-11216-thread-3) [n:127.0.0.1:62587_solr    ] o.a.s.c.LeaderElector Joined leadership election with path: /overseer_elect/election/96047194767360012-127.0.0.1:62587_solr-n_0000000002
   [junit4]   2> 2911282 INFO  (jetty-launcher-11216-thread-1) [n:127.0.0.1:62590_solr    ] o.a.s.c.LeaderElector Joined leadership election with path: /overseer_elect/election/96047194767360011-127.0.0.1:62590_solr-n_0000000003
   [junit4]   2> 2911282 INFO  (jetty-launcher-11216-thread-2) [n:127.0.0.1:62584_solr    ] o.a.s.c.LeaderElector Joined leadership election with path: /overseer_elect/election/96047194767360015-127.0.0.1:62584_solr-n_0000000004
   [junit4]   2> 2911282 INFO  (jetty-launcher-11216-thread-4) [n:127.0.0.1:62599_solr    ] o.a.s.c.OverseerElectionContext I am going to be the leader 127.0.0.1:62599_solr
   [junit4]   2> 2911282 INFO  (jetty-launcher-11216-thread-4) [n:127.0.0.1:62599_solr    ] o.a.s.c.c.SolrZkClient makePath: /overseer_elect/leader
   [junit4]   2> 2911283 INFO  (jetty-launcher-11216-thread-5) [n:127.0.0.1:62604_solr    ] o.a.s.c.LeaderElector Watching path /overseer_elect/election/96047194767360013-127.0.0.1:62599_solr-n_0000000000 to know if I could be the leader
   [junit4]   2> 2911283 INFO  (jetty-launcher-11216-thread-1) [n:127.0.0.1:62590_solr    ] o.a.s.c.LeaderElector Watching path /overseer_elect/election/96047194767360012-127.0.0.1:62587_solr-n_0000000002 to know if I could be the leader
   [junit4]   2> 2911283 INFO  (jetty-launcher-11216-thread-2) [n:127.0.0.1:62584_solr    ] o.a.s.c.LeaderElector Watching path /overseer_elect/election/96047194767360011-127.0.0.1:62590_solr-n_0000000003 to know if I could be the leader
   [junit4]   2> 2911283 INFO  (jetty-launcher-11216-thread-3) [n:127.0.0.1:62587_solr    ] o.a.s.c.LeaderElector Watching path /overseer_elect/election/96047194767360014-127.0.0.1:62604_solr-n_0000000001 to know if I could be the leader
   [junit4]   2> 2911284 INFO  (jetty-launcher-11216-thread-5) [n:127.0.0.1:62604_solr    ] o.a.s.c.ZkController Register node as live in ZooKeeper:/live_nodes/127.0.0.1:62604_solr
   [junit4]   2> 2911284 INFO  (jetty-launcher-11216-thread-1) [n:127.0.0.1:62590_solr    ] o.a.s.c.ZkController Register node as live in ZooKeeper:/live_nodes/127.0.0.1:62590_solr
   [junit4]   2> 2911285 INFO  (jetty-launcher-11216-thread-2) [n:127.0.0.1:62584_solr    ] o.a.s.c.ZkController Register node as live in ZooKeeper:/live_nodes/127.0.0.1:62584_solr
   [junit4]   2> 2911287 INFO  (jetty-launcher-11216-thread-5) [n:127.0.0.1:62604_solr    ] o.a.s.c.c.SolrZkClient makePath: /live_nodes/127.0.0.1:62604_solr
   [junit4]   2> 2911287 INFO  (jetty-launcher-11216-thread-3) [n:127.0.0.1:62587_solr    ] o.a.s.c.ZkController Register node as live in ZooKeeper:/live_nodes/127.0.0.1:62587_solr
   [junit4]   2> 2911287 INFO  (jetty-launcher-11216-thread-1) [n:127.0.0.1:62590_solr    ] o.a.s.c.c.SolrZkClient makePath: /live_nodes/127.0.0.1:62590_solr
   [junit4]   2> 2911287 INFO  (jetty-launcher-11216-thread-4) [n:127.0.0.1:62599_solr    ] o.a.s.c.Overseer Overseer (id=96047194767360013-127.0.0.1:62599_solr-n_0000000000) starting
   [junit4]   2> 2911288 INFO  (jetty-launcher-11216-thread-2) [n:127.0.0.1:62584_solr    ] o.a.s.c.c.SolrZkClient makePath: /live_nodes/127.0.0.1:62584_solr
   [junit4]   2> 2911288 INFO  (jetty-launcher-11216-thread-3) [n:127.0.0.1:62587_solr    ] o.a.s.c.c.SolrZkClient makePath: /live_nodes/127.0.0.1:62587_solr
   [junit4]   2> 2911292 INFO  (zkCallback-11242-thread-1-processing-n:127.0.0.1:62599_solr) [n:127.0.0.1:62599_solr    ] o.a.s.c.c.ZkStateReader A live node change: [WatchedEvent state:SyncConnected type:NodeChildrenChanged path:/live_nodes], has occurred - updating... (live nodes size: [0])
   [junit4]   2> 2911292 INFO  (zkCallback-11239-thread-1-processing-n:127.0.0.1:62584_solr) [n:127.0.0.1:62584_solr    ] o.a.s.c.c.ZkStateReader A live node change: [WatchedEvent state:SyncConnected type:NodeChildrenChanged path:/live_nodes], has occurred - updating... (live nodes size: [0])
   [junit4]   2> 2911292 INFO  (zkCallback-11238-thread-1-processing-n:127.0.0.1:62590_solr) [n:127.0.0.1:62590_solr    ] o.a.s.c.c.ZkStateReader A live node change: [WatchedEvent state:SyncConnected type:NodeChildrenChanged path:/live_nodes], has occurred - updating... (live nodes size: [0])
   [junit4]   2> 2911292 INFO  (zkCallback-11240-thread-1-processing-n:127.0.0.1:62604_solr) [n:127.0.0.1:62604_solr    ] o.a.s.c.c.ZkStateReader A live node change: [WatchedEvent state:SyncConnected type:NodeChildrenChanged path:/live_nodes], has occurred - updating... (live nodes size: [0])
   [junit4]   2> 2911293 INFO  (zkCallback-11241-thread-1-processing-n:127.0.0.1:62587_solr) [n:127.0.0.1:62587_solr    ] o.a.s.c.c.ZkStateReader A live node change: [WatchedEvent state:SyncConnected type:NodeChildrenChanged path:/live_nodes], has occurred - updating... (live nodes size: [0])
   [junit4]   2> 2911294 INFO  (zkCallback-11242-thread-1-processing-n:127.0.0.1:62599_solr) [n:127.0.0.1:62599_solr    ] o.a.s.c.c.ZkStateReader Updated live nodes from ZooKeeper... (0) -> (3)
   [junit4]   2> 2911294 INFO  (zkCallback-11239-thread-1-processing-n:127.0.0.1:62584_solr) [n:127.0.0.1:62584_solr    ] o.a.s.c.c.ZkStateReader Updated live nodes from ZooKeeper... (0) -> (3)
   [junit4]   2> 2911294 INFO  (zkCallback-11238-thread-1-processing-n:127.0.0.1:62590_solr) [n:127.0.0.1:62590_solr    ] o.a.s.c.c.ZkStateReader Updated live nodes from ZooKeeper... (0) -> (3)
   [junit4]   2> 2911294 INFO  (zkCallback-11240-thread-1-processing-n:127.0.0.1:62604_solr) [n:127.0.0.1:62604_solr    ] o.a.s.c.c.ZkStateReader Updated live nodes from ZooKeeper... (0) -> (3)
   [junit4]   2> 2911303 INFO  (jetty-launcher-11216-thread-1) [n:127.0.0.1:62590_solr    ] o.a.s.c.CoreContainer Security conf doesn't exist. Skipping setup for authorization module.
   [junit4]   2> 2911303 INFO  (jetty-launcher-11216-thread-1) [n:127.0.0.1:62590_solr    ] o.a.s.c.CoreContainer No authentication plugin used.
   [junit4]   2> 2911304 INFO  (jetty-launcher-11216-thread-1) [n:127.0.0.1:62590_solr    ] o.a.s.c.CorePropertiesLocator Looking for core definitions underneath C:\Users\jenkins\workspace\Lucene-Solr-6.x-Windows\solr\build\solr-core\test\J0\temp\solr.security.BasicAuthIntegrationTest_F20A57DBA1E1200-001\tempDir-001\node1\.
   [junit4]   2> 2911305 INFO  (jetty-launcher-11216-thread-1) [n:127.0.0.1:62590_solr    ] o.a.s.c.CorePropertiesLocator Found 0 core definitions
   [junit4]   2> 2911305 INFO  (zkCallback-11241-thread-1-processing-n:127.0.0.1:62587_solr) [n:127.0.0.1:62587_solr    ] o.a.s.c.c.ZkStateReader Updated live nodes from ZooKeeper... (0) -> (3)
   [junit4]   2> 2911306 INFO  (jetty-launcher-11216-thread-4) [n:127.0.0.1:62599_solr    ] o.a.s.c.c.SolrZkClient makePath: /overseer/queue-work
   [junit4]   2> 2911306 INFO  (jetty-launcher-11216-thread-1) [n:127.0.0.1:62590_solr    ] o.a.s.s.SolrDispatchFilter user.dir=C:\Users\jenkins\workspace\Lucene-Solr-6.x-Windows\solr\build\solr-core\test\J0
   [junit4]   2> 2911306 INFO  (jetty-launcher-11216-thread-1) [n:127.0.0.1:62590_solr    ] o.a.s.s.SolrDispatchFilter SolrDispatchFilter.init() done
   [junit4]   2> 2911310 INFO  (zkCallback-11242-thread-1-processing-n:127.0.0.1:62599_solr) [n:127.0.0.1:62599_solr    ] o.a.s.c.c.ZkStateReader A live node change: [WatchedEvent state:SyncConnected type:NodeChildrenChanged path:/live_nodes], has occurred - updating... (live nodes size: [3])
   [junit4]   2> 2911311 INFO  (zkCallback-11238-thread-1-processing-n:127.0.0.1:62590_solr) [n:127.0.0.1:62590_solr    ] o.a.s.c.c.ZkStateReader A live node change: [WatchedEvent state:SyncConnected type:NodeChildrenChanged path:/live_nodes], has occurred - updating... (live nodes size: [3])
   [junit4]   2> 2911311 INFO  (zkCallback-11239-thread-1-processing-n:127.0.0.1:62584_solr) [n:127.0.0.1:62584_solr    ] o.a.s.c.c.ZkStateReader A live node change: [WatchedEvent state:SyncConnected type:NodeChildrenChanged path:/live_nodes], has occurred - updating... (live nodes size: [3])
   [junit4]   2> 2911311 INFO  (zkCallback-11240-thread-1-processing-n:127.0.0.1:62604_solr) [n:127.0.0.1:62604_solr    ] o.a.s.c.c.ZkStateReader A live node change: [WatchedEvent state:SyncConnected type:NodeChildrenChanged path:/live_nodes], has occurred - updating... (live nodes size: [3])
   [junit4]   2> 2911311 INFO  (zkCallback-11241-thread-1-processing-n:127.0.0.1:62587_solr) [n:127.0.0.1:62587_solr    ] o.a.s.c.c.ZkStateReader A live node change: [WatchedEvent state:SyncConnected type:NodeChildrenChanged path:/live_nodes], has occurred - updating... (live nodes size: [3])
   [junit4]   2> 2911322 INFO  (jetty-launcher-11216-thread-3) [n:127.0.0.1:62587_solr    ] o.a.s.c.CoreContainer Security conf doesn't exist. Skipping setup for authorization module.
   [junit4]   2> 2911322 INFO  (jetty-launcher-11216-thread-3) [n:127.0.0.1:62587_solr    ] o.a.s.c.CoreContainer No authentication plugin used.
   [junit4]   2> 2911323 INFO  (jetty-launcher-11216-thread-3) [n:127.0.0.1:62587_solr    ] o.a.s.c.CorePropertiesLocator Looking for core definitions underneath C:\Users\jenkins\workspace\Lucene-Solr-6.x-Windows\solr\build\solr-core\test\J0\temp\solr.security.BasicAuthIntegrationTest_F20A57DBA1E1200-001\tempDir-001\node3\.
   [junit4]   2> 2911323 INFO  (jetty-launcher-11216-thread-3) [n:127.0.0.1:62587_solr    ] o.a.s.c.CorePropertiesLocator Found 0 core definitions
   [junit4]   2> 2911324 INFO  (zkCallback-11242-thread-1-processing-n:127.0.0.1:62599_solr) [n:127.0.0.1:62599_solr    ] o.a.s.c.c.ZkStateReader Updated live nodes from ZooKeeper... (3) -> (4)
   [junit4]   2> 2911324 INFO  (zkCallback-11238-thread-1-processing-n:127.0.0.1:62590_solr) [n:127.0.0.1:62590_solr    ] o.a.s.c.c.ZkStateReader Updated live nodes from ZooKeeper... (3) -> (4)
   [junit4]   2> 2911324 INFO  (zkCallback-11239-thread-1-processing-n:127.0.0.1:62584_solr) [n:127.0.0.1:62584_solr    ] o.a.s.c.c.ZkStateReader Updated live nodes from ZooKeeper... (3) -> (4)
   [junit4]   2> 2911324 INFO  (zkCallback-11240-thread-1-processing-n:127.0.0.1:62604_solr) [n:127.0.0.1:62604_solr    ] o.a.s.c.c.ZkStateReader Updated live nodes from ZooKeeper... (3) -> (4)
   [junit4]   2> 2911325 INFO  (zkCallback-11241-thread-1-processing-n:127.0.0.1:62587_solr) [n:127.0.0.1:62587_solr    ] o.a.s.c.c.ZkStateReader Updated live nodes from ZooKeeper... (3) -> (4)
   [junit4]   2> 2911326 INFO  (jetty-launcher-11216-thread-2) [n:127.0.0.1:62584_solr    ] o.a.s.c.CoreContainer Security conf doesn't exist. Skipping setup for authorization module.
   [junit4]   2> 2911326 INFO  (jetty-launcher-11216-thread-2) [n:127.0.0.1:62584_solr    ] o.a.s.c.CoreContainer No authentication plugin used.
   [junit4]   2> 2911327 INFO  (jetty-launcher-11216-thread-2) [n:127.0.0.1:62584_solr    ] o.a.s.c.CorePropertiesLocator Looking for core definitions underneath C:\Users\jenkins\workspace\Lucene-Solr-6.x-Windows\solr\build\solr-core\test\J0\temp\solr.security.BasicAuthIntegrationTest_F20A57DBA1E1200-001\tempDir-001\node2\.
   [junit4]   2> 2911327 INFO  (jetty-launcher-11216-thread-2) [n:127.0.0.1:62584_solr    ] o.a.s.c.CorePropertiesLocator Found 0 core definitions
   [junit4]   2> 2911327 INFO  (jetty-launcher-11216-thread-3) [n:127.0.0.1:62587_solr    ] o.a.s.s.SolrDispatchFilter user.dir=C:\Users\jenkins\workspace\Lucene-Solr-6.x-Windows\solr\build\solr-core\test\J0
   [junit4]   2> 2911327 INFO  (jetty-launcher-11216-thread-3) [n:127.0.0.1:62587_solr    ] o.a.s.s.SolrDispatchFilter SolrDispatchFilter.init() done
   [junit4]   2> 2911330 INFO  (jetty-launcher-11216-thread-2) [n:127.0.0.1:62584_solr    ] o.a.s.s.SolrDispatchFilter user.dir=C:\Users\jenkins\workspace\Lucene-Solr-6.x-Windows\solr\build\solr-core\test\J0
   [junit4]   2> 2911330 INFO  (jetty-launcher-11216-thread-2) [n:127.0.0.1:62584_solr    ] o.a.s.s.SolrDispatchFilter SolrDispatchFilter.init() done
   [junit4]   2> 2911331 INFO  (jetty-launcher-11216-thread-5) [n:127.0.0.1:62604_solr    ] o.a.s.c.CoreContainer Security conf doesn't exist. Skipping setup for authorization module.
   [junit4]   2> 2911332 INFO  (jetty-launcher-11216-thread-5) [n:127.0.0.1:62604_solr    ] o.a.s.c.CoreContainer No authentication plugin used.
   [junit4]   2> 2911332 INFO  (jetty-launcher-11216-thread-5) [n:127.0.0.1:62604_solr    ] o.a.s.c.CorePropertiesLocator Looking for core definitions underneath C:\Users\jenkins\workspace\Lucene-Solr-6.x-Windows\solr\build\solr-core\test\J0\temp\solr.security.BasicAuthIntegrationTest_F20A57DBA1E1200-001\tempDir-001\node5\.
   [junit4]   2> 2911333 INFO  (jetty-launcher-11216-thread-5) [n:127.0.0.1:62604_solr    ] o.a.s.c.CorePropertiesLocator Found 0 core definitions
   [junit4]   2> 2911333 INFO  (jetty-launcher-11216-thread-5) [n:127.0.0.1:62604_solr    ] o.a.s.s.SolrDispatchFilter user.dir=C:\Users\jenkins\workspace\Lucene-Solr-6.x-Windows\solr\build\solr-core\test\J0
   [junit4]   2> 2911333 INFO  (jetty-launcher-11216-thread-5) [n:127.0.0.1:62604_solr    ] o.a.s.s.SolrDispatchFilter SolrDispatchFilter.init() done
   [junit4]   2> 2911339 INFO  (jetty-launcher-11216-thread-4) [n:127.0.0.1:62599_solr    ] o.a.s.c.OverseerAutoReplicaFailoverThread Starting OverseerAutoReplicaFailoverThread autoReplicaFailoverWorkLoopDelay=10000 autoReplicaFailoverWaitAfterExpiration=30000 autoReplicaFailoverBadNodeExpiration=60000
   [junit4]   2> 2911340 INFO  (OverseerCollectionConfigSetProcessor-96047194767360013-127.0.0.1:62599_solr-n_0000000000) [n:127.0.0.1:62599_solr    ] o.a.s.c.OverseerTaskProcessor Process current queue of overseer operations
   [junit4]   2> 2911340 INFO  (jetty-launcher-11216-thread-4) [n:127.0.0.1:62599_solr    ] o.a.s.c.ZkController Publish node=127.0.0.1:62599_solr as DOWN
   [junit4]   2> 2911341 INFO  (OverseerStateUpdate-96047194767360013-127.0.0.1:62599_solr-n_0000000000) [n:127.0.0.1:62599_solr    ] o.a.s.c.Overseer Starting to work on the main queue
   [junit4]   2> 2911344 INFO  (OverseerStateUpdate-96047194767360013-127.0.0.1:62599_solr-n_0000000000) [n:127.0.0.1:62599_solr    ] o.a.s.c.c.ZkStateReader Updated live nodes from ZooKeeper... (4) -> (4)
   [junit4]   2> 2911346 INFO  (OverseerStateUpdate-96047194767360013-127.0.0.1:62599_solr-n_0000000000) [n:127.0.0.1:62599_solr    ] o.a.s.c.Overseer processMessage: queueSize: 1, message = {
   [junit4]   2>   "operation":"downnode",
   [junit4]   2>   "node_name":"127.0.0.1:62599_solr"} current state version: 0
   [junit4]   2> 2911346 INFO  (OverseerStateUpdate-96047194767360013-127.0.0.1:62599_solr-n_0000000000) [n:127.0.0.1:62599_solr    ] o.a.s.c.o.NodeMutator DownNode state invoked for node: 127.0.0.1:62599_solr
   [junit4]   2> 2912345 INFO  (jetty-launcher-11216-thread-4) [n:127.0.0.1:62599_solr    ] o.a.s.c.ZkController Register node as live in ZooKeeper:/live_nodes/127.0.0.1:62599_solr
   [junit4]   2> 2912346 INFO  (jetty-launcher-11216-thread-4) [n:127.0.0.1:62599_solr    ] o.a.s.c.c.SolrZkClient makePath: /live_nodes/127.0.0.1:62599_solr
   [junit4]   2> 2912348 INFO  (zkCallback-11242-thread-1-processing-n:127.0.0.1:62599_solr) [n:127.0.0.1:62599_solr    ] o.a.s.c.c.ZkStateReader A live node change: [WatchedEvent state:SyncConnected type:NodeChildrenChanged path:/live_nodes], has occurred - updating... (live nodes size: [4])
   [junit4]   2> 2912348 INFO  (zkCallback-11238-thread-1-processing-n:127.0.0.1:62590_solr) [n:127.0.0.1:62590_solr    ] o.a.s.c.c.ZkStateReader A live node change: [WatchedEvent state:SyncConnected type:NodeChildrenChanged path:/live_nodes], has occurred - updating... (live nodes size: [4])
   [junit4]   2> 2912348 INFO  (zkCallback-11239-thread-1-processing-n:127.0.0.1:62584_solr) [n:127.0.0.1:62584_solr    ] o.a.s.c.c.ZkStateReader A live node change: [WatchedEvent state:SyncConnected type:NodeChildrenChanged path:/live_nodes], has occurred - updating... (live nodes size: [4])
   [junit4]   2> 2912348 INFO  (zkCallback-11240-thread-1-processing-n:127.0.0.1:62604_solr) [n:127.0.0.1:62604_solr    ] o.a.s.c.c.ZkStateReader A live node change: [WatchedEvent state:SyncConnected type:NodeChildrenChanged path:/live_nodes], has occurred - updating... (live nodes size: [4])
   [junit4]   2> 2912348 INFO  (zkCallback-11241-thread-1-processing-n:127.0.0.1:62587_solr) [n:127.0.0.1:62587_solr    ] o.a.s.c.c.ZkStateReader A live node change: [WatchedEvent state:SyncConnected type:NodeChildrenChanged path:/live_nodes], has occurred - updating... (live nodes size: [4])
   [junit4]   2> 2912348 INFO  (zkCallback-11242-thread-1-processing-n:127.0.0.1:62599_solr) [n:127.0.0.1:62599_solr    ] o.a.s.c.c.ZkStateReader Updated live nodes from ZooKeeper... (4) -> (5)
   [junit4]   2> 2912349 INFO  (zkCallback-11238-thread-1-processing-n:127.0.0.1:62590_solr) [n:127.0.0.1:62590_solr    ] o.a.s.c.c.ZkStateReader Updated live nodes from ZooKeeper... (4) -> (5)
   [junit4]   2> 2912349 INFO  (zkCallback-11240-thread-1-processing-n:127.0.0.1:62604_solr) [n:127.0.0.1:62604_solr    ] o.a.s.c.c.ZkStateReader Updated live nodes from ZooKeeper... (4) -> (5)
   [junit4]   2> 2912349 INFO  (zkCallback-11241-thread-1-processing-n:127.0.0.1:62587_solr) [n:127.0.0.1:62587_solr    ] o.a.s.c.c.ZkStateReader Updated live nodes from ZooKeeper... (4) -> (5)
   [junit4]   2> 2912349 INFO  (zkCallback-11239-thread-1-processing-n:127.0.0.1:62584_solr) [n:127.0.0.1:62584_solr    ] o.a.s.c.c.ZkStateReader Updated live nodes from ZooKeeper... (4) -> (5)
   [junit4]   2> 2912358 INFO  (jetty-launcher-11216-thread-4) [n:127.0.0.1:62599_solr    ] o.a.s.c.CoreContainer Security conf doesn't exist. Skipping setup for authorization module.
   [junit4]   2> 2912358 INFO  (jetty-launcher-11216-thread-4) [n:127.0.0.1:62599_solr    ] o.a.s.c.CoreContainer No authentication plugin used.
   [junit4]   2> 2912359 INFO  (jetty-launcher-11216-thread-4) [n:127.0.0.1:62599_solr    ] o.a.s.c.CorePropertiesLocator Looking for core definitions underneath C:\Users\jenkins\workspace\Lucene-Solr-6.x-Windows\solr\build\solr-core\test\J0\temp\solr.security.BasicAuthIntegrationTest_F20A57DBA1E1200-001\tempDir-001\node4\.
   [junit4]   2> 2912359 INFO  (jetty-launcher-11216-thread-4) [n:127.0.0.1:62599_solr    ] o.a.s.c.CorePropertiesLocator Found 0 core definitions
   [junit4]   2> 2912360 INFO  (jetty-launcher-11216-thread-4) [n:127.0.0.1:62599_solr    ] o.a.s.s.SolrDispatchFilter user.dir=C:\Users\jenkins\workspace\Lucene-Solr-6.x-Windows\solr\build\solr-core\test\J0
   [junit4]   2> 2912360 INFO  (jetty-launcher-11216-thread-4) [n:127.0.0.1:62599_solr    ] o.a.s.s.SolrDispatchFilter SolrDispatchFilter.init() done
   [junit4]   2> 2912360 INFO  (TEST-BasicAuthIntegrationTest.testBasics-seed#[F20A57DBA1E1200]) [    ] o.a.s.c.c.SolrZkClient Using default ZkCredentialsProvider
   [junit4]   2> 2912361 INFO  (TEST-BasicAuthIntegrationTest.testBasics-seed#[F20A57DBA1E1200]) [    ] o.a.s.c.c.ConnectionManager Waiting for client to connect to ZooKeeper
   [junit4]   2> 2912362 INFO  (zkCallback-11248-thread-1) [    ] o.a.s.c.c.ConnectionManager Watcher org.apache.solr.common.cloud.ConnectionManager@1a82adc name:ZooKeeperConnection Watcher:127.0.0.1:62580 got event WatchedEvent state:SyncConnected type:None path:null path:null type:None
   [junit4]   2> 2912362 INFO  (TEST-BasicAuthIntegrationTest.testBasics-seed#[F20A57DBA1E1200]) [    ] o.a.s.c.c.ConnectionManager Client is connected to ZooKeeper
   [junit4]   2> 2912363 INFO  (TEST-BasicAuthIntegrationTest.testBasics-seed#[F20A57DBA1E1200]) [    ] o.a.s.c.c.SolrZkClient Using default ZkACLProvider
   [junit4]   2> 2912364 INFO  (TEST-BasicAuthIntegrationTest.testBasics-seed#[F20A57DBA1E1200]) [    ] o.a.s.c.s.i.CloudSolrClient Final constructed zkHost string: 127.0.0.1:62580/solr
   [junit4]   2> 2912365 INFO  (TEST-BasicAuthIntegrationTest.testBasics-seed#[F20A57DBA1E1200]) [    ] o.e.j.s.ServerConnector Stopped ServerConnector@15f4888{HTTP/1.1,[http/1.1]}{127.0.0.1:0}
   [junit4]   2> 2912367 INFO  (TEST-BasicAuthIntegrationTest.testBasics-seed#[F20A57DBA1E1200]) [    ] o.a.s.c.CoreContainer Shutting down CoreContainer instance=6403166
   [junit4]   2> 2912367 INFO  (TEST-BasicAuthIntegrationTest.testBasics-seed#[F20A57DBA1E1200]) [    ] o.a.s.c.ZkController Publish node=127.0.0.1:62590_solr as DOWN
   [junit4]   2> 2912371 INFO  (zkCallback-11238-thread-1-processing-n:127.0.0.1:62590_solr) [n:127.0.0.1:62590_solr    ] o.a.s.c.c.ZkStateReader A live node change: [WatchedEvent state:SyncConnected type:NodeChildrenChanged path:/live_nodes], has occurred - updating... (live nodes size: [5])
   [junit4]   2> 2912371 INFO  (zkCallback-11239-thread-1-processing-n:127.0.0.1:62584_solr) [n:127.0.0.1:62584_solr    ] o.a.s.c.c.ZkStateReader A live node change: [WatchedEvent state:SyncConnected type:NodeChildrenChanged path:/live_nodes], has occurred - updating... (live nodes size: [5])
   [junit4]   2> 2912373 WARN  (NIOServerCxn.Factory:0.0.0.0/0.0.0.0:0) [    ] o.a.z.s.NIOServerCnxn caught end of stream exception
   [junit4]   2> EndOfStreamException: Unable to read additional data from client sessionid 0x1553a6a2dc8000b, likely client has closed socket
   [junit4]   2> 	at org.apache.zookeeper.server.NIOServerCnxn.doIO(NIOServerCnxn.java:228)
   [junit4]   2> 	at org.apache.zookeeper.server.NIOServerCnxnFactory.run(NIOServerCnxnFactory.java:208)
   [junit4]   2> 	at java.lang.Thread.run(Thread.java:745)
   [junit4]   2> 2912373 INFO  (zkCallback-11241-thread-1-processing-n:127.0.0.1:62587_solr) [n:127.0.0.1:62587_solr    ] o.a.s.c.c.ZkStateReader A live node change: [WatchedEvent state:SyncConnected type:NodeChildrenChanged path:/live_nodes], has occurred - updating... (live nodes size: [5])
   [junit4]   2> 2912373 INFO  (OverseerStateUpdate-96047194767360013-127.0.0.1:62599_solr-n_0000000000) [n:127.0.0.1:62599_solr    ] o.a.s.c.Overseer processMessage: queueSize: 1, message = {
   [junit4]   2>   "operation":"downnode",
   [junit4]   2>   "node_name":"127.0.0.1:62590_solr"} current state version: 0
   [junit4]   2> 2912373 INFO  (zkCallback-11240-thread-1-processing-n:127.0.0.1:62604_solr) [n:127.0.0.1:62604_solr    ] o.a.s.c.c.ZkStateReader A live node change: [WatchedEvent state:SyncConnected type:NodeChildrenChanged path:/live_nodes], has occurred - updating... (live nodes size: [5])
   [junit4]   2> 2912373 INFO  (OverseerStateUpdate-96047194767360013-127.0.0.1:62599_solr-n_0000000000) [n:127.0.0.1:62599_solr    ] o.a.s.c.o.NodeMutator DownNode state invoked for node: 127.0.0.1:62590_solr
   [junit4]   2> 2912373 INFO  (zkCallback-11239-thread-1-processing-n:127.0.0.1:62584_solr) [n:127.0.0.1:62584_solr    ] o.a.s.c.c.ZkStateReader Updated live nodes from ZooKeeper... (5) -> (4)
   [junit4]   2> 2912373 INFO  (zkCallback-11241-thread-1-processing-n:127.0.0.1:62587_solr) [n:127.0.0.1:62587_solr    ] o.a.s.c.c.ZkStateReader Updated live nodes from ZooKeeper... (5) -> (4)
   [junit4]   2> 2912374 INFO  (zkCallback-11240-thread-1-processing-n:127.0.0.1:62604_solr) [n:127.0.0.1:62604_solr    ] o.a.s.c.c.ZkStateReader Updated live nodes from ZooKeeper... (5) -> (4)
   [junit4]   2> 2912374 INFO  (zkCallback-11242-thread-3-processing-n:127.0.0.1:62599_solr) [n:127.0.0.1:62599_solr    ] o.a.s.c.c.ZkStateReader A live node change: [WatchedEvent state:SyncConnected type:NodeChildrenChanged path:/live_nodes], has occurred - updating... (live nodes size: [5])
   [junit4]   2> 2912375 INFO  (zkCallback-11242-thread-3-processing-n:127.0.0.1:62599_solr) [n:127.0.0.1:62599_solr    ] o.a.s.c.c.ZkStateReader Updated live nodes from ZooKeeper... (5) -> (4)
   [junit4]   2> 2912376 INFO  (zkCallback-11239-thread-2-processing-n:127.0.0.1:62584_solr) [n:127.0.0.1:62584_solr    ] o.a.s.c.LeaderElector Watching path /overseer_elect/election/96047194767360012-127.0.0.1:62587_solr-n_0000000002 to know if I could be the leader
   [junit4]   2> 2913872 WARN  (zkCallback-11238-thread-1-processing-n:127.0.0.1:62590_solr) [n:127.0.0.1:62590_solr    ] o.a.s.c.c.ZkStateReader ZooKeeper watch triggered, but Solr cannot talk to ZK: [KeeperErrorCode = Session expired for /live_nodes]
   [junit4]   2> 2913872 INFO  (TEST-BasicAuthIntegrationTest.testBasics-seed#[F20A57DBA1E1200]) [    ] o.e.j.s.h.ContextHandler Stopped o.e.j.s.ServletContextHandler@1985ea8{/solr,null,UNAVAILABLE}
   [junit4]   2> 2913882 INFO  (TEST-BasicAuthIntegrationTest.testBasics-seed#[F20A57DBA1E1200]) [    ] o.e.j.s.Server jetty-9.3.8.v20160314
   [junit4]   2> 2913884 INFO  (TEST-BasicAuthIntegrationTest.testBasics-seed#[F20A57DBA1E1200]) [    ] o.e.j.s.h.ContextHandler Started o.e.j.s.ServletContextHandler@1561c4{/solr,null,AVAILABLE}
   [junit4]   2> 2913884 INFO  (TEST-BasicAuthIntegrationTest.testBasics-seed#[F20A57DBA1E1200]) [    ] o.e.j.s.ServerConnector Started ServerConnector@1ec86a0{HTTP/1.1,[http/1.1]}{127.0.0.1:62650}
   [junit4]   2> 2913884 INFO  (TEST-BasicAuthIntegrationTest.testBasics-seed#[F20A57DBA1E1200]) [    ] o.e.j.s.Server Started @2917991ms
   [junit4]   2> 2913884 INFO  (TEST-BasicAuthIntegrationTest.testBasics-seed#[F20A57DBA1E1200]) [    ] o.a.s.c.s.e.JettySolrRunner Jetty properties: {hostContext=/solr, hostPort=62650}
   [junit4]   2> 2913885 INFO  (TEST-BasicAuthIntegrationTest.testBasics-seed#[F20A57DBA1E1200]) [    ] o.a.s.s.SolrDispatchFilter SolrDispatchFilter.init(): sun.misc.Launcher$AppClassLoader@1d16e93
   [junit4]   2> 2913885 INFO  (TEST-BasicAuthIntegrationTest.testBasics-seed#[F20A57DBA1E1200]) [    ] o.a.s.c.SolrResourceLoader new SolrResourceLoader for directory: 'C:\Users\jenkins\workspace\Lucene-Solr-6.x-Windows\solr\build\solr-core\test\J0\temp\solr.security.BasicAuthIntegrationTest_F20A57DBA1E1200-001\tempDir-001\node6'
   [junit4]   2> 2913885 INFO  (TEST-BasicAuthIntegrationTest.testBasics-seed#[F20A57DBA1E1200]) [    ] o.a.s.c.SolrResourceLoader JNDI not configured for solr (NoInitialContextEx)
   [junit4]   2> 2913885 INFO  (TEST-BasicAuthIntegrationTest.testBasics-seed#[F20A57DBA1E1200]) [    ] o.a.s.c.SolrResourceLoader solr home defaulted to 'solr/' (could not find system property or JNDI)
   [junit4]   2> 2913886 INFO  (TEST-BasicAuthIntegrationTest.testBasics-seed#[F20A57DBA1E1200]) [    ] o.a.s.c.c.SolrZkClient Using default ZkCredentialsProvider
   [junit4]   2> 2913887 INFO  (TEST-BasicAuthIntegrationTest.testBasics-seed#[F20A57DBA1E1200]) [    ] o.a.s.c.c.ConnectionManager Waiting for client to connect to ZooKeeper
   [junit4]   2> 2913890 INFO  (zkCallback-11250-thread-1) [    ] o.a.s.c.c.ConnectionManager Watcher org.apache.solr.common.cloud.ConnectionManager@76fae name:ZooKeeperConnection Watcher:127.0.0.1:62580/solr got event WatchedEvent state:SyncConnected type:None path:null path:null type:None
   [junit4]   2> 2913890 INFO  (TEST-BasicAuthIntegrationTest.testBasics-seed#[F20A57DBA1E1200]) [    ] o.a.s.c.c.ConnectionManager Client is connected to ZooKeeper
   [junit4]   2> 2913890 INFO  (TEST-BasicAuthIntegrationTest.testBasics-seed#[F20A57DBA1E1200]) [    ] o.a.s.c.c.SolrZkClient Using default ZkACLProvider
   [junit4]   2> 2913891 INFO  (TEST-BasicAuthIntegrationTest.testBasics-seed#[F20A57DBA1E1200]) [    ] o.a.s.s.SolrDispatchFilter solr.xml found in ZooKeeper. Loading...
   [junit4]   2> 2913900 INFO  (TEST-BasicAuthIntegrationTest.testBasics-seed#[F20A57DBA1E1200]) [    ] o.a.s.c.CorePropertiesLocator Config-defined core root directory: C:\Users\jenkins\workspace\Lucene-Solr-6.x-Windows\solr\build\solr-core\test\J0\temp\solr.security.BasicAuthIntegrationTest_F20A57DBA1E1200-001\tempDir-001\node6\.
   [junit4]   2> 2913900 INFO  (TEST-BasicAuthIntegrationTest.testBasics-seed#[F20A57DBA1E1200]) [    ] o.a.s.c.CoreContainer New CoreContainer 12749963
   [junit4]   2> 2913900 INFO  (TEST-BasicAuthIntegrationTest.testBasics-seed#[F20A57DBA1E1200]) [    ] o.a.s.c.CoreContainer Loading cores into CoreContainer [instanceDir=C:\Users\jenkins\workspace\Lucene-Solr-6.x-Windows\solr\build\solr-core\test\J0\temp\solr.security.BasicAuthIntegrationTest_F20A57DBA1E1200-001\tempDir-001\node6]
   [junit4]   2> 2913901 WARN  (TEST-BasicAuthIntegrationTest.testBasics-seed#[F20A57DBA1E1200]) [    ] o.a.s.c.CoreContainer Couldn't add files from C:\Users\jenkins\workspace\Lucene-Solr-6.x-Windows\solr\build\solr-core\test\J0\temp\solr.security.BasicAuthIntegrationTest_F20A57DBA1E1200-001\tempDir-001\node6\lib to classpath: C:\Users\jenkins\workspace\Lucene-Solr-6.x-Windows\solr\build\solr-core\test\J0\temp\solr.security.BasicAuthIntegrationTest_F20A57DBA1E1200-001\tempDir-001\node6\lib
   [junit4]   2> 2913901 INFO  (TEST-BasicAuthIntegrationTest.testBasics-seed#[F20A57DBA1E1200]) [    ] o.a.s.h.c.HttpShardHandlerFactory created with socketTimeout : 90000,urlScheme : ,connTimeout : 15000,maxConnectionsPerHost : 20,maxConnections : 10000,corePoolSize : 0,maximumPoolSize : 2147483647,maxThreadIdleTime : 5,sizeOfQueue : -1,fairnessPolicy : false,useRetries : false,
   [junit4]   2> 2913902 INFO  (TEST-BasicAuthIntegrationTest.testBasics-seed#[F20A57DBA1E1200]) [    ] o.a.s.u.UpdateShardHandler Creating UpdateShardHandler HTTP client with params: socketTimeout=340000&connTimeout=45000&retry=true
   [junit4]   2> 2913902 INFO  (TEST-BasicAuthIntegrationTest.testBasics-seed#[F20A57DBA1E1200]) [    ] o.a.s.l.LogWatcher SLF4J impl is org.slf4j.impl.Log4jLoggerFactory
   [junit4]   2> 2913902 INFO  (TEST-BasicAuthIntegrationTest.testBasics-seed#[F20A57DBA1E1200]) [    ] o.a.s.l.LogWatcher Registering Log Listener [Log4j (org.slf4j.impl.Log4jLoggerFactory)]
   [junit4]   2> 2913902 INFO  (TEST-BasicAuthIntegrationTest.testBasics-seed#[F20A57DBA1E1200]) [    ] o.a.s.c.ZkContainer Zookeeper client=127.0.0.1:62580/solr
   [junit4]   2> 2913902 INFO  (TEST-BasicAuthIntegrationTest.testBasics-seed#[F20A57DBA1E1200]) [    ] o.a.s.c.ZkController zkHost includes chroot
   [junit4]   2> 2913903 INFO  (TEST-BasicAuthIntegrationTest.testBasics-seed#[F20A57DBA1E1200]) [    ] o.a.s.c.c.SolrZkClient Using default ZkCredentialsProvider
   [junit4]   2> 2913904 INFO  (TEST-BasicAuthIntegrationTest.testBasics-seed#[F20A57DBA1E1200]) [    ] o.a.s.c.c.ConnectionManager Waiting for client to connect to ZooKeeper
   [junit4]   2> 2913905 INFO  (zkCallback-11253-thread-1) [    ] o.a.s.c.c.ConnectionManager Watcher org.apache.solr.common.cloud.ConnectionManager@1b3f0d1 name:ZooKeeperConnection Watcher:127.0.0.1:62580 got event WatchedEvent state:SyncConnected type:None path:null path:null type:None
   [junit4]   2> 2913906 INFO  (TEST-BasicAuthIntegrationTest.testBasics-seed#[F20A57DBA1E1200]) [    ] o.a.s.c.c.ConnectionManager Client is connected to ZooKeeper
   [junit4]   2> 2913906 INFO  (TEST-BasicAuthIntegrationTest.testBasics-seed#[F20A57DBA1E1200]) [    ] o.a.s.c.c.SolrZkClient Using default ZkACLProvider
   [junit4]   2> 2913907 INFO  (TEST-BasicAuthIntegrationTest.testBasics-seed#[F20A57DBA1E1200]) [n:127.0.0.1:62650_solr    ] o.a.s.c.ZkController Added new OnReconnect listener org.apache.solr.cloud.ZkController$$Lambda$10/27941871@fe8b2e
   [junit4]   2> 2913910 INFO  (TEST-BasicAuthIntegrationTest.testBasics-seed#[F20A57DBA1E1200]) [n:127.0.0.1:62650_solr    ] o.a.s.c.c.ConnectionManager Waiting for client to connect to ZooKeeper
   [junit4]   2> 2913912 INFO  (zkCallback-11254-thread-1-processing-n:127.0.0.1:62650_solr) [n:127.0.0.1:62650_solr    ] o.a.s.c.c.ConnectionManager Watcher org.apache.solr.common.cloud.ConnectionManager@7e2a20 name:ZooKeeperConnection Watcher:127.0.0.1:62580/solr got event WatchedEvent state:SyncConnected type:None path:null path:null type:None
   [junit4]   2> 2913912 INFO  (TEST-BasicAuthIntegrationTest.testBasics-seed#[F20A57DBA1E1200]) [n:127.0.0.1:62650_solr    ] o.a.s.c.c.ConnectionManager Client is connected to ZooKeeper
   [junit4]   2> 2913922 INFO  (TEST-BasicAuthIntegrationTest.testBasics-seed#[F20A57DBA1E1200]) [n:127.0.0.1:62650_solr    ] o.a.s.c.c.ZkStateReader Updating cluster state from ZooKeeper... 
   [junit4]   2> 2913923 INFO  (TEST-BasicAuthIntegrationTest.testBasics-seed#[F20A57DBA1E1200]) [n:127.0.0.1:62650_solr    ] o.a.s.c.c.ZkStateReader Loaded empty cluster properties
   [junit4]   2> 2913923 INFO  (TEST-BasicAuthIntegrationTest.testBasics-seed#[F20A57DBA1E1200]) [n:127.0.0.1:62650_solr    ] o.a.s.c.c.ZkStateReader Updated live nodes from ZooKeeper... (0) -> (4)
   [junit4]   2> 2913926 INFO  (TEST-BasicAuthIntegrationTest.testBasics-seed#[F20A57DBA1E1200]) [n:127.0.0.1:62650_solr    ] o.a.s.c.Overseer Overseer (id=null) closing
   [junit4]   2> 2913927 INFO  (TEST-BasicAuthIntegrationTest.testBasics-seed#[F20A57DBA1E1200]) [n:127.0.0.1:62650_solr    ] o.a.s.c.LeaderElector Joined leadership election with path: /overseer_elect/election/96047194767360019-127.0.0.1:62650_solr-n_0000000005
   [junit4]   2> 2913928 INFO  (TEST-BasicAuthIntegrationTest.testBasics-seed#[F20A57DBA1E1200]) [n:127.0.0.1:62650_solr    ] o.a.s.c.LeaderElector Watching path /overseer_elect/election/96047194767360015-127.0.0.1:62584_solr-n_0000000004 to know if I could be the leader
   [junit4]   2> 2913928 INFO  (TEST-BasicAuthIntegrationTest.testBasics-seed#[F20A57DBA1E1200]) [n:127.0.0.1:62650_solr    ] o.a.s.c.ZkController Publish node=127.0.0.1:62650_solr as DOWN
   [junit4]   2> 2913931 INFO  (OverseerStateUpdate-96047194767360013-127.0.0.1:62599_solr-n_0000000000) [n:127.0.0.1:62599_solr    ] o.a.s.c.Overseer processMessage: queueSize: 1, message = {
   [junit4]   2>   "operation":"downnode",
   [junit4]   2>   "node_name":"127.0.0.1:62650_solr"} current state version: 0
   [junit4]   2> 2913931 INFO  (OverseerStateUpdate-96047194767360013-127.0.0.1:62599_solr-n_0000000000) [n:127.0.0.1:62599_solr    ] o.a.s.c.o.NodeMutator DownNode state invoked for node: 127.0.0.1:62650_solr
   [junit4]   2> 2914931 INFO  (TEST-BasicAuthIntegrationTest.testBasics-seed#[F20A57DBA1E1200]) [n:127.0.0.1:62650_solr    ] o.a.s.c.ZkController Register node as live in ZooKeeper:/live_nodes/127.0.0.1:62650_solr
   [junit4]   2> 2914932 INFO  (TEST-BasicAuthIntegrationTest.testBasics-seed#[F20A57DBA1E1200]) [n:127.0.0.1:62650_solr    ] o.a.s.c.c.SolrZkClient makePath: /live_nodes/127.0.0.1:62650_solr
   [junit4]   2> 2914933 INFO  (zkCallback-11242-thread-3-processing-n:127.0.0.1:62599_solr) [n:127.0.0.1:62599_solr    ] o.a.s.c.c.ZkStateReader A live node change: [WatchedEvent state:SyncConnected type:NodeChildrenChanged path:/live_nodes], has occurred - updating... (live nodes size: [4])
   [junit4]   2> 2914933 INFO  (zkCallback-11239-thread-2-processing-n:127.0.0.1:62584_solr) [n:127.0.0.1:62584_solr    ] o.a.s.c.c.ZkStateReader A live node change: [WatchedEvent state:SyncConnected type:NodeChildrenChanged path:/live_nodes], has occurred - updating... (live nodes size: [4])
   [junit4]   2> 2914933 INFO  (zkCallback-11240-thread-1-processing-n:127.0.0.1:62604_solr) [n:127.0.0.1:62604_solr    ] o.a.s.c.c.ZkStateReader A live node change: [WatchedEvent state:SyncConnected type:NodeChildrenChanged path:/live_nodes], has occurred - updating... (live nodes size: [4])
   [junit4]   2> 2914933 INFO  (zkCallback-11241-thread-1-processing-n:127.0.0.1:62587_solr) [n:127.0.0.1:62587_solr    ] o.a.s.c.c.ZkStateReader A live node change: [WatchedEvent state:SyncConnected type:NodeChildrenChanged path:/live_nodes], has occurred - updating... (live nodes size: [4])
   [junit4]   2> 2914933 INFO  (zkCallback-11254-thread-1-processing-n:127.0.0.1:62650_solr) [n:127.0.0.1:62650_solr    ] o.a.s.c.c.ZkStateReader A live node change: [WatchedEvent state:SyncConnected type:NodeChildrenChanged path:/live_nodes], has occurred - updating... (live nodes size: [4])
   [junit4]   2> 2914934 INFO  (zkCallback-11239-thread-2-processing-n:127.0.0.1:62584_solr) [n:127.0.0.1:62584_solr    ] o.a.s.c.c.ZkStateReader Updated live nodes from ZooKeeper... (4) -> (5)
   [junit4]   2> 2914934 INFO  (zkCallback-11242-thread-3-processing-n:127.0.0.1:62599_solr) [n:127.0.0.1:62599_solr    ] o.a.s.c.c.ZkStateReader Updated live nodes from ZooKeeper... (4) -> (5)
   [junit4]   2> 2914934 INFO  (zkCallback-11241-thread-1-processing-n:127.0.0.1:62587_solr) [n:127.0.0.1:62587_solr    ] o.a.s.c.c.ZkStateReader Updated live nodes from ZooKeeper... (4) -> (5)
   [junit4]   2> 2914934 INFO  (zkCallback-11240-thread-1-processing-n:127.0.0.1:62604_solr) [n:127.0.0.1:62604_solr    ] o.a.s.c.c.ZkStateReader Updated live nodes from ZooKeeper... (4) -> (5)
   [junit4]   2> 2914934 INFO  (zkCallback-11254-thread-1-processing-n:127.0.0.1:62650_solr) [n:127.0.0.1:62650_solr    ] o.a.s.c.c.ZkStateReader Updated live nodes from ZooKeeper... (4) -> (5)
   [junit4]   2> 2914951 INFO  (TEST-BasicAuthIntegrationTest.testBasics-seed#[F20A57DBA1E1200]) [n:127.0.0.1:62650_solr    ] o.a.s.c.CoreContainer Security conf doesn't exist. Skipping setup for authorization module.
   [junit4]   2> 2914951 INFO  (TEST-BasicAuthIntegrationTest.testBasics-seed#[F20A57DBA1E1200]) [n:127.0.0.1:62650_solr    ] o.a.s.c.CoreContainer No authentication plugin used.
   [junit4]   2> 2914953 INFO  (TEST-BasicAuthIntegrationTest.testBasics-seed#[F20A57DBA1E1200]) [n:127.0.0.1:62650_solr    ] o.a.s.c.CorePropertiesLocator Looking for core definitions underneath C:\Users\jenkins\workspace\Lucene-Solr-6.x-Windows\solr\build\solr-core\test\J0\temp\solr.security.BasicAuthIntegrationTest_F20A57DBA1E1200-001\tempDir-001\node6\.
   [junit4]   2> 2914953 INFO  (TEST-BasicAuthIntegrationTest.testBasics-seed#[F20A57DBA1E1200]) [n:127.0.0.1:62650_solr    ] o.a.s.c.CorePropertiesLocator Found 0 core definitions
   [junit4]   2> 2914954 INFO  (TEST-BasicAuthIntegrationTest.testBasics-seed#[F20A57DBA1E1200]) [n:127.0.0.1:62650_solr    ] o.a.s.s.SolrDispatchFilter user.dir=C:\Users\jenkins\workspace\Lucene-Solr-6.x-Windows\solr\build\solr-core\test\J0
   [junit4]   2> 2914954 INFO  (TEST-BasicAuthIntegrationTest.testBasics-seed#[F20A57DBA1E1200]) [n:127.0.0.1:62650_solr    ] o.a.s.s.SolrDispatchFilter SolrDispatchFilter.init() done
   [junit4]   2> 2914955 INFO  (TEST-BasicAuthIntegrationTest.testBasics-seed#[F20A57DBA1E1200]) [    ] o.a.s.c.c.SolrZkClient Using default ZkCredentialsProvider
   [junit4]   2> 2914956 INFO  (TEST-BasicAuthIntegrationTest.testBasics-seed#[F20A57DBA1E1200]) [    ] o.a.s.c.c.ConnectionManager Waiting for client to connect to ZooKeeper
   [junit4]   2> 2914958 INFO  (zkCallback-11256-thread-1) [    ] o.a.s.c.c.ConnectionManager Watcher org.apache.solr.common.cloud.ConnectionManager@151e120 name:ZooKeeperConnection Watcher:127.0.0.1:62580/solr got event WatchedEvent state:SyncConnected type:None path:null path:null type:None
   [junit4]   2> 2914958 INFO  (TEST-BasicAuthIntegrationTest.testBasics-seed#[F20A57DBA1E1200]) [    ] o.a.s.c.c.ConnectionManager Client is connected to ZooKeeper
   [junit4]   2> 2914958 INFO  (TEST-BasicAuthIntegrationTest.testBasics-seed#[F20A57DBA1E1200]) [    ] o.a.s.c.c.SolrZkClient Using default ZkACLProvider
   [junit4]   2> 2914960 INFO  (TEST-BasicAuthIntegrationTest.testBasics-seed#[F20A57DBA1E1200]) [    ] o.a.s.c.c.SolrZkClient makePath: /configs/solrCloudCollectionConfig/addfields.updateprocessor.js
   [junit4]   2> 2914964 INFO  (TEST-BasicAuthIntegrationTest.testBasics-seed#[F20A57DBA1E1200]) [    ] o.a.s.c.c.SolrZkClient makePath: /configs/solrCloudCollectionConfig/analyzingInfixSuggest.txt
   [junit4]   2> 2914966 INFO  (TEST-BasicAuthIntegrationTest.testBasics-seed#[F20A57DBA1E1200]) [    ] o.a.s.c.c.SolrZkClient makePath: /configs/solrCloudCollectionConfig/bad-currency.xml
   [junit4]   2> 2914972 INFO  (TEST-BasicAuthIntegrationTest.testBasics-seed#[F20A57DBA1E1200]) [    ] o.a.s.c.c.SolrZkClient makePath: /configs/solrCloudCollectionConfig/bad-error-solrconfig.xml
   [junit4]   2> 2914975 INFO  (TEST-BasicAuthIntegrationTest.testBasics-seed#[F20A57DBA1E1200]) [    ] o.a.s.c.c.SolrZkClient makePath: /configs/solrCloudCollectionConfig/bad-mp-solrconfig.xml
   [junit4]   2> 2914978 INFO  (TEST-BasicAuthIntegrationTest.testBasics-seed#[F20A57DBA1E1200]) [    ] o.a.s.c.c.SolrZkClient makePath: /configs/solrCloudCollectionConfig/bad-mpf-solrconfig.xml
   [junit4]   2> 2914981 INFO  (TEST-BasicAuthIntegrationTest.testBasics-seed#[F20A57DBA1E1200]) [    ] o.a.s.c.c.SolrZkClient makePath: /configs/solrCloudCollectionConfig/bad-schema-analyzer-class-and-nested.xml
   [junit4]   2> 2914982 INFO  (TEST-BasicAuthIntegrationTest.testBasics-seed#[F20A57DBA1E1200]) [    ] o.a.s.c.c.SolrZkClient makePath: /configs/solrCloudCollectionConfig/bad-schema-bogus-analysis-parameters.xml
   [junit4]   2> 2914985 INFO  (TEST-BasicAuthIntegrationTest.testBasics-seed#[F20A57DBA1E1200]) [    ] o.a.s.c.c.SolrZkClient makePath: /configs/solrCloudCollectionConfig/bad-schema-bogus-field-parameters.xml
   [junit4]   2> 2914987 INFO  (TEST-BasicAuthIntegrationTest.testBasics-seed#[F20A57DBA1E1200]) [    ] o.a.s.c.c.SolrZkClient makePath: /configs/solrCloudCollectionConfig/bad-schema-codec-global-vs-ft-mismatch.xml
   [junit4]   2> 2914990 INFO  (TEST-BasicAuthIntegrationTest.testBasics-seed#[F20A57DBA1E1200]) [    ] o.a.s.c.c.SolrZkClient makePath: /configs/solrCloudCollectionConfig/bad-schema-currency-dynamic-multivalued.xml
   [junit4]   2> 2914992 INFO  (TEST-BasicAuthIntegrationTest.testBasics-seed#[F20A57DBA1E1200]) [    ] o.a.s.c.c.SolrZkClient makePath: /configs/solrCloudCollectionConfig/bad-schema-currency-ft-bogus-code-in-xml.xml
   [junit4]   2> 2914995 INFO  (TEST-BasicAuthIntegrationTest.testBasics-seed#[F20A57DBA1E1200]) [    ] o.a.s.c.c.SolrZkClient makePath: /configs/solrCloudCollectionConfig/bad-schema-currency-ft-bogus-default-code.xml
   [junit4]   2> 2914997 INFO  (TEST-BasicAuthIntegrationTest.testBasics-seed#[F20A57DBA1E1200]) [    ] o.a.s.c.c.SolrZkClient makePath: /configs/solrCloudCollectionConfig/bad-schema-currency-ft-multivalued.xml
   [junit4]   2> 2915000 INFO  (TEST-BasicAuthIntegrationTest.testBasics-seed#[F20A57DBA1E1200]) [    ] o.a.s.c.c.SolrZkClient makePath: /configs/solrCloudCollectionConfig/bad-schema-currency-ft-oer-norates.xml
   [junit4]   2> 2915002 INFO  (TEST-BasicAuthIntegrationTest.testBasics-seed#[F20A57DBA1E1200]) [    ] o.a.s.c.c.SolrZkClient makePath: /configs/solrCloudCollectionConfig/bad-schema-currency-multivalued.xml
   [junit4]   2> 2915005 INFO  (TEST-BasicAuthIntegrationTest.testBasics-seed#[F20A57DBA1E1200]) [    ] o.a.s.c.c.SolrZkClient makePath: /configs/solrCloudCollectionConfig/bad-schema-dup-dynamicField.xml
   [junit4]   2> 2915007 INFO  (TEST-BasicAuthIntegrationTest.testBasics-seed#[F20A57DBA1E1200]) [    ] o.a.s.c.c.SolrZkClient makePath: /configs/solrCloudCollectionConfig/bad-schema-dup-field.xml
   [junit4]   2> 2915010 INFO  (TEST-BasicAuthIntegrationTest.testBasics-seed#[F20A57DBA1E1200]) [    ] o.a.s.c.c.SolrZkClient makePath: /configs/solrCloudCollectionConfig/bad-sche

[...truncated too long message...]

tHandler Stopped o.e.j.s.ServletContextHandler@14086d9{/solr,null,UNAVAILABLE}
   [junit4]   2> Jun 10, 2016 3:05:13 PM com.carrotsearch.randomizedtesting.ThreadLeakControl tryToInterruptAll
   [junit4]   2> INFO: All leaked threads terminated.
   [junit4]   2> NOTE: test params are: codec=Asserting(Lucene60): {range_facet_l_dv=FSTOrd50, _version_=PostingsFormat(name=Memory doPackFST= true), multiDefault=Lucene50(blocksize=128), intDefault=PostingsFormat(name=Memory doPackFST= true), id=FSTOrd50, range_facet_i_dv=PostingsFormat(name=Memory doPackFST= true), range_facet_l=PostingsFormat(name=Memory doPackFST= true), timestamp=PostingsFormat(name=Memory doPackFST= true)}, docValues:{range_facet_l_dv=DocValuesFormat(name=Memory), range_facet_i_dv=DocValuesFormat(name=Lucene54), timestamp=DocValuesFormat(name=Lucene54)}, maxPointsInLeafNode=1342, maxMBSortInHeap=7.3398451276642325, sim=ClassicSimilarity, locale=nl-BE, timezone=America/Antigua
   [junit4]   2> NOTE: Windows 10 10.0 x86/Oracle Corporation 1.8.0_92 (32-bit)/cpus=3,threads=11,free=259111472,total=418119680
   [junit4]   2> NOTE: All tests run in this JVM: [TriLevelCompositeIdRoutingTest, TestFastLRUCache, TestDocBasedVersionConstraints, RecoveryAfterSoftCommitTest, FastVectorHighlighterTest, TestTolerantSearch, TestShortCircuitedRequests, SOLR749Test, TestPerFieldSimilarityClassic, PathHierarchyTokenizerFactoryTest, TestRawTransformer, TestDistributedSearch, TestSerializedLuceneMatchVersion, DistributedFacetPivotLongTailTest, TestDocTermOrds, TestSolrDeletionPolicy1, ConnectionManagerTest, RegexBoostProcessorTest, TestObjectReleaseTracker, CdcrReplicationDistributedZkTest, SuggestComponentTest, TestDFISimilarityFactory, BlockDirectoryTest, AddSchemaFieldsUpdateProcessorFactoryTest, TestReqParamsAPI, TestDynamicLoading, TestSolrCloudWithKerberosAlt, TestManagedResourceStorage, TestAddFieldRealTimeGet, TestDynamicFieldCollectionResource, TestCoreContainer, TestRandomDVFaceting, ShardRoutingTest, AnalyticsMergeStrategyTest, HLLUtilTest, CdcrRequestHandlerTest, AlternateDirectoryTest, TestAnalyzeInfixSuggestions, BadCopyFieldTest, HdfsBasicDistributedZk2Test, TestNamedUpdateProcessors, ZkStateReaderTest, TestPhraseSuggestions, IndexSchemaTest, TestScoreJoinQPNoScore, BitVectorTest, TestCustomSort, ZkCLITest, TestStressUserVersions, TestConfigSetProperties, SolrTestCaseJ4Test, AsyncMigrateRouteKeyTest, DistributedExpandComponentTest, PeerSyncTest, TestElisionMultitermQuery, TestLMDirichletSimilarityFactory, CollectionsAPIAsyncDistributedZkTest, SharedFSAutoReplicaFailoverTest, TestMiniSolrCloudClusterBase, TestPartialUpdateDeduplication, TestSortingResponseWriter, HdfsThreadLeakTest, LeaderInitiatedRecoveryOnCommitTest, TestStressLiveNodes, TestSchemaSimilarityResource, HttpPartitionTest, TestConfigReload, TestStressVersions, TestMaxScoreQueryParser, DistributedSpellCheckComponentTest, HdfsCollectionsAPIDistributedZkTest, SystemInfoHandlerTest, ScriptEngineTest, TestNumericTerms64, HdfsRestartWhileUpdatingTest, TestSmileRequest, StatelessScriptUpdateProcessorFactoryTest, LeaderElectionTest, AnalysisAfterCoreReloadTest, TestConfig, UnloadDistributedZkTest, TestShardHandlerFactory, SimplePostToolTest, TestCSVLoader, QueryElevationComponentTest, TestCustomDocTransformer, TestDownShardTolerantSearch, OverseerTest, DocumentAnalysisRequestHandlerTest, TestRecoveryHdfs, TestCollectionAPI, TestManagedStopFilterFactory, TestExpandComponent, URLClassifyProcessorTest, TestHdfsUpdateLog, SimpleMLTQParserTest, BadComponentTest, OverseerCollectionConfigSetProcessorTest, TestNoOpRegenerator, TermsComponentTest, TestComponentsName, TestTrackingShardHandlerFactory, TestLegacyFieldCache, TestFieldCacheSort, TestAnalyzedSuggestions, DisMaxRequestHandlerTest, IndexBasedSpellCheckerTest, HdfsDirectoryFactoryTest, TestFieldCacheVsDocValues, MBeansHandlerTest, TestUseDocValuesAsStored, PrimUtilsTest, SolrRequestParserTest, CloudExitableDirectoryReaderTest, DOMUtilTest, SegmentsInfoRequestHandlerTest, TestBulkSchemaAPI, DistribJoinFromCollectionTest, TestFieldCacheReopen, TestStressReorder, DistributedQueryElevationComponentTest, QueryEqualityTest, TestArbitraryIndexDir, CustomCollectionTest, DeleteLastCustomShardedReplicaTest, DocValuesMultiTest, BlockJoinFacetDistribTest, OutOfBoxZkACLAndCredentialsProvidersTest, TestRuleBasedAuthorizationPlugin, SimpleCollectionCreateDeleteTest, TestJmxMonitoredMap, ConcurrentDeleteAndCreateCollectionTest, SliceStateTest, TestRandomRequestDistribution, WrapperMergePolicyFactoryTest, RecoveryZkTest, TestStressLucene, TestSurroundQueryParser, TestLRUCache, TestFaceting, TestReplicaProperties, SuggesterFSTTest, TestSolrCLIRunExample, CdcrUpdateLogTest, TestReplicationHandler, TestHashPartitioner, DistributedTermsComponentTest, SolrCoreTest, TestGroupingSearch, BadIndexSchemaTest, TestSort, TestFunctionQuery, TestLazyCores, TestFoldingMultitermQuery, DocValuesTest, TestWordDelimiterFilterFactory, XsltUpdateRequestHandlerTest, StandardRequestHandlerTest, TestWriterPerf, TestReversedWildcardFilterFactory, PrimitiveFieldTypeTest, FileBasedSpellCheckerTest, DocumentBuilderTest, TermVectorComponentTest, RequiredFieldsTest, IndexSchemaRuntimeFieldTest, TestJmxIntegration, JSONWriterTest, QueryParsingTest, PingRequestHandlerTest, SolrIndexConfigTest, TestSolrDeletionPolicy2, MultiTermTest, TestDocSet, TestSearchPerf, OutputWriterTest, ExternalFileFieldSortTest, TestPostingsSolrHighlighter, SpellPossibilityIteratorTest, TestCodecSupport, TestSweetSpotSimilarityFactory, TestIBSimilarityFactory, TimeZoneUtilsTest, PluginInfoTest, PreAnalyzedFieldTest, TestSuggestSpellingConverter, DateFieldTest, SpellingQueryConverterTest, ClusterStateTest, TestSolrJ, TestDocumentBuilder, ZkNodePropsTest, UUIDFieldTest, FileUtilsTest, CircularListTest, DistributedMLTComponentTest, CursorPagingTest, DistributedIntervalFacetingTest, TestCursorMarkWithoutUniqueKey, TestDistributedMissingSort, TestHighlightDedupGrouping, TestEmbeddedSolrServerConstructors, TestJettySolrRunner, ActionThrottleTest, AliasIntegrationTest, CollectionReloadTest, DeleteReplicaTest, DeleteStatusTest, DistribCursorPagingTest, DistributedQueueTest, DistributedVersionInfoTest, LeaderInitiatedRecoveryOnShardRestartTest, MigrateRouteKeyTest, MultiThreadedOCPTest, OverriddenZkACLAndCredentialsProvidersTest, OverseerStatusTest, RemoteQueryErrorTest, ShardSplitTest, TestDistribDocBasedVersion, TestRebalanceLeaders, TestRequestStatusCollectionAPI, TestTolerantUpdateProcessorCloud, BlobRepositoryCloudTest, DirectoryFactoryTest, ExitableDirectoryReaderTest, QueryResultKeyTest, TestConfigOverlay, TestConfigSetImmutable, TestConfigSets, TestInfoStreamLogging, TestNRTOpen, TestReloadAndDeleteDocs, TestSolrDynamicMBean, TestSolrXml, RequestLoggingTest, TestBlobHandler, TestSQLHandler, TestSolrConfigHandlerConcurrent, CoreAdminCreateDiscoverTest, CoreAdminRequestStatusTest, CoreMergeIndexesAdminHandlerTest, InfoHandlerTest, SecurityConfHandlerTest, DistributedFacetPivotLargeTest, DistributedFacetPivotSmallTest, DistributedQueryComponentCustomSortTest, DistributedSuggestComponentTest, FacetPivotSmallTest, SpatialHeatmapFacetsTest, TestManagedResource, TestCopyFieldCollectionResource, TestFieldCollectionResource, TestFieldTypeCollectionResource, TestSchemaNameResource, TestSolrQueryParserResource, TestUniqueKeyFieldResource, TestManagedSynonymFilterFactory, EnumFieldTest, SpatialRPTFieldTypeTest, TestCollationFieldDocValues, TestManagedSchema, TestManagedSchemaAPI, CursorMarkTest, RankQueryTest, SortSpecParsingTest, TestCollapseQParserPlugin, TestFilteredDocIdSet, TestGraphTermsQParserPlugin, TestHashQParserPlugin, TestQueryWrapperFilter, TestRandomCollapseQParserPlugin, TestReRankQParserPlugin, TestSearcherReuse, TestSimpleQParserPlugin, TestSolrFieldCacheMBean, TestXmlQParser, TestJsonFacets, TestMinMaxOnMultiValuedField, TestOrdValues, TestSortByMinMaxFunction, BlockJoinFacetRandomTest, BlockJoinFacetSimpleTest, TestJsonRequest, CloudMLTQParserTest, TestNonDefinedSimilarityFactory, TestDistribIDF, TestExactSharedStatsCache, TestExactStatsCache, BasicAuthIntegrationTest]
   [junit4]   2> NOTE: reproduce with: ant test  -Dtestcase=BasicAuthIntegrationTest -Dtests.seed=F20A57DBA1E1200 -Dtests.slow=true -Dtests.locale=nl-BE -Dtests.timezone=America/Antigua -Dtests.asserts=true -Dtests.file.encoding=US-ASCII
   [junit4] ERROR   0.00s J0 | BasicAuthIntegrationTest (suite) <<<
   [junit4]    > Throwable #1: java.lang.Exception: Suite timeout exceeded (>= 7200000 msec).
   [junit4]    > 	at __randomizedtesting.SeedInfo.seed([F20A57DBA1E1200]:0)
   [junit4] Completed [613/613 (1!)] on J0 in 7228.51s, 1 test, 2 errors <<< FAILURES!

[...truncated 11 lines...]
BUILD FAILED
C:\Users\jenkins\workspace\Lucene-Solr-6.x-Windows\build.xml:740: The following error occurred while executing this line:
C:\Users\jenkins\workspace\Lucene-Solr-6.x-Windows\build.xml:684: The following error occurred while executing this line:
C:\Users\jenkins\workspace\Lucene-Solr-6.x-Windows\build.xml:59: The following error occurred while executing this line:
C:\Users\jenkins\workspace\Lucene-Solr-6.x-Windows\solr\build.xml:233: The following error occurred while executing this line:
C:\Users\jenkins\workspace\Lucene-Solr-6.x-Windows\solr\common-build.xml:531: The following error occurred while executing this line:
C:\Users\jenkins\workspace\Lucene-Solr-6.x-Windows\lucene\common-build.xml:1427: The following error occurred while executing this line:
C:\Users\jenkins\workspace\Lucene-Solr-6.x-Windows\lucene\common-build.xml:984: There were test failures: 613 suites (10 ignored), 2570 tests, 1 suite-level error, 1 error, 125 ignored (81 assumptions) [seed: F20A57DBA1E1200]

Total time: 189 minutes 30 seconds
Build step 'Invoke Ant' marked build as failure
Archiving artifacts
[WARNINGS] Skipping publisher since build result is FAILURE
Recording test results
Email was triggered for: Failure - Any
Sending email for trigger: Failure - Any



Mime
View raw message