lucene-dev mailing list archives

Site index · List index
Message view « Date » · « Thread »
Top « Date » · « Thread »
From Apache Jenkins Server <jenk...@builds.apache.org>
Subject [JENKINS] Lucene-Solr-NightlyTests-6.x - Build # 105 - Still Failing
Date Wed, 29 Jun 2016 10:31:18 GMT
Build: https://builds.apache.org/job/Lucene-Solr-NightlyTests-6.x/105/

1 tests failed.
FAILED:  org.apache.lucene.index.TestIndexingSequenceNumbers.testStressConcurrentCommit

Error Message:
this IndexWriter is closed

Stack Trace:
org.apache.lucene.store.AlreadyClosedException: this IndexWriter is closed
	at org.apache.lucene.index.IndexWriter.ensureOpen(IndexWriter.java:742)
	at org.apache.lucene.index.IndexWriter.ensureOpen(IndexWriter.java:756)
	at org.apache.lucene.index.IndexWriter.commit(IndexWriter.java:3174)
	at org.apache.lucene.index.TestIndexingSequenceNumbers.testStressConcurrentCommit(TestIndexingSequenceNumbers.java:228)
	at sun.reflect.NativeMethodAccessorImpl.invoke0(Native Method)
	at sun.reflect.NativeMethodAccessorImpl.invoke(NativeMethodAccessorImpl.java:62)
	at sun.reflect.DelegatingMethodAccessorImpl.invoke(DelegatingMethodAccessorImpl.java:43)
	at java.lang.reflect.Method.invoke(Method.java:498)
	at com.carrotsearch.randomizedtesting.RandomizedRunner.invoke(RandomizedRunner.java:1764)
	at com.carrotsearch.randomizedtesting.RandomizedRunner$8.evaluate(RandomizedRunner.java:871)
	at com.carrotsearch.randomizedtesting.RandomizedRunner$9.evaluate(RandomizedRunner.java:907)
	at com.carrotsearch.randomizedtesting.RandomizedRunner$10.evaluate(RandomizedRunner.java:921)
	at org.apache.lucene.util.TestRuleSetupTeardownChained$1.evaluate(TestRuleSetupTeardownChained.java:49)
	at org.apache.lucene.util.AbstractBeforeAfterRule$1.evaluate(AbstractBeforeAfterRule.java:45)
	at org.apache.lucene.util.TestRuleThreadAndTestName$1.evaluate(TestRuleThreadAndTestName.java:48)
	at org.apache.lucene.util.TestRuleIgnoreAfterMaxFailures$1.evaluate(TestRuleIgnoreAfterMaxFailures.java:64)
	at org.apache.lucene.util.TestRuleMarkFailure$1.evaluate(TestRuleMarkFailure.java:47)
	at com.carrotsearch.randomizedtesting.rules.StatementAdapter.evaluate(StatementAdapter.java:36)
	at com.carrotsearch.randomizedtesting.ThreadLeakControl$StatementRunner.run(ThreadLeakControl.java:367)
	at com.carrotsearch.randomizedtesting.ThreadLeakControl.forkTimeoutingTask(ThreadLeakControl.java:809)
	at com.carrotsearch.randomizedtesting.ThreadLeakControl$3.evaluate(ThreadLeakControl.java:460)
	at com.carrotsearch.randomizedtesting.RandomizedRunner.runSingleTest(RandomizedRunner.java:880)
	at com.carrotsearch.randomizedtesting.RandomizedRunner$5.evaluate(RandomizedRunner.java:781)
	at com.carrotsearch.randomizedtesting.RandomizedRunner$6.evaluate(RandomizedRunner.java:816)
	at com.carrotsearch.randomizedtesting.RandomizedRunner$7.evaluate(RandomizedRunner.java:827)
	at org.apache.lucene.util.AbstractBeforeAfterRule$1.evaluate(AbstractBeforeAfterRule.java:45)
	at com.carrotsearch.randomizedtesting.rules.StatementAdapter.evaluate(StatementAdapter.java:36)
	at org.apache.lucene.util.TestRuleStoreClassName$1.evaluate(TestRuleStoreClassName.java:41)
	at com.carrotsearch.randomizedtesting.rules.NoShadowingOrOverridesOnMethodsRule$1.evaluate(NoShadowingOrOverridesOnMethodsRule.java:40)
	at com.carrotsearch.randomizedtesting.rules.NoShadowingOrOverridesOnMethodsRule$1.evaluate(NoShadowingOrOverridesOnMethodsRule.java:40)
	at com.carrotsearch.randomizedtesting.rules.StatementAdapter.evaluate(StatementAdapter.java:36)
	at com.carrotsearch.randomizedtesting.rules.StatementAdapter.evaluate(StatementAdapter.java:36)
	at com.carrotsearch.randomizedtesting.rules.StatementAdapter.evaluate(StatementAdapter.java:36)
	at org.apache.lucene.util.TestRuleAssertionsRequired$1.evaluate(TestRuleAssertionsRequired.java:53)
	at org.apache.lucene.util.TestRuleMarkFailure$1.evaluate(TestRuleMarkFailure.java:47)
	at org.apache.lucene.util.TestRuleIgnoreAfterMaxFailures$1.evaluate(TestRuleIgnoreAfterMaxFailures.java:64)
	at org.apache.lucene.util.TestRuleIgnoreTestSuites$1.evaluate(TestRuleIgnoreTestSuites.java:54)
	at com.carrotsearch.randomizedtesting.rules.StatementAdapter.evaluate(StatementAdapter.java:36)
	at com.carrotsearch.randomizedtesting.ThreadLeakControl$StatementRunner.run(ThreadLeakControl.java:367)
	at java.lang.Thread.run(Thread.java:745)
Caused by: java.lang.OutOfMemoryError: Java heap space
	at __randomizedtesting.SeedInfo.seed([F8BD42013B872937]:0)
	at java.util.HashMap.resize(HashMap.java:703)
	at java.util.HashMap.putVal(HashMap.java:628)
	at java.util.HashMap.put(HashMap.java:611)
	at org.apache.lucene.index.FieldInfos$Builder.getOrAdd(FieldInfos.java:386)
	at org.apache.lucene.index.DefaultIndexingChain.getOrAddField(DefaultIndexingChain.java:582)
	at org.apache.lucene.index.DefaultIndexingChain.processField(DefaultIndexingChain.java:430)
	at org.apache.lucene.index.DefaultIndexingChain.processDocument(DefaultIndexingChain.java:373)
	at org.apache.lucene.index.DocumentsWriterPerThread.updateDocument(DocumentsWriterPerThread.java:231)
	at org.apache.lucene.index.DocumentsWriter.updateDocument(DocumentsWriter.java:485)
	at org.apache.lucene.index.IndexWriter.updateDocument(IndexWriter.java:1565)
	at org.apache.lucene.index.TestIndexingSequenceNumbers$2.run(TestIndexingSequenceNumbers.java:208)




Build Log:
[...truncated 1006 lines...]
   [junit4] Suite: org.apache.lucene.index.TestIndexingSequenceNumbers
   [junit4]   2> juuni 29, 2016 11:59:43 AM com.carrotsearch.randomizedtesting.RandomizedRunner$QueueUncaughtExceptionsHandler
uncaughtException
   [junit4]   2> WARNING: Uncaught exception in thread: Thread[Thread-671,5,TGRP-TestIndexingSequenceNumbers]
   [junit4]   2> java.lang.OutOfMemoryError: Java heap space: failed reallocation of scalar
replaced objects
   [junit4]   2> 
   [junit4]   2> juuni 29, 2016 12:02:33 PM com.carrotsearch.randomizedtesting.RandomizedRunner$QueueUncaughtExceptionsHandler
uncaughtException
   [junit4]   2> WARNING: Uncaught exception in thread: Thread[Thread-672,5,TGRP-TestIndexingSequenceNumbers]
   [junit4]   2> java.lang.OutOfMemoryError: Java heap space
   [junit4]   2> 
   [junit4]   2> juuni 29, 2016 12:02:33 PM com.carrotsearch.randomizedtesting.RandomizedRunner$QueueUncaughtExceptionsHandler
uncaughtException
   [junit4]   2> WARNING: Uncaught exception in thread: Thread[Thread-675,5,TGRP-TestIndexingSequenceNumbers]
   [junit4]   2> java.lang.OutOfMemoryError: Java heap space
   [junit4]   2> 	at __randomizedtesting.SeedInfo.seed([F8BD42013B872937]:0)
   [junit4]   2> 	at org.apache.lucene.index.ParallelPostingsArray.<init>(ParallelPostingsArray.java:31)
   [junit4]   2> 	at org.apache.lucene.index.FreqProxTermsWriterPerField$FreqProxPostingsArray.<init>(FreqProxTermsWriterPerField.java:205)
   [junit4]   2> 	at org.apache.lucene.index.FreqProxTermsWriterPerField.createPostingsArray(FreqProxTermsWriterPerField.java:200)
   [junit4]   2> 	at org.apache.lucene.index.TermsHashPerField$PostingsBytesStartArray.init(TermsHashPerField.java:239)
   [junit4]   2> 	at org.apache.lucene.util.BytesRefHash.<init>(BytesRefHash.java:90)
   [junit4]   2> 	at org.apache.lucene.index.TermsHashPerField.<init>(TermsHashPerField.java:70)
   [junit4]   2> 	at org.apache.lucene.index.FreqProxTermsWriterPerField.<init>(FreqProxTermsWriterPerField.java:48)
   [junit4]   2> 	at org.apache.lucene.index.FreqProxTermsWriter.addField(FreqProxTermsWriter.java:121)
   [junit4]   2> 	at org.apache.lucene.index.DefaultIndexingChain$PerField.setInvertState(DefaultIndexingChain.java:656)
   [junit4]   2> 	at org.apache.lucene.index.DefaultIndexingChain$PerField.<init>(DefaultIndexingChain.java:650)
   [junit4]   2> 	at org.apache.lucene.index.DefaultIndexingChain.getOrAddField(DefaultIndexingChain.java:588)
   [junit4]   2> 	at org.apache.lucene.index.DefaultIndexingChain.processField(DefaultIndexingChain.java:415)
   [junit4]   2> 	at org.apache.lucene.index.DefaultIndexingChain.processDocument(DefaultIndexingChain.java:373)
   [junit4]   2> 	at org.apache.lucene.index.DocumentsWriterPerThread.updateDocument(DocumentsWriterPerThread.java:231)
   [junit4]   2> 	at org.apache.lucene.index.DocumentsWriter.updateDocument(DocumentsWriter.java:485)
   [junit4]   2> 	at org.apache.lucene.index.IndexWriter.updateDocument(IndexWriter.java:1565)
   [junit4]   2> 	at org.apache.lucene.index.TestIndexingSequenceNumbers$2.run(TestIndexingSequenceNumbers.java:208)
   [junit4]   2> 
   [junit4]   2> juuni 29, 2016 12:02:33 PM com.carrotsearch.randomizedtesting.RandomizedRunner$QueueUncaughtExceptionsHandler
uncaughtException
   [junit4]   2> WARNING: Uncaught exception in thread: Thread[Thread-673,5,TGRP-TestIndexingSequenceNumbers]
   [junit4]   2> java.lang.OutOfMemoryError: Java heap space
   [junit4]   2> 
   [junit4]   2> juuni 29, 2016 12:02:33 PM com.carrotsearch.randomizedtesting.RandomizedRunner$QueueUncaughtExceptionsHandler
uncaughtException
   [junit4]   2> WARNING: Uncaught exception in thread: Thread[Thread-676,5,TGRP-TestIndexingSequenceNumbers]
   [junit4]   2> java.lang.OutOfMemoryError: Java heap space
   [junit4]   2> 
   [junit4]   2> juuni 29, 2016 12:02:33 PM com.carrotsearch.randomizedtesting.RandomizedRunner$QueueUncaughtExceptionsHandler
uncaughtException
   [junit4]   2> WARNING: Uncaught exception in thread: Thread[Thread-677,5,TGRP-TestIndexingSequenceNumbers]
   [junit4]   2> java.lang.OutOfMemoryError: Java heap space
   [junit4]   2> 
   [junit4]   2> juuni 29, 2016 12:02:33 PM com.carrotsearch.randomizedtesting.RandomizedRunner$QueueUncaughtExceptionsHandler
uncaughtException
   [junit4]   2> WARNING: Uncaught exception in thread: Thread[Thread-670,5,TGRP-TestIndexingSequenceNumbers]
   [junit4]   2> java.lang.RuntimeException: org.apache.lucene.store.AlreadyClosedException:
refusing to delete any files: this IndexWriter hit an unrecoverable exception
   [junit4]   2> 	at __randomizedtesting.SeedInfo.seed([F8BD42013B872937]:0)
   [junit4]   2> 	at org.apache.lucene.index.TestIndexingSequenceNumbers$2.run(TestIndexingSequenceNumbers.java:216)
   [junit4]   2> Caused by: org.apache.lucene.store.AlreadyClosedException: refusing to
delete any files: this IndexWriter hit an unrecoverable exception
   [junit4]   2> 	at org.apache.lucene.index.IndexFileDeleter.ensureOpen(IndexFileDeleter.java:345)
   [junit4]   2> 	at org.apache.lucene.index.IndexFileDeleter.deleteFiles(IndexFileDeleter.java:696)
   [junit4]   2> 	at org.apache.lucene.index.IndexFileDeleter.decRef(IndexFileDeleter.java:594)
   [junit4]   2> 	at org.apache.lucene.index.IndexFileDeleter.checkpoint(IndexFileDeleter.java:533)
   [junit4]   2> 	at org.apache.lucene.index.IndexWriter.checkpoint(IndexWriter.java:2454)
   [junit4]   2> 	at org.apache.lucene.index.IndexWriter.publishFlushedSegment(IndexWriter.java:2512)
   [junit4]   2> 	at org.apache.lucene.index.DocumentsWriterFlushQueue$FlushTicket.publishFlushedSegment(DocumentsWriterFlushQueue.java:198)
   [junit4]   2> 	at org.apache.lucene.index.DocumentsWriterFlushQueue$FlushTicket.finishFlush(DocumentsWriterFlushQueue.java:213)
   [junit4]   2> 	at org.apache.lucene.index.DocumentsWriterFlushQueue$SegmentFlushTicket.publish(DocumentsWriterFlushQueue.java:249)
   [junit4]   2> 	at org.apache.lucene.index.DocumentsWriterFlushQueue.innerPurge(DocumentsWriterFlushQueue.java:116)
   [junit4]   2> 	at org.apache.lucene.index.DocumentsWriterFlushQueue.forcePurge(DocumentsWriterFlushQueue.java:138)
   [junit4]   2> 	at org.apache.lucene.index.DocumentsWriter.flushAllThreads(DocumentsWriter.java:670)
   [junit4]   2> 	at org.apache.lucene.index.IndexWriter.prepareCommitInternal(IndexWriter.java:2977)
   [junit4]   2> 	at org.apache.lucene.index.IndexWriter.commitInternal(IndexWriter.java:3210)
   [junit4]   2> 	at org.apache.lucene.index.IndexWriter.commit(IndexWriter.java:3175)
   [junit4]   2> 	at org.apache.lucene.index.TestIndexingSequenceNumbers$2.run(TestIndexingSequenceNumbers.java:184)
   [junit4]   2> Caused by: java.lang.OutOfMemoryError: Java heap space
   [junit4]   2> 	at java.util.HashMap.resize(HashMap.java:703)
   [junit4]   2> 	at java.util.HashMap.putVal(HashMap.java:628)
   [junit4]   2> 	at java.util.HashMap.put(HashMap.java:611)
   [junit4]   2> 	at org.apache.lucene.index.FieldInfos$Builder.getOrAdd(FieldInfos.java:386)
   [junit4]   2> 	at org.apache.lucene.index.DefaultIndexingChain.getOrAddField(DefaultIndexingChain.java:582)
   [junit4]   2> 	at org.apache.lucene.index.DefaultIndexingChain.processField(DefaultIndexingChain.java:430)
   [junit4]   2> 	at org.apache.lucene.index.DefaultIndexingChain.processDocument(DefaultIndexingChain.java:373)
   [junit4]   2> 	at org.apache.lucene.index.DocumentsWriterPerThread.updateDocument(DocumentsWriterPerThread.java:231)
   [junit4]   2> 	at org.apache.lucene.index.DocumentsWriter.updateDocument(DocumentsWriter.java:485)
   [junit4]   2> 	at org.apache.lucene.index.IndexWriter.updateDocument(IndexWriter.java:1565)
   [junit4]   2> 	at org.apache.lucene.index.TestIndexingSequenceNumbers$2.run(TestIndexingSequenceNumbers.java:208)
   [junit4]   2> 
   [junit4]   2> juuni 29, 2016 12:02:33 PM com.carrotsearch.randomizedtesting.RandomizedRunner$QueueUncaughtExceptionsHandler
uncaughtException
   [junit4]   2> WARNING: Uncaught exception in thread: Thread[Thread-674,5,TGRP-TestIndexingSequenceNumbers]
   [junit4]   2> java.lang.RuntimeException: org.apache.lucene.store.AlreadyClosedException:
this IndexWriter is closed
   [junit4]   2> 	at __randomizedtesting.SeedInfo.seed([F8BD42013B872937]:0)
   [junit4]   2> 	at org.apache.lucene.index.TestIndexingSequenceNumbers$2.run(TestIndexingSequenceNumbers.java:216)
   [junit4]   2> Caused by: org.apache.lucene.store.AlreadyClosedException: this IndexWriter
is closed
   [junit4]   2> 	at org.apache.lucene.index.IndexWriter.ensureOpen(IndexWriter.java:742)
   [junit4]   2> 	at org.apache.lucene.index.IndexWriter.ensureOpen(IndexWriter.java:756)
   [junit4]   2> 	at org.apache.lucene.index.IndexWriter.commit(IndexWriter.java:3174)
   [junit4]   2> 	at org.apache.lucene.index.TestIndexingSequenceNumbers$2.run(TestIndexingSequenceNumbers.java:184)
   [junit4]   2> Caused by: java.lang.OutOfMemoryError: Java heap space
   [junit4]   2> 	at java.util.HashMap.resize(HashMap.java:703)
   [junit4]   2> 	at java.util.HashMap.putVal(HashMap.java:628)
   [junit4]   2> 	at java.util.HashMap.put(HashMap.java:611)
   [junit4]   2> 	at org.apache.lucene.index.FieldInfos$Builder.getOrAdd(FieldInfos.java:386)
   [junit4]   2> 	at org.apache.lucene.index.DefaultIndexingChain.getOrAddField(DefaultIndexingChain.java:582)
   [junit4]   2> 	at org.apache.lucene.index.DefaultIndexingChain.processField(DefaultIndexingChain.java:430)
   [junit4]   2> 	at org.apache.lucene.index.DefaultIndexingChain.processDocument(DefaultIndexingChain.java:373)
   [junit4]   2> 	at org.apache.lucene.index.DocumentsWriterPerThread.updateDocument(DocumentsWriterPerThread.java:231)
   [junit4]   2> 	at org.apache.lucene.index.DocumentsWriter.updateDocument(DocumentsWriter.java:485)
   [junit4]   2> 	at org.apache.lucene.index.IndexWriter.updateDocument(IndexWriter.java:1565)
   [junit4]   2> 	at org.apache.lucene.index.TestIndexingSequenceNumbers$2.run(TestIndexingSequenceNumbers.java:208)
   [junit4]   2> 
   [junit4]   2> juuni 29, 2016 12:02:33 PM com.carrotsearch.randomizedtesting.RandomizedRunner$QueueUncaughtExceptionsHandler
uncaughtException
   [junit4]   2> WARNING: Uncaught exception in thread: Thread[Thread-669,5,TGRP-TestIndexingSequenceNumbers]
   [junit4]   2> java.lang.RuntimeException: org.apache.lucene.store.AlreadyClosedException:
this IndexWriter is closed
   [junit4]   2> 	at __randomizedtesting.SeedInfo.seed([F8BD42013B872937]:0)
   [junit4]   2> 	at org.apache.lucene.index.TestIndexingSequenceNumbers$2.run(TestIndexingSequenceNumbers.java:216)
   [junit4]   2> Caused by: org.apache.lucene.store.AlreadyClosedException: this IndexWriter
is closed
   [junit4]   2> 	at org.apache.lucene.index.IndexWriter.ensureOpen(IndexWriter.java:742)
   [junit4]   2> 	at org.apache.lucene.index.IndexWriter.ensureOpen(IndexWriter.java:756)
   [junit4]   2> 	at org.apache.lucene.index.IndexWriter.commit(IndexWriter.java:3174)
   [junit4]   2> 	at org.apache.lucene.index.TestIndexingSequenceNumbers$2.run(TestIndexingSequenceNumbers.java:184)
   [junit4]   2> Caused by: java.lang.OutOfMemoryError: Java heap space
   [junit4]   2> 	at java.util.HashMap.resize(HashMap.java:703)
   [junit4]   2> 	at java.util.HashMap.putVal(HashMap.java:628)
   [junit4]   2> 	at java.util.HashMap.put(HashMap.java:611)
   [junit4]   2> 	at org.apache.lucene.index.FieldInfos$Builder.getOrAdd(FieldInfos.java:386)
   [junit4]   2> 	at org.apache.lucene.index.DefaultIndexingChain.getOrAddField(DefaultIndexingChain.java:582)
   [junit4]   2> 	at org.apache.lucene.index.DefaultIndexingChain.processField(DefaultIndexingChain.java:430)
   [junit4]   2> 	at org.apache.lucene.index.DefaultIndexingChain.processDocument(DefaultIndexingChain.java:373)
   [junit4]   2> 	at org.apache.lucene.index.DocumentsWriterPerThread.updateDocument(DocumentsWriterPerThread.java:231)
   [junit4]   2> 	at org.apache.lucene.index.DocumentsWriter.updateDocument(DocumentsWriter.java:485)
   [junit4]   2> 	at org.apache.lucene.index.IndexWriter.updateDocument(IndexWriter.java:1565)
   [junit4]   2> 	at org.apache.lucene.index.TestIndexingSequenceNumbers$2.run(TestIndexingSequenceNumbers.java:208)
   [junit4]   2> 
   [junit4]   2> juuni 29, 2016 12:02:33 PM com.carrotsearch.randomizedtesting.RandomizedRunner$QueueUncaughtExceptionsHandler
uncaughtException
   [junit4]   2> WARNING: Uncaught exception in thread: Thread[Thread-678,5,TGRP-TestIndexingSequenceNumbers]
   [junit4]   2> java.lang.OutOfMemoryError: Java heap space
   [junit4]   2> 	at __randomizedtesting.SeedInfo.seed([F8BD42013B872937]:0)
   [junit4]   2> 	at java.util.HashMap.resize(HashMap.java:703)
   [junit4]   2> 	at java.util.HashMap.putVal(HashMap.java:628)
   [junit4]   2> 	at java.util.HashMap.put(HashMap.java:611)
   [junit4]   2> 	at org.apache.lucene.index.FieldInfos$Builder.getOrAdd(FieldInfos.java:386)
   [junit4]   2> 	at org.apache.lucene.index.DefaultIndexingChain.getOrAddField(DefaultIndexingChain.java:582)
   [junit4]   2> 	at org.apache.lucene.index.DefaultIndexingChain.processField(DefaultIndexingChain.java:430)
   [junit4]   2> 	at org.apache.lucene.index.DefaultIndexingChain.processDocument(DefaultIndexingChain.java:373)
   [junit4]   2> 	at org.apache.lucene.index.DocumentsWriterPerThread.updateDocument(DocumentsWriterPerThread.java:231)
   [junit4]   2> 	at org.apache.lucene.index.DocumentsWriter.updateDocument(DocumentsWriter.java:485)
   [junit4]   2> 	at org.apache.lucene.index.IndexWriter.updateDocument(IndexWriter.java:1565)
   [junit4]   2> 	at org.apache.lucene.index.TestIndexingSequenceNumbers$2.run(TestIndexingSequenceNumbers.java:208)
   [junit4]   2> 
   [junit4]   2> NOTE: download the large Jenkins line-docs file by running 'ant get-jenkins-line-docs'
in the lucene directory.
   [junit4]   2> NOTE: reproduce with: ant test  -Dtestcase=TestIndexingSequenceNumbers
-Dtests.method=testStressConcurrentCommit -Dtests.seed=F8BD42013B872937 -Dtests.multiplier=2
-Dtests.nightly=true -Dtests.slow=true -Dtests.linedocsfile=/x1/jenkins/lucene-data/enwiki.random.lines.txt
-Dtests.locale=et-EE -Dtests.timezone=Africa/Bujumbura -Dtests.asserts=true -Dtests.file.encoding=ISO-8859-1
   [junit4] ERROR    661s J0 | TestIndexingSequenceNumbers.testStressConcurrentCommit <<<
   [junit4]    > Throwable #1: org.apache.lucene.store.AlreadyClosedException: this IndexWriter
is closed
   [junit4]    > 	at org.apache.lucene.index.IndexWriter.ensureOpen(IndexWriter.java:742)
   [junit4]    > 	at org.apache.lucene.index.IndexWriter.ensureOpen(IndexWriter.java:756)
   [junit4]    > 	at org.apache.lucene.index.IndexWriter.commit(IndexWriter.java:3174)
   [junit4]    > 	at org.apache.lucene.index.TestIndexingSequenceNumbers.testStressConcurrentCommit(TestIndexingSequenceNumbers.java:228)
   [junit4]    > 	at java.lang.Thread.run(Thread.java:745)
   [junit4]    > Caused by: java.lang.OutOfMemoryError: Java heap space
   [junit4]    > 	at __randomizedtesting.SeedInfo.seed([F8BD42013B872937]:0)
   [junit4]    > 	at java.util.HashMap.resize(HashMap.java:703)
   [junit4]    > 	at java.util.HashMap.putVal(HashMap.java:628)
   [junit4]    > 	at java.util.HashMap.put(HashMap.java:611)
   [junit4]    > 	at org.apache.lucene.index.FieldInfos$Builder.getOrAdd(FieldInfos.java:386)
   [junit4]    > 	at org.apache.lucene.index.DefaultIndexingChain.getOrAddField(DefaultIndexingChain.java:582)
   [junit4]    > 	at org.apache.lucene.index.DefaultIndexingChain.processField(DefaultIndexingChain.java:430)
   [junit4]    > 	at org.apache.lucene.index.DefaultIndexingChain.processDocument(DefaultIndexingChain.java:373)
   [junit4]    > 	at org.apache.lucene.index.DocumentsWriterPerThread.updateDocument(DocumentsWriterPerThread.java:231)
   [junit4]    > 	at org.apache.lucene.index.DocumentsWriter.updateDocument(DocumentsWriter.java:485)
   [junit4]    > 	at org.apache.lucene.index.IndexWriter.updateDocument(IndexWriter.java:1565)
   [junit4]    > 	at org.apache.lucene.index.TestIndexingSequenceNumbers$2.run(TestIndexingSequenceNumbers.java:208)Throwable
#2: com.carrotsearch.randomizedtesting.UncaughtExceptionError: Captured an uncaught exception
in thread: Thread[id=878, name=Thread-671, state=RUNNABLE, group=TGRP-TestIndexingSequenceNumbers]
   [junit4]    > Caused by: java.lang.OutOfMemoryError: Java heap space: failed reallocation
of scalar replaced objectsThrowable #3: com.carrotsearch.randomizedtesting.UncaughtExceptionError:
Captured an uncaught exception in thread: Thread[id=879, name=Thread-672, state=RUNNABLE,
group=TGRP-TestIndexingSequenceNumbers]
   [junit4]    > Caused by: java.lang.OutOfMemoryError: Java heap spaceThrowable #4: com.carrotsearch.randomizedtesting.UncaughtExceptionError:
Captured an uncaught exception in thread: Thread[id=884, name=Thread-677, state=RUNNABLE,
group=TGRP-TestIndexingSequenceNumbers]
   [junit4]    > Caused by: java.lang.OutOfMemoryError: Java heap spaceThrowable #5: com.carrotsearch.randomizedtesting.UncaughtExceptionError:
Captured an uncaught exception in thread: Thread[id=883, name=Thread-676, state=RUNNABLE,
group=TGRP-TestIndexingSequenceNumbers]
   [junit4]    > Caused by: java.lang.OutOfMemoryError: Java heap spaceThrowable #6: com.carrotsearch.randomizedtesting.UncaughtExceptionError:
Captured an uncaught exception in thread: Thread[id=880, name=Thread-673, state=RUNNABLE,
group=TGRP-TestIndexingSequenceNumbers]
   [junit4]    > Caused by: java.lang.OutOfMemoryError: Java heap spaceThrowable #7: com.carrotsearch.randomizedtesting.UncaughtExceptionError:
Captured an uncaught exception in thread: Thread[id=882, name=Thread-675, state=RUNNABLE,
group=TGRP-TestIndexingSequenceNumbers]
   [junit4]    > Caused by: java.lang.OutOfMemoryError: Java heap space
   [junit4]    > 	at __randomizedtesting.SeedInfo.seed([F8BD42013B872937]:0)
   [junit4]    > 	at org.apache.lucene.index.ParallelPostingsArray.<init>(ParallelPostingsArray.java:31)
   [junit4]    > 	at org.apache.lucene.index.FreqProxTermsWriterPerField$FreqProxPostingsArray.<init>(FreqProxTermsWriterPerField.java:205)
   [junit4]    > 	at org.apache.lucene.index.FreqProxTermsWriterPerField.createPostingsArray(FreqProxTermsWriterPerField.java:200)
   [junit4]    > 	at org.apache.lucene.index.TermsHashPerField$PostingsBytesStartArray.init(TermsHashPerField.java:239)
   [junit4]    > 	at org.apache.lucene.util.BytesRefHash.<init>(BytesRefHash.java:90)
   [junit4]    > 	at org.apache.lucene.index.TermsHashPerField.<init>(TermsHashPerField.java:70)
   [junit4]    > 	at org.apache.lucene.index.FreqProxTermsWriterPerField.<init>(FreqProxTermsWriterPerField.java:48)
   [junit4]    > 	at org.apache.lucene.index.FreqProxTermsWriter.addField(FreqProxTermsWriter.java:121)
   [junit4]    > 	at org.apache.lucene.index.DefaultIndexingChain$PerField.setInvertState(DefaultIndexingChain.java:656)
   [junit4]    > 	at org.apache.lucene.index.DefaultIndexingChain$PerField.<init>(DefaultIndexingChain.java:650)
   [junit4]    > 	at org.apache.lucene.index.DefaultIndexingChain.getOrAddField(DefaultIndexingChain.java:588)
   [junit4]    > 	at org.apache.lucene.index.DefaultIndexingChain.processField(DefaultIndexingChain.java:415)
   [junit4]    > 	at org.apache.lucene.index.DefaultIndexingChain.processDocument(DefaultIndexingChain.java:373)
   [junit4]    > 	at org.apache.lucene.index.DocumentsWriterPerThread.updateDocument(DocumentsWriterPerThread.java:231)
   [junit4]    > 	at org.apache.lucene.index.DocumentsWriter.updateDocument(DocumentsWriter.java:485)
   [junit4]    > 	at org.apache.lucene.index.IndexWriter.updateDocument(IndexWriter.java:1565)
   [junit4]    > 	at org.apache.lucene.index.TestIndexingSequenceNumbers$2.run(TestIndexingSequenceNumbers.java:208)Throwable
#8: com.carrotsearch.randomizedtesting.UncaughtExceptionError: Captured an uncaught exception
in thread: Thread[id=877, name=Thread-670, state=RUNNABLE, group=TGRP-TestIndexingSequenceNumbers]
   [junit4]    > Caused by: java.lang.RuntimeException: org.apache.lucene.store.AlreadyClosedException:
refusing to delete any files: this IndexWriter hit an unrecoverable exception
   [junit4]    > 	at __randomizedtesting.SeedInfo.seed([F8BD42013B872937]:0)
   [junit4]    > 	at org.apache.lucene.index.TestIndexingSequenceNumbers$2.run(TestIndexingSequenceNumbers.java:216)
   [junit4]    > Caused by: org.apache.lucene.store.AlreadyClosedException: refusing to
delete any files: this IndexWriter hit an unrecoverable exception
   [junit4]    > 	at org.apache.lucene.index.IndexFileDeleter.ensureOpen(IndexFileDeleter.java:345)
   [junit4]    > 	at org.apache.lucene.index.IndexFileDeleter.deleteFiles(IndexFileDeleter.java:696)
   [junit4]    > 	at org.apache.lucene.index.IndexFileDeleter.decRef(IndexFileDeleter.java:594)
   [junit4]    > 	at org.apache.lucene.index.IndexFileDeleter.checkpoint(IndexFileDeleter.java:533)
   [junit4]    > 	at org.apache.lucene.index.IndexWriter.checkpoint(IndexWriter.java:2454)
   [junit4]    > 	at org.apache.lucene.index.IndexWriter.publishFlushedSegment(IndexWriter.java:2512)
   [junit4]    > 	at org.apache.lucene.index.DocumentsWriterFlushQueue$FlushTicket.publishFlushedSegment(DocumentsWriterFlushQueue.java:198)
   [junit4]    > 	at org.apache.lucene.index.DocumentsWriterFlushQueue$FlushTicket.finishFlush(DocumentsWriterFlushQueue.java:213)
   [junit4]    > 	at org.apache.lucene.index.DocumentsWriterFlushQueue$SegmentFlushTicket.publish(DocumentsWriterFlushQueue.java:249)
   [junit4]    > 	at org.apache.lucene.index.DocumentsWriterFlushQueue.innerPurge(DocumentsWriterFlushQueue.java:116)
   [junit4]    > 	at org.apache.lucene.index.DocumentsWriterFlushQueue.forcePurge(DocumentsWriterFlushQueue.java:138)
   [junit4]    > 	at org.apache.lucene.index.DocumentsWriter.flushAllThreads(DocumentsWriter.java:670)
   [junit4]    > 	at org.apache.lucene.index.IndexWriter.prepareCommitInternal(IndexWriter.java:2977)
   [junit4]    > 	at org.apache.lucene.index.IndexWriter.commitInternal(IndexWriter.java:3210)
   [junit4]    > 	at org.apache.lucene.index.IndexWriter.commit(IndexWriter.java:3175)
   [junit4]    > 	at org.apache.lucene.index.TestIndexingSequenceNumbers$2.run(TestIndexingSequenceNumbers.java:184)
   [junit4]    > Caused by: java.lang.OutOfMemoryError: Java heap space
   [junit4]    > 	at __randomizedtesting.SeedInfo.seed([F8BD42013B872937]:0)
   [junit4]    > 	at java.util.HashMap.resize(HashMap.java:703)
   [junit4]    > 	at java.util.HashMap.putVal(HashMap.java:628)
   [junit4]    > 	at java.util.HashMap.put(HashMap.java:611)
   [junit4]    > 	at org.apache.lucene.index.FieldInfos$Builder.getOrAdd(FieldInfos.java:386)
   [junit4]    > 	at org.apache.lucene.index.DefaultIndexingChain.getOrAddField(DefaultIndexingChain.java:582)
   [junit4]    > 	at org.apache.lucene.index.DefaultIndexingChain.processField(DefaultIndexingChain.java:430)
   [junit4]    > 	at org.apache.lucene.index.DefaultIndexingChain.processDocument(DefaultIndexingChain.java:373)
   [junit4]    > 	at org.apache.lucene.index.DocumentsWriterPerThread.updateDocument(DocumentsWriterPerThread.java:231)
   [junit4]    > 	at org.apache.lucene.index.DocumentsWriter.updateDocument(DocumentsWriter.java:485)
   [junit4]    > 	at org.apache.lucene.index.IndexWriter.updateDocument(IndexWriter.java:1565)
   [junit4]    > 	at org.apache.lucene.index.TestIndexingSequenceNumbers$2.run(TestIndexingSequenceNumbers.java:208)Throwable
#9: com.carrotsearch.randomizedtesting.UncaughtExceptionError: Captured an uncaught exception
in thread: Thread[id=881, name=Thread-674, state=RUNNABLE, group=TGRP-TestIndexingSequenceNumbers]
   [junit4]    > Caused by: java.lang.RuntimeException: org.apache.lucene.store.AlreadyClosedException:
this IndexWriter is closed
   [junit4]    > 	at __randomizedtesting.SeedInfo.seed([F8BD42013B872937]:0)
   [junit4]    > 	at org.apache.lucene.index.TestIndexingSequenceNumbers$2.run(TestIndexingSequenceNumbers.java:216)
   [junit4]    > Caused by: org.apache.lucene.store.AlreadyClosedException: this IndexWriter
is closed
   [junit4]    > 	at org.apache.lucene.index.IndexWriter.ensureOpen(IndexWriter.java:742)
   [junit4]    > 	at org.apache.lucene.index.IndexWriter.ensureOpen(IndexWriter.java:756)
   [junit4]    > 	at org.apache.lucene.index.IndexWriter.commit(IndexWriter.java:3174)
   [junit4]    > 	at org.apache.lucene.index.TestIndexingSequenceNumbers$2.run(TestIndexingSequenceNumbers.java:184)
   [junit4]    > Caused by: java.lang.OutOfMemoryError: Java heap space
   [junit4]    > 	at __randomizedtesting.SeedInfo.seed([F8BD42013B872937]:0)
   [junit4]    > 	at java.util.HashMap.resize(HashMap.java:703)
   [junit4]    > 	at java.util.HashMap.putVal(HashMap.java:628)
   [junit4]    > 	at java.util.HashMap.put(HashMap.java:611)
   [junit4]    > 	at org.apache.lucene.index.FieldInfos$Builder.getOrAdd(FieldInfos.java:386)
   [junit4]    > 	at org.apache.lucene.index.DefaultIndexingChain.getOrAddField(DefaultIndexingChain.java:582)
   [junit4]    > 	at org.apache.lucene.index.DefaultIndexingChain.processField(DefaultIndexingChain.java:430)
   [junit4]    > 	at org.apache.lucene.index.DefaultIndexingChain.processDocument(DefaultIndexingChain.java:373)
   [junit4]    > 	at org.apache.lucene.index.DocumentsWriterPerThread.updateDocument(DocumentsWriterPerThread.java:231)
   [junit4]    > 	at org.apache.lucene.index.DocumentsWriter.updateDocument(DocumentsWriter.java:485)
   [junit4]    > 	at org.apache.lucene.index.IndexWriter.updateDocument(IndexWriter.java:1565)
   [junit4]    > 	at org.apache.lucene.index.TestIndexingSequenceNumbers$2.run(TestIndexingSequenceNumbers.java:208)Throwable
#10: com.carrotsearch.randomizedtesting.UncaughtExceptionError: Captured an uncaught exception
in thread: Thread[id=876, name=Thread-669, state=RUNNABLE, group=TGRP-TestIndexingSequenceNumbers]
   [junit4]    > Caused by: java.lang.RuntimeException: org.apache.lucene.store.AlreadyClosedException:
this IndexWriter is closed
   [junit4]    > 	at __randomizedtesting.SeedInfo.seed([F8BD42013B872937]:0)
   [junit4]    > 	at org.apache.lucene.index.TestIndexingSequenceNumbers$2.run(TestIndexingSequenceNumbers.java:216)
   [junit4]    > Caused by: org.apache.lucene.store.AlreadyClosedException: this IndexWriter
is closed
   [junit4]    > 	at org.apache.lucene.index.IndexWriter.ensureOpen(IndexWriter.java:742)
   [junit4]    > 	at org.apache.lucene.index.IndexWriter.ensureOpen(IndexWriter.java:756)
   [junit4]    > 	at org.apache.lucene.index.IndexWriter.commit(IndexWriter.java:3174)
   [junit4]    > 	at org.apache.lucene.index.TestIndexingSequenceNumbers$2.run(TestIndexingSequenceNumbers.java:184)
   [junit4]    > Caused by: java.lang.OutOfMemoryError: Java heap space
   [junit4]    > 	at __randomizedtesting.SeedInfo.seed([F8BD42013B872937]:0)
   [junit4]    > 	at java.util.HashMap.resize(HashMap.java:703)
   [junit4]    > 	at java.util.HashMap.putVal(HashMap.java:628)
   [junit4]    > 	at java.util.HashMap.put(HashMap.java:611)
   [junit4]    > 	at org.apache.lucene.index.FieldInfos$Builder.getOrAdd(FieldInfos.java:386)
   [junit4]    > 	at org.apache.lucene.index.DefaultIndexingChain.getOrAddField(DefaultIndexingChain.java:582)
   [junit4]    > 	at org.apache.lucene.index.DefaultIndexingChain.processField(DefaultIndexingChain.java:430)
   [junit4]    > 	at org.apache.lucene.index.DefaultIndexingChain.processDocument(DefaultIndexingChain.java:373)
   [junit4]    > 	at org.apache.lucene.index.DocumentsWriterPerThread.updateDocument(DocumentsWriterPerThread.java:231)
   [junit4]    > 	at org.apache.lucene.index.DocumentsWriter.updateDocument(DocumentsWriter.java:485)
   [junit4]    > 	at org.apache.lucene.index.IndexWriter.updateDocument(IndexWriter.java:1565)
   [junit4]    > 	at org.apache.lucene.index.TestIndexingSequenceNumbers$2.run(TestIndexingSequenceNumbers.java:208)Throwable
#11: com.carrotsearch.randomizedtesting.UncaughtExceptionError: Captured an uncaught exception
in thread: Thread[id=885, name=Thread-678, state=RUNNABLE, group=TGRP-TestIndexingSequenceNumbers]
   [junit4]    > Caused by: java.lang.OutOfMemoryError: Java heap space
   [junit4]    > 	at __randomizedtesting.SeedInfo.seed([F8BD42013B872937]:0)
   [junit4]    > 	at java.util.HashMap.resize(HashMap.java:703)
   [junit4]    > 	at java.util.HashMap.putVal(HashMap.java:628)
   [junit4]    > 	at java.util.HashMap.put(HashMap.java:611)
   [junit4]    > 	at org.apache.lucene.index.FieldInfos$Builder.getOrAdd(FieldInfos.java:386)
   [junit4]    > 	at org.apache.lucene.index.DefaultIndexingChain.getOrAddField(DefaultIndexingChain.java:582)
   [junit4]    > 	at org.apache.lucene.index.DefaultIndexingChain.processField(DefaultIndexingChain.java:430)
   [junit4]    > 	at org.apache.lucene.index.DefaultIndexingChain.processDocument(DefaultIndexingChain.java:373)
   [junit4]    > 	at org.apache.lucene.index.DocumentsWriterPerThread.updateDocument(DocumentsWriterPerThread.java:231)
   [junit4]    > 	at org.apache.lucene.index.DocumentsWriter.updateDocument(DocumentsWriter.java:485)
   [junit4]    > 	at org.apache.lucene.index.IndexWriter.updateDocument(IndexWriter.java:1565)
   [junit4]    > 	at org.apache.lucene.index.TestIndexingSequenceNumbers$2.run(TestIndexingSequenceNumbers.java:208)
   [junit4]   2> NOTE: leaving temporary files on disk at: /x1/jenkins/jenkins-slave/workspace/Lucene-Solr-NightlyTests-6.x/lucene/build/core/test/J0/temp/lucene.index.TestIndexingSequenceNumbers_F8BD42013B872937-001
   [junit4]   2> NOTE: test params are: codec=CheapBastard, sim=ClassicSimilarity, locale=et-EE,
timezone=Africa/Bujumbura
   [junit4]   2> NOTE: Linux 3.13.0-85-generic amd64/Oracle Corporation 1.8.0_74 (64-bit)/cpus=4,threads=1,free=158326400,total=535822336
   [junit4]   2> NOTE: All tests run in this JVM: [Test2BSortedDocValuesFixedSorted, TestSizeBoundedForceMerge,
TestTotalHitCountCollector, TestIndexWriterExceptions2, TestSimpleAttributeImpl, TestNumericTokenStream,
Test2BPostingsBytes, TestTragicIndexWriterDeadlock, TestTermsEnum, TestDocValuesIndexing,
TestMergeRateLimiter, TestCustomNorms, TestDisjunctionMaxQuery, TestDocIdSetBuilder, TestBlockPostingsFormat2,
TestNeverDelete, TestMultiLevelSkipList, TestOmitNorms, TestIndexWriterOnVMError, TestSimpleExplanations,
Test2BTerms, TestSwappedIndexFiles, TestCrashCausesCorruptIndex, TestPhraseQuery, TestSimpleFSLockFactory,
TestNumericRangeQuery64, TestAutomatonQuery, TestIndexWriterWithThreads, TestBooleanScorer,
TestBooleanCoord, Test2BBKDPoints, TestTermVectorsReader, TestAllFilesDetectTruncation, TestStressIndexing,
TestSearcherManager, TestIndexWriterMergePolicy, TestPolygon, TestTimSorterWorstCase, FuzzyTermOnShortTermsTest,
TestSortRescorer, TestRollback, TestMultiTermQueryRewrites, TestRecyclingIntBlockAllocator,
TestFieldsReader, TestDeletionPolicy, TestBM25Similarity, TestPrefixQuery, TestSloppyMath,
TestDateTools, TestIndexSearcher, TestTrackingDirectoryWrapper, TestNGramPhraseQuery, TestParallelCompositeReader,
TestNoDeletionPolicy, TestSpanBoostQuery, TestPrefixCodedTerms, TestNamedSPILoader, TestCrash,
TestStringHelper, TestSegmentTermDocs, TestIndexWriterDelete, TestComplexExplanationsOfNonMatches,
TestSpanNearQuery, TestLevenshteinAutomata, TestDateSort, TestFieldCacheRewriteMethod, TestMultiset,
TestIndexingSequenceNumbers]
   [junit4] Completed [228/432 (1!)] on J0 in 710.78s, 8 tests, 1 error <<< FAILURES!

[...truncated 702 lines...]
   [junit4] JVM J0: stdout was not empty, see: /x1/jenkins/jenkins-slave/workspace/Lucene-Solr-NightlyTests-6.x/lucene/build/core/test/temp/junit4-J0-20160629_092021_497.sysout
   [junit4] >>> JVM J0 emitted unexpected output (verbatim) ----
   [junit4] java.lang.OutOfMemoryError: Java heap space
   [junit4] Dumping heap to /x1/jenkins/jenkins-slave/workspace/Lucene-Solr-NightlyTests-6.x/heapdumps/java_pid23901.hprof
...
   [junit4] Heap dump file created [482210764 bytes in 2.525 secs]
   [junit4] <<< JVM J0: EOF ----

[...truncated 13 lines...]
BUILD FAILED
/x1/jenkins/jenkins-slave/workspace/Lucene-Solr-NightlyTests-6.x/build.xml:747: The following
error occurred while executing this line:
/x1/jenkins/jenkins-slave/workspace/Lucene-Solr-NightlyTests-6.x/build.xml:684: The following
error occurred while executing this line:
/x1/jenkins/jenkins-slave/workspace/Lucene-Solr-NightlyTests-6.x/build.xml:59: The following
error occurred while executing this line:
/x1/jenkins/jenkins-slave/workspace/Lucene-Solr-NightlyTests-6.x/lucene/build.xml:50: The
following error occurred while executing this line:
/x1/jenkins/jenkins-slave/workspace/Lucene-Solr-NightlyTests-6.x/lucene/common-build.xml:1427:
The following error occurred while executing this line:
/x1/jenkins/jenkins-slave/workspace/Lucene-Solr-NightlyTests-6.x/lucene/common-build.xml:984:
There were test failures: 432 suites (1 ignored), 3704 tests, 1 error, 39 ignored (35 assumptions)
[seed: F8BD42013B872937]

Total time: 70 minutes 43 seconds
Build step 'Invoke Ant' marked build as failure
Archiving artifacts
No prior successful build to compare, so performing full copy of artifacts
Recording test results
Email was triggered for: Failure - Any
Sending email for trigger: Failure - Any




Mime
View raw message