lucene-dev mailing list archives

Site index · List index
Message view « Date » · « Thread »
Top « Date » · « Thread »
From Policeman Jenkins Server <jenk...@thetaphi.de>
Subject [JENKINS] Lucene-Solr-master-Linux (32bit/jdk1.8.0_92) - Build # 16951 - Failure!
Date Thu, 09 Jun 2016 00:54:32 GMT
Build: http://jenkins.thetaphi.de/job/Lucene-Solr-master-Linux/16951/
Java: 32bit/jdk1.8.0_92 -client -XX:+UseParallelGC

1 tests failed.
FAILED:  org.apache.solr.cloud.RecoveryZkTest.test

Error Message:
Captured an uncaught exception in thread: Thread[id=1548, name=StoppableIndexingThread, state=RUNNABLE, group=TGRP-RecoveryZkTest]

Stack Trace:
com.carrotsearch.randomizedtesting.UncaughtExceptionError: Captured an uncaught exception in thread: Thread[id=1548, name=StoppableIndexingThread, state=RUNNABLE, group=TGRP-RecoveryZkTest]
Caused by: java.lang.OutOfMemoryError: GC overhead limit exceeded
	at __randomizedtesting.SeedInfo.seed([E483A65CABC70E3E]:0)
	at java.util.HashMap$KeySet.iterator(HashMap.java:916)
	at java.util.HashSet.iterator(HashSet.java:172)
	at sun.security.util.AbstractAlgorithmConstraints.checkAlgorithm(AbstractAlgorithmConstraints.java:108)
	at sun.security.util.DisabledAlgorithmConstraints.permits(DisabledAlgorithmConstraints.java:91)
	at sun.security.ssl.SSLAlgorithmConstraints.permits(SSLAlgorithmConstraints.java:144)
	at sun.security.ssl.Handshaker.getActiveCipherSuites(Handshaker.java:642)
	at sun.security.ssl.Handshaker.activate(Handshaker.java:509)
	at sun.security.ssl.SSLSocketImpl.kickstartHandshake(SSLSocketImpl.java:1482)
	at sun.security.ssl.SSLSocketImpl.performInitialHandshake(SSLSocketImpl.java:1351)
	at sun.security.ssl.SSLSocketImpl.startHandshake(SSLSocketImpl.java:1403)
	at sun.security.ssl.SSLSocketImpl.startHandshake(SSLSocketImpl.java:1387)
	at org.apache.http.conn.ssl.SSLConnectionSocketFactory.createLayeredSocket(SSLConnectionSocketFactory.java:394)
	at org.apache.http.conn.ssl.SSLConnectionSocketFactory.connectSocket(SSLConnectionSocketFactory.java:353)
	at org.apache.http.impl.conn.DefaultHttpClientConnectionOperator.connect(DefaultHttpClientConnectionOperator.java:134)
	at org.apache.http.impl.conn.PoolingHttpClientConnectionManager.connect(PoolingHttpClientConnectionManager.java:353)
	at org.apache.http.impl.execchain.MainClientExec.establishRoute(MainClientExec.java:380)
	at org.apache.http.impl.execchain.MainClientExec.execute(MainClientExec.java:236)
	at org.apache.http.impl.execchain.ProtocolExec.execute(ProtocolExec.java:184)
	at org.apache.http.impl.execchain.RetryExec.execute(RetryExec.java:88)
	at org.apache.http.impl.execchain.RedirectExec.execute(RedirectExec.java:110)
	at org.apache.http.impl.client.InternalHttpClient.doExecute(InternalHttpClient.java:184)
	at org.apache.http.impl.client.CloseableHttpClient.execute(CloseableHttpClient.java:82)
	at org.apache.http.impl.client.CloseableHttpClient.execute(CloseableHttpClient.java:55)
	at org.apache.solr.client.solrj.impl.HttpSolrClient.executeMethod(HttpSolrClient.java:511)
	at org.apache.solr.client.solrj.impl.HttpSolrClient.request(HttpSolrClient.java:259)
	at org.apache.solr.client.solrj.impl.HttpSolrClient.request(HttpSolrClient.java:248)
	at org.apache.solr.client.solrj.SolrRequest.process(SolrRequest.java:149)
	at org.apache.solr.client.solrj.SolrRequest.process(SolrRequest.java:166)
	at org.apache.solr.cloud.StoppableIndexingThread.indexDocs(StoppableIndexingThread.java:176)
	at org.apache.solr.cloud.StoppableIndexingThread.run(StoppableIndexingThread.java:115)




Build Log:
[...truncated 10801 lines...]
   [junit4] Suite: org.apache.solr.cloud.RecoveryZkTest
   [junit4]   2> Creating dataDir: /home/jenkins/workspace/Lucene-Solr-master-Linux/solr/build/solr-core/test/J2/temp/solr.cloud.RecoveryZkTest_E483A65CABC70E3E-001/init-core-data-001
   [junit4]   2> 251816 INFO  (SUITE-RecoveryZkTest-seed#[E483A65CABC70E3E]-worker) [    ] o.a.s.SolrTestCaseJ4 Randomized ssl (true) and clientAuth (true) via: @org.apache.solr.util.RandomizeSSL(reason=, ssl=NaN, value=NaN, clientAuth=NaN)
   [junit4]   2> 251817 INFO  (SUITE-RecoveryZkTest-seed#[E483A65CABC70E3E]-worker) [    ] o.a.s.BaseDistributedSearchTestCase Setting hostContext system property: /v/
   [junit4]   2> 251819 INFO  (TEST-RecoveryZkTest.test-seed#[E483A65CABC70E3E]) [    ] o.a.s.c.ZkTestServer STARTING ZK TEST SERVER
   [junit4]   2> 251819 INFO  (Thread-460) [    ] o.a.s.c.ZkTestServer client port:0.0.0.0/0.0.0.0:0
   [junit4]   2> 251819 INFO  (Thread-460) [    ] o.a.s.c.ZkTestServer Starting server
   [junit4]   2> 251919 INFO  (TEST-RecoveryZkTest.test-seed#[E483A65CABC70E3E]) [    ] o.a.s.c.ZkTestServer start zk server on port:34273
   [junit4]   2> 251919 INFO  (TEST-RecoveryZkTest.test-seed#[E483A65CABC70E3E]) [    ] o.a.s.c.c.SolrZkClient Using default ZkCredentialsProvider
   [junit4]   2> 251919 INFO  (TEST-RecoveryZkTest.test-seed#[E483A65CABC70E3E]) [    ] o.a.s.c.c.ConnectionManager Waiting for client to connect to ZooKeeper
   [junit4]   2> 251922 INFO  (zkCallback-233-thread-1) [    ] o.a.s.c.c.ConnectionManager Watcher org.apache.solr.common.cloud.ConnectionManager@1b583c9 name:ZooKeeperConnection Watcher:127.0.0.1:34273 got event WatchedEvent state:SyncConnected type:None path:null path:null type:None
   [junit4]   2> 251923 INFO  (TEST-RecoveryZkTest.test-seed#[E483A65CABC70E3E]) [    ] o.a.s.c.c.ConnectionManager Client is connected to ZooKeeper
   [junit4]   2> 251923 INFO  (TEST-RecoveryZkTest.test-seed#[E483A65CABC70E3E]) [    ] o.a.s.c.c.SolrZkClient Using default ZkACLProvider
   [junit4]   2> 251923 INFO  (TEST-RecoveryZkTest.test-seed#[E483A65CABC70E3E]) [    ] o.a.s.c.c.SolrZkClient makePath: /solr
   [junit4]   2> 251925 INFO  (TEST-RecoveryZkTest.test-seed#[E483A65CABC70E3E]) [    ] o.a.s.c.c.SolrZkClient Using default ZkCredentialsProvider
   [junit4]   2> 251925 INFO  (TEST-RecoveryZkTest.test-seed#[E483A65CABC70E3E]) [    ] o.a.s.c.c.ConnectionManager Waiting for client to connect to ZooKeeper
   [junit4]   2> 251926 INFO  (zkCallback-234-thread-1) [    ] o.a.s.c.c.ConnectionManager Watcher org.apache.solr.common.cloud.ConnectionManager@253e19 name:ZooKeeperConnection Watcher:127.0.0.1:34273/solr got event WatchedEvent state:SyncConnected type:None path:null path:null type:None
   [junit4]   2> 251926 INFO  (TEST-RecoveryZkTest.test-seed#[E483A65CABC70E3E]) [    ] o.a.s.c.c.ConnectionManager Client is connected to ZooKeeper
   [junit4]   2> 251926 INFO  (TEST-RecoveryZkTest.test-seed#[E483A65CABC70E3E]) [    ] o.a.s.c.c.SolrZkClient Using default ZkACLProvider
   [junit4]   2> 251926 INFO  (TEST-RecoveryZkTest.test-seed#[E483A65CABC70E3E]) [    ] o.a.s.c.c.SolrZkClient makePath: /collections/collection1
   [junit4]   2> 251927 INFO  (TEST-RecoveryZkTest.test-seed#[E483A65CABC70E3E]) [    ] o.a.s.c.c.SolrZkClient makePath: /collections/collection1/shards
   [junit4]   2> 251929 INFO  (TEST-RecoveryZkTest.test-seed#[E483A65CABC70E3E]) [    ] o.a.s.c.c.SolrZkClient makePath: /collections/control_collection
   [junit4]   2> 251930 INFO  (TEST-RecoveryZkTest.test-seed#[E483A65CABC70E3E]) [    ] o.a.s.c.c.SolrZkClient makePath: /collections/control_collection/shards
   [junit4]   2> 251931 INFO  (TEST-RecoveryZkTest.test-seed#[E483A65CABC70E3E]) [    ] o.a.s.c.AbstractZkTestCase put /home/jenkins/workspace/Lucene-Solr-master-Linux/solr/core/src/test-files/solr/collection1/conf/solrconfig-tlog.xml to /configs/conf1/solrconfig.xml
   [junit4]   2> 251931 INFO  (TEST-RecoveryZkTest.test-seed#[E483A65CABC70E3E]) [    ] o.a.s.c.c.SolrZkClient makePath: /configs/conf1/solrconfig.xml
   [junit4]   2> 251932 INFO  (TEST-RecoveryZkTest.test-seed#[E483A65CABC70E3E]) [    ] o.a.s.c.AbstractZkTestCase put /home/jenkins/workspace/Lucene-Solr-master-Linux/solr/core/src/test-files/solr/collection1/conf/schema15.xml to /configs/conf1/schema.xml
   [junit4]   2> 251932 INFO  (TEST-RecoveryZkTest.test-seed#[E483A65CABC70E3E]) [    ] o.a.s.c.c.SolrZkClient makePath: /configs/conf1/schema.xml
   [junit4]   2> 251933 INFO  (TEST-RecoveryZkTest.test-seed#[E483A65CABC70E3E]) [    ] o.a.s.c.AbstractZkTestCase put /home/jenkins/workspace/Lucene-Solr-master-Linux/solr/core/src/test-files/solr/collection1/conf/solrconfig.snippet.randomindexconfig.xml to /configs/conf1/solrconfig.snippet.randomindexconfig.xml
   [junit4]   2> 251933 INFO  (TEST-RecoveryZkTest.test-seed#[E483A65CABC70E3E]) [    ] o.a.s.c.c.SolrZkClient makePath: /configs/conf1/solrconfig.snippet.randomindexconfig.xml
   [junit4]   2> 251934 INFO  (TEST-RecoveryZkTest.test-seed#[E483A65CABC70E3E]) [    ] o.a.s.c.AbstractZkTestCase put /home/jenkins/workspace/Lucene-Solr-master-Linux/solr/core/src/test-files/solr/collection1/conf/stopwords.txt to /configs/conf1/stopwords.txt
   [junit4]   2> 251934 INFO  (TEST-RecoveryZkTest.test-seed#[E483A65CABC70E3E]) [    ] o.a.s.c.c.SolrZkClient makePath: /configs/conf1/stopwords.txt
   [junit4]   2> 251935 INFO  (TEST-RecoveryZkTest.test-seed#[E483A65CABC70E3E]) [    ] o.a.s.c.AbstractZkTestCase put /home/jenkins/workspace/Lucene-Solr-master-Linux/solr/core/src/test-files/solr/collection1/conf/protwords.txt to /configs/conf1/protwords.txt
   [junit4]   2> 251935 INFO  (TEST-RecoveryZkTest.test-seed#[E483A65CABC70E3E]) [    ] o.a.s.c.c.SolrZkClient makePath: /configs/conf1/protwords.txt
   [junit4]   2> 251936 INFO  (TEST-RecoveryZkTest.test-seed#[E483A65CABC70E3E]) [    ] o.a.s.c.AbstractZkTestCase put /home/jenkins/workspace/Lucene-Solr-master-Linux/solr/core/src/test-files/solr/collection1/conf/currency.xml to /configs/conf1/currency.xml
   [junit4]   2> 251936 INFO  (TEST-RecoveryZkTest.test-seed#[E483A65CABC70E3E]) [    ] o.a.s.c.c.SolrZkClient makePath: /configs/conf1/currency.xml
   [junit4]   2> 251937 INFO  (TEST-RecoveryZkTest.test-seed#[E483A65CABC70E3E]) [    ] o.a.s.c.AbstractZkTestCase put /home/jenkins/workspace/Lucene-Solr-master-Linux/solr/core/src/test-files/solr/collection1/conf/enumsConfig.xml to /configs/conf1/enumsConfig.xml
   [junit4]   2> 251937 INFO  (TEST-RecoveryZkTest.test-seed#[E483A65CABC70E3E]) [    ] o.a.s.c.c.SolrZkClient makePath: /configs/conf1/enumsConfig.xml
   [junit4]   2> 251938 INFO  (TEST-RecoveryZkTest.test-seed#[E483A65CABC70E3E]) [    ] o.a.s.c.AbstractZkTestCase put /home/jenkins/workspace/Lucene-Solr-master-Linux/solr/core/src/test-files/solr/collection1/conf/open-exchange-rates.json to /configs/conf1/open-exchange-rates.json
   [junit4]   2> 251938 INFO  (TEST-RecoveryZkTest.test-seed#[E483A65CABC70E3E]) [    ] o.a.s.c.c.SolrZkClient makePath: /configs/conf1/open-exchange-rates.json
   [junit4]   2> 251939 INFO  (TEST-RecoveryZkTest.test-seed#[E483A65CABC70E3E]) [    ] o.a.s.c.AbstractZkTestCase put /home/jenkins/workspace/Lucene-Solr-master-Linux/solr/core/src/test-files/solr/collection1/conf/mapping-ISOLatin1Accent.txt to /configs/conf1/mapping-ISOLatin1Accent.txt
   [junit4]   2> 251939 INFO  (TEST-RecoveryZkTest.test-seed#[E483A65CABC70E3E]) [    ] o.a.s.c.c.SolrZkClient makePath: /configs/conf1/mapping-ISOLatin1Accent.txt
   [junit4]   2> 251940 INFO  (TEST-RecoveryZkTest.test-seed#[E483A65CABC70E3E]) [    ] o.a.s.c.AbstractZkTestCase put /home/jenkins/workspace/Lucene-Solr-master-Linux/solr/core/src/test-files/solr/collection1/conf/old_synonyms.txt to /configs/conf1/old_synonyms.txt
   [junit4]   2> 251940 INFO  (TEST-RecoveryZkTest.test-seed#[E483A65CABC70E3E]) [    ] o.a.s.c.c.SolrZkClient makePath: /configs/conf1/old_synonyms.txt
   [junit4]   2> 251941 INFO  (TEST-RecoveryZkTest.test-seed#[E483A65CABC70E3E]) [    ] o.a.s.c.AbstractZkTestCase put /home/jenkins/workspace/Lucene-Solr-master-Linux/solr/core/src/test-files/solr/collection1/conf/synonyms.txt to /configs/conf1/synonyms.txt
   [junit4]   2> 251941 INFO  (TEST-RecoveryZkTest.test-seed#[E483A65CABC70E3E]) [    ] o.a.s.c.c.SolrZkClient makePath: /configs/conf1/synonyms.txt
   [junit4]   2> 251943 INFO  (TEST-RecoveryZkTest.test-seed#[E483A65CABC70E3E]) [    ] o.a.s.c.c.SolrZkClient Using default ZkCredentialsProvider
   [junit4]   2> 251943 INFO  (TEST-RecoveryZkTest.test-seed#[E483A65CABC70E3E]) [    ] o.a.s.c.c.ConnectionManager Waiting for client to connect to ZooKeeper
   [junit4]   2> 251944 INFO  (zkCallback-236-thread-1) [    ] o.a.s.c.c.ConnectionManager Watcher org.apache.solr.common.cloud.ConnectionManager@14e4428 name:ZooKeeperConnection Watcher:127.0.0.1:34273/solr got event WatchedEvent state:SyncConnected type:None path:null path:null type:None
   [junit4]   2> 251944 INFO  (TEST-RecoveryZkTest.test-seed#[E483A65CABC70E3E]) [    ] o.a.s.c.c.ConnectionManager Client is connected to ZooKeeper
   [junit4]   2> 251945 INFO  (TEST-RecoveryZkTest.test-seed#[E483A65CABC70E3E]) [    ] o.a.s.c.c.SolrZkClient Using default ZkACLProvider
   [junit4]   2> 252007 INFO  (TEST-RecoveryZkTest.test-seed#[E483A65CABC70E3E]) [    ] o.a.s.SolrTestCaseJ4 Writing core.properties file to /home/jenkins/workspace/Lucene-Solr-master-Linux/solr/build/solr-core/test/J2/temp/solr.cloud.RecoveryZkTest_E483A65CABC70E3E-001/control-001/cores/collection1
   [junit4]   2> 252010 INFO  (TEST-RecoveryZkTest.test-seed#[E483A65CABC70E3E]) [    ] o.e.j.s.Server jetty-9.3.8.v20160314
   [junit4]   2> 252011 INFO  (TEST-RecoveryZkTest.test-seed#[E483A65CABC70E3E]) [    ] o.e.j.s.h.ContextHandler Started o.e.j.s.ServletContextHandler@bd7493{/v,null,AVAILABLE}
   [junit4]   2> 252015 INFO  (TEST-RecoveryZkTest.test-seed#[E483A65CABC70E3E]) [    ] o.e.j.s.ServerConnector Started ServerConnector@1b34ac8{SSL,[ssl, http/1.1]}{127.0.0.1:34542}
   [junit4]   2> 252015 INFO  (TEST-RecoveryZkTest.test-seed#[E483A65CABC70E3E]) [    ] o.e.j.s.Server Started @253554ms
   [junit4]   2> 252015 INFO  (TEST-RecoveryZkTest.test-seed#[E483A65CABC70E3E]) [    ] o.a.s.c.s.e.JettySolrRunner Jetty properties: {solr.data.dir=/home/jenkins/workspace/Lucene-Solr-master-Linux/solr/build/solr-core/test/J2/temp/solr.cloud.RecoveryZkTest_E483A65CABC70E3E-001/tempDir-001/control/data, hostContext=/v, hostPort=34542, coreRootDirectory=/home/jenkins/workspace/Lucene-Solr-master-Linux/solr/build/solr-core/test/J2/temp/solr.cloud.RecoveryZkTest_E483A65CABC70E3E-001/control-001/cores}
   [junit4]   2> 252015 INFO  (TEST-RecoveryZkTest.test-seed#[E483A65CABC70E3E]) [    ] o.a.s.s.SolrDispatchFilter SolrDispatchFilter.init(): sun.misc.Launcher$AppClassLoader@1d16e93
   [junit4]   2> 252015 INFO  (TEST-RecoveryZkTest.test-seed#[E483A65CABC70E3E]) [    ] o.a.s.c.SolrResourceLoader new SolrResourceLoader for directory: '/home/jenkins/workspace/Lucene-Solr-master-Linux/solr/build/solr-core/test/J2/temp/solr.cloud.RecoveryZkTest_E483A65CABC70E3E-001/control-001'
   [junit4]   2> 252015 INFO  (TEST-RecoveryZkTest.test-seed#[E483A65CABC70E3E]) [    ] o.a.s.c.SolrResourceLoader JNDI not configured for solr (NoInitialContextEx)
   [junit4]   2> 252015 INFO  (TEST-RecoveryZkTest.test-seed#[E483A65CABC70E3E]) [    ] o.a.s.c.SolrResourceLoader solr home defaulted to 'solr/' (could not find system property or JNDI)
   [junit4]   2> 252015 INFO  (TEST-RecoveryZkTest.test-seed#[E483A65CABC70E3E]) [    ] o.a.s.c.c.SolrZkClient Using default ZkCredentialsProvider
   [junit4]   2> 252016 INFO  (TEST-RecoveryZkTest.test-seed#[E483A65CABC70E3E]) [    ] o.a.s.c.c.ConnectionManager Waiting for client to connect to ZooKeeper
   [junit4]   2> 252017 INFO  (zkCallback-237-thread-1) [    ] o.a.s.c.c.ConnectionManager Watcher org.apache.solr.common.cloud.ConnectionManager@1d04f29 name:ZooKeeperConnection Watcher:127.0.0.1:34273/solr got event WatchedEvent state:SyncConnected type:None path:null path:null type:None
   [junit4]   2> 252017 INFO  (TEST-RecoveryZkTest.test-seed#[E483A65CABC70E3E]) [    ] o.a.s.c.c.ConnectionManager Client is connected to ZooKeeper
   [junit4]   2> 252017 INFO  (TEST-RecoveryZkTest.test-seed#[E483A65CABC70E3E]) [    ] o.a.s.c.c.SolrZkClient Using default ZkACLProvider
   [junit4]   2> 252018 INFO  (TEST-RecoveryZkTest.test-seed#[E483A65CABC70E3E]) [    ] o.a.s.s.SolrDispatchFilter Loading solr.xml from SolrHome (not found in ZooKeeper)
   [junit4]   2> 252018 INFO  (TEST-RecoveryZkTest.test-seed#[E483A65CABC70E3E]) [    ] o.a.s.c.SolrXmlConfig Loading container configuration from /home/jenkins/workspace/Lucene-Solr-master-Linux/solr/build/solr-core/test/J2/temp/solr.cloud.RecoveryZkTest_E483A65CABC70E3E-001/control-001/solr.xml
   [junit4]   2> 252022 INFO  (TEST-RecoveryZkTest.test-seed#[E483A65CABC70E3E]) [    ] o.a.s.c.CorePropertiesLocator Config-defined core root directory: /home/jenkins/workspace/Lucene-Solr-master-Linux/solr/build/solr-core/test/J2/temp/solr.cloud.RecoveryZkTest_E483A65CABC70E3E-001/control-001/cores
   [junit4]   2> 252022 INFO  (TEST-RecoveryZkTest.test-seed#[E483A65CABC70E3E]) [    ] o.a.s.c.CoreContainer New CoreContainer 14571741
   [junit4]   2> 252022 INFO  (TEST-RecoveryZkTest.test-seed#[E483A65CABC70E3E]) [    ] o.a.s.c.CoreContainer Loading cores into CoreContainer [instanceDir=/home/jenkins/workspace/Lucene-Solr-master-Linux/solr/build/solr-core/test/J2/temp/solr.cloud.RecoveryZkTest_E483A65CABC70E3E-001/control-001]
   [junit4]   2> 252022 WARN  (TEST-RecoveryZkTest.test-seed#[E483A65CABC70E3E]) [    ] o.a.s.c.CoreContainer Couldn't add files from /home/jenkins/workspace/Lucene-Solr-master-Linux/solr/build/solr-core/test/J2/temp/solr.cloud.RecoveryZkTest_E483A65CABC70E3E-001/control-001/lib to classpath: /home/jenkins/workspace/Lucene-Solr-master-Linux/solr/build/solr-core/test/J2/temp/solr.cloud.RecoveryZkTest_E483A65CABC70E3E-001/control-001/lib
   [junit4]   2> 252023 INFO  (TEST-RecoveryZkTest.test-seed#[E483A65CABC70E3E]) [    ] o.a.s.h.c.HttpShardHandlerFactory created with socketTimeout : 90000,urlScheme : ,connTimeout : 15000,maxConnectionsPerHost : 20,maxConnections : 10000,corePoolSize : 0,maximumPoolSize : 2147483647,maxThreadIdleTime : 5,sizeOfQueue : -1,fairnessPolicy : false,
   [junit4]   2> 252024 INFO  (TEST-RecoveryZkTest.test-seed#[E483A65CABC70E3E]) [    ] o.a.s.u.UpdateShardHandler Creating UpdateShardHandler HTTP client with params: 
   [junit4]   2> 252026 INFO  (TEST-RecoveryZkTest.test-seed#[E483A65CABC70E3E]) [    ] o.a.s.l.LogWatcher SLF4J impl is org.slf4j.impl.Log4jLoggerFactory
   [junit4]   2> 252026 INFO  (TEST-RecoveryZkTest.test-seed#[E483A65CABC70E3E]) [    ] o.a.s.l.LogWatcher Registering Log Listener [Log4j (org.slf4j.impl.Log4jLoggerFactory)]
   [junit4]   2> 252026 INFO  (TEST-RecoveryZkTest.test-seed#[E483A65CABC70E3E]) [    ] o.a.s.c.ZkContainer Zookeeper client=127.0.0.1:34273/solr
   [junit4]   2> 252026 INFO  (TEST-RecoveryZkTest.test-seed#[E483A65CABC70E3E]) [    ] o.a.s.c.ZkController zkHost includes chroot
   [junit4]   2> 252026 INFO  (TEST-RecoveryZkTest.test-seed#[E483A65CABC70E3E]) [    ] o.a.s.c.c.SolrZkClient Using default ZkCredentialsProvider
   [junit4]   2> 252026 INFO  (TEST-RecoveryZkTest.test-seed#[E483A65CABC70E3E]) [    ] o.a.s.c.c.ConnectionManager Waiting for client to connect to ZooKeeper
   [junit4]   2> 252027 INFO  (zkCallback-240-thread-1) [    ] o.a.s.c.c.ConnectionManager Watcher org.apache.solr.common.cloud.ConnectionManager@dffd5e name:ZooKeeperConnection Watcher:127.0.0.1:34273 got event WatchedEvent state:SyncConnected type:None path:null path:null type:None
   [junit4]   2> 252028 INFO  (TEST-RecoveryZkTest.test-seed#[E483A65CABC70E3E]) [    ] o.a.s.c.c.ConnectionManager Client is connected to ZooKeeper
   [junit4]   2> 252028 INFO  (TEST-RecoveryZkTest.test-seed#[E483A65CABC70E3E]) [    ] o.a.s.c.c.SolrZkClient Using default ZkACLProvider
   [junit4]   2> 252029 INFO  (TEST-RecoveryZkTest.test-seed#[E483A65CABC70E3E]) [n:127.0.0.1:34542_v    ] o.a.s.c.ZkController Added new OnReconnect listener org.apache.solr.cloud.ZkController$$Lambda$10/10270780@d0d497
   [junit4]   2> 252029 INFO  (TEST-RecoveryZkTest.test-seed#[E483A65CABC70E3E]) [n:127.0.0.1:34542_v    ] o.a.s.c.c.ConnectionManager Waiting for client to connect to ZooKeeper
   [junit4]   2> 252030 INFO  (zkCallback-241-thread-1-processing-n:127.0.0.1:34542_v) [n:127.0.0.1:34542_v    ] o.a.s.c.c.ConnectionManager Watcher org.apache.solr.common.cloud.ConnectionManager@7969fc name:ZooKeeperConnection Watcher:127.0.0.1:34273/solr got event WatchedEvent state:SyncConnected type:None path:null path:null type:None
   [junit4]   2> 252030 INFO  (TEST-RecoveryZkTest.test-seed#[E483A65CABC70E3E]) [n:127.0.0.1:34542_v    ] o.a.s.c.c.ConnectionManager Client is connected to ZooKeeper
   [junit4]   2> 252031 INFO  (TEST-RecoveryZkTest.test-seed#[E483A65CABC70E3E]) [n:127.0.0.1:34542_v    ] o.a.s.c.c.SolrZkClient makePath: /overseer/queue
   [junit4]   2> 252032 INFO  (TEST-RecoveryZkTest.test-seed#[E483A65CABC70E3E]) [n:127.0.0.1:34542_v    ] o.a.s.c.c.SolrZkClient makePath: /overseer/collection-queue-work
   [junit4]   2> 252033 INFO  (TEST-RecoveryZkTest.test-seed#[E483A65CABC70E3E]) [n:127.0.0.1:34542_v    ] o.a.s.c.c.SolrZkClient makePath: /overseer/collection-map-running
   [junit4]   2> 252034 INFO  (TEST-RecoveryZkTest.test-seed#[E483A65CABC70E3E]) [n:127.0.0.1:34542_v    ] o.a.s.c.c.SolrZkClient makePath: /overseer/collection-map-completed
   [junit4]   2> 252035 INFO  (TEST-RecoveryZkTest.test-seed#[E483A65CABC70E3E]) [n:127.0.0.1:34542_v    ] o.a.s.c.c.SolrZkClient makePath: /overseer/collection-map-failure
   [junit4]   2> 252036 INFO  (TEST-RecoveryZkTest.test-seed#[E483A65CABC70E3E]) [n:127.0.0.1:34542_v    ] o.a.s.c.c.SolrZkClient makePath: /live_nodes
   [junit4]   2> 252038 INFO  (TEST-RecoveryZkTest.test-seed#[E483A65CABC70E3E]) [n:127.0.0.1:34542_v    ] o.a.s.c.c.SolrZkClient makePath: /aliases.json
   [junit4]   2> 252039 INFO  (TEST-RecoveryZkTest.test-seed#[E483A65CABC70E3E]) [n:127.0.0.1:34542_v    ] o.a.s.c.c.SolrZkClient makePath: /clusterstate.json
   [junit4]   2> 252039 INFO  (TEST-RecoveryZkTest.test-seed#[E483A65CABC70E3E]) [n:127.0.0.1:34542_v    ] o.a.s.c.c.SolrZkClient makePath: /security.json
   [junit4]   2> 252040 INFO  (TEST-RecoveryZkTest.test-seed#[E483A65CABC70E3E]) [n:127.0.0.1:34542_v    ] o.a.s.c.c.ZkStateReader Updating cluster state from ZooKeeper... 
   [junit4]   2> 252040 INFO  (TEST-RecoveryZkTest.test-seed#[E483A65CABC70E3E]) [n:127.0.0.1:34542_v    ] o.a.s.c.c.ZkStateReader Loaded cluster properties: {urlScheme=https}
   [junit4]   2> 252040 INFO  (TEST-RecoveryZkTest.test-seed#[E483A65CABC70E3E]) [n:127.0.0.1:34542_v    ] o.a.s.c.c.ZkStateReader Updated live nodes from ZooKeeper... (0) -> (0)
   [junit4]   2> 252042 INFO  (TEST-RecoveryZkTest.test-seed#[E483A65CABC70E3E]) [n:127.0.0.1:34542_v    ] o.a.s.c.c.SolrZkClient makePath: /overseer_elect
   [junit4]   2> 252042 INFO  (TEST-RecoveryZkTest.test-seed#[E483A65CABC70E3E]) [n:127.0.0.1:34542_v    ] o.a.s.c.c.SolrZkClient makePath: /overseer_elect/election
   [junit4]   2> 252043 INFO  (TEST-RecoveryZkTest.test-seed#[E483A65CABC70E3E]) [n:127.0.0.1:34542_v    ] o.a.s.c.Overseer Overseer (id=null) closing
   [junit4]   2> 252043 INFO  (TEST-RecoveryZkTest.test-seed#[E483A65CABC70E3E]) [n:127.0.0.1:34542_v    ] o.a.s.c.LeaderElector Joined leadership election with path: /overseer_elect/election/96038539272847365-127.0.0.1:34542_v-n_0000000000
   [junit4]   2> 252043 INFO  (TEST-RecoveryZkTest.test-seed#[E483A65CABC70E3E]) [n:127.0.0.1:34542_v    ] o.a.s.c.OverseerElectionContext I am going to be the leader 127.0.0.1:34542_v
   [junit4]   2> 252043 INFO  (TEST-RecoveryZkTest.test-seed#[E483A65CABC70E3E]) [n:127.0.0.1:34542_v    ] o.a.s.c.c.SolrZkClient makePath: /overseer_elect/leader
   [junit4]   2> 252044 INFO  (TEST-RecoveryZkTest.test-seed#[E483A65CABC70E3E]) [n:127.0.0.1:34542_v    ] o.a.s.c.Overseer Overseer (id=96038539272847365-127.0.0.1:34542_v-n_0000000000) starting
   [junit4]   2> 252045 INFO  (TEST-RecoveryZkTest.test-seed#[E483A65CABC70E3E]) [n:127.0.0.1:34542_v    ] o.a.s.c.c.SolrZkClient makePath: /overseer/queue-work
   [junit4]   2> 252047 INFO  (TEST-RecoveryZkTest.test-seed#[E483A65CABC70E3E]) [n:127.0.0.1:34542_v    ] o.a.s.c.OverseerAutoReplicaFailoverThread Starting OverseerAutoReplicaFailoverThread autoReplicaFailoverWorkLoopDelay=10000 autoReplicaFailoverWaitAfterExpiration=30000 autoReplicaFailoverBadNodeExpiration=60000
   [junit4]   2> 252047 INFO  (OverseerCollectionConfigSetProcessor-96038539272847365-127.0.0.1:34542_v-n_0000000000) [n:127.0.0.1:34542_v    ] o.a.s.c.OverseerTaskProcessor Process current queue of overseer operations
   [junit4]   2> 252048 INFO  (OverseerStateUpdate-96038539272847365-127.0.0.1:34542_v-n_0000000000) [n:127.0.0.1:34542_v    ] o.a.s.c.Overseer Starting to work on the main queue
   [junit4]   2> 252048 INFO  (TEST-RecoveryZkTest.test-seed#[E483A65CABC70E3E]) [n:127.0.0.1:34542_v    ] o.a.s.c.ZkController Register node as live in ZooKeeper:/live_nodes/127.0.0.1:34542_v
   [junit4]   2> 252049 INFO  (TEST-RecoveryZkTest.test-seed#[E483A65CABC70E3E]) [n:127.0.0.1:34542_v    ] o.a.s.c.c.SolrZkClient makePath: /live_nodes/127.0.0.1:34542_v
   [junit4]   2> 252050 INFO  (OverseerStateUpdate-96038539272847365-127.0.0.1:34542_v-n_0000000000) [n:127.0.0.1:34542_v    ] o.a.s.c.c.ZkStateReader Updated live nodes from ZooKeeper... (0) -> (0)
   [junit4]   2> 252050 INFO  (zkCallback-241-thread-1-processing-n:127.0.0.1:34542_v) [n:127.0.0.1:34542_v    ] o.a.s.c.c.ZkStateReader A live node change: [WatchedEvent state:SyncConnected type:NodeChildrenChanged path:/live_nodes], has occurred - updating... (live nodes size: [0])
   [junit4]   2> 252050 INFO  (zkCallback-241-thread-1-processing-n:127.0.0.1:34542_v) [n:127.0.0.1:34542_v    ] o.a.s.c.c.ZkStateReader Updated live nodes from ZooKeeper... (0) -> (1)
   [junit4]   2> 252069 INFO  (TEST-RecoveryZkTest.test-seed#[E483A65CABC70E3E]) [n:127.0.0.1:34542_v    ] o.a.s.c.CoreContainer Security conf doesn't exist. Skipping setup for authorization module.
   [junit4]   2> 252069 INFO  (TEST-RecoveryZkTest.test-seed#[E483A65CABC70E3E]) [n:127.0.0.1:34542_v    ] o.a.s.c.CoreContainer No authentication plugin used.
   [junit4]   2> 252070 INFO  (TEST-RecoveryZkTest.test-seed#[E483A65CABC70E3E]) [n:127.0.0.1:34542_v    ] o.a.s.c.CorePropertiesLocator Looking for core definitions underneath /home/jenkins/workspace/Lucene-Solr-master-Linux/solr/build/solr-core/test/J2/temp/solr.cloud.RecoveryZkTest_E483A65CABC70E3E-001/control-001/cores
   [junit4]   2> 252070 INFO  (TEST-RecoveryZkTest.test-seed#[E483A65CABC70E3E]) [n:127.0.0.1:34542_v    ] o.a.s.c.CoreDescriptor Created CoreDescriptor: {name=collection1, config=solrconfig.xml, transient=false, schema=schema.xml, loadOnStartup=true, configSetProperties=configsetprops.json, collection=control_collection, coreNodeName=, dataDir=data/, shard=}
   [junit4]   2> 252070 INFO  (TEST-RecoveryZkTest.test-seed#[E483A65CABC70E3E]) [n:127.0.0.1:34542_v    ] o.a.s.c.CorePropertiesLocator Found core collection1 in /home/jenkins/workspace/Lucene-Solr-master-Linux/solr/build/solr-core/test/J2/temp/solr.cloud.RecoveryZkTest_E483A65CABC70E3E-001/control-001/cores/collection1
   [junit4]   2> 252071 INFO  (TEST-RecoveryZkTest.test-seed#[E483A65CABC70E3E]) [n:127.0.0.1:34542_v    ] o.a.s.c.CorePropertiesLocator Found 1 core definitions
   [junit4]   2> 252071 INFO  (coreLoadExecutor-764-thread-1-processing-n:127.0.0.1:34542_v) [n:127.0.0.1:34542_v c:control_collection   x:collection1] o.a.s.c.ZkController publishing state=down
   [junit4]   2> 252071 INFO  (coreLoadExecutor-764-thread-1-processing-n:127.0.0.1:34542_v) [n:127.0.0.1:34542_v c:control_collection   x:collection1] o.a.s.c.ZkController numShards not found on descriptor - reading it from system property
   [junit4]   2> 252071 INFO  (TEST-RecoveryZkTest.test-seed#[E483A65CABC70E3E]) [n:127.0.0.1:34542_v    ] o.a.s.s.SolrDispatchFilter user.dir=/home/jenkins/workspace/Lucene-Solr-master-Linux/solr/build/solr-core/test/J2
   [junit4]   2> 252071 INFO  (TEST-RecoveryZkTest.test-seed#[E483A65CABC70E3E]) [n:127.0.0.1:34542_v    ] o.a.s.s.SolrDispatchFilter SolrDispatchFilter.init() done
   [junit4]   2> 252072 INFO  (coreLoadExecutor-764-thread-1-processing-n:127.0.0.1:34542_v) [n:127.0.0.1:34542_v c:control_collection   x:collection1] o.a.s.c.ZkController Collection control_collection not visible yet, but flagging it so a watch is registered when it becomes visible
   [junit4]   2> 252072 INFO  (OverseerStateUpdate-96038539272847365-127.0.0.1:34542_v-n_0000000000) [n:127.0.0.1:34542_v    ] o.a.s.c.Overseer processMessage: queueSize: 1, message = {
   [junit4]   2>   "core":"collection1",
   [junit4]   2>   "roles":null,
   [junit4]   2>   "base_url":"https://127.0.0.1:34542/v",
   [junit4]   2>   "node_name":"127.0.0.1:34542_v",
   [junit4]   2>   "numShards":"1",
   [junit4]   2>   "state":"down",
   [junit4]   2>   "shard":null,
   [junit4]   2>   "collection":"control_collection",
   [junit4]   2>   "operation":"state"} current state version: 0
   [junit4]   2> 252073 INFO  (coreLoadExecutor-764-thread-1-processing-n:127.0.0.1:34542_v) [n:127.0.0.1:34542_v c:control_collection   x:collection1] o.a.s.c.c.ZkStateReader Deleting data for [control_collection]
   [junit4]   2> 252073 INFO  (OverseerStateUpdate-96038539272847365-127.0.0.1:34542_v-n_0000000000) [n:127.0.0.1:34542_v    ] o.a.s.c.o.ReplicaMutator Update state numShards=1 message={
   [junit4]   2>   "core":"collection1",
   [junit4]   2>   "roles":null,
   [junit4]   2>   "base_url":"https://127.0.0.1:34542/v",
   [junit4]   2>   "node_name":"127.0.0.1:34542_v",
   [junit4]   2>   "numShards":"1",
   [junit4]   2>   "state":"down",
   [junit4]   2>   "shard":null,
   [junit4]   2>   "collection":"control_collection",
   [junit4]   2>   "operation":"state"}
   [junit4]   2> 252073 INFO  (OverseerStateUpdate-96038539272847365-127.0.0.1:34542_v-n_0000000000) [n:127.0.0.1:34542_v    ] o.a.s.c.o.ClusterStateMutator building a new cName: control_collection
   [junit4]   2> 252073 INFO  (coreLoadExecutor-764-thread-1-processing-n:127.0.0.1:34542_v) [n:127.0.0.1:34542_v c:control_collection   x:collection1] o.a.s.c.ZkController look for our core node name
   [junit4]   2> 252073 INFO  (OverseerStateUpdate-96038539272847365-127.0.0.1:34542_v-n_0000000000) [n:127.0.0.1:34542_v    ] o.a.s.c.o.ReplicaMutator Assigning new node to shard shard=shard1
   [junit4]   2> 252074 INFO  (zkCallback-241-thread-1-processing-n:127.0.0.1:34542_v) [n:127.0.0.1:34542_v    ] o.a.s.c.c.ZkStateReader A cluster state change: [WatchedEvent state:SyncConnected type:NodeDataChanged path:/clusterstate.json], has occurred - updating... (live nodes size: [1])
   [junit4]   2> 253073 INFO  (coreLoadExecutor-764-thread-1-processing-n:127.0.0.1:34542_v) [n:127.0.0.1:34542_v c:control_collection   x:collection1] o.a.s.c.ZkController waiting to find shard id in clusterstate for collection1
   [junit4]   2> 253073 INFO  (coreLoadExecutor-764-thread-1-processing-n:127.0.0.1:34542_v) [n:127.0.0.1:34542_v c:control_collection   x:collection1] o.a.s.c.ZkController Check for collection zkNode:control_collection
   [junit4]   2> 253074 INFO  (coreLoadExecutor-764-thread-1-processing-n:127.0.0.1:34542_v) [n:127.0.0.1:34542_v c:control_collection   x:collection1] o.a.s.c.ZkController Collection zkNode exists
   [junit4]   2> 253074 INFO  (coreLoadExecutor-764-thread-1-processing-n:127.0.0.1:34542_v) [n:127.0.0.1:34542_v c:control_collection   x:collection1] o.a.s.c.c.ZkStateReader Load collection config from: [/collections/control_collection]
   [junit4]   2> 253074 INFO  (coreLoadExecutor-764-thread-1-processing-n:127.0.0.1:34542_v) [n:127.0.0.1:34542_v c:control_collection   x:collection1] o.a.s.c.c.ZkStateReader path=[/collections/control_collection] [configName]=[conf1] specified config exists in ZooKeeper
   [junit4]   2> 253074 INFO  (coreLoadExecutor-764-thread-1-processing-n:127.0.0.1:34542_v) [n:127.0.0.1:34542_v c:control_collection   x:collection1] o.a.s.c.SolrResourceLoader new SolrResourceLoader for directory: '/home/jenkins/workspace/Lucene-Solr-master-Linux/solr/build/solr-core/test/J2/temp/solr.cloud.RecoveryZkTest_E483A65CABC70E3E-001/control-001/cores/collection1'
   [junit4]   2> 253074 INFO  (coreLoadExecutor-764-thread-1-processing-n:127.0.0.1:34542_v) [n:127.0.0.1:34542_v c:control_collection   x:collection1] o.a.s.c.SolrResourceLoader JNDI not configured for solr (NoInitialContextEx)
   [junit4]   2> 253075 INFO  (coreLoadExecutor-764-thread-1-processing-n:127.0.0.1:34542_v) [n:127.0.0.1:34542_v c:control_collection   x:collection1] o.a.s.c.SolrResourceLoader solr home defaulted to 'solr/' (could not find system property or JNDI)
   [junit4]   2> 253076 INFO  (coreLoadExecutor-764-thread-1-processing-n:127.0.0.1:34542_v) [n:127.0.0.1:34542_v c:control_collection   x:collection1] o.a.s.c.Config loaded config solrconfig.xml with version 0 
   [junit4]   2> 253081 INFO  (coreLoadExecutor-764-thread-1-processing-n:127.0.0.1:34542_v) [n:127.0.0.1:34542_v c:control_collection   x:collection1] o.a.s.c.SolrConfig current version of requestparams : -1
   [junit4]   2> 253086 INFO  (coreLoadExecutor-764-thread-1-processing-n:127.0.0.1:34542_v) [n:127.0.0.1:34542_v c:control_collection   x:collection1] o.a.s.c.SolrConfig Using Lucene MatchVersion: 7.0.0
   [junit4]   2> 253095 INFO  (coreLoadExecutor-764-thread-1-processing-n:127.0.0.1:34542_v) [n:127.0.0.1:34542_v c:control_collection   x:collection1] o.a.s.c.SolrConfig Loaded SolrConfig: solrconfig.xml
   [junit4]   2> 253099 INFO  (coreLoadExecutor-764-thread-1-processing-n:127.0.0.1:34542_v) [n:127.0.0.1:34542_v c:control_collection   x:collection1] o.a.s.s.IndexSchema [collection1] Schema name=test
   [junit4]   2> 253166 INFO  (coreLoadExecutor-764-thread-1-processing-n:127.0.0.1:34542_v) [n:127.0.0.1:34542_v c:control_collection   x:collection1] o.a.s.s.IndexSchema default search field in schema is text
   [junit4]   2> 253167 INFO  (coreLoadExecutor-764-thread-1-processing-n:127.0.0.1:34542_v) [n:127.0.0.1:34542_v c:control_collection   x:collection1] o.a.s.s.IndexSchema unique key field: id
   [junit4]   2> 253168 INFO  (coreLoadExecutor-764-thread-1-processing-n:127.0.0.1:34542_v) [n:127.0.0.1:34542_v c:control_collection   x:collection1] o.a.s.s.FileExchangeRateProvider Reloading exchange rates from file currency.xml
   [junit4]   2> 253170 INFO  (coreLoadExecutor-764-thread-1-processing-n:127.0.0.1:34542_v) [n:127.0.0.1:34542_v c:control_collection   x:collection1] o.a.s.s.FileExchangeRateProvider Reloading exchange rates from file currency.xml
   [junit4]   2> 253182 INFO  (coreLoadExecutor-764-thread-1-processing-n:127.0.0.1:34542_v) [n:127.0.0.1:34542_v c:control_collection   x:collection1] o.a.s.c.ConfigSetProperties Did not find ConfigSet properties, assuming default properties: Can't find resource 'configsetprops.json' in classpath or '/configs/conf1', cwd=/home/jenkins/workspace/Lucene-Solr-master-Linux/solr/build/solr-core/test/J2
   [junit4]   2> 253182 INFO  (coreLoadExecutor-764-thread-1-processing-n:127.0.0.1:34542_v) [n:127.0.0.1:34542_v c:control_collection   x:collection1] o.a.s.c.CoreContainer Creating SolrCore 'collection1' using configuration from collection control_collection
   [junit4]   2> 253182 INFO  (coreLoadExecutor-764-thread-1-processing-n:127.0.0.1:34542_v) [n:127.0.0.1:34542_v c:control_collection s:shard1 r:core_node1 x:collection1] o.a.s.c.SolrCore org.apache.solr.core.MockDirectoryFactory
   [junit4]   2> 253182 INFO  (coreLoadExecutor-764-thread-1-processing-n:127.0.0.1:34542_v) [n:127.0.0.1:34542_v c:control_collection s:shard1 r:core_node1 x:collection1] o.a.s.c.SolrCore [[collection1] ] Opening new SolrCore at [/home/jenkins/workspace/Lucene-Solr-master-Linux/solr/build/solr-core/test/J2/temp/solr.cloud.RecoveryZkTest_E483A65CABC70E3E-001/control-001/cores/collection1], dataDir=[/home/jenkins/workspace/Lucene-Solr-master-Linux/solr/build/solr-core/test/J2/temp/solr.cloud.RecoveryZkTest_E483A65CABC70E3E-001/control-001/cores/collection1/data/]
   [junit4]   2> 253182 INFO  (coreLoadExecutor-764-thread-1-processing-n:127.0.0.1:34542_v) [n:127.0.0.1:34542_v c:control_collection s:shard1 r:core_node1 x:collection1] o.a.s.c.JmxMonitoredMap JMX monitoring is enabled. Adding Solr mbeans to JMX Server: com.sun.jmx.mbeanserver.JmxMBeanServer@58a21a
   [junit4]   2> 253183 INFO  (coreLoadExecutor-764-thread-1-processing-n:127.0.0.1:34542_v) [n:127.0.0.1:34542_v c:control_collection s:shard1 r:core_node1 x:collection1] o.a.s.c.CachingDirectoryFactory return new directory for /home/jenkins/workspace/Lucene-Solr-master-Linux/solr/build/solr-core/test/J2/temp/solr.cloud.RecoveryZkTest_E483A65CABC70E3E-001/control-001/cores/collection1/data
   [junit4]   2> 253183 INFO  (coreLoadExecutor-764-thread-1-processing-n:127.0.0.1:34542_v) [n:127.0.0.1:34542_v c:control_collection s:shard1 r:core_node1 x:collection1] o.a.s.c.SolrCore New index directory detected: old=null new=/home/jenkins/workspace/Lucene-Solr-master-Linux/solr/build/solr-core/test/J2/temp/solr.cloud.RecoveryZkTest_E483A65CABC70E3E-001/control-001/cores/collection1/data/index/
   [junit4]   2> 253183 WARN  (coreLoadExecutor-764-thread-1-processing-n:127.0.0.1:34542_v) [n:127.0.0.1:34542_v c:control_collection s:shard1 r:core_node1 x:collection1] o.a.s.c.SolrCore [collection1] Solr index directory '/home/jenkins/workspace/Lucene-Solr-master-Linux/solr/build/solr-core/test/J2/temp/solr.cloud.RecoveryZkTest_E483A65CABC70E3E-001/control-001/cores/collection1/data/index' doesn't exist. Creating new index...
   [junit4]   2> 253183 INFO  (coreLoadExecutor-764-thread-1-processing-n:127.0.0.1:34542_v) [n:127.0.0.1:34542_v c:control_collection s:shard1 r:core_node1 x:collection1] o.a.s.c.CachingDirectoryFactory return new directory for /home/jenkins/workspace/Lucene-Solr-master-Linux/solr/build/solr-core/test/J2/temp/solr.cloud.RecoveryZkTest_E483A65CABC70E3E-001/control-001/cores/collection1/data/index
   [junit4]   2> 253184 INFO  (coreLoadExecutor-764-thread-1-processing-n:127.0.0.1:34542_v) [n:127.0.0.1:34542_v c:control_collection s:shard1 r:core_node1 x:collection1] o.a.s.u.RandomMergePolicy RandomMergePolicy wrapping class org.apache.lucene.index.AlcoholicMergePolicy: [AlcoholicMergePolicy: minMergeSize=0, mergeFactor=10, maxMergeSize=848888079, maxMergeSizeForForcedMerge=9223372036854775807, calibrateSizeByDeletes=true, maxMergeDocs=2147483647, maxCFSSegmentSizeMB=8.796093022207999E12, noCFSRatio=0.1]
   [junit4]   2> 253184 INFO  (coreLoadExecutor-764-thread-1-processing-n:127.0.0.1:34542_v) [n:127.0.0.1:34542_v c:control_collection s:shard1 r:core_node1 x:collection1] o.a.s.c.SolrDeletionPolicy SolrDeletionPolicy.onCommit: commits: num=1
   [junit4]   2> 	commit{dir=MockDirectoryWrapper(RAMDirectory@738d8e lockFactory=org.apache.lucene.store.SingleInstanceLockFactory@9e1de1),segFN=segments_1,generation=1}
   [junit4]   2> 253184 INFO  (coreLoadExecutor-764-thread-1-processing-n:127.0.0.1:34542_v) [n:127.0.0.1:34542_v c:control_collection s:shard1 r:core_node1 x:collection1] o.a.s.c.SolrDeletionPolicy newest commit generation = 1
   [junit4]   2> 253184 INFO  (OldIndexDirectoryCleanupThreadForCore-collection1) [n:127.0.0.1:34542_v c:control_collection s:shard1 r:core_node1 x:collection1] o.a.s.c.SolrCore Looking for old index directories to cleanup for core collection1 in /home/jenkins/workspace/Lucene-Solr-master-Linux/solr/build/solr-core/test/J2/temp/solr.cloud.RecoveryZkTest_E483A65CABC70E3E-001/control-001/cores/collection1/data/
   [junit4]   2> 253185 WARN  (OldIndexDirectoryCleanupThreadForCore-collection1) [n:127.0.0.1:34542_v c:control_collection s:shard1 r:core_node1 x:collection1] o.a.s.c.DirectoryFactory /home/jenkins/workspace/Lucene-Solr-master-Linux/solr/build/solr-core/test/J2/temp/solr.cloud.RecoveryZkTest_E483A65CABC70E3E-001/control-001/cores/collection1/data/ does not point to a valid data directory; skipping clean-up of old index directories.
   [junit4]   2> 253190 INFO  (coreLoadExecutor-764-thread-1-processing-n:127.0.0.1:34542_v) [n:127.0.0.1:34542_v c:control_collection s:shard1 r:core_node1 x:collection1] o.a.s.u.p.UpdateRequestProcessorChain creating updateRequestProcessorChain "nodistrib"
   [junit4]   2> 253190 INFO  (coreLoadExecutor-764-thread-1-processing-n:127.0.0.1:34542_v) [n:127.0.0.1:34542_v c:control_collection s:shard1 r:core_node1 x:collection1] o.a.s.u.p.UpdateRequestProcessorChain creating updateRequestProcessorChain "dedupe"
   [junit4]   2> 253191 INFO  (coreLoadExecutor-764-thread-1-processing-n:127.0.0.1:34542_v) [n:127.0.0.1:34542_v c:control_collection s:shard1 r:core_node1 x:collection1] o.a.s.u.p.UpdateRequestProcessorChain inserting DistributedUpdateProcessorFactory into updateRequestProcessorChain "dedupe"
   [junit4]   2> 253191 INFO  (coreLoadExecutor-764-thread-1-processing-n:127.0.0.1:34542_v) [n:127.0.0.1:34542_v c:control_collection s:shard1 r:core_node1 x:collection1] o.a.s.u.p.UpdateRequestProcessorChain creating updateRequestProcessorChain "stored_sig"
   [junit4]   2> 253191 INFO  (coreLoadExecutor-764-thread-1-processing-n:127.0.0.1:34542_v) [n:127.0.0.1:34542_v c:control_collection s:shard1 r:core_node1 x:collection1] o.a.s.u.p.UpdateRequestProcessorChain inserting DistributedUpdateProcessorFactory into updateRequestProcessorChain "stored_sig"
   [junit4]   2> 253191 INFO  (coreLoadExecutor-764-thread-1-processing-n:127.0.0.1:34542_v) [n:127.0.0.1:34542_v c:control_collection s:shard1 r:core_node1 x:collection1] o.a.s.u.p.UpdateRequestProcessorChain creating updateRequestProcessorChain "distrib-dup-test-chain-explicit"
   [junit4]   2> 253191 INFO  (coreLoadExecutor-764-thread-1-processing-n:127.0.0.1:34542_v) [n:127.0.0.1:34542_v c:control_collection s:shard1 r:core_node1 x:collection1] o.a.s.u.p.UpdateRequestProcessorChain creating updateRequestProcessorChain "distrib-dup-test-chain-implicit"
   [junit4]   2> 253191 INFO  (coreLoadExecutor-764-thread-1-processing-n:127.0.0.1:34542_v) [n:127.0.0.1:34542_v c:control_collection s:shard1 r:core_node1 x:collection1] o.a.s.u.p.UpdateRequestProcessorChain inserting DistributedUpdateProcessorFactory into updateRequestProcessorChain "distrib-dup-test-chain-implicit"
   [junit4]   2> 253191 INFO  (coreLoadExecutor-764-thread-1-processing-n:127.0.0.1:34542_v) [n:127.0.0.1:34542_v c:control_collection s:shard1 r:core_node1 x:collection1] o.a.s.c.SolrCore no updateRequestProcessorChain defined as default, creating implicit default
   [junit4]   2> 253192 WARN  (coreLoadExecutor-764-thread-1-processing-n:127.0.0.1:34542_v) [n:127.0.0.1:34542_v c:control_collection s:shard1 r:core_node1 x:collection1] o.a.s.c.RequestHandlers INVALID paramSet a in requestHandler {type = requestHandler,name = /dump,class = DumpRequestHandler,args = {defaults={a=A,b=B}}}
   [junit4]   2> 253193 INFO  (coreLoadExecutor-764-thread-1-processing-n:127.0.0.1:34542_v) [n:127.0.0.1:34542_v c:control_collection s:shard1 r:core_node1 x:collection1] o.a.s.h.l.XMLLoader xsltCacheLifetimeSeconds=60
   [junit4]   2> 253194 INFO  (coreLoadExecutor-764-thread-1-processing-n:127.0.0.1:34542_v) [n:127.0.0.1:34542_v c:control_collection s:shard1 r:core_node1 x:collection1] o.a.s.h.l.XMLLoader xsltCacheLifetimeSeconds=60
   [junit4]   2> 253195 INFO  (coreLoadExecutor-764-thread-1-processing-n:127.0.0.1:34542_v) [n:127.0.0.1:34542_v c:control_collection s:shard1 r:core_node1 x:collection1] o.a.s.h.l.XMLLoader xsltCacheLifetimeSeconds=60
   [junit4]   2> 253197 INFO  (coreLoadExecutor-764-thread-1-processing-n:127.0.0.1:34542_v) [n:127.0.0.1:34542_v c:control_collection s:shard1 r:core_node1 x:collection1] o.a.s.h.l.XMLLoader xsltCacheLifetimeSeconds=60
   [junit4]   2> 253204 INFO  (coreLoadExecutor-764-thread-1-processing-n:127.0.0.1:34542_v) [n:127.0.0.1:34542_v c:control_collection s:shard1 r:core_node1 x:collection1] o.a.s.c.RequestHandlers Registered paths: /admin/mbeans,standard,/update/json/docs,/admin/luke,/export,/get,/admin/properties,/update/json,/admin/threads,/dump,/update/csv,/sql,/graph,/admin/segments,/admin/system,/replication,/config,/stream,/schema,/admin/plugins,/admin/logging,/admin/ping,/update,/admin/file
   [junit4]   2> 253204 INFO  (coreLoadExecutor-764-thread-1-processing-n:127.0.0.1:34542_v) [n:127.0.0.1:34542_v c:control_collection s:shard1 r:core_node1 x:collection1] o.a.s.c.SolrCore Using default statsCache cache: org.apache.solr.search.stats.LocalStatsCache
   [junit4]   2> 253205 INFO  (coreLoadExecutor-764-thread-1-processing-n:127.0.0.1:34542_v) [n:127.0.0.1:34542_v c:control_collection s:shard1 r:core_node1 x:collection1] o.a.s.u.UpdateHandler Using UpdateLog implementation: org.apache.solr.update.UpdateLog
   [junit4]   2> 253205 INFO  (coreLoadExecutor-764-thread-1-processing-n:127.0.0.1:34542_v) [n:127.0.0.1:34542_v c:control_collection s:shard1 r:core_node1 x:collection1] o.a.s.u.UpdateLog Initializing UpdateLog: dataDir= defaultSyncLevel=FLUSH numRecordsToKeep=100 maxNumLogsToKeep=10 numVersionBuckets=65536
   [junit4]   2> 253205 INFO  (coreLoadExecutor-764-thread-1-processing-n:127.0.0.1:34542_v) [n:127.0.0.1:34542_v c:control_collection s:shard1 r:core_node1 x:collection1] o.a.s.u.CommitTracker Hard AutoCommit: disabled
   [junit4]   2> 253205 INFO  (coreLoadExecutor-764-thread-1-processing-n:127.0.0.1:34542_v) [n:127.0.0.1:34542_v c:control_collection s:shard1 r:core_node1 x:collection1] o.a.s.u.CommitTracker Soft AutoCommit: disabled
   [junit4]   2> 253206 INFO  (coreLoadExecutor-764-thread-1-processing-n:127.0.0.1:34542_v) [n:127.0.0.1:34542_v c:control_collection s:shard1 r:core_node1 x:collection1] o.a.s.u.RandomMergePolicy RandomMergePolicy wrapping class org.apache.lucene.index.TieredMergePolicy: [TieredMergePolicy: maxMergeAtOnce=28, maxMergeAtOnceExplicit=33, maxMergedSegmentMB=81.8056640625, floorSegmentMB=0.4072265625, forceMergeDeletesPctAllowed=29.95055149808739, segmentsPerTier=13.0, maxCFSSegmentSizeMB=8.796093022207999E12, noCFSRatio=0.4211043388725324
   [junit4]   2> 253206 INFO  (coreLoadExecutor-764-thread-1-processing-n:127.0.0.1:34542_v) [n:127.0.0.1:34542_v c:control_collection s:shard1 r:core_node1 x:collection1] o.a.s.c.SolrDeletionPolicy SolrDeletionPolicy.onInit: commits: num=1
   [junit4]   2> 	commit{dir=MockDirectoryWrapper(RAMDirectory@738d8e lockFactory=org.apache.lucene.store.SingleInstanceLockFactory@9e1de1),segFN=segments_1,generation=1}
   [junit4]   2> 253206 INFO  (coreLoadExecutor-764-thread-1-processing-n:127.0.0.1:34542_v) [n:127.0.0.1:34542_v c:control_collection s:shard1 r:core_node1 x:collection1] o.a.s.c.SolrDeletionPolicy newest commit generation = 1
   [junit4]   2> 253207 INFO  (coreLoadExecutor-764-thread-1-processing-n:127.0.0.1:34542_v) [n:127.0.0.1:34542_v c:control_collection s:shard1 r:core_node1 x:collection1] o.a.s.s.SolrIndexSearcher Opening [Searcher@1aa165d[collection1] main]
   [junit4]   2> 253207 INFO  (coreLoadExecutor-764-thread-1-processing-n:127.0.0.1:34542_v) [n:127.0.0.1:34542_v c:control_collection s:shard1 r:core_node1 x:collection1] o.a.s.c.c.ZkStateReader Load collection config from: [/collections/control_collection]
   [junit4]   2> 253207 INFO  (coreLoadExecutor-764-thread-1-processing-n:127.0.0.1:34542_v) [n:127.0.0.1:34542_v c:control_collection s:shard1 r:core_node1 x:collection1] o.a.s.c.c.ZkStateReader path=[/collections/control_collection] [configName]=[conf1] specified config exists in ZooKeeper
   [junit4]   2> 253207 INFO  (coreLoadExecutor-764-thread-1-processing-n:127.0.0.1:34542_v) [n:127.0.0.1:34542_v c:control_collection s:shard1 r:core_node1 x:collection1] o.a.s.r.ManagedResourceStorage Setting up ZooKeeper-based storage for the RestManager with znodeBase: /configs/conf1
   [junit4]   2> 253207 INFO  (coreLoadExecutor-764-thread-1-processing-n:127.0.0.1:34542_v) [n:127.0.0.1:34542_v c:control_collection s:shard1 r:core_node1 x:collection1] o.a.s.r.ManagedResourceStorage Configured ZooKeeperStorageIO with znodeBase: /configs/conf1
   [junit4]   2> 253207 INFO  (coreLoadExecutor-764-thread-1-processing-n:127.0.0.1:34542_v) [n:127.0.0.1:34542_v c:control_collection s:shard1 r:core_node1 x:collection1] o.a.s.r.RestManager Initializing RestManager with initArgs: {}
   [junit4]   2> 253208 INFO  (coreLoadExecutor-764-thread-1-processing-n:127.0.0.1:34542_v) [n:127.0.0.1:34542_v c:control_collection s:shard1 r:core_node1 x:collection1] o.a.s.r.ManagedResourceStorage Reading _rest_managed.json using ZooKeeperStorageIO:path=/configs/conf1
   [junit4]   2> 253208 INFO  (coreLoadExecutor-764-thread-1-processing-n:127.0.0.1:34542_v) [n:127.0.0.1:34542_v c:control_collection s:shard1 r:core_node1 x:collection1] o.a.s.r.ManagedResourceStorage No data found for znode /configs/conf1/_rest_managed.json
   [junit4]   2> 253208 INFO  (coreLoadExecutor-764-thread-1-processing-n:127.0.0.1:34542_v) [n:127.0.0.1:34542_v c:control_collection s:shard1 r:core_node1 x:collection1] o.a.s.r.ManagedResourceStorage Loaded null at path _rest_managed.json using ZooKeeperStorageIO:path=/configs/conf1
   [junit4]   2> 253208 INFO  (coreLoadExecutor-764-thread-1-processing-n:127.0.0.1:34542_v) [n:127.0.0.1:34542_v c:control_collection s:shard1 r:core_node1 x:collection1] o.a.s.r.RestManager Initializing 0 registered ManagedResources
   [junit4]   2> 253208 INFO  (coreLoadExecutor-764-thread-1-processing-n:127.0.0.1:34542_v) [n:127.0.0.1:34542_v c:control_collection s:shard1 r:core_node1 x:collection1] o.a.s.h.ReplicationHandler Commits will be reserved for  10000
   [junit4]   2> 253210 INFO  (searcherExecutor-765-thread-1-processing-n:127.0.0.1:34542_v x:collection1 s:shard1 c:control_collection r:core_node1) [n:127.0.0.1:34542_v c:control_collection s:shard1 r:core_node1 x:collection1] o.a.s.c.SolrCore [collection1] Registered new searcher Searcher@1aa165d[collection1] main{ExitableDirectoryReader(UninvertingDirectoryReader())}
   [junit4]   2> 253210 INFO  (coreLoadExecutor-764-thread-1-processing-n:127.0.0.1:34542_v) [n:127.0.0.1:34542_v c:control_collection s:shard1 r:core_node1 x:collection1] o.a.s.u.UpdateLog Looking up max value of version field to seed version buckets
   [junit4]   2> 253210 INFO  (coreLoadExecutor-764-thread-1-processing-n:127.0.0.1:34542_v) [n:127.0.0.1:34542_v c:control_collection s:shard1 r:core_node1 x:collection1] o.a.s.u.VersionInfo Refreshing highest value of _version_ for 65536 version buckets from index
   [junit4]   2> 253210 INFO  (coreLoadExecutor-764-thread-1-processing-n:127.0.0.1:34542_v) [n:127.0.0.1:34542_v c:control_collection s:shard1 r:core_node1 x:collection1] o.a.s.u.VersionInfo No terms found for _version_, cannot seed version bucket highest value from index
   [junit4]   2> 253210 INFO  (coreLoadExecutor-764-thread-1-processing-n:127.0.0.1:34542_v) [n:127.0.0.1:34542_v c:control_collection s:shard1 r:core_node1 x:collection1] o.a.s.u.UpdateLog Could not find max version in index or recent updates, using new clock 1536616629823078400
   [junit4]   2> 253211 INFO  (coreLoadExecutor-764-thread-1-processing-n:127.0.0.1:34542_v) [n:127.0.0.1:34542_v c:control_collection s:shard1 r:core_node1 x:collection1] o.a.s.u.UpdateLog Took 1.0ms to seed version buckets with highest version 1536616629823078400
   [junit4]   2> 253211 INFO  (coreLoadExecutor-764-thread-1-processing-n:127.0.0.1:34542_v) [n:127.0.0.1:34542_v c:control_collection s:shard1 r:core_node1 x:collection1] o.a.s.c.ZkController watch zkdir /configs/conf1
   [junit4]   2> 253212 INFO  (coreLoadExecutor-764-thread-1-processing-n:127.0.0.1:34542_v) [n:127.0.0.1:34542_v c:control_collection s:shard1 r:core_node1 x:collection1] o.a.s.c.CoreContainer registering core: collection1
   [junit4]   2> 253212 INFO  (coreZkRegister-758-thread-1-processing-n:127.0.0.1:34542_v x:collection1 s:shard1 c:control_collection r:core_node1) [n:127.0.0.1:34542_v c:control_collection s:shard1 r:core_node1 x:collection1] o.a.s.c.ZkController Register replica - core:collection1 address:https://127.0.0.1:34542/v collection:control_collection shard:shard1
   [junit4]   2> 253213 INFO  (coreZkRegister-758-thread-1-processing-n:127.0.0.1:34542_v x:collection1 s:shard1 c:control_collection r:core_node1) [n:127.0.0.1:34542_v c:control_collection s:shard1 r:core_node1 x:collection1] o.a.s.c.c.SolrZkClient makePath: /collections/control_collection/leader_elect/shard1/election
   [junit4]   2> 253214 INFO  (coreZkRegister-758-thread-1-processing-n:127.0.0.1:34542_v x:collection1 s:shard1 c:control_collection r:core_node1) [n:127.0.0.1:34542_v c:control_collection s:shard1 r:core_node1 x:collection1] o.a.s.c.LeaderElector Joined leadership election with path: /collections/control_collection/leader_elect/shard1/election/96038539272847365-core_node1-n_0000000000
   [junit4]   2> 253215 INFO  (coreZkRegister-758-thread-1-processing-n:127.0.0.1:34542_v x:collection1 s:shard1 c:control_collection r:core_node1) [n:127.0.0.1:34542_v c:control_collection s:shard1 r:core_node1 x:collection1] o.a.s.c.ShardLeaderElectionContext Running the leader process for shard=shard1 and weAreReplacement=false and leaderVoteWait=10000
   [junit4]   2> 253216 INFO  (coreZkRegister-758-thread-1-processing-n:127.0.0.1:34542_v x:collection1 s:shard1 c:control_collection r:core_node1) [n:127.0.0.1:34542_v c:control_collection s:shard1 r:core_node1 x:collection1] o.a.s.c.ShardLeaderElectionContext Enough replicas found to continue.
   [junit4]   2> 253216 INFO  (coreZkRegister-758-thread-1-processing-n:127.0.0.1:34542_v x:collection1 s:shard1 c:control_collection r:core_node1) [n:127.0.0.1:34542_v c:control_collection s:shard1 r:core_node1 x:collection1] o.a.s.c.ShardLeaderElectionContext I may be the new leader - try and sync
   [junit4]   2> 253216 INFO  (coreZkRegister-758-thread-1-processing-n:127.0.0.1:34542_v x:collection1 s:shard1 c:control_collection r:core_node1) [n:127.0.0.1:34542_v c:control_collection s:shard1 r:core_node1 x:collection1] o.a.s.c.SyncStrategy Sync replicas to https://127.0.0.1:34542/v/collection1/
   [junit4]   2> 253216 INFO  (coreZkRegister-758-thread-1-processing-n:127.0.0.1:34542_v x:collection1 s:shard1 c:control_collection r:core_node1) [n:127.0.0.1:34542_v c:control_collection s:shard1 r:core_node1 x:collection1] o.a.s.c.SyncStrategy Sync Success - now sync replicas to me
   [junit4]   2> 253216 INFO  (coreZkRegister-758-thread-1-processing-n:127.0.0.1:34542_v x:collection1 s:shard1 c:control_collection r:core_node1) [n:127.0.0.1:34542_v c:control_collection s:shard1 r:core_node1 x:collection1] o.a.s.c.SyncStrategy https://127.0.0.1:34542/v/collection1/ has no replicas
   [junit4]   2> 253216 INFO  (OverseerStateUpdate-96038539272847365-127.0.0.1:34542_v-n_0000000000) [n:127.0.0.1:34542_v    ] o.a.s.c.Overseer processMessage: queueSize: 1, message = {
   [junit4]   2>   "operation":"leader",
   [junit4]   2>   "shard":"shard1",
   [junit4]   2>   "collection":"control_collection"} current state version: 1
   [junit4]   2> 253217 INFO  (coreZkRegister-758-thread-1-processing-n:127.0.0.1:34542_v x:collection1 s:shard1 c:control_collection r:core_node1) [n:127.0.0.1:34542_v c:control_collection s:shard1 r:core_node1 x:collection1] o.a.s.c.c.SolrZkClient makePath: /collections/control_collection/leaders/shard1
   [junit4]   2> 253218 INFO  (coreZkRegister-758-thread-1-processing-n:127.0.0.1:34542_v x:collection1 s:shard1 c:control_collection r:core_node1) [n:127.0.0.1:34542_v c:control_collection s:shard1 r:core_node1 x:collection1] o.a.s.c.ShardLeaderElectionContextBase Creating leader registration node /collections/control_collection/leaders/shard1/leader after winning as /collections/control_collection/leader_elect/shard1/election/96038539272847365-core_node1-n_0000000000
   [junit4]   2> 253219 INFO  (coreZkRegister-758-thread-1-processing-n:127.0.0.1:34542_v x:collection1 s:shard1 c:control_collection r:core_node1) [n:127.0.0.1:34542_v c:control_collection s:shard1 r:core_node1 x:collection1] o.a.s.c.ShardLeaderElectionContext I am the new leader: https://127.0.0.1:34542/v/collection1/ shard1
   [junit4]   2> 253219 INFO  (OverseerStateUpdate-96038539272847365-127.0.0.1:34542_v-n_0000000000) [n:127.0.0.1:34542_v    ] o.a.s.c.Overseer processMessage: queueSize: 1, message = {
   [junit4]   2>   "operation":"leader",
   [junit4]   2>   "shard":"shard1",
   [junit4]   2>   "collection":"control_collection",
   [junit4]   2>   "base_url":"https://127.0.0.1:34542/v",
   [junit4]   2>   "core":"collection1",
   [junit4]   2>   "state":"active"} current state version: 1
   [junit4]   2> 253321 INFO  (zkCallback-241-thread-1-processing-n:127.0.0.1:34542_v) [n:127.0.0.1:34542_v    ] o.a.s.c.c.ZkStateReader A cluster state change: [WatchedEvent state:SyncConnected type:NodeDataChanged path:/clusterstate.json], has occurred - updating... (live nodes size: [1])
   [junit4]   2> 253369 INFO  (coreZkRegister-758-thread-1-processing-n:127.0.0.1:34542_v x:collection1 s:shard1 c:control_collection r:core_node1) [n:127.0.0.1:34542_v c:control_collection s:shard1 r:core_node1 x:collection1] o.a.s.c.ZkController We are https://127.0.0.1:34542/v/collection1/ and leader is https://127.0.0.1:34542/v/collection1/
   [junit4]   2> 253369 INFO  (coreZkRegister-758-thread-1-processing-n:127.0.0.1:34542_v x:collection1 s:shard1 c:control_collection r:core_node1) [n:127.0.0.1:34542_v c:control_collection s:shard1 r:core_node1 x:collection1] o.a.s.c.ZkController No LogReplay needed for core=collection1 baseURL=https://127.0.0.1:34542/v
   [junit4]   2> 253370 INFO  (coreZkRegister-758-thread-1-processing-n:127.0.0.1:34542_v x:collection1 s:shard1 c:control_collection r:core_node1) [n:127.0.0.1:34542_v c:control_collection s:shard1 r:core_node1 x:collection1] o.a.s.c.ZkController I am the leader, no recovery necessary
   [junit4]   2> 253370 INFO  (coreZkRegister-758-thread-1-processing-n:127.0.0.1:34542_v x:collection1 s:shard1 c:control_collection r:core_node1) [n:127.0.0.1:34542_v c:control_collection s:shard1 r:core_node1 x:collection1] o.a.s.c.ZkController publishing state=active
   [junit4]   2> 253370 INFO  (coreZkRegister-758-thread-1-processing-n:127.0.0.1:34542_v x:collection1 s:shard1 c:control_collection r:core_node1) [n:127.0.0.1:34542_v c:control_collection s:shard1 r:core_node1 x:collection1] o.a.s.c.ZkController numShards not found on descriptor - reading it from system property
   [junit4]   2> 253371 INFO  (OverseerStateUpdate-96038539272847365-127.0.0.1:34542_v-n_0000000000) [n:127.0.0.1:34542_v    ] o.a.s.c.Overseer processMessage: queueSize: 1, message = {
   [junit4]   2>   "core":"collection1",
   [junit4]   2>   "core_node_name":"core_node1",
   [junit4]   2>   "roles":null,
   [junit4]   2>   "base_url":"https://127.0.0.1:34542/v",
   [junit4]   2>   "node_name":"127.0.0.1:34542_v",
   [junit4]   2>   "numShards":"1",
   [junit4]   2>   "state":"active",
   [junit4]   2>   "shard":"shard1",
   [junit4]   2>   "collection":"control_collection",
   [junit4]   2>   "operation":"state"} current state version: 2
   [junit4]   2> 253371 INFO  (OverseerStateUpdate-96038539272847365-127.0.0.1:34542_v-n_0000000000) [n:127.0.0.1:34542_v    ] o.a.s.c.o.ReplicaMutator Update state numShards=1 message={
   [junit4]   2>   "core":"collection1",
   [junit4]   2>   "core_node_name":"core_node1",
   [junit4]   2>   "roles":null,
   [junit4]   2>   "base_url":"https://127.0.0.1:34542/v",
   [junit4]   2>   "node_name":"127.0.0.1:34542_v",
   [junit4]   2>   "numShards":"1",
   [junit4]   2>   "state":"active",
   [junit4]   2>   "shard":"shard1",
   [junit4]   2>   "collection":"control_collection",
   [junit4]   2>   "operation":"state"}
   [junit4]   2> 253473 INFO  (zkCallback-241-thread-1-processing-n:127.0.0.1:34542_v) [n:127.0.0.1:34542_v    ] o.a.s.c.c.ZkStateReader A cluster state change: [WatchedEvent state:SyncConnected type:NodeDataChanged path:/clusterstate.json], has occurred - updating... (live nodes size: [1])
   [junit4]   2> 253574 INFO  (TEST-RecoveryZkTest.test-seed#[E483A65CABC70E3E]) [    ] o.a.s.c.c.SolrZkClient Using default ZkCredentialsProvider
   [junit4]   2> 253575 INFO  (TEST-RecoveryZkTest.test-seed#[E483A65CABC70E3E]) [    ] o.a.s.c.c.ConnectionManager Waiting for client to connect to ZooKeeper
   [junit4]   2> 253576 INFO  (zkCallback-245-thread-1) [    ] o.a.s.c.c.ConnectionManager Watcher org.apache.solr.common.cloud.ConnectionManager@1996590 name:ZooKeeperConnection Watcher:127.0.0.1:34273/solr got event WatchedEvent state:SyncConnected type:None path:null path:null type:None
   [junit4]   2> 253576 INFO  (TEST-RecoveryZkTest.test-seed#[E483A65CABC70E3E]) [    ] o.a.s.c.c.ConnectionManager Client is connected to ZooKeeper
   [junit4]   2> 253576 INFO  (TEST-RecoveryZkTest.test-seed#[E483A65CABC70E3E]) [    ] o.a.s.c.c.SolrZkClient Using default ZkACLProvider
   [junit4]   2> 253576 INFO  (TEST-RecoveryZkTest.test-seed#[E483A65CABC70E3E]) [    ] o.a.s.c.c.ZkStateReader Updating cluster state from ZooKeeper... 
   [junit4]   2> 253577 INFO  (TEST-RecoveryZkTest.test-seed#[E483A65CABC70E3E]) [    ] o.a.s.c.c.ZkStateReader Loaded cluster properties: {urlScheme=https}
   [junit4]   2> 253577 INFO  (TEST-RecoveryZkTest.test-seed#[E483A65CABC70E3E]) [    ] o.a.s.c.c.ZkStateReader Updated live nodes from ZooKeeper... (0) -> (1)
   [junit4]   2> 253578 INFO  (TEST-RecoveryZkTest.test-seed#[E483A65CABC70E3E]) [    ] o.a.s.c.ChaosMonkey monkey: init - expire sessions:false cause connection loss:false
   [junit4]   2> 253639 INFO  (TEST-RecoveryZkTest.test-seed#[E483A65CABC70E3E]) [    ] o.a.s.SolrTestCaseJ4 Writing core.properties file to /home/jenkins/workspace/Lucene-Solr-master-Linux/solr/build/solr-core/test/J2/temp/solr.cloud.RecoveryZkTest_E483A65CABC70E3E-001/shard-1-001/cores/collection1
   [junit4]   2> 253640 INFO  (TEST-RecoveryZkTest.test-seed#[E483A65CABC70E3E]) [    ] o.a.s.c.AbstractFullDistribZkTestBase create jetty 1 in directory /home/jenkins/workspace/Lucene-Solr-master-Linux/solr/build/solr-core/test/J2/temp/solr.cloud.RecoveryZkTest_E483A65CABC70E3E-001/shard-1-001
   [junit4]   2> 253641 INFO  (TEST-RecoveryZkTest.test-seed#[E483A65CABC70E3E]) [    ] o.e.j.s.Server jetty-9.3.8.v20160314
   [junit4]   2> 253642 INFO  (TEST-RecoveryZkTest.test-seed#[E483A65CABC70E3E]) [    ] o.e.j.s.h.ContextHandler Started o.e.j.s.ServletContextHandler@15f81ca{/v,null,AVAILABLE}
   [junit4]   2> 253646 INFO  (TEST-RecoveryZkTest.test-seed#[E483A65CABC70E3E]) [    ] o.e.j.s.ServerConnector Started ServerConnector@942275{SSL,[ssl, http/1.1]}{127.0.0.1:35624}
   [junit4]   2> 253646 INFO  (TEST-RecoveryZkTest.test-seed#[E483A65CABC70E3E]) [    ] o.e.j.s.Server Started @255184ms
   [junit4]   2> 253646 INFO  (TEST-RecoveryZkTest.test-seed#[E483A65CABC70E3E]) [    ] o.a.s.c.s.e.JettySolrRunner Jetty properties: {solr.data.dir=/home/jenkins/workspace/Lucene-Solr-master-Linux/solr/build/solr-core/test/J2/temp/solr.cloud.RecoveryZkTest_E483A65CABC70E3E-001/tempDir-001/jetty1, solrconfig=solrconfig.xml, hostContext=/v, hostPort=35624, coreRootDirectory=/home/jenkins/workspace/Lucene-Solr-master-Linux/solr/build/solr-core/test/J2/temp/solr.cloud.RecoveryZkTest_E483A65CABC70E3E-001/shard-1-001/cores}
   [junit4]   2> 253646 INFO  (TEST-RecoveryZkTest.test-seed#[E483A65CABC70E3E]) [    ] o.a.s.s.SolrDispatchFilter SolrDispatchFilter.init(): sun.misc.Launcher$AppClassLoader@1d16e93
   [junit4]   2> 253646 INFO  (TEST-RecoveryZkTest.test-seed#[E483A65CABC70E3E]) [    ] o.a.s.c.SolrResourceLoader new SolrResourceLoader for directory: '/home/jenkins/workspace/Lucene-Solr-master-Linux/solr/build/solr-core/test/J2/temp/solr.cloud.RecoveryZkTest_E483A65CABC70E3E-001/shard-1-001'
   [junit4]   2> 253646 INFO  (TEST-RecoveryZkTest.test-seed#[E483A65CABC70E3E]) [    ] o.a.s.c.SolrResourceLoader JNDI not configured for solr (NoInitialContextEx)
   [junit4]   2> 253646 INFO  (TEST-RecoveryZkTest.test-seed#[E483A65CABC70E3E]) [    ] o.a.s.c.SolrResourceLoader solr home defaulted to 'solr/' (could not find system property or JNDI)
   [junit4]   2> 253646 INFO  (TEST-RecoveryZkTest.test-seed#[E483A65CABC70E3E]) [    ] o.a.s.c.c.SolrZkClient Using default ZkCredentialsProvider
   [junit4]   2> 253647 INFO  (TEST-RecoveryZkTest.test-seed#[E483A65CABC70E3E]) [    ] o.a.s.c.c.ConnectionManager Waiting for client to connect to ZooKeeper
   [junit4]   2> 253648 INFO  (zkCallback-246-thread-1) [    ] o.a.s.c.c.ConnectionManager Watcher org.apache.solr.common.cloud.ConnectionManager@cd2b11 name:ZooKeeperConnection Watcher:127.0.0.1:34273/solr got event WatchedEvent state:SyncConnected type:None path:null path:null type:None
   [junit4]   2> 253648 INFO  (TEST-RecoveryZkTest.test-seed#[E483A65CABC70E3E]) [    ] o.a.s.c.c.ConnectionManager Client is connected to ZooKeeper
   [junit4]   2> 253648 INFO  (TEST-RecoveryZkTest.test-seed#[E483A65CABC70E3E]) [    ] o.a.s.c.c.SolrZkClient Using default ZkACLProvider
   [junit4]   2> 253649 INFO  (TEST-RecoveryZkTest.test-seed#[E483A65CABC70E3E]) [    ] o.a.s.s.SolrDispatchFilter Loading solr.xml from SolrHome (not found in ZooKeeper)
   [junit4]   2> 253649 INFO  (TEST-RecoveryZkTest.test-seed#[E483A65CABC70E3E]) [    ] o.a.s.c.SolrXmlConfig Loading container configuration from /home/jenkins/workspace/Lucene-Solr-master-Linux/solr/build/solr-core/test/J2/temp/solr.cloud.RecoveryZkTest_E483A65CABC70E3E-001/shard-1-001/solr.xml
   [junit4]   2> 253654 INFO  (TEST-RecoveryZkTest.test-seed#[E483A65CABC70E3E]) [    ] o.a.s.c.CorePropertiesLocator Config-defined core root directory: /home/jenkins/workspace/Lucene-Solr-master-Linux/solr/build/solr-core/test/J2/temp/solr.cloud.RecoveryZkTest_E483A65CABC70E3E-001/shard-1-001/cores
   [junit4]   2> 253654 INFO  (TEST-RecoveryZkTest.test-seed#[E483A65CABC70E3E]) [    ] o.a.s.c.CoreContainer New CoreContainer 14471102
   [junit4]   2> 253654 INFO  (TEST-RecoveryZkTest.test-seed#[E483A65CABC70E3E]) [    ] o.a.s.c.CoreContainer Loading cores into CoreContainer [instanceDir=/home/jenkins/workspace/Lucene-Solr-master-Linux/solr/build/solr-core/test/J2/temp/solr.cloud.RecoveryZkTest_E483A65CABC70E3E-001/shard-1-001]
   [junit4]   2> 253654 WARN  (TEST-RecoveryZkTest.test-seed#[E483A65CABC70E3E]) [    ] o.a.s.c.CoreContainer Couldn't add files from /home/jenkins/workspace/Lucene-Solr-master-Linux/solr/build/solr-core/test/J2/temp/solr.cloud.RecoveryZkTest_E483A65CABC70E3E-001/shard-1-001/lib to classpath: /home/jenkins/workspace/Lucene-Solr-master-Linux/solr/build/solr-core/test/J2/temp/solr.cloud.RecoveryZkTest_E483A65CABC70E3E-001/shard-1-001/lib
   [junit4]   2> 253654 INFO  (TEST-RecoveryZkTest.test-seed#[E483A65CABC70E3E]) [    ] o.a.s.h.c.HttpShardHandlerFactory created with socketTimeout : 90000,urlScheme : ,connTimeout : 15000,maxConnectionsPerHost : 20,maxConnections : 10000,corePoolSize : 0,maximumPoolSize : 2147483647,maxThreadIdleTime : 5,sizeOfQueue : -1,fairnessPolicy : false,
   [junit4]   2> 253656 INFO  (TEST-RecoveryZkTest.test-seed#[E483A65CABC70E3E]) [    ] o.a.s.u.UpdateShardHandler Creating UpdateShardHandler HTTP client with params: 
   [junit4]   2> 253657 INFO  (TEST-RecoveryZkTest.test-seed#[E483A65CABC70E3E]) [    ] o.a.s.l.LogWatcher SLF4J impl is org.slf4j.impl.Log4jLoggerFactory
   [junit4]   2> 253657 INFO  (TEST-RecoveryZkTest.test-seed#[E483A65CABC70E3E]) [    ] o.a.s.l.LogWatcher Registering Log Listener [Log4j (org.slf4j.impl.Log4jLoggerFactory)]
   [junit4]   2> 253657 INFO  (TEST-RecoveryZkTest.test-seed#[E483A65CABC70E3E]) [    ] o.a.s.c.ZkContainer Zookeeper client=127.0.0.1:34273/solr
   [junit4]   2> 253657 INFO  (TEST-RecoveryZkTest.test-seed#[E483A65CABC70E3E]) [    ] o.a.s.c.ZkController zkHost includes chroot
   [junit4]   2> 253657 INFO  (TEST-RecoveryZkTest.test-seed#[E483A65CABC70E3E]) [    ] o.a.s.c.c.SolrZkClient Using default ZkCredentialsProvider
   [junit4]   2> 253658 INFO  (TEST-RecoveryZkTest.test-seed#[E483A65CABC70E3E]) [    ] o.a.s.c.c.ConnectionManager Waiting for client to connect to ZooKeeper
   [junit4]   2> 253659 INFO  (zkCallback-249-thread-1) [    ] o.a.s.c.c.ConnectionManager Watcher org.apache.solr.common.cloud.ConnectionManager@1e1df24 name:ZooKeeperConnection Watcher:127.0.0.1:34273 got event WatchedEvent state:SyncConnected type:None path:null path:null type:None
   [junit4]   2> 253659 INFO  (TEST-RecoveryZkTest.test-seed#[E483A65CABC70E3E]) [    ] o.a.s.c.c.ConnectionManager Client is connected to ZooKeeper
   [junit4]   2> 253659 INFO  (TEST-RecoveryZkTest.test-seed#[E483A65CABC70E3E]) [    ] o.a.s.c.c.SolrZkClient Using default ZkACLProvider
   [junit4]   2> 253660 INFO  (TEST-RecoveryZkTest.test-seed#[E483A65CABC70E3E]) [n:127.0.0.1:35624_v    ] o.a.s.c.ZkController Added new OnReconnect listener org.apache.solr.cloud.ZkController$$Lambda$10/10270780@de4503
   [junit4]   2> 253661 INFO  (TEST-RecoveryZkTest.test-seed#[E483A65CABC70E3E]) [n:127.0.0.1:35624_v    ] o.a.s.c.c.ConnectionManager Waiting for client to connect to ZooKeeper
   [junit4]   2> 253662 INFO  (zkCallback-250-thread-1-processing-n:127.0.0.1:35624_v) [n:127.0.0.1:35624_v    ] o.a.s.c.c.ConnectionManager Watcher org.apache.solr.common.cloud.ConnectionManager@106e62f name:ZooKeeperConnection Watcher:127.0.0.1:34273/solr got event WatchedEvent state:SyncConnected type:None path:null path:null type:None
   [junit4]   2> 253662 INFO  (TEST-RecoveryZkTest.test-seed#[E483A65CABC70E3E]) [n:127.0.0.1:35624_v    ] o.a.s.c.c.ConnectionManager Client is connected to ZooKeeper
   [junit4]   2> 253665 INFO  (TEST-RecoveryZkTest.test-seed#[E483A65CABC70E3E]) [n:127.0.0.1:35624_v    ] o.a.s.c.c.ZkStateReader Updating cluster state from ZooKeeper... 
   [junit4]   2> 253665 INFO  (TEST-RecoveryZkTest.test-seed#[E483A65CABC70E3E]) [n:127.0.0.1:35624_v    ] o.a.s.c.c.ZkStateReader Loaded cluster properties: {urlScheme=https}
   [junit4]   2> 253665 INFO  (TEST-RecoveryZkTest.test-seed#[E483A65CABC70E3E]) [n:127.0.0.1:35624_v    ] o.a.s.c.c.ZkStateReader Updated live nodes from ZooKeeper... (0) -> (1)
   [junit4]   2> 253667 INFO  (TEST-RecoveryZkTest.test-seed#[E483A65CABC70E3E]) [n:127.0.0.1:35624_v    ] o.a.s.c.Overseer Overseer (id=null) closing
   [junit4]   2> 253667 INFO  (TEST-RecoveryZkTest.test-seed#[E483A65CABC70E3E]) [n:127.0.0.1:35624_v    ] o.a.s.c.LeaderElector Joined leadership election with path: /overseer_elect/election/96038539272847369-127.0.0.1:35624_v-n_0000000001
   [junit4]   2> 253668 INFO  (TEST-RecoveryZkTest.test-seed#[E483A65CABC70E3E]) [n:127.0.0.1:35624_v    ] o.a.s.c.LeaderElector Watching path /overseer_elect/election/96038539272847365-127.0.0.1:34542_v-n_0000000000 to know if I could be the leader
   [junit4]   2> 253668 INFO  (TEST-RecoveryZkTest.test-seed#[E483A65CABC70E3E]) [n:127.0.0.1:35624_v    ] o.a.s.c.ZkController Publish node=127.0.0.1:35624_v as DOWN
   [junit4]   2> 253670 INFO  (OverseerStateUpdate-96038539272847365-127.0.0.1:34542_v-n_0000000000) [n:127.0.0.1:34542_v    ] o.a.s.c.Overseer processMessage: queueSize: 1, message = {
   [junit4]   2>   "operation":"downnode",
   [junit4]   2>   "node_name":"127.0.0.1:35624_v"} current state version: 3
   [junit4]   2> 253670 INFO  (OverseerStateUpdate-96038539272847365-127.0.0.1:34542_v-n_0000000000) [n:127.0.0.1:34542_v    ] o.a.s.c.o.NodeMutator DownNode state invoked for node: 127.0.0.1:35624_v
   [junit4]   2> 253772 INFO  (zkCallback-250-thread-1-processing-n:127.0.0.1:35624_v) [n:127.0.0.1:35624_v    ] o.a.s.c.c.ZkStateReader A cluster state change: [WatchedEvent state:SyncConnected type:NodeDataChanged path:/clusterstate.json], has occurred - updating... (live nodes size: [1])
   [junit4]   2> 253772 INFO  (zkCallback-241-thread-1-processing-n:127.0.0.1:34542_v) [n:127.0.0.1:34542_v    ] o.a.s.c.c.ZkStateReader A cluster state change: [WatchedEvent state:SyncConnected type:NodeDataChanged path:/clusterstate.json], has occurred - updating... (live nodes size: [1])
   [junit4]   2> 253772 INFO  (zkCallback-245-thread-1) [    ] o.a.s.c.c.ZkStateReader A cluster state change: [WatchedEvent state:SyncConnected type:NodeDataChanged path:/clusterstate.json], has occurred - updating... (live nodes size: [1])
   [junit4]   2> 254670 INFO  (TEST-RecoveryZkTest.test-seed#[E483A65CABC70E3E]) [n:127.0.0.1:35624_v    ] o.a.s.c.ZkController Register node as live in ZooKeeper:/live_nodes/127.0.0.1:35624_v
   [junit4]   2> 254670 INFO  (TEST-RecoveryZkTest.test-seed#[E483A65CABC70E3E]) [n:127.0.0.1:35624_v    ] o.a.s.c.c.SolrZkClient makePath: /live_nodes/127.0.0.1:35624_v
   [junit4]   2> 254671 INFO  (zkCallback-245-thread-1) [    ] o.a.s.c.c.ZkStateReader A live node change: [WatchedEvent state:SyncConnected type:NodeChildrenChanged path:/live_nodes], has occurred - updating... (live nodes size: [1])
   [junit4]   2> 254671 INFO  (zkCallback-250-thread-1-processing-n:127.0.0.1:35624_v) [n:127.0.0.1:35624_v    ] o.a.s.c.c.ZkStateReader A live node change: [WatchedEvent state:SyncConnected type:NodeChildrenChanged path:/live_nodes], has occurred - updating... (live nodes size: [1])
   [junit4]   2> 254671 INFO  (zkCallback-241-thread-1-processing-n:127.0.0.1:34542_v) [n:127.0.0.1:34542_v    ] o.a.s.c.c.ZkStateReader A live node change: [WatchedEvent state:SyncConnected type:NodeChildrenChanged path:/live_nodes], has occurred - updating... (live nodes size: [1])
   [junit4]   2> 254671 INFO  (zkCallback-245-thread-1) [    ] o.a.s.c.c.ZkStateReader Updated live nodes from ZooKeeper... (1) -> (2)
   [junit4]   2> 254671 INFO  (zkCallback-250-thread-1-processing-n:127.0.0.1:35624_v) [n:127.0.0.1:35624_v    ] o.a.s.c.c.ZkStateReader Updated live nodes from ZooKeeper... (1) -> (2)
   [junit4]   2> 254671 INFO  (zkCallback-241-thread-1-processing-n:127.0.0.1:34542_v) [n:127.0.0.1:34542_v    ] o.a.s.c.c.ZkStateReader Updated live nodes from ZooKeeper... (1) -> (2)
   [junit4]   2> 254691 INFO  (TEST-RecoveryZkTest.test-seed#[E483A65CABC70E3E]) [n:127.0.0.1:35624_v    ] o.a.s.c.CoreContainer Security conf doesn't exist. Skipping setup for authorization module.
   [junit4]   2> 254691 INFO  (TEST-RecoveryZkTest.test-seed#[E483A65CABC70E3E]) [n:127.0.0.1:35624_v    ] o.a.s.c.CoreContainer No authentication plugin used.
   [junit4]   2> 254692 INFO  (TEST-RecoveryZkTest.test-seed#[E483A65CABC70E3E]) [n:127.0.0.1:35624_v    ] o.a.s.c.CorePropertiesLocator Looking for core definitions underneath /home/jenkins/workspace/Lucene-Solr-master-Linux/solr/build/solr-core/test/J2/temp/solr.cloud.RecoveryZkTest_E483A65CABC70E3E-001/shard-1-001/cores
   [junit4]   2> 254693 INFO  (TEST-RecoveryZkTest.test-seed#[E483A65CABC70E3E]) [n:127.0.0.1:35624_v    ] o.a.s.c.CoreDescriptor Created CoreDescriptor: {name=collection1, config=solrconfig.xml, transient=false, schema=schema.xml, loadOnStartup=true, configSetProperties=configsetprops.json, collection=collection1, coreNodeName=, dataDir=data/, shard=}
   [junit4]   2> 254693 INFO  (TEST-RecoveryZkTest.test-seed#[E483A65CABC70E3E]) [n:127.0.0.1:35624_v    ] o.a.s.c.CorePropertiesLocator Found core collection1 in /home/jenkins/workspace/Lucene-Solr-master-Linux/solr/build/solr-core/test/J2/temp/solr.cloud.RecoveryZkTest_E483A65CABC70E3E-001/shard-1-001/cores/collection1
   [junit4]   2> 254693 INFO  (TEST-RecoveryZkTest.test-seed#[E483A65CABC70E3E]) [n:127.0.0.1:35624_v    ] o.a.s.c.CorePropertiesLocator Found 1 core definitions
   [junit4]   2> 254694 INFO  (coreLoadExecutor-775-thread-1-processing-n:127.0.0.1:35624_v) [n:127.0.0.1:35624_v c:collection1   x:collection1] o.a.s.c.ZkController publishing state=down
   [junit4]   2> 254694 INFO  (TEST-RecoveryZkTest.test-seed#[E483A65CABC70E3E]) [n:127.0.0.1:35624_v    ] o.a.s.s.SolrDispatchFilter user.dir=/home/jenkins/workspace/Lucene-Solr-master-Linux/solr/build/solr-core/test/J2
   [junit4]   2> 254694 INFO  (coreLoadExecutor-775-thread-1-processing-n:127.0.0.1:35624_v) [n:127.0.0.1:35624_v c:collection1   x:collection1] o.a.s.c.ZkController numShards not found on descriptor - reading it from system property
   [junit4]   2> 254694 INFO  (TEST-RecoveryZkTest.test-seed#[E483A65CABC70E3E]) [n:127.0.0.1:35624_v    ] o.a.s.s.SolrDispatchFilter SolrDispatchFilter.init() done
   [junit4]   2> 254695 INFO  (coreLoadExecutor-775-thread-1-processing-n:127.0.0.1:35624_v) [n:127.0.0.1:35624_v c:collection1   x:collection1] o.a.s.c.ZkController Collection collection1 not visible yet, but flagging it so a watch is registered when it becomes visible
   [junit4]   2> 254695 INFO  (OverseerStateUpdate-96038539272847365-127.0.0.1:34542_v-n_0000000000) [n:127.0.0.1:34542_v    ] o.a.s.c.Overseer processMessage: queueSize: 1, message = {
   [junit4]   2>   "core":"collection1",
   [junit4]   2>   "roles":null,
   [junit4]   2>   "base_url":"https://127.0.0.1:35624/v",
   [junit4]   2>   "node_name":"127.0.0.1:35624_v",
   [junit4]   2>   "numShards":"1",
   [junit4]   2>   "state":"down",
   [junit4]   2>   "shard":null,
   [junit4]   2>   "collection":"collection1",
   [junit4]   2>   "operation":"state"} current state version: 4
   [junit4]   2> 254695 INFO  (coreLoadExecutor-775-thread-1-processing-n:127.0.0.1:35624_v) [n:127.0.0.1:35624_v c:collection1   x:collection1] o.a.s.c.c.ZkStateReader Deleting data for [collection1]
   [junit4]   2> 254695 INFO  (OverseerStateUpdate-96038539272847365-127.0.0.1:34542_v-n_0000000000) [n:127.0.0.1:34542_v    ] o.a.s.c.o.ReplicaMutator Update state numShards=1 message={
   [junit4]   2>   "core":"collection1",
   [junit4]   2>   "roles":null,
   [junit4]   2>   "base_url":"https://127.0.0.1:35624/v",
   [junit4]   2>   "node_name":"127.0.0.1:35624_v",
   [junit4]   2>   "numShards":"1",
   [junit4]   2>   "state":"down",
   [junit4]   2>   "shard":null,
   [junit4]   2>   "collection":"collection1",
   [junit4]   2>   "operation":"state"}
   [junit4]   2> 254695 INFO  (OverseerStateUpdate-96038539272847365-127.0.0.1:34542_v-n_0000000000) [n:127.0.0.1:34542_v    ] o.a.s.c.o.ClusterStateMutator building a new cName: collection1
   [junit4]   2> 254695 INFO  (OverseerStateUpdate-96038539272847365-127.0.0.1:34542_v-n_0000000000) [n:127.0.0.1:34542_v    ] o.a.s.c.o.ReplicaMutator Assigning new node to shard shard=shard1
   [junit4]   2> 254695 INFO  (coreLoadExecutor-775-thread-1-processing-n:127.0.0.1:35624_v) [n:127.0.0.1:35624_v c:collection1   x:collection1] o.a.s.c.ZkController look for our core node name
   [junit4]   2> 254797 INFO  (zkCallback-245-thread-1) [    ] o.a.s.c.c.ZkStateReader A cluster state change: [WatchedEvent state:SyncConnected type:NodeDataChanged path:/clusterstate.json], has occurred - updating... (live nodes size: [2])
   [junit4]   2> 254797 INFO  (zkCallback-241-thread-1-processing-n:127.0.0.1:34542_v) [n:127.0.0.1:34542_v    ] o.a.s.c.c.ZkStateReader A cluster state change: [WatchedEvent state:SyncConnected type:NodeDataChanged path:/clusterstate.json], has occurred - updating... (live nodes size: [2])
   [junit4]   2> 254797 INFO  (zkCallback-250-thread-1-processing-n:127.0.0.1:35624_v) [n:127.0.0.1:35624_v    ] o.a.s.c.c.ZkStateReader A cluster state change: [WatchedEvent state:SyncConnected type:NodeDataChanged path:/clusterstate.json], has occurred - updating... (live nodes size: [2])
   [junit4]   2> 255696 INFO  (coreLoadExecutor-775-thread-1-processing-n:127.0.0.1:35624_v) [n:127.0.0.1:35624_v c:collection1   x:collection1] o.a.s.c.ZkController waiting to find shard id in clusterstate for collection1
   [junit4]   2> 255696 INFO  (coreLoadExecutor-775-thread-1-processing-n:127.0.0.1:35624_v) [n:127.0.0.1:35624_v c:collection1   x:collection1] o.a.s.c.ZkController Check for collection zkNode:collection1
   [junit4]   2> 255697 INFO  (coreLoadExecutor-775-thread-1-processing-n:127.0.0.1:35624_v) [n:127.0.0.1:35624_v c:collection1   x:collection1] o.a.s.c.ZkController Collection zkNode exists
   [junit4]   2> 255697 INFO  (coreLoadExecutor-775-thread-1-processing-n:127.0.0.1:35624_v) [n:127.0.0.1:35624_v c:collection1   x:collection1] o.a.s.c.c.ZkStateReader Load collection config from: [/collections/collection1]
   [junit4]   2> 255697 INFO  (coreLoadExecutor-775-thread-1-processing-n:127.0.0.1:35624_v) [n:127.0.0.1:35624_v c:collection1   x:collection1] o.a.s.c.c.ZkStateReader path=[/collections/collection1] [configName]=[conf1] specified config exists in ZooKeeper
   [junit4]   2> 255697 INFO  (coreLoadExecutor-775-thread-1-processing-n:127.0.0.1:35624_v) [n:127.0.0.1:35624_v c:collection1   x:collection1] o.a.s.c.SolrResourceLoader new SolrResourceLoader for directory: '/home/jenkins/workspace/Lucene-Solr-master-Linux/solr/build/solr-core/test/J2/temp/solr.cloud.RecoveryZkTest_E483A65CABC70E3E-001/shard-1-001/cores/collection1'
   [junit4]   2> 255697 INFO  (coreLoadExecutor-775-thread-1-processing-n:127.0.0.1:35624_v) [n:127.0.0.1:35624_v c:collection1   x:collection1] o.a.s.c.SolrResourceLoader JNDI not configured for solr (NoInitialContextEx)
   [junit4]   2> 255698 INFO  (coreLoadExecutor-775-thread-1-processing-n:127.0.0.1:35624_v) [n:127.0.0.1:35624_v c:collection1   x:collection1] o.a.s.c.SolrResourceLoader solr home defaulted to 'solr/' (could not find system property or JNDI)
   [junit4]   2> 255699 INFO  (coreLoadExecutor-775-thread-1-processing-n:127.0.0.1:35624_v) [n:127.0.0.1:35624_v c:collection1   x:collection1] o.a.s.c.Config loaded config solrconfig.xml with version 0 
   [junit4]   2> 255704 INFO  (coreLoadExecutor-775-thread-1-processing-n:127.0.0.1:35624_v) [n:127.0.0.1:35624_v c:collection1   x:collection1] o.a.s.c.SolrConfig current version of requestparams : -1
   [junit4]   2> 255711 INFO  (coreLoadExecutor-775-thread-1-processing-n:127.0.0.1:35624_v) [n:127.0.0.1:35624_v c:collection1   x:collection1] o.a.s.c.SolrConfig Using Lucene MatchVersion: 7.0.0
   [junit4]   2> 255726 INFO  (coreLoadExecutor-775-thread-1-processing-n:127.0.0.1:35624_v) [n:127.0.0.1:35624_v c:collection1   x:collection1] o.a.s.c.SolrConfig Loaded SolrConfig: solrconfig.xml
   [junit4]   2> 255735 INFO  (coreLoadExecutor-775-thread-1-processing-n:127.0.0.1:35624_v) [n:127.0.0.1:35624_v c:collection1   x:collection1] o.a.s.s.IndexSchema [collection1] Schema name=test
   [junit4]   2> 255848 INFO  (coreLoadExecutor-775-thread-1-processing-n:127.0.0.1:35624_v) [n:127.0.0.1:35624_v c:collection1   x:collection1] o.a.s.s.IndexSchema default search field in schema is text
   [junit4]   2> 255849 INFO  (coreLoadExecutor-775-thread-1-processing-n:127.0.0.1:35624_v) [n:127.0.0.1:35624_v c:collection1   x:collection1] o.a.s.s.IndexSchema unique key field: id
   [junit4]   2> 255850 INFO  (coreLoadExecutor-775-thread-1-processing-n:127.0.0.1:35624_v) [n:127.0.0.1:35624_v c:collection1   x:collection1] o.a.s.s.FileExchangeRateProvider Reloading exchange rates from file currency.xml
   [junit4]   2> 255853 INFO  (coreLoadExecutor-775-thread-1-processing-n:127.0.0.1:35624_v) [n:127.0.0.1:35624_v c:collection1   x:collection1] o.a.s.s.FileExchangeRateProvider Reloading exchange rates from file currency.xml
   [junit4]   2> 255867 INFO  (coreLoadExecutor-775-thread-1-processing-n:127.0.0.1:35624_v) [n:127.0.0.1:35624_v c:collection1   x:collection1] o.a.s.c.ConfigSetProperties Did not find ConfigSet properties, assuming default properties: Can't find resource 'configsetprops.json' in classpath or '/configs/conf1', cwd=/home/jenkins/workspace/Lucene-Solr-master-Linux/solr/build/solr-core/test/J2
   [junit4]   2> 255867 INFO  (coreLoadExecutor-775-thread-1-processing-n:127.0.0.1:35624_v) [n:127.0.0.1:35624_v c:collection1   x:collection1] o.a.s.c.CoreContainer Creating SolrCore 'collection1' using configuration from collection collection1
   [junit4]   2> 255867 INFO  (coreLoadExecutor-775-thread-1-processing-n:127.0.0.1:35624_v) [n:127.0.0.1:35624_v c:collection1 s:shard1 r:core_node1 x:collection1] o.a.s.c.SolrCore org.apache.solr.core.MockDirectoryFactory
   [junit4]   2> 255868 INFO  (coreLoadExecutor-775-thread-1-processing-n:127.0.0.1:35624_v) [n:127.0.0.1:35624_v c:collection1 s:shard1 r:core_node1 x:collection1] o.a.s.c.SolrCore [[collection1] ] Opening new SolrCore at [/home/jenkins/workspace/Lucene-Solr-master-Linux/solr/build/solr-core/test/J2/temp/solr.cloud.RecoveryZkTest_E483A65CABC70E3E-001/shard-1-001/cores/collection1], dataDir=[/home/jenkins/workspace/Lucene-Solr-master-Linux/solr/build/solr-core/test/J2/temp/solr.cloud.RecoveryZkTest_E483A65CABC70E3E-001/shard-1-001/cores/collection1/data/]
   [junit4]   2> 255868 INFO  (coreLoadExecutor-775-thread-1-processing-n:127.0.0.1:35624_v) [n:127.0.0.1:35624_v c:collection1 s:shard1 r:core_node1 x:collection1] o.a.s.c.JmxMonitoredMap JMX monitoring is enabled. Adding Solr mbeans to JMX Server: com.sun.jmx.mbeanserver.JmxMBeanServer@58a21a
   [junit4]   2> 255869 INFO  (coreLoadExecutor-775-thread-1-processing-n:127.0.0.1:35624_v) [n:127.0.0.1:35624_v c:collection1 s:shard1 r:core_node1 x:collection1] o.a.s.c.CachingDirectoryFactory return new directory for /home/jenkins/workspace/Lucene-Solr-master-Linux/solr/build/solr-core/test/J2/temp/solr.cloud.RecoveryZkTest_E483A65CABC70E3E-001/shard-1-001/cores/collection1/data
   [junit4]   2> 255869 INFO  (coreLoadExecutor-775-thread-1-processing-n:127.0.0.1:35624_v) [n:127.0.0.1:35624_v c:collection1 s:shard1 r:core_node1 x:collection1] o.a.s.c.SolrCore New index directory detected: old=null new=/home/jenkins/workspace/Lucene-Solr-master-Linux/solr/build/solr-core/test/J2/temp/solr.cloud.RecoveryZkTest_E483A65CABC70E3E-001/shard-1-001/cores/collection1/data/index/
   [junit4]   2> 255869 WARN  (coreLoadExecutor-775-thread-1-processing-n:127.0.0.1:35624_v) [n:127.0.0.1:35624_v c:collection1 s:shard1 r:core_node1 x:collection1] o.a.s.c.SolrCore [collection1] Solr index directory '/home/jenkins/workspace/Lucene-Solr-master-Linux/solr/build/solr-core/test/J2/temp/solr.cloud.RecoveryZkTest_E483A65CABC70E3E-001/shard-1-001/cores/collection1/data/index' doesn't exist. Creating new index...
   [junit4]   2> 255869 INFO  (coreLoadExecutor-775-thread-1-processing-n:127.0.0.1:35624_v) [n:127.0.0.1:35624_v c:collection1 s:shard1 r:core_node1 x:collection1] o.a.s.c.CachingDirectoryFactory return new directory for /home/jenkins/workspace/Lucene-Solr-master-Linux/solr/build/solr-core/test/J2/temp/solr.cloud.RecoveryZkTest_E483A65CABC70E3E-001/shard-1-001/cores/collection1/data/index
   [junit4]   2> 255870 INFO  (coreLoadExecutor-775-thread-1-processing-n:127.0.0.1:35624_v) [n:127.0.0.1:35624_v c:collection1 s:shard1 r:core_node1 x:collection1] o.a.s.u.RandomMergePolicy RandomMergePolicy wrapping class org.apache.lucene.index.AlcoholicMergePolicy: [AlcoholicMergePolicy: minMergeSize=0, mergeFactor=10, maxMergeSize=848888079, maxMergeSizeForForcedMerge=9223372036854775807, calibrateSizeByDeletes=true, maxMergeDocs=2147483647, maxCFSSegmentSizeMB=8.796093022207999E12, noCFSRatio=0.1]
   [junit4]   2> 255871 INFO  (coreLoadExecutor-775-thread-1-processing-n:127.0.0.1:35624_v) [n:127.0.0.1:35624_v c:collection1 s:shard1 r:core_node1 x:collection1] o.a.s.c.SolrDeletionPolicy SolrDeletionPolicy.onCommit: commits: num=1
   [junit4]   2> 	commit{dir=MockDirectoryWrapper(RAMDirectory@c9fe9d lockFactory=org.apache.lucene.store.SingleInstanceLockFactory@80022d),segFN=segments_1,generation=1}
   [junit4]   2> 255871 INFO  (coreLoadExecutor-775-thread-1-processing-n:127.0.0.1:35624_v) [n:127.0.0.1:35624_v c:collection1 s:shard1 r:core_node1 x:collection1] o.a.s.c.SolrDeletionPolicy newest commit generation = 1
   [junit4]   2> 255871 INFO  (OldIndexDirectoryCleanupThreadForCore-collection1) [n:127.0.0.1:35624_v c:collection1 s:shard1 r:core_node1 x:collection1] o.a.s.c.SolrCore Looking for old index directories to cleanup for core collection1 in /home/jenkins/workspace/Lucene-Solr-master-Linux/solr/build/solr-core/test/J2/temp/solr.cloud.RecoveryZkTest_E483A65CABC70E3E-001/shard-1-001/cores/collection1/data/
   [junit4]   2> 255871 WARN  (OldIndexDirectoryCleanupThreadForCore-collection1) [n:127.0.0.1:35624_v c:collection1 s:shard1 r:core_node1 x:collection1] o.a.s.c.DirectoryFactory /home/jenkins/workspace/Lucene-Solr-master-Linux/solr/build/solr-core/test/J2/temp/solr.cloud.RecoveryZkTest_E483A65CABC70E3E-001/shard-1-001/cores/collection1/data/ does not point to a valid data directory; skipping clean-up of old index directories.
   [junit4]   2> 255880 INFO  (coreLoadExecutor-775-thread-1-processing-n:127.0.0.1:35624_v) [n:127.0.0.1:35624_v c:collection1 s:shard1 r:core_node1 x:collection1] o.a.s.u.p.UpdateRequestProcessorChain creating updateRequestProcessorChain "nodistrib"
   [junit4]   2> 255880 INFO  (coreLoadExecutor-775-thread-1-processing-n:127.0.0.1:35624_v) [n:127.0.0.1:35624_v c:collection1 s:shard1 r:core_node1 x:collection1] o.a.s.u.p.UpdateRequestProcessorChain creating updateRequestProcessorChain "dedupe"
   [junit4]   2> 255880 INFO  (coreLoadExecutor-775-thread-1-processing-n:127.0.0.1:35624_v) [n:127.0.0.1:35624_v c:collection1 s:shard1 r:core_node1 x:collection1] o.a.s.u.p.UpdateRequestProcessorChain inserting DistributedUpdateProcessorFactory into updateRequestProcessorChain "dedupe"
   [junit4]   2> 255880 INFO  (coreLoadExecutor-775-thread-1-processing-n:127.0.0.1:35624_v) [n:127.0.0.1:35624_v c:collection1 s:shard1 r:core_node1 x:collection1] o.a.s.u.p.UpdateRequestProcessorChain creating updateRequestProcessorChain "stored_sig"
   [junit4]   2> 255881 INFO  (coreLoadExecutor-775-thread-1-processing-n:127.0.0.1:35624_v) [n:127.0.0.1:35624_v c:collection1 s:shard1 r:core_node1 x:collection1] o.a.s.u.p.UpdateRequestProcessorChain inserting DistributedUpdateProcessorFactory into updateRequestProcessorChain "stored_sig"
   [junit4]   2> 255881 INFO  (coreLoadExecutor-775-thread-1-processing-n:127.0.0.1:35624_v) [n:127.0.0.1:35624_v c:collection1 s:shard1 r:core_node1 x:collection1] o.a.s.u.p.UpdateRequestProcessorChain creating updateRequestProcessorChain "distrib-dup-test-chain-explicit"
   [junit4]   2> 255881 INFO  (coreLoadExecutor-775-thread-1-processing-n:127.0.0.1:35624_v) [n:127.0.0.1:35624_v c:collection1 s:shard1 r:core_node1 x:collection1] o.a.s.u.p.UpdateRequestProcessorChain creating updateRequestProcessorChain "distrib-dup-test-chain-implicit"
   [junit4]   2> 255881 INFO  (coreLoadExecutor-775-thread-1-processing-n:127.0.0.1:35624_v) [n:127.0.0.1:35624_v c:collection1 s:shard1 r:core_node1 x:collection1] o.a.s.u.p.UpdateRequestProcessorChain inserting DistributedUpdateProcessorFactory into updateRequestProcessorChain "di

[...truncated too long message...]

t4]   2> 	at java.util.concurrent.AbstractExecutorService.submit(AbstractExecutorService.java:112)
   [junit4]   2> 	at org.apache.solr.common.cloud.SolrZkClient$3.process(SolrZkClient.java:266)
   [junit4]   2> 	at org.apache.zookeeper.ClientCnxn$EventThread.processEvent(ClientCnxn.java:522)
   [junit4]   2> 	at org.apache.zookeeper.ClientCnxn$EventThread.run(ClientCnxn.java:498)
   [junit4]   2> 441059 INFO  (TEST-RecoveryZkTest.test-seed#[E483A65CABC70E3E]) [    ] o.e.j.s.ServerConnector Stopped ServerConnector@163f519{SSL,[ssl, http/1.1]}{127.0.0.1:43790}
   [junit4]   2> 441063 INFO  (TEST-RecoveryZkTest.test-seed#[E483A65CABC70E3E]) [    ] o.e.j.s.h.ContextHandler Stopped o.e.j.s.ServletContextHandler@4feba5{/v,null,UNAVAILABLE}
   [junit4]   2> 441064 INFO  (TEST-RecoveryZkTest.test-seed#[E483A65CABC70E3E]) [    ] o.a.s.c.ZkTestServer connecting to 127.0.0.1:34273 34273
   [junit4]   2> 441198 INFO  (Thread-460) [    ] o.a.s.c.ZkTestServer connecting to 127.0.0.1:34273 34273
   [junit4]   2> 441199 WARN  (Thread-460) [    ] o.a.s.c.ZkTestServer Watch limit violations: 
   [junit4]   2> Maximum concurrent create/delete watches above limit:
   [junit4]   2> 
   [junit4]   2> 	5	/solr/aliases.json
   [junit4]   2> 	4	/solr/security.json
   [junit4]   2> 	3	/solr/collections/collection1/state.json
   [junit4]   2> 	3	/solr/configs/conf1
   [junit4]   2> 
   [junit4]   2> Maximum concurrent data watches above limit:
   [junit4]   2> 
   [junit4]   2> 	5	/solr/clusterstate.json
   [junit4]   2> 	5	/solr/clusterprops.json
   [junit4]   2> 	2	/solr/overseer_elect/election/96038539272847369-127.0.0.1:35624_v-n_0000000001
   [junit4]   2> 
   [junit4]   2> Maximum concurrent children watches above limit:
   [junit4]   2> 
   [junit4]   2> 	5	/solr/collections
   [junit4]   2> 	4	/solr/live_nodes
   [junit4]   2> 	2	/solr/overseer/queue
   [junit4]   2> 	2	/solr/overseer/collection-queue-work
   [junit4]   2> 
   [junit4]   2> NOTE: reproduce with: ant test  -Dtestcase=RecoveryZkTest -Dtests.method=test -Dtests.seed=E483A65CABC70E3E -Dtests.multiplier=3 -Dtests.slow=true -Dtests.locale=en-ZA -Dtests.timezone=America/Kentucky/Monticello -Dtests.asserts=true -Dtests.file.encoding=ISO-8859-1
   [junit4] ERROR    189s J2 | RecoveryZkTest.test <<<
   [junit4]    > Throwable #1: java.lang.AssertionError: There are still nodes recoverying - waited for 120 seconds
   [junit4]    > 	at org.apache.solr.cloud.AbstractDistribZkTestBase.waitForRecoveriesToFinish(AbstractDistribZkTestBase.java:182)
   [junit4]    > 	at org.apache.solr.cloud.AbstractFullDistribZkTestBase.waitForRecoveriesToFinish(AbstractFullDistribZkTestBase.java:862)
   [junit4]    > 	at org.apache.solr.cloud.AbstractFullDistribZkTestBase.waitForThingsToLevelOut(AbstractFullDistribZkTestBase.java:1418)
   [junit4]    > 	at org.apache.solr.cloud.RecoveryZkTest.test(RecoveryZkTest.java:105)
   [junit4]    > 	at org.apache.solr.BaseDistributedSearchTestCase$ShardsRepeatRule$ShardsFixedStatement.callStatement(BaseDistributedSearchTestCase.java:985)
   [junit4]    > 	at org.apache.solr.BaseDistributedSearchTestCase$ShardsRepeatRule$ShardsStatement.evaluate(BaseDistributedSearchTestCase.java:960)
   [junit4]    > 	at java.lang.Thread.run(Thread.java:745)Throwable #2: com.carrotsearch.randomizedtesting.UncaughtExceptionError: Captured an uncaught exception in thread: Thread[id=1548, name=StoppableIndexingThread, state=RUNNABLE, group=TGRP-RecoveryZkTest]
   [junit4]    > Caused by: java.lang.OutOfMemoryError: GC overhead limit exceeded
   [junit4]    > 	at __randomizedtesting.SeedInfo.seed([E483A65CABC70E3E]:0)
   [junit4]    > 	at java.util.HashMap$KeySet.iterator(HashMap.java:916)
   [junit4]    > 	at java.util.HashSet.iterator(HashSet.java:172)
   [junit4]    > 	at sun.security.util.AbstractAlgorithmConstraints.checkAlgorithm(AbstractAlgorithmConstraints.java:108)
   [junit4]    > 	at sun.security.util.DisabledAlgorithmConstraints.permits(DisabledAlgorithmConstraints.java:91)
   [junit4]    > 	at sun.security.ssl.SSLAlgorithmConstraints.permits(SSLAlgorithmConstraints.java:144)
   [junit4]    > 	at sun.security.ssl.Handshaker.getActiveCipherSuites(Handshaker.java:642)
   [junit4]    > 	at sun.security.ssl.Handshaker.activate(Handshaker.java:509)
   [junit4]    > 	at sun.security.ssl.SSLSocketImpl.kickstartHandshake(SSLSocketImpl.java:1482)
   [junit4]    > 	at sun.security.ssl.SSLSocketImpl.performInitialHandshake(SSLSocketImpl.java:1351)
   [junit4]    > 	at sun.security.ssl.SSLSocketImpl.startHandshake(SSLSocketImpl.java:1403)
   [junit4]    > 	at sun.security.ssl.SSLSocketImpl.startHandshake(SSLSocketImpl.java:1387)
   [junit4]    > 	at org.apache.http.conn.ssl.SSLConnectionSocketFactory.createLayeredSocket(SSLConnectionSocketFactory.java:394)
   [junit4]    > 	at org.apache.http.conn.ssl.SSLConnectionSocketFactory.connectSocket(SSLConnectionSocketFactory.java:353)
   [junit4]    > 	at org.apache.http.impl.conn.DefaultHttpClientConnectionOperator.connect(DefaultHttpClientConnectionOperator.java:134)
   [junit4]    > 	at org.apache.http.impl.conn.PoolingHttpClientConnectionManager.connect(PoolingHttpClientConnectionManager.java:353)
   [junit4]    > 	at org.apache.http.impl.execchain.MainClientExec.establishRoute(MainClientExec.java:380)
   [junit4]    > 	at org.apache.http.impl.execchain.MainClientExec.execute(MainClientExec.java:236)
   [junit4]    > 	at org.apache.http.impl.execchain.ProtocolExec.execute(ProtocolExec.java:184)
   [junit4]    > 	at org.apache.http.impl.execchain.RetryExec.execute(RetryExec.java:88)
   [junit4]    > 	at org.apache.http.impl.execchain.RedirectExec.execute(RedirectExec.java:110)
   [junit4]    > 	at org.apache.http.impl.client.InternalHttpClient.doExecute(InternalHttpClient.java:184)
   [junit4]    > 	at org.apache.http.impl.client.CloseableHttpClient.execute(CloseableHttpClient.java:82)
   [junit4]    > 	at org.apache.http.impl.client.CloseableHttpClient.execute(CloseableHttpClient.java:55)
   [junit4]    > 	at org.apache.solr.client.solrj.impl.HttpSolrClient.executeMethod(HttpSolrClient.java:511)
   [junit4]    > 	at org.apache.solr.client.solrj.impl.HttpSolrClient.request(HttpSolrClient.java:259)
   [junit4]    > 	at org.apache.solr.client.solrj.impl.HttpSolrClient.request(HttpSolrClient.java:248)
   [junit4]    > 	at org.apache.solr.client.solrj.SolrRequest.process(SolrRequest.java:149)
   [junit4]    > 	at org.apache.solr.client.solrj.SolrRequest.process(SolrRequest.java:166)
   [junit4]    > 	at org.apache.solr.cloud.StoppableIndexingThread.indexDocs(StoppableIndexingThread.java:176)
   [junit4]    > 	at org.apache.solr.cloud.StoppableIndexingThread.run(StoppableIndexingThread.java:115)
   [junit4]   2> 441207 INFO  (SUITE-RecoveryZkTest-seed#[E483A65CABC70E3E]-worker) [    ] o.a.s.SolrTestCaseJ4 ###deleteCore
   [junit4]   2> NOTE: leaving temporary files on disk at: /home/jenkins/workspace/Lucene-Solr-master-Linux/solr/build/solr-core/test/J2/temp/solr.cloud.RecoveryZkTest_E483A65CABC70E3E-001
   [junit4]   2> NOTE: test params are: codec=Lucene62, sim=ClassicSimilarity, locale=en-ZA, timezone=America/Kentucky/Monticello
   [junit4]   2> NOTE: Linux 4.4.0-21-generic i386/Oracle Corporation 1.8.0_92 (32-bit)/cpus=12,threads=1,free=242429808,total=435945472
   [junit4]   2> NOTE: All tests run in this JVM: [DistributedVersionInfoTest, SuggesterTest, EnumFieldTest, CollectionStateFormat2Test, TestJettySolrRunner, TestSolrQueryParserDefaultOperatorResource, BasicDistributedZk2Test, TestRecovery, TestXIncludeConfig, DirectSolrConnectionTest, TestDistributedStatsComponentCardinality, TestCloudManagedSchema, SuggesterTSTTest, SolrTestCaseJ4Test, PrimitiveFieldTypeTest, RecoveryZkTest]
   [junit4] Completed [99/612 (1!)] on J2 in 189.42s, 1 test, 1 error <<< FAILURES!

[...truncated 1667 lines...]
   [junit4] JVM J2: stdout was not empty, see: /home/jenkins/workspace/Lucene-Solr-master-Linux/solr/build/solr-core/test/temp/junit4-J2-20160609_001919_243.sysout
   [junit4] >>> JVM J2 emitted unexpected output (verbatim) ----
   [junit4] java.lang.OutOfMemoryError: GC overhead limit exceeded
   [junit4] Dumping heap to /home/jenkins/workspace/Lucene-Solr-master-Linux/heapdumps/java_pid20359.hprof ...
   [junit4] Heap dump file created [434040364 bytes in 1.337 secs]
   [junit4] <<< JVM J2: EOF ----

   [junit4] JVM J2: stderr was not empty, see: /home/jenkins/workspace/Lucene-Solr-master-Linux/solr/build/solr-core/test/temp/junit4-J2-20160609_001919_243.syserr
   [junit4] >>> JVM J2 emitted unexpected output (verbatim) ----
   [junit4] 
   [junit4] Exception: java.lang.OutOfMemoryError thrown from the UncaughtExceptionHandler in thread "StoppableIndexingThread"
   [junit4] <<< JVM J2: EOF ----

[...truncated 13 lines...]
BUILD FAILED
/home/jenkins/workspace/Lucene-Solr-master-Linux/build.xml:740: The following error occurred while executing this line:
/home/jenkins/workspace/Lucene-Solr-master-Linux/build.xml:684: The following error occurred while executing this line:
/home/jenkins/workspace/Lucene-Solr-master-Linux/build.xml:59: The following error occurred while executing this line:
/home/jenkins/workspace/Lucene-Solr-master-Linux/solr/build.xml:233: The following error occurred while executing this line:
/home/jenkins/workspace/Lucene-Solr-master-Linux/solr/common-build.xml:531: The following error occurred while executing this line:
/home/jenkins/workspace/Lucene-Solr-master-Linux/lucene/common-build.xml:1427: The following error occurred while executing this line:
/home/jenkins/workspace/Lucene-Solr-master-Linux/lucene/common-build.xml:984: There were test failures: 612 suites (10 ignored), 2560 tests, 1 error, 116 ignored (72 assumptions) [seed: E483A65CABC70E3E]

Total time: 65 minutes 43 seconds
Build step 'Invoke Ant' marked build as failure
Archiving artifacts
[WARNINGS] Skipping publisher since build result is FAILURE
Recording test results
Email was triggered for: Failure - Any
Sending email for trigger: Failure - Any



Mime
View raw message