lucene-dev mailing list archives

Site index · List index
Message view « Date » · « Thread »
Top « Date » · « Thread »
From Apache Jenkins Server <jenk...@builds.apache.org>
Subject [JENKINS] Lucene-Solr-NightlyTests-master - Build # 1044 - Still Failing
Date Fri, 17 Jun 2016 15:33:37 GMT
Build: https://builds.apache.org/job/Lucene-Solr-NightlyTests-master/1044/

2 tests failed.
FAILED:  org.apache.lucene.index.TestIndexSorting.testRandom3

Error Message:
Test abandoned because suite timeout was reached.

Stack Trace:
java.lang.Exception: Test abandoned because suite timeout was reached.
	at __randomizedtesting.SeedInfo.seed([B4776E82E8EDFF5B]:0)


FAILED:  junit.framework.TestSuite.org.apache.lucene.index.TestIndexSorting

Error Message:
Suite timeout exceeded (>= 7200000 msec).

Stack Trace:
java.lang.Exception: Suite timeout exceeded (>= 7200000 msec).
	at __randomizedtesting.SeedInfo.seed([B4776E82E8EDFF5B]:0)




Build Log:
[...truncated 1750 lines...]
   [junit4] Suite: org.apache.lucene.index.TestIndexSorting
   [junit4]   2> يون 17, 2016 11:19:38 ص com.carrotsearch.randomizedtesting.ThreadLeakControl$2
evaluate
   [junit4]   2> WARNING: Suite execution timed out: org.apache.lucene.index.TestIndexSorting
   [junit4]   2>    1) Thread[id=1, name=main, state=WAITING, group=main]
   [junit4]   2>         at java.lang.Object.wait(Native Method)
   [junit4]   2>         at java.lang.Thread.join(Thread.java:1245)
   [junit4]   2>         at java.lang.Thread.join(Thread.java:1319)
   [junit4]   2>         at com.carrotsearch.randomizedtesting.RandomizedRunner.runSuite(RandomizedRunner.java:601)
   [junit4]   2>         at com.carrotsearch.randomizedtesting.RandomizedRunner.run(RandomizedRunner.java:450)
   [junit4]   2>         at com.carrotsearch.ant.tasks.junit4.slave.SlaveMain.execute(SlaveMain.java:243)
   [junit4]   2>         at com.carrotsearch.ant.tasks.junit4.slave.SlaveMain.main(SlaveMain.java:354)
   [junit4]   2>         at com.carrotsearch.ant.tasks.junit4.slave.SlaveMainSafe.main(SlaveMainSafe.java:10)
   [junit4]   2>    2) Thread[id=2428, name=SUITE-TestIndexSorting-seed#[B4776E82E8EDFF5B],
state=RUNNABLE, group=TGRP-TestIndexSorting]
   [junit4]   2>         at java.lang.Thread.getStackTrace(Thread.java:1552)
   [junit4]   2>         at com.carrotsearch.randomizedtesting.ThreadLeakControl$4.run(ThreadLeakControl.java:688)
   [junit4]   2>         at com.carrotsearch.randomizedtesting.ThreadLeakControl$4.run(ThreadLeakControl.java:685)
   [junit4]   2>         at java.security.AccessController.doPrivileged(Native Method)
   [junit4]   2>         at com.carrotsearch.randomizedtesting.ThreadLeakControl.getStackTrace(ThreadLeakControl.java:685)
   [junit4]   2>         at com.carrotsearch.randomizedtesting.ThreadLeakControl.getThreadsWithTraces(ThreadLeakControl.java:701)
   [junit4]   2>         at com.carrotsearch.randomizedtesting.ThreadLeakControl.formatThreadStacksFull(ThreadLeakControl.java:681)
   [junit4]   2>         at com.carrotsearch.randomizedtesting.ThreadLeakControl.access$1000(ThreadLeakControl.java:64)
   [junit4]   2>         at com.carrotsearch.randomizedtesting.ThreadLeakControl$2.evaluate(ThreadLeakControl.java:414)
   [junit4]   2>         at com.carrotsearch.randomizedtesting.RandomizedRunner.runSuite(RandomizedRunner.java:681)
   [junit4]   2>         at com.carrotsearch.randomizedtesting.RandomizedRunner.access$200(RandomizedRunner.java:140)
   [junit4]   2>         at com.carrotsearch.randomizedtesting.RandomizedRunner$2.run(RandomizedRunner.java:591)
   [junit4]   2>    3) Thread[id=9, name=JUnit4-serializer-daemon, state=TIMED_WAITING,
group=main]
   [junit4]   2>         at java.lang.Thread.sleep(Native Method)
   [junit4]   2>         at com.carrotsearch.ant.tasks.junit4.events.Serializer$1.run(Serializer.java:47)
   [junit4]   2>    4) Thread[id=2429, name=TEST-TestIndexSorting.testRandom3-seed#[B4776E82E8EDFF5B],
state=RUNNABLE, group=TGRP-TestIndexSorting]
   [junit4]   2>         at java.lang.Throwable.fillInStackTrace(Native Method)
   [junit4]   2>         at java.lang.Throwable.fillInStackTrace(Throwable.java:783)
   [junit4]   2>         at java.lang.Throwable.<init>(Throwable.java:250)
   [junit4]   2>         at java.lang.Exception.<init>(Exception.java:54)
   [junit4]   2>         at java.lang.RuntimeException.<init>(RuntimeException.java:51)
   [junit4]   2>         at java.lang.UnsupportedOperationException.<init>(UnsupportedOperationException.java:42)
   [junit4]   2>         at org.apache.lucene.codecs.DocValuesConsumer$1$1.remove(DocValuesConsumer.java:305)
   [junit4]   2>         at org.apache.lucene.util.TestUtil.checkIterator(TestUtil.java:181)
   [junit4]   2>         at org.apache.lucene.codecs.asserting.AssertingDocValuesFormat$AssertingDocValuesConsumer.addNumericField(AssertingDocValuesFormat.java:87)
   [junit4]   2>         at org.apache.lucene.codecs.perfield.PerFieldDocValuesFormat$FieldsWriter.addNumericField(PerFieldDocValuesFormat.java:109)
   [junit4]   2>         at org.apache.lucene.codecs.DocValuesConsumer.mergeNumericField(DocValuesConsumer.java:279)
   [junit4]   2>         at org.apache.lucene.codecs.DocValuesConsumer.merge(DocValuesConsumer.java:165)
   [junit4]   2>         at org.apache.lucene.index.SegmentMerger.mergeDocValues(SegmentMerger.java:167)
   [junit4]   2>         at org.apache.lucene.index.SegmentMerger.merge(SegmentMerger.java:111)
   [junit4]   2>         at org.apache.lucene.index.IndexWriter.mergeMiddle(IndexWriter.java:4291)
   [junit4]   2>         at org.apache.lucene.index.IndexWriter.merge(IndexWriter.java:3868)
   [junit4]   2>         at org.apache.lucene.index.SerialMergeScheduler.merge(SerialMergeScheduler.java:40)
   [junit4]   2>         at org.apache.lucene.index.IndexWriter.maybeMerge(IndexWriter.java:2055)
   [junit4]   2>         at org.apache.lucene.index.IndexWriter.doAfterSegmentFlushed(IndexWriter.java:4933)
   [junit4]   2>         at org.apache.lucene.index.DocumentsWriter$MergePendingEvent.process(DocumentsWriter.java:738)
   [junit4]   2>         at org.apache.lucene.index.IndexWriter.processEvents(IndexWriter.java:4971)
   [junit4]   2>         at org.apache.lucene.index.IndexWriter.processEvents(IndexWriter.java:4962)
   [junit4]   2>         at org.apache.lucene.index.IndexWriter.updateDocument(IndexWriter.java:1568)
   [junit4]   2>         at org.apache.lucene.index.IndexWriter.addDocument(IndexWriter.java:1310)
   [junit4]   2>         at org.apache.lucene.index.TestIndexSorting.testRandom3(TestIndexSorting.java:1265)
   [junit4]   2>         at sun.reflect.NativeMethodAccessorImpl.invoke0(Native Method)
   [junit4]   2>         at sun.reflect.NativeMethodAccessorImpl.invoke(NativeMethodAccessorImpl.java:62)
   [junit4]   2>         at sun.reflect.DelegatingMethodAccessorImpl.invoke(DelegatingMethodAccessorImpl.java:43)
   [junit4]   2>         at java.lang.reflect.Method.invoke(Method.java:498)
   [junit4]   2>         at com.carrotsearch.randomizedtesting.RandomizedRunner.invoke(RandomizedRunner.java:1764)
   [junit4]   2>         at com.carrotsearch.randomizedtesting.RandomizedRunner$8.evaluate(RandomizedRunner.java:871)
   [junit4]   2>         at com.carrotsearch.randomizedtesting.RandomizedRunner$9.evaluate(RandomizedRunner.java:907)
   [junit4]   2>         at com.carrotsearch.randomizedtesting.RandomizedRunner$10.evaluate(RandomizedRunner.java:921)
   [junit4]   2>         at org.apache.lucene.util.TestRuleSetupTeardownChained$1.evaluate(TestRuleSetupTeardownChained.java:49)
   [junit4]   2>         at org.apache.lucene.util.AbstractBeforeAfterRule$1.evaluate(AbstractBeforeAfterRule.java:45)
   [junit4]   2>         at org.apache.lucene.util.TestRuleThreadAndTestName$1.evaluate(TestRuleThreadAndTestName.java:48)
   [junit4]   2>         at org.apache.lucene.util.TestRuleIgnoreAfterMaxFailures$1.evaluate(TestRuleIgnoreAfterMaxFailures.java:64)
   [junit4]   2>         at org.apache.lucene.util.TestRuleMarkFailure$1.evaluate(TestRuleMarkFailure.java:47)
   [junit4]   2>         at com.carrotsearch.randomizedtesting.rules.StatementAdapter.evaluate(StatementAdapter.java:36)
   [junit4]   2>         at com.carrotsearch.randomizedtesting.ThreadLeakControl$StatementRunner.run(ThreadLeakControl.java:367)
   [junit4]   2>         at com.carrotsearch.randomizedtesting.ThreadLeakControl.forkTimeoutingTask(ThreadLeakControl.java:809)
   [junit4]   2>         at com.carrotsearch.randomizedtesting.ThreadLeakControl$3.evaluate(ThreadLeakControl.java:460)
   [junit4]   2>         at com.carrotsearch.randomizedtesting.RandomizedRunner.runSingleTest(RandomizedRunner.java:880)
   [junit4]   2>         at com.carrotsearch.randomizedtesting.RandomizedRunner$5.evaluate(RandomizedRunner.java:781)
   [junit4]   2>         at com.carrotsearch.randomizedtesting.RandomizedRunner$6.evaluate(RandomizedRunner.java:816)
   [junit4]   2>         at com.carrotsearch.randomizedtesting.RandomizedRunner$7.evaluate(RandomizedRunner.java:827)
   [junit4]   2>         at org.apache.lucene.util.AbstractBeforeAfterRule$1.evaluate(AbstractBeforeAfterRule.java:45)
   [junit4]   2>         at com.carrotsearch.randomizedtesting.rules.StatementAdapter.evaluate(StatementAdapter.java:36)
   [junit4]   2>         at org.apache.lucene.util.TestRuleStoreClassName$1.evaluate(TestRuleStoreClassName.java:41)
   [junit4]   2>         at com.carrotsearch.randomizedtesting.rules.NoShadowingOrOverridesOnMethodsRule$1.evaluate(NoShadowingOrOverridesOnMethodsRule.java:40)
   [junit4]   2>         at com.carrotsearch.randomizedtesting.rules.NoShadowingOrOverridesOnMethodsRule$1.evaluate(NoShadowingOrOverridesOnMethodsRule.java:40)
   [junit4]   2>         at com.carrotsearch.randomizedtesting.rules.StatementAdapter.evaluate(StatementAdapter.java:36)
   [junit4]   2>         at com.carrotsearch.randomizedtesting.rules.StatementAdapter.evaluate(StatementAdapter.java:36)
   [junit4]   2>         at com.carrotsearch.randomizedtesting.rules.StatementAdapter.evaluate(StatementAdapter.java:36)
   [junit4]   2>         at org.apache.lucene.util.TestRuleAssertionsRequired$1.evaluate(TestRuleAssertionsRequired.java:53)
   [junit4]   2>         at org.apache.lucene.util.TestRuleMarkFailure$1.evaluate(TestRuleMarkFailure.java:47)
   [junit4]   2>         at org.apache.lucene.util.TestRuleIgnoreAfterMaxFailures$1.evaluate(TestRuleIgnoreAfterMaxFailures.java:64)
   [junit4]   2>         at org.apache.lucene.util.TestRuleIgnoreTestSuites$1.evaluate(TestRuleIgnoreTestSuites.java:54)
   [junit4]   2>         at com.carrotsearch.randomizedtesting.rules.StatementAdapter.evaluate(StatementAdapter.java:36)
   [junit4]   2>         at com.carrotsearch.randomizedtesting.ThreadLeakControl$StatementRunner.run(ThreadLeakControl.java:367)
   [junit4]   2>         at java.lang.Thread.run(Thread.java:745)
   [junit4]   2> NOTE: download the large Jenkins line-docs file by running 'ant get-jenkins-line-docs'
in the lucene directory.
   [junit4]   2> NOTE: reproduce with: ant test  -Dtestcase=TestIndexSorting -Dtests.method=testRandom3
-Dtests.seed=B4776E82E8EDFF5B -Dtests.multiplier=2 -Dtests.nightly=true -Dtests.slow=true
-Dtests.linedocsfile=/x1/jenkins/lucene-data/enwiki.random.lines.txt -Dtests.locale=ar-OM
-Dtests.timezone=America/Manaus -Dtests.asserts=true -Dtests.file.encoding=UTF-8
   [junit4] ERROR   7177s J1 | TestIndexSorting.testRandom3 <<<
   [junit4]    > Throwable #1: java.lang.Exception: Test abandoned because suite timeout
was reached.
   [junit4]    > 	at __randomizedtesting.SeedInfo.seed([B4776E82E8EDFF5B]:0)
   [junit4]   2> يون 17, 2016 11:19:38 ص com.carrotsearch.randomizedtesting.ThreadLeakControl
checkThreadLeaks
   [junit4]   2> WARNING: Will linger awaiting termination of 1 leaked thread(s).
   [junit4]   2> يون 17, 2016 11:19:58 ص com.carrotsearch.randomizedtesting.ThreadLeakControl
checkThreadLeaks
   [junit4]   2> SEVERE: 1 thread leaked from SUITE scope at org.apache.lucene.index.TestIndexSorting:

   [junit4]   2>    1) Thread[id=2429, name=TEST-TestIndexSorting.testRandom3-seed#[B4776E82E8EDFF5B],
state=RUNNABLE, group=TGRP-TestIndexSorting]
   [junit4]   2>         at java.lang.Throwable.fillInStackTrace(Native Method)
   [junit4]   2>         at java.lang.Throwable.fillInStackTrace(Throwable.java:783)
   [junit4]   2>         at java.lang.Throwable.<init>(Throwable.java:250)
   [junit4]   2>         at java.lang.Exception.<init>(Exception.java:54)
   [junit4]   2>         at java.lang.RuntimeException.<init>(RuntimeException.java:51)
   [junit4]   2>         at java.lang.UnsupportedOperationException.<init>(UnsupportedOperationException.java:42)
   [junit4]   2>         at org.apache.lucene.codecs.DocValuesConsumer$1$1.remove(DocValuesConsumer.java:305)
   [junit4]   2>         at org.apache.lucene.util.TestUtil.checkIterator(TestUtil.java:181)
   [junit4]   2>         at org.apache.lucene.codecs.asserting.AssertingDocValuesFormat$AssertingDocValuesConsumer.addNumericField(AssertingDocValuesFormat.java:87)
   [junit4]   2>         at org.apache.lucene.codecs.perfield.PerFieldDocValuesFormat$FieldsWriter.addNumericField(PerFieldDocValuesFormat.java:109)
   [junit4]   2>         at org.apache.lucene.codecs.DocValuesConsumer.mergeNumericField(DocValuesConsumer.java:279)
   [junit4]   2>         at org.apache.lucene.codecs.DocValuesConsumer.merge(DocValuesConsumer.java:165)
   [junit4]   2>         at org.apache.lucene.index.SegmentMerger.mergeDocValues(SegmentMerger.java:167)
   [junit4]   2>         at org.apache.lucene.index.SegmentMerger.merge(SegmentMerger.java:111)
   [junit4]   2>         at org.apache.lucene.index.IndexWriter.mergeMiddle(IndexWriter.java:4291)
   [junit4]   2>         at org.apache.lucene.index.IndexWriter.merge(IndexWriter.java:3868)
   [junit4]   2>         at org.apache.lucene.index.SerialMergeScheduler.merge(SerialMergeScheduler.java:40)
   [junit4]   2>         at org.apache.lucene.index.IndexWriter.maybeMerge(IndexWriter.java:2055)
   [junit4]   2>         at org.apache.lucene.index.IndexWriter.doAfterSegmentFlushed(IndexWriter.java:4933)
   [junit4]   2>         at org.apache.lucene.index.DocumentsWriter$MergePendingEvent.process(DocumentsWriter.java:738)
   [junit4]   2>         at org.apache.lucene.index.IndexWriter.processEvents(IndexWriter.java:4971)
   [junit4]   2>         at org.apache.lucene.index.IndexWriter.processEvents(IndexWriter.java:4962)
   [junit4]   2>         at org.apache.lucene.index.IndexWriter.updateDocument(IndexWriter.java:1568)
   [junit4]   2>         at org.apache.lucene.index.IndexWriter.addDocument(IndexWriter.java:1310)
   [junit4]   2>         at org.apache.lucene.index.TestIndexSorting.testRandom3(TestIndexSorting.java:1265)
   [junit4]   2>         at sun.reflect.NativeMethodAccessorImpl.invoke0(Native Method)
   [junit4]   2>         at sun.reflect.NativeMethodAccessorImpl.invoke(NativeMethodAccessorImpl.java:62)
   [junit4]   2>         at sun.reflect.DelegatingMethodAccessorImpl.invoke(DelegatingMethodAccessorImpl.java:43)
   [junit4]   2>         at java.lang.reflect.Method.invoke(Method.java:498)
   [junit4]   2>         at com.carrotsearch.randomizedtesting.RandomizedRunner.invoke(RandomizedRunner.java:1764)
   [junit4]   2>         at com.carrotsearch.randomizedtesting.RandomizedRunner$8.evaluate(RandomizedRunner.java:871)
   [junit4]   2>         at com.carrotsearch.randomizedtesting.RandomizedRunner$9.evaluate(RandomizedRunner.java:907)
   [junit4]   2>         at com.carrotsearch.randomizedtesting.RandomizedRunner$10.evaluate(RandomizedRunner.java:921)
   [junit4]   2>         at org.apache.lucene.util.TestRuleSetupTeardownChained$1.evaluate(TestRuleSetupTeardownChained.java:49)
   [junit4]   2>         at org.apache.lucene.util.AbstractBeforeAfterRule$1.evaluate(AbstractBeforeAfterRule.java:45)
   [junit4]   2>         at org.apache.lucene.util.TestRuleThreadAndTestName$1.evaluate(TestRuleThreadAndTestName.java:48)
   [junit4]   2>         at org.apache.lucene.util.TestRuleIgnoreAfterMaxFailures$1.evaluate(TestRuleIgnoreAfterMaxFailures.java:64)
   [junit4]   2>         at org.apache.lucene.util.TestRuleMarkFailure$1.evaluate(TestRuleMarkFailure.java:47)
   [junit4]   2>         at com.carrotsearch.randomizedtesting.rules.StatementAdapter.evaluate(StatementAdapter.java:36)
   [junit4]   2>         at com.carrotsearch.randomizedtesting.ThreadLeakControl$StatementRunner.run(ThreadLeakControl.java:367)
   [junit4]   2>         at com.carrotsearch.randomizedtesting.ThreadLeakControl.forkTimeoutingTask(ThreadLeakControl.java:809)
   [junit4]   2>         at com.carrotsearch.randomizedtesting.ThreadLeakControl$3.evaluate(ThreadLeakControl.java:460)
   [junit4]   2>         at com.carrotsearch.randomizedtesting.RandomizedRunner.runSingleTest(RandomizedRunner.java:880)
   [junit4]   2>         at com.carrotsearch.randomizedtesting.RandomizedRunner$5.evaluate(RandomizedRunner.java:781)
   [junit4]   2>         at com.carrotsearch.randomizedtesting.RandomizedRunner$6.evaluate(RandomizedRunner.java:816)
   [junit4]   2>         at com.carrotsearch.randomizedtesting.RandomizedRunner$7.evaluate(RandomizedRunner.java:827)
   [junit4]   2>         at org.apache.lucene.util.AbstractBeforeAfterRule$1.evaluate(AbstractBeforeAfterRule.java:45)
   [junit4]   2>         at com.carrotsearch.randomizedtesting.rules.StatementAdapter.evaluate(StatementAdapter.java:36)
   [junit4]   2>         at org.apache.lucene.util.TestRuleStoreClassName$1.evaluate(TestRuleStoreClassName.java:41)
   [junit4]   2>         at com.carrotsearch.randomizedtesting.rules.NoShadowingOrOverridesOnMethodsRule$1.evaluate(NoShadowingOrOverridesOnMethodsRule.java:40)
   [junit4]   2>         at com.carrotsearch.randomizedtesting.rules.NoShadowingOrOverridesOnMethodsRule$1.evaluate(NoShadowingOrOverridesOnMethodsRule.java:40)
   [junit4]   2>         at com.carrotsearch.randomizedtesting.rules.StatementAdapter.evaluate(StatementAdapter.java:36)
   [junit4]   2>         at com.carrotsearch.randomizedtesting.rules.StatementAdapter.evaluate(StatementAdapter.java:36)
   [junit4]   2>         at com.carrotsearch.randomizedtesting.rules.StatementAdapter.evaluate(StatementAdapter.java:36)
   [junit4]   2>         at org.apache.lucene.util.TestRuleAssertionsRequired$1.evaluate(TestRuleAssertionsRequired.java:53)
   [junit4]   2>         at org.apache.lucene.util.TestRuleMarkFailure$1.evaluate(TestRuleMarkFailure.java:47)
   [junit4]   2>         at org.apache.lucene.util.TestRuleIgnoreAfterMaxFailures$1.evaluate(TestRuleIgnoreAfterMaxFailures.java:64)
   [junit4]   2>         at org.apache.lucene.util.TestRuleIgnoreTestSuites$1.evaluate(TestRuleIgnoreTestSuites.java:54)
   [junit4]   2>         at com.carrotsearch.randomizedtesting.rules.StatementAdapter.evaluate(StatementAdapter.java:36)
   [junit4]   2>         at com.carrotsearch.randomizedtesting.ThreadLeakControl$StatementRunner.run(ThreadLeakControl.java:367)
   [junit4]   2>         at java.lang.Thread.run(Thread.java:745)
   [junit4]   2> يون 17, 2016 11:19:58 ص com.carrotsearch.randomizedtesting.ThreadLeakControl
tryToInterruptAll
   [junit4]   2> INFO: Starting to interrupt leaked threads:
   [junit4]   2>    1) Thread[id=2429, name=TEST-TestIndexSorting.testRandom3-seed#[B4776E82E8EDFF5B],
state=RUNNABLE, group=TGRP-TestIndexSorting]
   [junit4]   2> NOTE: leaving temporary files on disk at: /x1/jenkins/jenkins-slave/workspace/Lucene-Solr-NightlyTests-master/lucene/build/core/test/J1/temp/lucene.index.TestIndexSorting_B4776E82E8EDFF5B-001
   [junit4]   2> Jun 17, 2016 3:19:58 PM com.carrotsearch.randomizedtesting.ThreadLeakControl
tryToInterruptAll
   [junit4]   2> INFO: All leaked threads terminated.
   [junit4]   2> NOTE: test params are: codec=Asserting(Lucene62): {docs=BlockTreeOrds(blocksize=128),
norms=BlockTreeOrds(blocksize=128), positions=TestBloomFilteredLucenePostings(BloomFilteringPostingsFormat(Lucene50(blocksize=128))),
id=BlockTreeOrds(blocksize=128), term_vectors=PostingsFormat(name=Memory doPackFST= true)},
docValues:{sorted=DocValuesFormat(name=Lucene54), double=DocValuesFormat(name=Lucene54), bytes=DocValuesFormat(name=Asserting),
foo=DocValuesFormat(name=Memory), binary=DocValuesFormat(name=Lucene54), numeric=DocValuesFormat(name=Lucene54),
sorted_set=DocValuesFormat(name=Memory), id=DocValuesFormat(name=Asserting), float=DocValuesFormat(name=Lucene54),
sorted_numeric=DocValuesFormat(name=Asserting), long=DocValuesFormat(name=Lucene54), int=DocValuesFormat(name=Asserting)},
maxPointsInLeafNode=1972, maxMBSortInHeap=7.8081509358457755, sim=ClassicSimilarity, locale=ar-OM,
timezone=America/Manaus
   [junit4]   2> NOTE: Linux 3.13.0-85-generic amd64/Oracle Corporation 1.8.0_74 (64-bit)/cpus=4,threads=1,free=241461104,total=425721856
   [junit4]   2> NOTE: All tests run in this JVM: [TestFilterIterator, TestLSBRadixSorter,
Test2BSortedDocValuesOrds, TestOperations, TestApproximationSearchEquivalence, TestNewestSegment,
TestControlledRealTimeReopenThread, TestMultiDocValues, TestTermVectors, TestMergeSchedulerExternal,
TestDeterminizeLexicon, TestBooleanRewrites, TestScorerPerf, TestIndexWriterUnicode, Test2BNumericDocValues,
TestSynonymQuery, TestReadOnlyIndex, TestVirtualMethod, TestSortedNumericSortField, TestBKD,
TestPackedInts, TestDirectPacked, TestInPlaceMergeSorter, TestParallelLeafReader, TestDocument,
MultiCollectorTest, TestBooleanQueryVisitSubscorers, TestTransactions, TestByteSlices, TestHighCompressionMode,
TestGrowableByteArrayDataOutput, TestPostingsOffsets, TestSearchWithThreads, TestSpanExplanations,
TestFieldMaskingSpanQuery, TestPerFieldDocValuesFormat, TestSameTokenSamePosition, TestEarlyTermination,
TestBoolean2, TestSetOnce, TestFSTs, TestLucene50FieldInfoFormat, TestSingleInstanceLockFactory,
TestFileSwitchDirectory, TestTwoPhaseCommitTool, TestBytesRefArray, TestConstantScoreQuery,
TestIndexWriterFromReader, TestPositionIncrement, TestSloppyPhraseQuery2, TestByteBlockPool,
TestAllFilesHaveCodecHeader, TestPerSegmentDeletes, FiniteStringsIteratorTest, TestIndexSorting]
   [junit4]   2> NOTE: download the large Jenkins line-docs file by running 'ant get-jenkins-line-docs'
in the lucene directory.
   [junit4]   2> NOTE: reproduce with: ant test  -Dtestcase=TestIndexSorting -Dtests.seed=B4776E82E8EDFF5B
-Dtests.multiplier=2 -Dtests.nightly=true -Dtests.slow=true -Dtests.linedocsfile=/x1/jenkins/lucene-data/enwiki.random.lines.txt
-Dtests.locale=ar-OM -Dtests.timezone=America/Manaus -Dtests.asserts=true -Dtests.file.encoding=UTF-8
   [junit4] ERROR   0.00s J1 | TestIndexSorting (suite) <<<
   [junit4]    > Throwable #1: java.lang.Exception: Suite timeout exceeded (>= 7200000
msec).
   [junit4]    > 	at __randomizedtesting.SeedInfo.seed([B4776E82E8EDFF5B]:0)
   [junit4] Completed [415/432 (1!)] on J1 in 7220.20s, 23 tests, 2 errors <<< FAILURES!

[...truncated 74 lines...]
BUILD FAILED
/x1/jenkins/jenkins-slave/workspace/Lucene-Solr-NightlyTests-master/build.xml:747: The following
error occurred while executing this line:
/x1/jenkins/jenkins-slave/workspace/Lucene-Solr-NightlyTests-master/build.xml:684: The following
error occurred while executing this line:
/x1/jenkins/jenkins-slave/workspace/Lucene-Solr-NightlyTests-master/build.xml:59: The following
error occurred while executing this line:
/x1/jenkins/jenkins-slave/workspace/Lucene-Solr-NightlyTests-master/lucene/build.xml:50: The
following error occurred while executing this line:
/x1/jenkins/jenkins-slave/workspace/Lucene-Solr-NightlyTests-master/lucene/common-build.xml:1427:
The following error occurred while executing this line:
/x1/jenkins/jenkins-slave/workspace/Lucene-Solr-NightlyTests-master/lucene/common-build.xml:984:
There were test failures: 432 suites (1 ignored), 3700 tests, 1 suite-level error, 1 error,
39 ignored (35 assumptions) [seed: B4776E82E8EDFF5B]

Total time: 155 minutes 25 seconds
Build step 'Invoke Ant' marked build as failure
Archiving artifacts
No prior successful build to compare, so performing full copy of artifacts
Recording test results
Email was triggered for: Failure - Any
Sending email for trigger: Failure - Any




Mime
View raw message