lucene-dev mailing list archives

Site index · List index
Message view « Date » · « Thread »
Top « Date » · « Thread »
From Policeman Jenkins Server <jenk...@thetaphi.de>
Subject [JENKINS] Lucene-Solr-master-MacOSX (64bit/jdk1.8.0) - Build # 3353 - Still Failing!
Date Tue, 21 Jun 2016 04:44:22 GMT
Build: http://jenkins.thetaphi.de/job/Lucene-Solr-master-MacOSX/3353/
Java: 64bit/jdk1.8.0 -XX:+UseCompressedOops -XX:+UseSerialGC

1 tests failed.
FAILED:  org.apache.solr.schema.TestManagedSchemaAPI.test

Error Message:
Error from server at http://127.0.0.1:62237/solr/testschemaapi_shard1_replica1: ERROR: [doc=2] unknown field 'myNewField1'

Stack Trace:
org.apache.solr.client.solrj.impl.CloudSolrClient$RouteException: Error from server at http://127.0.0.1:62237/solr/testschemaapi_shard1_replica1: ERROR: [doc=2] unknown field 'myNewField1'
	at __randomizedtesting.SeedInfo.seed([CA900C6A7C14BFB1:42C433B0D2E8D249]:0)
	at org.apache.solr.client.solrj.impl.CloudSolrClient.directUpdate(CloudSolrClient.java:697)
	at org.apache.solr.client.solrj.impl.CloudSolrClient.sendRequest(CloudSolrClient.java:1109)
	at org.apache.solr.client.solrj.impl.CloudSolrClient.requestWithRetryOnStaleState(CloudSolrClient.java:998)
	at org.apache.solr.client.solrj.impl.CloudSolrClient.request(CloudSolrClient.java:934)
	at org.apache.solr.schema.TestManagedSchemaAPI.testAddFieldAndDocument(TestManagedSchemaAPI.java:86)
	at org.apache.solr.schema.TestManagedSchemaAPI.test(TestManagedSchemaAPI.java:55)
	at sun.reflect.NativeMethodAccessorImpl.invoke0(Native Method)
	at sun.reflect.NativeMethodAccessorImpl.invoke(NativeMethodAccessorImpl.java:62)
	at sun.reflect.DelegatingMethodAccessorImpl.invoke(DelegatingMethodAccessorImpl.java:43)
	at java.lang.reflect.Method.invoke(Method.java:498)
	at com.carrotsearch.randomizedtesting.RandomizedRunner.invoke(RandomizedRunner.java:1764)
	at com.carrotsearch.randomizedtesting.RandomizedRunner$8.evaluate(RandomizedRunner.java:871)
	at com.carrotsearch.randomizedtesting.RandomizedRunner$9.evaluate(RandomizedRunner.java:907)
	at com.carrotsearch.randomizedtesting.RandomizedRunner$10.evaluate(RandomizedRunner.java:921)
	at com.carrotsearch.randomizedtesting.rules.SystemPropertiesRestoreRule$1.evaluate(SystemPropertiesRestoreRule.java:57)
	at org.apache.lucene.util.TestRuleSetupTeardownChained$1.evaluate(TestRuleSetupTeardownChained.java:49)
	at org.apache.lucene.util.AbstractBeforeAfterRule$1.evaluate(AbstractBeforeAfterRule.java:45)
	at org.apache.lucene.util.TestRuleThreadAndTestName$1.evaluate(TestRuleThreadAndTestName.java:48)
	at org.apache.lucene.util.TestRuleIgnoreAfterMaxFailures$1.evaluate(TestRuleIgnoreAfterMaxFailures.java:64)
	at org.apache.lucene.util.TestRuleMarkFailure$1.evaluate(TestRuleMarkFailure.java:47)
	at com.carrotsearch.randomizedtesting.rules.StatementAdapter.evaluate(StatementAdapter.java:36)
	at com.carrotsearch.randomizedtesting.ThreadLeakControl$StatementRunner.run(ThreadLeakControl.java:367)
	at com.carrotsearch.randomizedtesting.ThreadLeakControl.forkTimeoutingTask(ThreadLeakControl.java:809)
	at com.carrotsearch.randomizedtesting.ThreadLeakControl$3.evaluate(ThreadLeakControl.java:460)
	at com.carrotsearch.randomizedtesting.RandomizedRunner.runSingleTest(RandomizedRunner.java:880)
	at com.carrotsearch.randomizedtesting.RandomizedRunner$5.evaluate(RandomizedRunner.java:781)
	at com.carrotsearch.randomizedtesting.RandomizedRunner$6.evaluate(RandomizedRunner.java:816)
	at com.carrotsearch.randomizedtesting.RandomizedRunner$7.evaluate(RandomizedRunner.java:827)
	at com.carrotsearch.randomizedtesting.rules.StatementAdapter.evaluate(StatementAdapter.java:36)
	at com.carrotsearch.randomizedtesting.rules.SystemPropertiesRestoreRule$1.evaluate(SystemPropertiesRestoreRule.java:57)
	at org.apache.lucene.util.AbstractBeforeAfterRule$1.evaluate(AbstractBeforeAfterRule.java:45)
	at com.carrotsearch.randomizedtesting.rules.StatementAdapter.evaluate(StatementAdapter.java:36)
	at org.apache.lucene.util.TestRuleStoreClassName$1.evaluate(TestRuleStoreClassName.java:41)
	at com.carrotsearch.randomizedtesting.rules.NoShadowingOrOverridesOnMethodsRule$1.evaluate(NoShadowingOrOverridesOnMethodsRule.java:40)
	at com.carrotsearch.randomizedtesting.rules.NoShadowingOrOverridesOnMethodsRule$1.evaluate(NoShadowingOrOverridesOnMethodsRule.java:40)
	at com.carrotsearch.randomizedtesting.rules.StatementAdapter.evaluate(StatementAdapter.java:36)
	at com.carrotsearch.randomizedtesting.rules.StatementAdapter.evaluate(StatementAdapter.java:36)
	at com.carrotsearch.randomizedtesting.rules.StatementAdapter.evaluate(StatementAdapter.java:36)
	at org.apache.lucene.util.TestRuleAssertionsRequired$1.evaluate(TestRuleAssertionsRequired.java:53)
	at org.apache.lucene.util.TestRuleMarkFailure$1.evaluate(TestRuleMarkFailure.java:47)
	at org.apache.lucene.util.TestRuleIgnoreAfterMaxFailures$1.evaluate(TestRuleIgnoreAfterMaxFailures.java:64)
	at org.apache.lucene.util.TestRuleIgnoreTestSuites$1.evaluate(TestRuleIgnoreTestSuites.java:54)
	at com.carrotsearch.randomizedtesting.rules.StatementAdapter.evaluate(StatementAdapter.java:36)
	at com.carrotsearch.randomizedtesting.ThreadLeakControl$StatementRunner.run(ThreadLeakControl.java:367)
	at java.lang.Thread.run(Thread.java:745)
Caused by: org.apache.solr.client.solrj.impl.HttpSolrClient$RemoteSolrException: Error from server at http://127.0.0.1:62237/solr/testschemaapi_shard1_replica1: ERROR: [doc=2] unknown field 'myNewField1'
	at org.apache.solr.client.solrj.impl.HttpSolrClient.executeMethod(HttpSolrClient.java:606)
	at org.apache.solr.client.solrj.impl.HttpSolrClient.request(HttpSolrClient.java:259)
	at org.apache.solr.client.solrj.impl.HttpSolrClient.request(HttpSolrClient.java:248)
	at org.apache.solr.client.solrj.impl.LBHttpSolrClient.doRequest(LBHttpSolrClient.java:413)
	at org.apache.solr.client.solrj.impl.LBHttpSolrClient.request(LBHttpSolrClient.java:366)
	at org.apache.solr.client.solrj.impl.CloudSolrClient.lambda$directUpdate$0(CloudSolrClient.java:674)
	at java.util.concurrent.FutureTask.run(FutureTask.java:266)
	at org.apache.solr.common.util.ExecutorUtil$MDCAwareThreadPoolExecutor.lambda$execute$0(ExecutorUtil.java:229)
	at java.util.concurrent.ThreadPoolExecutor.runWorker(ThreadPoolExecutor.java:1142)
	at java.util.concurrent.ThreadPoolExecutor$Worker.run(ThreadPoolExecutor.java:617)
	... 1 more




Build Log:
[...truncated 10934 lines...]
   [junit4] Suite: org.apache.solr.schema.TestManagedSchemaAPI
   [junit4]   2> Creating dataDir: /Users/jenkins/workspace/Lucene-Solr-master-MacOSX/solr/build/solr-core/test/J0/temp/solr.schema.TestManagedSchemaAPI_CA900C6A7C14BFB1-001/init-core-data-001
   [junit4]   2> 1025839 INFO  (SUITE-TestManagedSchemaAPI-seed#[CA900C6A7C14BFB1]-worker) [    ] o.a.s.SolrTestCaseJ4 Randomized ssl (false) and clientAuth (false) via: @org.apache.solr.util.RandomizeSSL(reason=, value=NaN, ssl=NaN, clientAuth=NaN) w/ MAC_OS_X supressed clientAuth
   [junit4]   2> 1025841 INFO  (SUITE-TestManagedSchemaAPI-seed#[CA900C6A7C14BFB1]-worker) [    ] o.a.s.c.ZkTestServer STARTING ZK TEST SERVER
   [junit4]   2> 1025841 INFO  (Thread-2412) [    ] o.a.s.c.ZkTestServer client port:0.0.0.0/0.0.0.0:0
   [junit4]   2> 1025841 INFO  (Thread-2412) [    ] o.a.s.c.ZkTestServer Starting server
   [junit4]   2> 1025941 INFO  (SUITE-TestManagedSchemaAPI-seed#[CA900C6A7C14BFB1]-worker) [    ] o.a.s.c.ZkTestServer start zk server on port:62235
   [junit4]   2> 1025941 INFO  (SUITE-TestManagedSchemaAPI-seed#[CA900C6A7C14BFB1]-worker) [    ] o.a.s.c.c.SolrZkClient Using default ZkCredentialsProvider
   [junit4]   2> 1025942 INFO  (SUITE-TestManagedSchemaAPI-seed#[CA900C6A7C14BFB1]-worker) [    ] o.a.s.c.c.ConnectionManager Waiting for client to connect to ZooKeeper
   [junit4]   2> 1025960 INFO  (zkCallback-8543-thread-1) [    ] o.a.s.c.c.ConnectionManager Watcher org.apache.solr.common.cloud.ConnectionManager@7790a50d name:ZooKeeperConnection Watcher:127.0.0.1:62235 got event WatchedEvent state:SyncConnected type:None path:null path:null type:None
   [junit4]   2> 1025961 INFO  (SUITE-TestManagedSchemaAPI-seed#[CA900C6A7C14BFB1]-worker) [    ] o.a.s.c.c.ConnectionManager Client is connected to ZooKeeper
   [junit4]   2> 1025961 INFO  (SUITE-TestManagedSchemaAPI-seed#[CA900C6A7C14BFB1]-worker) [    ] o.a.s.c.c.SolrZkClient Using default ZkACLProvider
   [junit4]   2> 1025961 INFO  (SUITE-TestManagedSchemaAPI-seed#[CA900C6A7C14BFB1]-worker) [    ] o.a.s.c.c.SolrZkClient makePath: /solr/solr.xml
   [junit4]   2> 1025967 INFO  (jetty-launcher-8542-thread-2) [    ] o.e.j.s.Server jetty-9.3.8.v20160314
   [junit4]   2> 1025967 INFO  (jetty-launcher-8542-thread-1) [    ] o.e.j.s.Server jetty-9.3.8.v20160314
   [junit4]   2> 1025969 INFO  (jetty-launcher-8542-thread-2) [    ] o.e.j.s.h.ContextHandler Started o.e.j.s.ServletContextHandler@454c9076{/solr,null,AVAILABLE}
   [junit4]   2> 1025971 INFO  (jetty-launcher-8542-thread-2) [    ] o.e.j.s.ServerConnector Started ServerConnector@3b7329ab{HTTP/1.1,[http/1.1]}{127.0.0.1:62237}
   [junit4]   2> 1025971 INFO  (jetty-launcher-8542-thread-2) [    ] o.e.j.s.Server Started @1034170ms
   [junit4]   2> 1025971 INFO  (jetty-launcher-8542-thread-2) [    ] o.a.s.c.s.e.JettySolrRunner Jetty properties: {hostContext=/solr, hostPort=62237}
   [junit4]   2> 1025972 INFO  (jetty-launcher-8542-thread-2) [    ] o.a.s.s.SolrDispatchFilter SolrDispatchFilter.init(): sun.misc.Launcher$AppClassLoader@4554617c
   [junit4]   2> 1025972 INFO  (jetty-launcher-8542-thread-2) [    ] o.a.s.c.SolrResourceLoader new SolrResourceLoader for directory: '/Users/jenkins/workspace/Lucene-Solr-master-MacOSX/solr/build/solr-core/test/J0/temp/solr.schema.TestManagedSchemaAPI_CA900C6A7C14BFB1-001/tempDir-001/node2'
   [junit4]   2> 1025972 INFO  (jetty-launcher-8542-thread-2) [    ] o.a.s.c.SolrResourceLoader JNDI not configured for solr (NoInitialContextEx)
   [junit4]   2> 1025972 INFO  (jetty-launcher-8542-thread-2) [    ] o.a.s.c.SolrResourceLoader solr home defaulted to 'solr/' (could not find system property or JNDI)
   [junit4]   2> 1025972 INFO  (jetty-launcher-8542-thread-2) [    ] o.a.s.c.c.SolrZkClient Using default ZkCredentialsProvider
   [junit4]   2> 1025973 INFO  (jetty-launcher-8542-thread-1) [    ] o.e.j.s.h.ContextHandler Started o.e.j.s.ServletContextHandler@32c73d{/solr,null,AVAILABLE}
   [junit4]   2> 1025973 INFO  (jetty-launcher-8542-thread-2) [    ] o.a.s.c.c.ConnectionManager Waiting for client to connect to ZooKeeper
   [junit4]   2> 1025974 INFO  (jetty-launcher-8542-thread-1) [    ] o.e.j.s.ServerConnector Started ServerConnector@4448cebc{HTTP/1.1,[http/1.1]}{127.0.0.1:62238}
   [junit4]   2> 1025974 INFO  (jetty-launcher-8542-thread-1) [    ] o.e.j.s.Server Started @1034172ms
   [junit4]   2> 1025974 INFO  (jetty-launcher-8542-thread-1) [    ] o.a.s.c.s.e.JettySolrRunner Jetty properties: {hostContext=/solr, hostPort=62238}
   [junit4]   2> 1025974 INFO  (jetty-launcher-8542-thread-1) [    ] o.a.s.s.SolrDispatchFilter SolrDispatchFilter.init(): sun.misc.Launcher$AppClassLoader@4554617c
   [junit4]   2> 1025974 INFO  (jetty-launcher-8542-thread-1) [    ] o.a.s.c.SolrResourceLoader new SolrResourceLoader for directory: '/Users/jenkins/workspace/Lucene-Solr-master-MacOSX/solr/build/solr-core/test/J0/temp/solr.schema.TestManagedSchemaAPI_CA900C6A7C14BFB1-001/tempDir-001/node1'
   [junit4]   2> 1025975 INFO  (jetty-launcher-8542-thread-1) [    ] o.a.s.c.SolrResourceLoader JNDI not configured for solr (NoInitialContextEx)
   [junit4]   2> 1025975 INFO  (jetty-launcher-8542-thread-1) [    ] o.a.s.c.SolrResourceLoader solr home defaulted to 'solr/' (could not find system property or JNDI)
   [junit4]   2> 1025976 INFO  (jetty-launcher-8542-thread-1) [    ] o.a.s.c.c.SolrZkClient Using default ZkCredentialsProvider
   [junit4]   2> 1025977 INFO  (jetty-launcher-8542-thread-1) [    ] o.a.s.c.c.ConnectionManager Waiting for client to connect to ZooKeeper
   [junit4]   2> 1025978 INFO  (zkCallback-8544-thread-1) [    ] o.a.s.c.c.ConnectionManager Watcher org.apache.solr.common.cloud.ConnectionManager@7b80dd82 name:ZooKeeperConnection Watcher:127.0.0.1:62235/solr got event WatchedEvent state:SyncConnected type:None path:null path:null type:None
   [junit4]   2> 1025978 INFO  (jetty-launcher-8542-thread-2) [    ] o.a.s.c.c.ConnectionManager Client is connected to ZooKeeper
   [junit4]   2> 1025978 INFO  (jetty-launcher-8542-thread-2) [    ] o.a.s.c.c.SolrZkClient Using default ZkACLProvider
   [junit4]   2> 1025979 INFO  (zkCallback-8545-thread-1) [    ] o.a.s.c.c.ConnectionManager Watcher org.apache.solr.common.cloud.ConnectionManager@5b0378f3 name:ZooKeeperConnection Watcher:127.0.0.1:62235/solr got event WatchedEvent state:SyncConnected type:None path:null path:null type:None
   [junit4]   2> 1025979 INFO  (jetty-launcher-8542-thread-1) [    ] o.a.s.c.c.ConnectionManager Client is connected to ZooKeeper
   [junit4]   2> 1025979 INFO  (jetty-launcher-8542-thread-1) [    ] o.a.s.c.c.SolrZkClient Using default ZkACLProvider
   [junit4]   2> 1025980 INFO  (jetty-launcher-8542-thread-2) [    ] o.a.s.s.SolrDispatchFilter solr.xml found in ZooKeeper. Loading...
   [junit4]   2> 1025981 INFO  (jetty-launcher-8542-thread-1) [    ] o.a.s.s.SolrDispatchFilter solr.xml found in ZooKeeper. Loading...
   [junit4]   2> 1025989 INFO  (jetty-launcher-8542-thread-2) [    ] o.a.s.c.CorePropertiesLocator Config-defined core root directory: /Users/jenkins/workspace/Lucene-Solr-master-MacOSX/solr/build/solr-core/test/J0/temp/solr.schema.TestManagedSchemaAPI_CA900C6A7C14BFB1-001/tempDir-001/node2/.
   [junit4]   2> 1025989 INFO  (jetty-launcher-8542-thread-2) [    ] o.a.s.c.CoreContainer New CoreContainer 197276818
   [junit4]   2> 1025989 INFO  (jetty-launcher-8542-thread-2) [    ] o.a.s.c.CoreContainer Loading cores into CoreContainer [instanceDir=/Users/jenkins/workspace/Lucene-Solr-master-MacOSX/solr/build/solr-core/test/J0/temp/solr.schema.TestManagedSchemaAPI_CA900C6A7C14BFB1-001/tempDir-001/node2]
   [junit4]   2> 1025989 WARN  (jetty-launcher-8542-thread-2) [    ] o.a.s.c.CoreContainer Couldn't add files from /Users/jenkins/workspace/Lucene-Solr-master-MacOSX/solr/build/solr-core/test/J0/temp/solr.schema.TestManagedSchemaAPI_CA900C6A7C14BFB1-001/tempDir-001/node2/lib to classpath: /Users/jenkins/workspace/Lucene-Solr-master-MacOSX/solr/build/solr-core/test/J0/temp/solr.schema.TestManagedSchemaAPI_CA900C6A7C14BFB1-001/tempDir-001/node2/lib
   [junit4]   2> 1025990 INFO  (jetty-launcher-8542-thread-2) [    ] o.a.s.h.c.HttpShardHandlerFactory created with socketTimeout : 90000,urlScheme : ,connTimeout : 15000,maxConnectionsPerHost : 20,maxConnections : 10000,corePoolSize : 0,maximumPoolSize : 2147483647,maxThreadIdleTime : 5,sizeOfQueue : -1,fairnessPolicy : false,
   [junit4]   2> 1025991 INFO  (jetty-launcher-8542-thread-1) [    ] o.a.s.c.CorePropertiesLocator Config-defined core root directory: /Users/jenkins/workspace/Lucene-Solr-master-MacOSX/solr/build/solr-core/test/J0/temp/solr.schema.TestManagedSchemaAPI_CA900C6A7C14BFB1-001/tempDir-001/node1/.
   [junit4]   2> 1025991 INFO  (jetty-launcher-8542-thread-1) [    ] o.a.s.c.CoreContainer New CoreContainer 1268850901
   [junit4]   2> 1025991 INFO  (jetty-launcher-8542-thread-1) [    ] o.a.s.c.CoreContainer Loading cores into CoreContainer [instanceDir=/Users/jenkins/workspace/Lucene-Solr-master-MacOSX/solr/build/solr-core/test/J0/temp/solr.schema.TestManagedSchemaAPI_CA900C6A7C14BFB1-001/tempDir-001/node1]
   [junit4]   2> 1025991 WARN  (jetty-launcher-8542-thread-1) [    ] o.a.s.c.CoreContainer Couldn't add files from /Users/jenkins/workspace/Lucene-Solr-master-MacOSX/solr/build/solr-core/test/J0/temp/solr.schema.TestManagedSchemaAPI_CA900C6A7C14BFB1-001/tempDir-001/node1/lib to classpath: /Users/jenkins/workspace/Lucene-Solr-master-MacOSX/solr/build/solr-core/test/J0/temp/solr.schema.TestManagedSchemaAPI_CA900C6A7C14BFB1-001/tempDir-001/node1/lib
   [junit4]   2> 1025991 INFO  (jetty-launcher-8542-thread-1) [    ] o.a.s.h.c.HttpShardHandlerFactory created with socketTimeout : 90000,urlScheme : ,connTimeout : 15000,maxConnectionsPerHost : 20,maxConnections : 10000,corePoolSize : 0,maximumPoolSize : 2147483647,maxThreadIdleTime : 5,sizeOfQueue : -1,fairnessPolicy : false,
   [junit4]   2> 1025992 INFO  (jetty-launcher-8542-thread-2) [    ] o.a.s.u.UpdateShardHandler Creating UpdateShardHandler HTTP client with params: 
   [junit4]   2> 1025992 INFO  (jetty-launcher-8542-thread-1) [    ] o.a.s.u.UpdateShardHandler Creating UpdateShardHandler HTTP client with params: 
   [junit4]   2> 1025992 INFO  (jetty-launcher-8542-thread-2) [    ] o.a.s.l.LogWatcher SLF4J impl is org.slf4j.impl.Log4jLoggerFactory
   [junit4]   2> 1025992 INFO  (jetty-launcher-8542-thread-2) [    ] o.a.s.l.LogWatcher Registering Log Listener [Log4j (org.slf4j.impl.Log4jLoggerFactory)]
   [junit4]   2> 1025992 INFO  (jetty-launcher-8542-thread-2) [    ] o.a.s.c.ZkContainer Zookeeper client=127.0.0.1:62235/solr
   [junit4]   2> 1025992 INFO  (jetty-launcher-8542-thread-2) [    ] o.a.s.c.ZkController zkHost includes chroot
   [junit4]   2> 1025992 INFO  (jetty-launcher-8542-thread-2) [    ] o.a.s.c.c.SolrZkClient Using default ZkCredentialsProvider
   [junit4]   2> 1025993 INFO  (jetty-launcher-8542-thread-1) [    ] o.a.s.l.LogWatcher SLF4J impl is org.slf4j.impl.Log4jLoggerFactory
   [junit4]   2> 1025994 INFO  (jetty-launcher-8542-thread-1) [    ] o.a.s.l.LogWatcher Registering Log Listener [Log4j (org.slf4j.impl.Log4jLoggerFactory)]
   [junit4]   2> 1025994 INFO  (jetty-launcher-8542-thread-1) [    ] o.a.s.c.ZkContainer Zookeeper client=127.0.0.1:62235/solr
   [junit4]   2> 1025994 INFO  (jetty-launcher-8542-thread-1) [    ] o.a.s.c.ZkController zkHost includes chroot
   [junit4]   2> 1025994 INFO  (jetty-launcher-8542-thread-1) [    ] o.a.s.c.c.SolrZkClient Using default ZkCredentialsProvider
   [junit4]   2> 1025993 INFO  (jetty-launcher-8542-thread-2) [    ] o.a.s.c.c.ConnectionManager Waiting for client to connect to ZooKeeper
   [junit4]   2> 1025995 INFO  (jetty-launcher-8542-thread-1) [    ] o.a.s.c.c.ConnectionManager Waiting for client to connect to ZooKeeper
   [junit4]   2> 1025996 INFO  (zkCallback-8550-thread-1) [    ] o.a.s.c.c.ConnectionManager Watcher org.apache.solr.common.cloud.ConnectionManager@69daff34 name:ZooKeeperConnection Watcher:127.0.0.1:62235 got event WatchedEvent state:SyncConnected type:None path:null path:null type:None
   [junit4]   2> 1025996 INFO  (jetty-launcher-8542-thread-2) [    ] o.a.s.c.c.ConnectionManager Client is connected to ZooKeeper
   [junit4]   2> 1025997 INFO  (jetty-launcher-8542-thread-2) [    ] o.a.s.c.c.SolrZkClient Using default ZkACLProvider
   [junit4]   2> 1025997 INFO  (zkCallback-8551-thread-1) [    ] o.a.s.c.c.ConnectionManager Watcher org.apache.solr.common.cloud.ConnectionManager@4a1f84cc name:ZooKeeperConnection Watcher:127.0.0.1:62235 got event WatchedEvent state:SyncConnected type:None path:null path:null type:None
   [junit4]   2> 1025997 INFO  (jetty-launcher-8542-thread-1) [    ] o.a.s.c.c.ConnectionManager Client is connected to ZooKeeper
   [junit4]   2> 1025997 INFO  (jetty-launcher-8542-thread-1) [    ] o.a.s.c.c.SolrZkClient Using default ZkACLProvider
   [junit4]   2> 1025999 INFO  (jetty-launcher-8542-thread-2) [n:127.0.0.1:62237_solr    ] o.a.s.c.ZkController Added new OnReconnect listener org.apache.solr.cloud.ZkController$$Lambda$40/475451174@6075543a
   [junit4]   2> 1025999 INFO  (jetty-launcher-8542-thread-2) [n:127.0.0.1:62237_solr    ] o.a.s.c.c.ConnectionManager Waiting for client to connect to ZooKeeper
   [junit4]   2> 1026000 INFO  (jetty-launcher-8542-thread-1) [n:127.0.0.1:62238_solr    ] o.a.s.c.ZkController Added new OnReconnect listener org.apache.solr.cloud.ZkController$$Lambda$40/475451174@666567be
   [junit4]   2> 1026000 INFO  (jetty-launcher-8542-thread-1) [n:127.0.0.1:62238_solr    ] o.a.s.c.c.ConnectionManager Waiting for client to connect to ZooKeeper
   [junit4]   2> 1026001 INFO  (zkCallback-8552-thread-1-processing-n:127.0.0.1:62237_solr) [n:127.0.0.1:62237_solr    ] o.a.s.c.c.ConnectionManager Watcher org.apache.solr.common.cloud.ConnectionManager@5c582786 name:ZooKeeperConnection Watcher:127.0.0.1:62235/solr got event WatchedEvent state:SyncConnected type:None path:null path:null type:None
   [junit4]   2> 1026001 INFO  (jetty-launcher-8542-thread-2) [n:127.0.0.1:62237_solr    ] o.a.s.c.c.ConnectionManager Client is connected to ZooKeeper
   [junit4]   2> 1026002 INFO  (zkCallback-8553-thread-1-processing-n:127.0.0.1:62238_solr) [n:127.0.0.1:62238_solr    ] o.a.s.c.c.ConnectionManager Watcher org.apache.solr.common.cloud.ConnectionManager@199a30f5 name:ZooKeeperConnection Watcher:127.0.0.1:62235/solr got event WatchedEvent state:SyncConnected type:None path:null path:null type:None
   [junit4]   2> 1026002 INFO  (jetty-launcher-8542-thread-1) [n:127.0.0.1:62238_solr    ] o.a.s.c.c.ConnectionManager Client is connected to ZooKeeper
   [junit4]   2> 1026002 INFO  (jetty-launcher-8542-thread-2) [n:127.0.0.1:62237_solr    ] o.a.s.c.c.SolrZkClient makePath: /overseer/queue
   [junit4]   2> 1026003 INFO  (jetty-launcher-8542-thread-1) [n:127.0.0.1:62238_solr    ] o.a.s.c.c.SolrZkClient makePath: /overseer/queue
   [junit4]   2> 1026006 INFO  (jetty-launcher-8542-thread-2) [n:127.0.0.1:62237_solr    ] o.a.s.c.c.SolrZkClient makePath: /overseer/collection-queue-work
   [junit4]   2> 1026006 INFO  (jetty-launcher-8542-thread-1) [n:127.0.0.1:62238_solr    ] o.a.s.c.c.SolrZkClient makePath: /overseer/collection-queue-work
   [junit4]   2> 1026011 INFO  (jetty-launcher-8542-thread-1) [n:127.0.0.1:62238_solr    ] o.a.s.c.c.SolrZkClient makePath: /overseer/collection-map-running
   [junit4]   2> 1026012 INFO  (jetty-launcher-8542-thread-2) [n:127.0.0.1:62237_solr    ] o.a.s.c.c.SolrZkClient makePath: /overseer/collection-map-running
   [junit4]   2> 1026016 INFO  (jetty-launcher-8542-thread-1) [n:127.0.0.1:62238_solr    ] o.a.s.c.c.SolrZkClient makePath: /overseer/collection-map-completed
   [junit4]   2> 1026016 INFO  (jetty-launcher-8542-thread-2) [n:127.0.0.1:62237_solr    ] o.a.s.c.c.SolrZkClient makePath: /overseer/collection-map-completed
   [junit4]   2> 1026022 INFO  (jetty-launcher-8542-thread-2) [n:127.0.0.1:62237_solr    ] o.a.s.c.c.SolrZkClient makePath: /overseer/collection-map-failure
   [junit4]   2> 1026023 INFO  (jetty-launcher-8542-thread-1) [n:127.0.0.1:62238_solr    ] o.a.s.c.c.SolrZkClient makePath: /overseer/collection-map-failure
   [junit4]   2> 1026028 INFO  (jetty-launcher-8542-thread-1) [n:127.0.0.1:62238_solr    ] o.a.s.c.c.SolrZkClient makePath: /live_nodes
   [junit4]   2> 1026029 INFO  (jetty-launcher-8542-thread-2) [n:127.0.0.1:62237_solr    ] o.a.s.c.c.SolrZkClient makePath: /live_nodes
   [junit4]   2> 1026030 INFO  (jetty-launcher-8542-thread-2) [n:127.0.0.1:62237_solr    ] o.a.s.c.c.SolrZkClient makePath: /collections
   [junit4]   2> 1026031 INFO  (jetty-launcher-8542-thread-1) [n:127.0.0.1:62238_solr    ] o.a.s.c.c.SolrZkClient makePath: /collections
   [junit4]   2> 1026033 INFO  (jetty-launcher-8542-thread-2) [n:127.0.0.1:62237_solr    ] o.a.s.c.c.SolrZkClient makePath: /aliases.json
   [junit4]   2> 1026033 INFO  (jetty-launcher-8542-thread-1) [n:127.0.0.1:62238_solr    ] o.a.s.c.c.SolrZkClient makePath: /aliases.json
   [junit4]   2> 1026035 INFO  (jetty-launcher-8542-thread-2) [n:127.0.0.1:62237_solr    ] o.a.s.c.c.SolrZkClient makePath: /clusterstate.json
   [junit4]   2> 1026035 INFO  (jetty-launcher-8542-thread-1) [n:127.0.0.1:62238_solr    ] o.a.s.c.c.SolrZkClient makePath: /clusterstate.json
   [junit4]   2> 1026038 INFO  (jetty-launcher-8542-thread-1) [n:127.0.0.1:62238_solr    ] o.a.s.c.c.SolrZkClient makePath: /security.json
   [junit4]   2> 1026038 INFO  (jetty-launcher-8542-thread-2) [n:127.0.0.1:62237_solr    ] o.a.s.c.c.SolrZkClient makePath: /security.json
   [junit4]   2> 1026039 INFO  (jetty-launcher-8542-thread-1) [n:127.0.0.1:62238_solr    ] o.a.s.c.c.ZkStateReader Updating cluster state from ZooKeeper... 
   [junit4]   2> 1026040 INFO  (jetty-launcher-8542-thread-2) [n:127.0.0.1:62237_solr    ] o.a.s.c.c.ZkStateReader Updating cluster state from ZooKeeper... 
   [junit4]   2> 1026040 INFO  (jetty-launcher-8542-thread-1) [n:127.0.0.1:62238_solr    ] o.a.s.c.c.ZkStateReader Loaded empty cluster properties
   [junit4]   2> 1026041 INFO  (jetty-launcher-8542-thread-2) [n:127.0.0.1:62237_solr    ] o.a.s.c.c.ZkStateReader Loaded empty cluster properties
   [junit4]   2> 1026041 INFO  (jetty-launcher-8542-thread-1) [n:127.0.0.1:62238_solr    ] o.a.s.c.c.ZkStateReader Updated live nodes from ZooKeeper... (0) -> (0)
   [junit4]   2> 1026042 INFO  (jetty-launcher-8542-thread-2) [n:127.0.0.1:62237_solr    ] o.a.s.c.c.ZkStateReader Updated live nodes from ZooKeeper... (0) -> (0)
   [junit4]   2> 1026046 INFO  (jetty-launcher-8542-thread-1) [n:127.0.0.1:62238_solr    ] o.a.s.c.c.SolrZkClient makePath: /overseer_elect
   [junit4]   2> 1026047 INFO  (jetty-launcher-8542-thread-2) [n:127.0.0.1:62237_solr    ] o.a.s.c.c.SolrZkClient makePath: /overseer_elect
   [junit4]   2> 1026049 INFO  (jetty-launcher-8542-thread-1) [n:127.0.0.1:62238_solr    ] o.a.s.c.c.SolrZkClient makePath: /overseer_elect/election
   [junit4]   2> 1026049 INFO  (jetty-launcher-8542-thread-2) [n:127.0.0.1:62237_solr    ] o.a.s.c.c.SolrZkClient makePath: /overseer_elect/election
   [junit4]   2> 1026051 INFO  (jetty-launcher-8542-thread-2) [n:127.0.0.1:62237_solr    ] o.a.s.c.Overseer Overseer (id=null) closing
   [junit4]   2> 1026052 INFO  (jetty-launcher-8542-thread-1) [n:127.0.0.1:62238_solr    ] o.a.s.c.Overseer Overseer (id=null) closing
   [junit4]   2> 1026052 INFO  (jetty-launcher-8542-thread-2) [n:127.0.0.1:62237_solr    ] o.a.s.c.LeaderElector Joined leadership election with path: /overseer_elect/election/96107355195375621-127.0.0.1:62237_solr-n_0000000000
   [junit4]   2> 1026052 INFO  (jetty-launcher-8542-thread-1) [n:127.0.0.1:62238_solr    ] o.a.s.c.LeaderElector Joined leadership election with path: /overseer_elect/election/96107355195375622-127.0.0.1:62238_solr-n_0000000001
   [junit4]   2> 1026053 INFO  (jetty-launcher-8542-thread-2) [n:127.0.0.1:62237_solr    ] o.a.s.c.OverseerElectionContext I am going to be the leader 127.0.0.1:62237_solr
   [junit4]   2> 1026053 INFO  (jetty-launcher-8542-thread-2) [n:127.0.0.1:62237_solr    ] o.a.s.c.c.SolrZkClient makePath: /overseer_elect/leader
   [junit4]   2> 1026053 INFO  (jetty-launcher-8542-thread-1) [n:127.0.0.1:62238_solr    ] o.a.s.c.LeaderElector Watching path /overseer_elect/election/96107355195375621-127.0.0.1:62237_solr-n_0000000000 to know if I could be the leader
   [junit4]   2> 1026054 INFO  (jetty-launcher-8542-thread-1) [n:127.0.0.1:62238_solr    ] o.a.s.c.ZkController Register node as live in ZooKeeper:/live_nodes/127.0.0.1:62238_solr
   [junit4]   2> 1026055 INFO  (jetty-launcher-8542-thread-1) [n:127.0.0.1:62238_solr    ] o.a.s.c.c.SolrZkClient makePath: /live_nodes/127.0.0.1:62238_solr
   [junit4]   2> 1026055 INFO  (jetty-launcher-8542-thread-2) [n:127.0.0.1:62237_solr    ] o.a.s.c.Overseer Overseer (id=96107355195375621-127.0.0.1:62237_solr-n_0000000000) starting
   [junit4]   2> 1026057 INFO  (zkCallback-8553-thread-1-processing-n:127.0.0.1:62238_solr) [n:127.0.0.1:62238_solr    ] o.a.s.c.c.ZkStateReader A live node change: [WatchedEvent state:SyncConnected type:NodeChildrenChanged path:/live_nodes], has occurred - updating... (live nodes size: [0])
   [junit4]   2> 1026057 INFO  (zkCallback-8552-thread-1-processing-n:127.0.0.1:62237_solr) [n:127.0.0.1:62237_solr    ] o.a.s.c.c.ZkStateReader A live node change: [WatchedEvent state:SyncConnected type:NodeChildrenChanged path:/live_nodes], has occurred - updating... (live nodes size: [0])
   [junit4]   2> 1026058 INFO  (zkCallback-8553-thread-1-processing-n:127.0.0.1:62238_solr) [n:127.0.0.1:62238_solr    ] o.a.s.c.c.ZkStateReader Updated live nodes from ZooKeeper... (0) -> (1)
   [junit4]   2> 1026059 INFO  (zkCallback-8552-thread-1-processing-n:127.0.0.1:62237_solr) [n:127.0.0.1:62237_solr    ] o.a.s.c.c.ZkStateReader Updated live nodes from ZooKeeper... (0) -> (1)
   [junit4]   2> 1026060 INFO  (jetty-launcher-8542-thread-2) [n:127.0.0.1:62237_solr    ] o.a.s.c.c.SolrZkClient makePath: /overseer/queue-work
   [junit4]   2> 1026065 INFO  (jetty-launcher-8542-thread-1) [n:127.0.0.1:62238_solr    ] o.a.s.c.CoreContainer Security conf doesn't exist. Skipping setup for authorization module.
   [junit4]   2> 1026065 INFO  (jetty-launcher-8542-thread-1) [n:127.0.0.1:62238_solr    ] o.a.s.c.CoreContainer No authentication plugin used.
   [junit4]   2> 1026066 INFO  (jetty-launcher-8542-thread-1) [n:127.0.0.1:62238_solr    ] o.a.s.c.CorePropertiesLocator Looking for core definitions underneath /Users/jenkins/workspace/Lucene-Solr-master-MacOSX/solr/build/solr-core/test/J0/temp/solr.schema.TestManagedSchemaAPI_CA900C6A7C14BFB1-001/tempDir-001/node1/.
   [junit4]   2> 1026066 INFO  (jetty-launcher-8542-thread-1) [n:127.0.0.1:62238_solr    ] o.a.s.c.CorePropertiesLocator Found 0 core definitions
   [junit4]   2> 1026068 INFO  (jetty-launcher-8542-thread-1) [n:127.0.0.1:62238_solr    ] o.a.s.s.SolrDispatchFilter user.dir=/Users/jenkins/workspace/Lucene-Solr-master-MacOSX/solr/build/solr-core/test/J0
   [junit4]   2> 1026068 INFO  (jetty-launcher-8542-thread-1) [n:127.0.0.1:62238_solr    ] o.a.s.s.SolrDispatchFilter SolrDispatchFilter.init() done
   [junit4]   2> 1026070 INFO  (jetty-launcher-8542-thread-2) [n:127.0.0.1:62237_solr    ] o.a.s.c.OverseerAutoReplicaFailoverThread Starting OverseerAutoReplicaFailoverThread autoReplicaFailoverWorkLoopDelay=10000 autoReplicaFailoverWaitAfterExpiration=30000 autoReplicaFailoverBadNodeExpiration=60000
   [junit4]   2> 1026071 INFO  (OverseerCollectionConfigSetProcessor-96107355195375621-127.0.0.1:62237_solr-n_0000000000) [n:127.0.0.1:62237_solr    ] o.a.s.c.OverseerTaskProcessor Process current queue of overseer operations
   [junit4]   2> 1026072 INFO  (OverseerStateUpdate-96107355195375621-127.0.0.1:62237_solr-n_0000000000) [n:127.0.0.1:62237_solr    ] o.a.s.c.Overseer Starting to work on the main queue
   [junit4]   2> 1026072 INFO  (jetty-launcher-8542-thread-2) [n:127.0.0.1:62237_solr    ] o.a.s.c.ZkController Publish node=127.0.0.1:62237_solr as DOWN
   [junit4]   2> 1026074 INFO  (OverseerStateUpdate-96107355195375621-127.0.0.1:62237_solr-n_0000000000) [n:127.0.0.1:62237_solr    ] o.a.s.c.c.ZkStateReader Updated live nodes from ZooKeeper... (1) -> (1)
   [junit4]   2> 1026076 INFO  (OverseerStateUpdate-96107355195375621-127.0.0.1:62237_solr-n_0000000000) [n:127.0.0.1:62237_solr    ] o.a.s.c.Overseer processMessage: queueSize: 1, message = {
   [junit4]   2>   "operation":"downnode",
   [junit4]   2>   "node_name":"127.0.0.1:62237_solr"} current state version: 0
   [junit4]   2> 1026076 INFO  (OverseerStateUpdate-96107355195375621-127.0.0.1:62237_solr-n_0000000000) [n:127.0.0.1:62237_solr    ] o.a.s.c.o.NodeMutator DownNode state invoked for node: 127.0.0.1:62237_solr
   [junit4]   2> 1027075 INFO  (jetty-launcher-8542-thread-2) [n:127.0.0.1:62237_solr    ] o.a.s.c.ZkController Register node as live in ZooKeeper:/live_nodes/127.0.0.1:62237_solr
   [junit4]   2> 1027076 INFO  (jetty-launcher-8542-thread-2) [n:127.0.0.1:62237_solr    ] o.a.s.c.c.SolrZkClient makePath: /live_nodes/127.0.0.1:62237_solr
   [junit4]   2> 1027079 INFO  (zkCallback-8552-thread-1-processing-n:127.0.0.1:62237_solr) [n:127.0.0.1:62237_solr    ] o.a.s.c.c.ZkStateReader A live node change: [WatchedEvent state:SyncConnected type:NodeChildrenChanged path:/live_nodes], has occurred - updating... (live nodes size: [1])
   [junit4]   2> 1027079 INFO  (zkCallback-8553-thread-1-processing-n:127.0.0.1:62238_solr) [n:127.0.0.1:62238_solr    ] o.a.s.c.c.ZkStateReader A live node change: [WatchedEvent state:SyncConnected type:NodeChildrenChanged path:/live_nodes], has occurred - updating... (live nodes size: [1])
   [junit4]   2> 1027079 INFO  (zkCallback-8553-thread-1-processing-n:127.0.0.1:62238_solr) [n:127.0.0.1:62238_solr    ] o.a.s.c.c.ZkStateReader Updated live nodes from ZooKeeper... (1) -> (2)
   [junit4]   2> 1027079 INFO  (zkCallback-8552-thread-1-processing-n:127.0.0.1:62237_solr) [n:127.0.0.1:62237_solr    ] o.a.s.c.c.ZkStateReader Updated live nodes from ZooKeeper... (1) -> (2)
   [junit4]   2> 1027087 INFO  (jetty-launcher-8542-thread-2) [n:127.0.0.1:62237_solr    ] o.a.s.c.CoreContainer Security conf doesn't exist. Skipping setup for authorization module.
   [junit4]   2> 1027087 INFO  (jetty-launcher-8542-thread-2) [n:127.0.0.1:62237_solr    ] o.a.s.c.CoreContainer No authentication plugin used.
   [junit4]   2> 1027089 INFO  (jetty-launcher-8542-thread-2) [n:127.0.0.1:62237_solr    ] o.a.s.c.CorePropertiesLocator Looking for core definitions underneath /Users/jenkins/workspace/Lucene-Solr-master-MacOSX/solr/build/solr-core/test/J0/temp/solr.schema.TestManagedSchemaAPI_CA900C6A7C14BFB1-001/tempDir-001/node2/.
   [junit4]   2> 1027089 INFO  (jetty-launcher-8542-thread-2) [n:127.0.0.1:62237_solr    ] o.a.s.c.CorePropertiesLocator Found 0 core definitions
   [junit4]   2> 1027090 INFO  (jetty-launcher-8542-thread-2) [n:127.0.0.1:62237_solr    ] o.a.s.s.SolrDispatchFilter user.dir=/Users/jenkins/workspace/Lucene-Solr-master-MacOSX/solr/build/solr-core/test/J0
   [junit4]   2> 1027090 INFO  (jetty-launcher-8542-thread-2) [n:127.0.0.1:62237_solr    ] o.a.s.s.SolrDispatchFilter SolrDispatchFilter.init() done
   [junit4]   2> 1027091 INFO  (SUITE-TestManagedSchemaAPI-seed#[CA900C6A7C14BFB1]-worker) [    ] o.a.s.c.c.SolrZkClient Using default ZkCredentialsProvider
   [junit4]   2> 1027091 INFO  (SUITE-TestManagedSchemaAPI-seed#[CA900C6A7C14BFB1]-worker) [    ] o.a.s.c.c.ConnectionManager Waiting for client to connect to ZooKeeper
   [junit4]   2> 1027093 INFO  (zkCallback-8556-thread-1) [    ] o.a.s.c.c.ConnectionManager Watcher org.apache.solr.common.cloud.ConnectionManager@2fcf1c14 name:ZooKeeperConnection Watcher:127.0.0.1:62235 got event WatchedEvent state:SyncConnected type:None path:null path:null type:None
   [junit4]   2> 1027093 INFO  (SUITE-TestManagedSchemaAPI-seed#[CA900C6A7C14BFB1]-worker) [    ] o.a.s.c.c.ConnectionManager Client is connected to ZooKeeper
   [junit4]   2> 1027093 INFO  (SUITE-TestManagedSchemaAPI-seed#[CA900C6A7C14BFB1]-worker) [    ] o.a.s.c.c.SolrZkClient Using default ZkACLProvider
   [junit4]   2> 1027096 INFO  (SUITE-TestManagedSchemaAPI-seed#[CA900C6A7C14BFB1]-worker) [    ] o.a.s.c.s.i.CloudSolrClient Final constructed zkHost string: 127.0.0.1:62235/solr
   [junit4]   2> 1027097 INFO  (SUITE-TestManagedSchemaAPI-seed#[CA900C6A7C14BFB1]-worker) [    ] o.a.s.c.c.SolrZkClient Using default ZkCredentialsProvider
   [junit4]   2> 1027098 INFO  (SUITE-TestManagedSchemaAPI-seed#[CA900C6A7C14BFB1]-worker) [    ] o.a.s.c.c.ConnectionManager Waiting for client to connect to ZooKeeper
   [junit4]   2> 1027099 INFO  (zkCallback-8559-thread-1) [    ] o.a.s.c.c.ConnectionManager Watcher org.apache.solr.common.cloud.ConnectionManager@2f465c98 name:ZooKeeperConnection Watcher:127.0.0.1:62235/solr got event WatchedEvent state:SyncConnected type:None path:null path:null type:None
   [junit4]   2> 1027099 INFO  (SUITE-TestManagedSchemaAPI-seed#[CA900C6A7C14BFB1]-worker) [    ] o.a.s.c.c.ConnectionManager Client is connected to ZooKeeper
   [junit4]   2> 1027100 INFO  (SUITE-TestManagedSchemaAPI-seed#[CA900C6A7C14BFB1]-worker) [    ] o.a.s.c.c.SolrZkClient Using default ZkACLProvider
   [junit4]   2> 1027100 INFO  (SUITE-TestManagedSchemaAPI-seed#[CA900C6A7C14BFB1]-worker) [    ] o.a.s.c.c.ZkStateReader Updating cluster state from ZooKeeper... 
   [junit4]   2> 1027101 INFO  (SUITE-TestManagedSchemaAPI-seed#[CA900C6A7C14BFB1]-worker) [    ] o.a.s.c.c.ZkStateReader Loaded empty cluster properties
   [junit4]   2> 1027103 INFO  (SUITE-TestManagedSchemaAPI-seed#[CA900C6A7C14BFB1]-worker) [    ] o.a.s.c.c.ZkStateReader Updated live nodes from ZooKeeper... (0) -> (2)
   [junit4]   2> 1027106 INFO  (SUITE-TestManagedSchemaAPI-seed#[CA900C6A7C14BFB1]-worker) [    ] o.a.s.c.c.SolrZkClient makePath: /configs/conf1/managed-schema
   [junit4]   2> 1027111 INFO  (SUITE-TestManagedSchemaAPI-seed#[CA900C6A7C14BFB1]-worker) [    ] o.a.s.c.c.SolrZkClient makePath: /configs/conf1/solrconfig.xml
   [junit4]   2> 1027137 INFO  (TEST-TestManagedSchemaAPI.test-seed#[CA900C6A7C14BFB1]) [    ] o.a.s.SolrTestCaseJ4 ###Starting test
   [junit4]   2> 1027140 INFO  (qtp601604536-34695) [n:127.0.0.1:62238_solr    ] o.a.s.h.a.CollectionsHandler Invoked Collection Action :create with params replicationFactor=2&collection.configName=conf1&name=testschemaapi&action=CREATE&numShards=1&wt=javabin&version=2 and sendToOCPQueue=true
   [junit4]   2> 1027143 INFO  (OverseerCollectionConfigSetProcessor-96107355195375621-127.0.0.1:62237_solr-n_0000000000) [n:127.0.0.1:62237_solr    ] o.a.s.c.OverseerTaskProcessor Overseer Collection Message Handler: Get the message id:/overseer/collection-queue-work/qn-0000000000 message:{
   [junit4]   2>   "name":"testschemaapi",
   [junit4]   2>   "fromApi":"true",
   [junit4]   2>   "replicationFactor":"2",
   [junit4]   2>   "collection.configName":"conf1",
   [junit4]   2>   "numShards":"1",
   [junit4]   2>   "stateFormat":"2",
   [junit4]   2>   "operation":"create"}
   [junit4]   2> 1027144 INFO  (OverseerThreadFactory-4673-thread-1-processing-n:127.0.0.1:62237_solr) [n:127.0.0.1:62237_solr    ] o.a.s.c.OverseerCollectionMessageHandler OverseerCollectionMessageHandler.processMessage : create , {
   [junit4]   2>   "name":"testschemaapi",
   [junit4]   2>   "fromApi":"true",
   [junit4]   2>   "replicationFactor":"2",
   [junit4]   2>   "collection.configName":"conf1",
   [junit4]   2>   "numShards":"1",
   [junit4]   2>   "stateFormat":"2",
   [junit4]   2>   "operation":"create"}
   [junit4]   2> 1027144 INFO  (OverseerThreadFactory-4673-thread-1-processing-n:127.0.0.1:62237_solr) [n:127.0.0.1:62237_solr    ] o.a.s.c.OverseerCollectionMessageHandler Create collection testschemaapi
   [junit4]   2> 1027145 INFO  (OverseerThreadFactory-4673-thread-1-processing-n:127.0.0.1:62237_solr) [n:127.0.0.1:62237_solr    ] o.a.s.c.OverseerCollectionMessageHandler creating collections conf node /collections/testschemaapi 
   [junit4]   2> 1027145 INFO  (OverseerThreadFactory-4673-thread-1-processing-n:127.0.0.1:62237_solr) [n:127.0.0.1:62237_solr    ] o.a.s.c.c.SolrZkClient makePath: /collections/testschemaapi
   [junit4]   2> 1027148 INFO  (zkCallback-8553-thread-1-processing-n:127.0.0.1:62238_solr) [n:127.0.0.1:62238_solr    ] o.a.s.c.c.ZkStateReader A collections change: [WatchedEvent state:SyncConnected type:NodeChildrenChanged path:/collections], has occurred - updating...
   [junit4]   2> 1027148 INFO  (zkCallback-8552-thread-1-processing-n:127.0.0.1:62237_solr) [n:127.0.0.1:62237_solr    ] o.a.s.c.c.ZkStateReader A collections change: [WatchedEvent state:SyncConnected type:NodeChildrenChanged path:/collections], has occurred - updating...
   [junit4]   2> 1027148 INFO  (zkCallback-8559-thread-1) [    ] o.a.s.c.c.ZkStateReader A collections change: [WatchedEvent state:SyncConnected type:NodeChildrenChanged path:/collections], has occurred - updating...
   [junit4]   2> 1027153 INFO  (OverseerStateUpdate-96107355195375621-127.0.0.1:62237_solr-n_0000000000) [n:127.0.0.1:62237_solr    ] o.a.s.c.Overseer processMessage: queueSize: 1, message = {
   [junit4]   2>   "name":"testschemaapi",
   [junit4]   2>   "fromApi":"true",
   [junit4]   2>   "replicationFactor":"2",
   [junit4]   2>   "collection.configName":"conf1",
   [junit4]   2>   "numShards":"1",
   [junit4]   2>   "stateFormat":"2",
   [junit4]   2>   "operation":"create"} current state version: 0
   [junit4]   2> 1027153 INFO  (OverseerStateUpdate-96107355195375621-127.0.0.1:62237_solr-n_0000000000) [n:127.0.0.1:62237_solr    ] o.a.s.c.o.ClusterStateMutator building a new cName: testschemaapi
   [junit4]   2> 1027155 INFO  (OverseerStateUpdate-96107355195375621-127.0.0.1:62237_solr-n_0000000000) [n:127.0.0.1:62237_solr    ] o.a.s.c.o.ZkStateWriter going to create_collection /collections/testschemaapi/state.json
   [junit4]   2> 1027253 INFO  (OverseerThreadFactory-4673-thread-1-processing-n:127.0.0.1:62237_solr) [n:127.0.0.1:62237_solr    ] o.a.s.c.OverseerCollectionMessageHandler Creating SolrCores for new collection testschemaapi, shardNames [shard1] , replicationFactor : 2
   [junit4]   2> 1027253 INFO  (OverseerThreadFactory-4673-thread-1-processing-n:127.0.0.1:62237_solr) [n:127.0.0.1:62237_solr    ] o.a.s.c.OverseerCollectionMessageHandler Creating core testschemaapi_shard1_replica1 as part of shard shard1 of collection testschemaapi on 127.0.0.1:62237_solr
   [junit4]   2> 1027253 INFO  (OverseerThreadFactory-4673-thread-1-processing-n:127.0.0.1:62237_solr) [n:127.0.0.1:62237_solr    ] o.a.s.c.OverseerCollectionMessageHandler Creating core testschemaapi_shard1_replica2 as part of shard shard1 of collection testschemaapi on 127.0.0.1:62238_solr
   [junit4]   2> 1027258 INFO  (qtp261402490-34686) [n:127.0.0.1:62237_solr    ] o.a.s.h.a.CoreAdminOperation core create command qt=/admin/cores&collection.configName=conf1&name=testschemaapi_shard1_replica1&action=CREATE&numShards=1&collection=testschemaapi&shard=shard1&wt=javabin&version=2
   [junit4]   2> 1027258 INFO  (qtp601604536-34697) [n:127.0.0.1:62238_solr    ] o.a.s.h.a.CoreAdminOperation core create command qt=/admin/cores&collection.configName=conf1&name=testschemaapi_shard1_replica2&action=CREATE&numShards=1&collection=testschemaapi&shard=shard1&wt=javabin&version=2
   [junit4]   2> 1027259 INFO  (qtp601604536-34697) [n:127.0.0.1:62238_solr    ] o.a.s.c.CoreDescriptor Created CoreDescriptor: {name=testschemaapi_shard1_replica2, collection.configName=conf1, config=solrconfig.xml, transient=false, schema=schema.xml, loadOnStartup=true, configSetProperties=configsetprops.json, collection=testschemaapi, numShards=1, dataDir=data/, shard=shard1}
   [junit4]   2> 1027259 INFO  (qtp261402490-34686) [n:127.0.0.1:62237_solr    ] o.a.s.c.CoreDescriptor Created CoreDescriptor: {name=testschemaapi_shard1_replica1, collection.configName=conf1, config=solrconfig.xml, transient=false, schema=schema.xml, loadOnStartup=true, configSetProperties=configsetprops.json, collection=testschemaapi, numShards=1, dataDir=data/, shard=shard1}
   [junit4]   2> 1027260 INFO  (qtp601604536-34697) [n:127.0.0.1:62238_solr c:testschemaapi s:shard1  x:testschemaapi_shard1_replica2] o.a.s.c.ZkController publishing state=down
   [junit4]   2> 1027260 INFO  (qtp261402490-34686) [n:127.0.0.1:62237_solr c:testschemaapi s:shard1  x:testschemaapi_shard1_replica1] o.a.s.c.ZkController publishing state=down
   [junit4]   2> 1027263 INFO  (qtp261402490-34686) [n:127.0.0.1:62237_solr c:testschemaapi s:shard1  x:testschemaapi_shard1_replica1] o.a.s.c.ZkController Registering watch for collection testschemaapi
   [junit4]   2> 1027263 INFO  (qtp601604536-34697) [n:127.0.0.1:62238_solr c:testschemaapi s:shard1  x:testschemaapi_shard1_replica2] o.a.s.c.ZkController Registering watch for collection testschemaapi
   [junit4]   2> 1027264 INFO  (qtp261402490-34686) [n:127.0.0.1:62237_solr c:testschemaapi s:shard1  x:testschemaapi_shard1_replica1] o.a.s.c.c.ZkStateReader Add data for [testschemaapi] ver [0]
   [junit4]   2> 1027264 INFO  (qtp601604536-34697) [n:127.0.0.1:62238_solr c:testschemaapi s:shard1  x:testschemaapi_shard1_replica2] o.a.s.c.c.ZkStateReader Add data for [testschemaapi] ver [0]
   [junit4]   2> 1027265 INFO  (qtp261402490-34686) [n:127.0.0.1:62237_solr c:testschemaapi s:shard1  x:testschemaapi_shard1_replica1] o.a.s.c.ZkController look for our core node name
   [junit4]   2> 1027265 INFO  (qtp601604536-34697) [n:127.0.0.1:62238_solr c:testschemaapi s:shard1  x:testschemaapi_shard1_replica2] o.a.s.c.ZkController look for our core node name
   [junit4]   2> 1027266 INFO  (OverseerStateUpdate-96107355195375621-127.0.0.1:62237_solr-n_0000000000) [n:127.0.0.1:62237_solr    ] o.a.s.c.Overseer processMessage: queueSize: 2, message = {
   [junit4]   2>   "core":"testschemaapi_shard1_replica2",
   [junit4]   2>   "roles":null,
   [junit4]   2>   "base_url":"http://127.0.0.1:62238/solr",
   [junit4]   2>   "node_name":"127.0.0.1:62238_solr",
   [junit4]   2>   "numShards":"1",
   [junit4]   2>   "state":"down",
   [junit4]   2>   "shard":"shard1",
   [junit4]   2>   "collection":"testschemaapi",
   [junit4]   2>   "operation":"state"} current state version: 0
   [junit4]   2> 1027266 INFO  (OverseerStateUpdate-96107355195375621-127.0.0.1:62237_solr-n_0000000000) [n:127.0.0.1:62237_solr    ] o.a.s.c.o.ReplicaMutator Update state numShards=1 message={
   [junit4]   2>   "core":"testschemaapi_shard1_replica2",
   [junit4]   2>   "roles":null,
   [junit4]   2>   "base_url":"http://127.0.0.1:62238/solr",
   [junit4]   2>   "node_name":"127.0.0.1:62238_solr",
   [junit4]   2>   "numShards":"1",
   [junit4]   2>   "state":"down",
   [junit4]   2>   "shard":"shard1",
   [junit4]   2>   "collection":"testschemaapi",
   [junit4]   2>   "operation":"state"}
   [junit4]   2> 1027269 INFO  (OverseerStateUpdate-96107355195375621-127.0.0.1:62237_solr-n_0000000000) [n:127.0.0.1:62237_solr    ] o.a.s.c.Overseer processMessage: queueSize: 2, message = {
   [junit4]   2>   "core":"testschemaapi_shard1_replica1",
   [junit4]   2>   "roles":null,
   [junit4]   2>   "base_url":"http://127.0.0.1:62237/solr",
   [junit4]   2>   "node_name":"127.0.0.1:62237_solr",
   [junit4]   2>   "numShards":"1",
   [junit4]   2>   "state":"down",
   [junit4]   2>   "shard":"shard1",
   [junit4]   2>   "collection":"testschemaapi",
   [junit4]   2>   "operation":"state"} current state version: 0
   [junit4]   2> 1027269 INFO  (OverseerStateUpdate-96107355195375621-127.0.0.1:62237_solr-n_0000000000) [n:127.0.0.1:62237_solr    ] o.a.s.c.o.ReplicaMutator Update state numShards=1 message={
   [junit4]   2>   "core":"testschemaapi_shard1_replica1",
   [junit4]   2>   "roles":null,
   [junit4]   2>   "base_url":"http://127.0.0.1:62237/solr",
   [junit4]   2>   "node_name":"127.0.0.1:62237_solr",
   [junit4]   2>   "numShards":"1",
   [junit4]   2>   "state":"down",
   [junit4]   2>   "shard":"shard1",
   [junit4]   2>   "collection":"testschemaapi",
   [junit4]   2>   "operation":"state"}
   [junit4]   2> 1027373 INFO  (OverseerStateUpdate-96107355195375621-127.0.0.1:62237_solr-n_0000000000) [n:127.0.0.1:62237_solr    ] o.a.s.c.o.ZkStateWriter going to update_collection /collections/testschemaapi/state.json version: 0
   [junit4]   2> 1027374 INFO  (zkCallback-8552-thread-1-processing-n:127.0.0.1:62237_solr) [n:127.0.0.1:62237_solr    ] o.a.s.c.c.ZkStateReader A cluster state change: [WatchedEvent state:SyncConnected type:NodeDataChanged path:/collections/testschemaapi/state.json] for collection [testschemaapi] has occurred - updating... (live nodes size: [2])
   [junit4]   2> 1027374 INFO  (zkCallback-8553-thread-1-processing-n:127.0.0.1:62238_solr) [n:127.0.0.1:62238_solr    ] o.a.s.c.c.ZkStateReader A cluster state change: [WatchedEvent state:SyncConnected type:NodeDataChanged path:/collections/testschemaapi/state.json] for collection [testschemaapi] has occurred - updating... (live nodes size: [2])
   [junit4]   2> 1027376 INFO  (zkCallback-8553-thread-1-processing-n:127.0.0.1:62238_solr) [n:127.0.0.1:62238_solr    ] o.a.s.c.c.ZkStateReader Updating data for [testschemaapi] from [0] to [1]
   [junit4]   2> 1027376 INFO  (zkCallback-8552-thread-1-processing-n:127.0.0.1:62237_solr) [n:127.0.0.1:62237_solr    ] o.a.s.c.c.ZkStateReader Updating data for [testschemaapi] from [0] to [1]
   [junit4]   2> 1028266 INFO  (qtp261402490-34686) [n:127.0.0.1:62237_solr c:testschemaapi s:shard1  x:testschemaapi_shard1_replica1] o.a.s.c.ZkController waiting to find shard id in clusterstate for testschemaapi_shard1_replica1
   [junit4]   2> 1028266 INFO  (qtp601604536-34697) [n:127.0.0.1:62238_solr c:testschemaapi s:shard1  x:testschemaapi_shard1_replica2] o.a.s.c.ZkController waiting to find shard id in clusterstate for testschemaapi_shard1_replica2
   [junit4]   2> 1028266 INFO  (qtp261402490-34686) [n:127.0.0.1:62237_solr c:testschemaapi s:shard1  x:testschemaapi_shard1_replica1] o.a.s.c.ZkController Check for collection zkNode:testschemaapi
   [junit4]   2> 1028266 INFO  (qtp601604536-34697) [n:127.0.0.1:62238_solr c:testschemaapi s:shard1  x:testschemaapi_shard1_replica2] o.a.s.c.ZkController Check for collection zkNode:testschemaapi
   [junit4]   2> 1028267 INFO  (qtp261402490-34686) [n:127.0.0.1:62237_solr c:testschemaapi s:shard1  x:testschemaapi_shard1_replica1] o.a.s.c.ZkController Collection zkNode exists
   [junit4]   2> 1028267 INFO  (qtp601604536-34697) [n:127.0.0.1:62238_solr c:testschemaapi s:shard1  x:testschemaapi_shard1_replica2] o.a.s.c.ZkController Collection zkNode exists
   [junit4]   2> 1028267 INFO  (qtp601604536-34697) [n:127.0.0.1:62238_solr c:testschemaapi s:shard1  x:testschemaapi_shard1_replica2] o.a.s.c.c.ZkStateReader Load collection config from: [/collections/testschemaapi]
   [junit4]   2> 1028267 INFO  (qtp261402490-34686) [n:127.0.0.1:62237_solr c:testschemaapi s:shard1  x:testschemaapi_shard1_replica1] o.a.s.c.c.ZkStateReader Load collection config from: [/collections/testschemaapi]
   [junit4]   2> 1028269 INFO  (qtp601604536-34697) [n:127.0.0.1:62238_solr c:testschemaapi s:shard1  x:testschemaapi_shard1_replica2] o.a.s.c.c.ZkStateReader path=[/collections/testschemaapi] [configName]=[conf1] specified config exists in ZooKeeper
   [junit4]   2> 1028269 INFO  (qtp601604536-34697) [n:127.0.0.1:62238_solr c:testschemaapi s:shard1  x:testschemaapi_shard1_replica2] o.a.s.c.SolrResourceLoader new SolrResourceLoader for directory: '/Users/jenkins/workspace/Lucene-Solr-master-MacOSX/solr/build/solr-core/test/J0/temp/solr.schema.TestManagedSchemaAPI_CA900C6A7C14BFB1-001/tempDir-001/node1/testschemaapi_shard1_replica2'
   [junit4]   2> 1028269 INFO  (qtp601604536-34697) [n:127.0.0.1:62238_solr c:testschemaapi s:shard1  x:testschemaapi_shard1_replica2] o.a.s.c.SolrResourceLoader JNDI not configured for solr (NoInitialContextEx)
   [junit4]   2> 1028269 INFO  (qtp601604536-34697) [n:127.0.0.1:62238_solr c:testschemaapi s:shard1  x:testschemaapi_shard1_replica2] o.a.s.c.SolrResourceLoader solr home defaulted to 'solr/' (could not find system property or JNDI)
   [junit4]   2> 1028269 INFO  (qtp261402490-34686) [n:127.0.0.1:62237_solr c:testschemaapi s:shard1  x:testschemaapi_shard1_replica1] o.a.s.c.c.ZkStateReader path=[/collections/testschemaapi] [configName]=[conf1] specified config exists in ZooKeeper
   [junit4]   2> 1028269 INFO  (qtp261402490-34686) [n:127.0.0.1:62237_solr c:testschemaapi s:shard1  x:testschemaapi_shard1_replica1] o.a.s.c.SolrResourceLoader new SolrResourceLoader for directory: '/Users/jenkins/workspace/Lucene-Solr-master-MacOSX/solr/build/solr-core/test/J0/temp/solr.schema.TestManagedSchemaAPI_CA900C6A7C14BFB1-001/tempDir-001/node2/testschemaapi_shard1_replica1'
   [junit4]   2> 1028269 INFO  (qtp261402490-34686) [n:127.0.0.1:62237_solr c:testschemaapi s:shard1  x:testschemaapi_shard1_replica1] o.a.s.c.SolrResourceLoader JNDI not configured for solr (NoInitialContextEx)
   [junit4]   2> 1028269 INFO  (qtp261402490-34686) [n:127.0.0.1:62237_solr c:testschemaapi s:shard1  x:testschemaapi_shard1_replica1] o.a.s.c.SolrResourceLoader solr home defaulted to 'solr/' (could not find system property or JNDI)
   [junit4]   2> 1028271 INFO  (qtp261402490-34686) [n:127.0.0.1:62237_solr c:testschemaapi s:shard1  x:testschemaapi_shard1_replica1] o.a.s.c.Config loaded config solrconfig.xml with version 0 
   [junit4]   2> 1028271 INFO  (qtp601604536-34697) [n:127.0.0.1:62238_solr c:testschemaapi s:shard1  x:testschemaapi_shard1_replica2] o.a.s.c.Config loaded config solrconfig.xml with version 0 
   [junit4]   2> 1028277 INFO  (qtp601604536-34697) [n:127.0.0.1:62238_solr c:testschemaapi s:shard1  x:testschemaapi_shard1_replica2] o.a.s.c.SolrConfig current version of requestparams : -1
   [junit4]   2> 1028278 INFO  (qtp261402490-34686) [n:127.0.0.1:62237_solr c:testschemaapi s:shard1  x:testschemaapi_shard1_replica1] o.a.s.c.SolrConfig current version of requestparams : -1
   [junit4]   2> 1028279 INFO  (qtp601604536-34697) [n:127.0.0.1:62238_solr c:testschemaapi s:shard1  x:testschemaapi_shard1_replica2] o.a.s.c.SolrConfig Using Lucene MatchVersion: 7.0.0
   [junit4]   2> 1028279 INFO  (qtp261402490-34686) [n:127.0.0.1:62237_solr c:testschemaapi s:shard1  x:testschemaapi_shard1_replica1] o.a.s.c.SolrConfig Using Lucene MatchVersion: 7.0.0
   [junit4]   2> 1028298 INFO  (qtp601604536-34697) [n:127.0.0.1:62238_solr c:testschemaapi s:shard1  x:testschemaapi_shard1_replica2] o.a.s.c.SolrConfig Loaded SolrConfig: solrconfig.xml
   [junit4]   2> 1028298 INFO  (qtp261402490-34686) [n:127.0.0.1:62237_solr c:testschemaapi s:shard1  x:testschemaapi_shard1_replica1] o.a.s.c.SolrConfig Loaded SolrConfig: solrconfig.xml
   [junit4]   2> 1028302 INFO  (qtp261402490-34686) [n:127.0.0.1:62237_solr c:testschemaapi s:shard1  x:testschemaapi_shard1_replica1] o.a.s.s.IndexSchema [testschemaapi_shard1_replica1] Schema name=minimal
   [junit4]   2> 1028302 INFO  (qtp601604536-34697) [n:127.0.0.1:62238_solr c:testschemaapi s:shard1  x:testschemaapi_shard1_replica2] o.a.s.s.IndexSchema [testschemaapi_shard1_replica2] Schema name=minimal
   [junit4]   2> 1028306 INFO  (qtp261402490-34686) [n:127.0.0.1:62237_solr c:testschemaapi s:shard1  x:testschemaapi_shard1_replica1] o.a.s.s.IndexSchema unique key field: id
   [junit4]   2> 1028306 INFO  (qtp601604536-34697) [n:127.0.0.1:62238_solr c:testschemaapi s:shard1  x:testschemaapi_shard1_replica2] o.a.s.s.IndexSchema unique key field: id
   [junit4]   2> 1028307 INFO  (qtp601604536-34697) [n:127.0.0.1:62238_solr c:testschemaapi s:shard1  x:testschemaapi_shard1_replica2] o.a.s.c.ConfigSetProperties Did not find ConfigSet properties, assuming default properties: Can't find resource 'configsetprops.json' in classpath or '/configs/conf1', cwd=/Users/jenkins/workspace/Lucene-Solr-master-MacOSX/solr/build/solr-core/test/J0
   [junit4]   2> 1028307 INFO  (qtp261402490-34686) [n:127.0.0.1:62237_solr c:testschemaapi s:shard1  x:testschemaapi_shard1_replica1] o.a.s.c.ConfigSetProperties Did not find ConfigSet properties, assuming default properties: Can't find resource 'configsetprops.json' in classpath or '/configs/conf1', cwd=/Users/jenkins/workspace/Lucene-Solr-master-MacOSX/solr/build/solr-core/test/J0
   [junit4]   2> 1028307 INFO  (qtp261402490-34686) [n:127.0.0.1:62237_solr c:testschemaapi s:shard1  x:testschemaapi_shard1_replica1] o.a.s.c.CoreContainer Creating SolrCore 'testschemaapi_shard1_replica1' using configuration from collection testschemaapi
   [junit4]   2> 1028307 INFO  (qtp601604536-34697) [n:127.0.0.1:62238_solr c:testschemaapi s:shard1  x:testschemaapi_shard1_replica2] o.a.s.c.CoreContainer Creating SolrCore 'testschemaapi_shard1_replica2' using configuration from collection testschemaapi
   [junit4]   2> 1028307 INFO  (qtp261402490-34686) [n:127.0.0.1:62237_solr c:testschemaapi s:shard1 r:core_node2 x:testschemaapi_shard1_replica1] o.a.s.c.SolrCore org.apache.solr.core.MockDirectoryFactory
   [junit4]   2> 1028307 INFO  (qtp601604536-34697) [n:127.0.0.1:62238_solr c:testschemaapi s:shard1 r:core_node1 x:testschemaapi_shard1_replica2] o.a.s.c.SolrCore org.apache.solr.core.MockDirectoryFactory
   [junit4]   2> 1028308 INFO  (qtp261402490-34686) [n:127.0.0.1:62237_solr c:testschemaapi s:shard1 r:core_node2 x:testschemaapi_shard1_replica1] o.a.s.c.SolrCore [[testschemaapi_shard1_replica1] ] Opening new SolrCore at [/Users/jenkins/workspace/Lucene-Solr-master-MacOSX/solr/build/solr-core/test/J0/temp/solr.schema.TestManagedSchemaAPI_CA900C6A7C14BFB1-001/tempDir-001/node2/testschemaapi_shard1_replica1], dataDir=[/Users/jenkins/workspace/Lucene-Solr-master-MacOSX/solr/build/solr-core/test/J0/temp/solr.schema.TestManagedSchemaAPI_CA900C6A7C14BFB1-001/tempDir-001/node2/./testschemaapi_shard1_replica1/data/]
   [junit4]   2> 1028308 INFO  (qtp601604536-34697) [n:127.0.0.1:62238_solr c:testschemaapi s:shard1 r:core_node1 x:testschemaapi_shard1_replica2] o.a.s.c.SolrCore [[testschemaapi_shard1_replica2] ] Opening new SolrCore at [/Users/jenkins/workspace/Lucene-Solr-master-MacOSX/solr/build/solr-core/test/J0/temp/solr.schema.TestManagedSchemaAPI_CA900C6A7C14BFB1-001/tempDir-001/node1/testschemaapi_shard1_replica2], dataDir=[/Users/jenkins/workspace/Lucene-Solr-master-MacOSX/solr/build/solr-core/test/J0/temp/solr.schema.TestManagedSchemaAPI_CA900C6A7C14BFB1-001/tempDir-001/node1/./testschemaapi_shard1_replica2/data/]
   [junit4]   2> 1028308 INFO  (qtp261402490-34686) [n:127.0.0.1:62237_solr c:testschemaapi s:shard1 r:core_node2 x:testschemaapi_shard1_replica1] o.a.s.c.SolrCore JMX monitoring not detected for core: testschemaapi_shard1_replica1
   [junit4]   2> 1028308 INFO  (qtp601604536-34697) [n:127.0.0.1:62238_solr c:testschemaapi s:shard1 r:core_node1 x:testschemaapi_shard1_replica2] o.a.s.c.SolrCore JMX monitoring not detected for core: testschemaapi_shard1_replica2
   [junit4]   2> 1028308 INFO  (qtp261402490-34686) [n:127.0.0.1:62237_solr c:testschemaapi s:shard1 r:core_node2 x:testschemaapi_shard1_replica1] o.a.s.c.CachingDirectoryFactory return new directory for /Users/jenkins/workspace/Lucene-Solr-master-MacOSX/solr/build/solr-core/test/J0/temp/solr.schema.TestManagedSchemaAPI_CA900C6A7C14BFB1-001/tempDir-001/node2/./testschemaapi_shard1_replica1/data
   [junit4]   2> 1028308 INFO  (qtp601604536-34697) [n:127.0.0.1:62238_solr c:testschemaapi s:shard1 r:core_node1 x:testschemaapi_shard1_replica2] o.a.s.c.CachingDirectoryFactory return new directory for /Users/jenkins/workspace/Lucene-Solr-master-MacOSX/solr/build/solr-core/test/J0/temp/solr.schema.TestManagedSchemaAPI_CA900C6A7C14BFB1-001/tempDir-001/node1/./testschemaapi_shard1_replica2/data
   [junit4]   2> 1028308 INFO  (qtp261402490-34686) [n:127.0.0.1:62237_solr c:testschemaapi s:shard1 r:core_node2 x:testschemaapi_shard1_replica1] o.a.s.c.SolrCore New index directory detected: old=null new=/Users/jenkins/workspace/Lucene-Solr-master-MacOSX/solr/build/solr-core/test/J0/temp/solr.schema.TestManagedSchemaAPI_CA900C6A7C14BFB1-001/tempDir-001/node2/./testschemaapi_shard1_replica1/data/index/
   [junit4]   2> 1028308 INFO  (qtp601604536-34697) [n:127.0.0.1:62238_solr c:testschemaapi s:shard1 r:core_node1 x:testschemaapi_shard1_replica2] o.a.s.c.SolrCore New index directory detected: old=null new=/Users/jenkins/workspace/Lucene-Solr-master-MacOSX/solr/build/solr-core/test/J0/temp/solr.schema.TestManagedSchemaAPI_CA900C6A7C14BFB1-001/tempDir-001/node1/./testschemaapi_shard1_replica2/data/index/
   [junit4]   2> 1028309 WARN  (qtp261402490-34686) [n:127.0.0.1:62237_solr c:testschemaapi s:shard1 r:core_node2 x:testschemaapi_shard1_replica1] o.a.s.c.SolrCore [testschemaapi_shard1_replica1] Solr index directory '/Users/jenkins/workspace/Lucene-Solr-master-MacOSX/solr/build/solr-core/test/J0/temp/solr.schema.TestManagedSchemaAPI_CA900C6A7C14BFB1-001/tempDir-001/node2/./testschemaapi_shard1_replica1/data/index' doesn't exist. Creating new index...
   [junit4]   2> 1028309 WARN  (qtp601604536-34697) [n:127.0.0.1:62238_solr c:testschemaapi s:shard1 r:core_node1 x:testschemaapi_shard1_replica2] o.a.s.c.SolrCore [testschemaapi_shard1_replica2] Solr index directory '/Users/jenkins/workspace/Lucene-Solr-master-MacOSX/solr/build/solr-core/test/J0/temp/solr.schema.TestManagedSchemaAPI_CA900C6A7C14BFB1-001/tempDir-001/node1/./testschemaapi_shard1_replica2/data/index' doesn't exist. Creating new index...
   [junit4]   2> 1028310 INFO  (qtp261402490-34686) [n:127.0.0.1:62237_solr c:testschemaapi s:shard1 r:core_node2 x:testschemaapi_shard1_replica1] o.a.s.c.CachingDirectoryFactory return new directory for /Users/jenkins/workspace/Lucene-Solr-master-MacOSX/solr/build/solr-core/test/J0/temp/solr.schema.TestManagedSchemaAPI_CA900C6A7C14BFB1-001/tempDir-001/node2/./testschemaapi_shard1_replica1/data/index
   [junit4]   2> 1028310 INFO  (qtp601604536-34697) [n:127.0.0.1:62238_solr c:testschemaapi s:shard1 r:core_node1 x:testschemaapi_shard1_replica2] o.a.s.c.CachingDirectoryFactory return new directory for /Users/jenkins/workspace/Lucene-Solr-master-MacOSX/solr/build/solr-core/test/J0/temp/solr.schema.TestManagedSchemaAPI_CA900C6A7C14BFB1-001/tempDir-001/node1/./testschemaapi_shard1_replica2/data/index
   [junit4]   2> 1028311 INFO  (qtp261402490-34686) [n:127.0.0.1:62237_solr c:testschemaapi s:shard1 r:core_node2 x:testschemaapi_shard1_replica1] o.a.s.c.SolrDeletionPolicy SolrDeletionPolicy.onCommit: commits: num=1
   [junit4]   2> 	commit{dir=MockDirectoryWrapper(RAMDirectory@5774232f lockFactory=org.apache.lucene.store.SingleInstanceLockFactory@569c2d4),segFN=segments_1,generation=1}
   [junit4]   2> 1028311 INFO  (qtp261402490-34686) [n:127.0.0.1:62237_solr c:testschemaapi s:shard1 r:core_node2 x:testschemaapi_shard1_replica1] o.a.s.c.SolrDeletionPolicy newest commit generation = 1
   [junit4]   2> 1028311 INFO  (qtp601604536-34697) [n:127.0.0.1:62238_solr c:testschemaapi s:shard1 r:core_node1 x:testschemaapi_shard1_replica2] o.a.s.c.SolrDeletionPolicy SolrDeletionPolicy.onCommit: commits: num=1
   [junit4]   2> 	commit{dir=MockDirectoryWrapper(RAMDirectory@4bdeb7aa lockFactory=org.apache.lucene.store.SingleInstanceLockFactory@6bc89326),segFN=segments_1,generation=1}
   [junit4]   2> 1028311 INFO  (qtp601604536-34697) [n:127.0.0.1:62238_solr c:testschemaapi s:shard1 r:core_node1 x:testschemaapi_shard1_replica2] o.a.s.c.SolrDeletionPolicy newest commit generation = 1
   [junit4]   2> 1028312 INFO  (OldIndexDirectoryCleanupThreadForCore-testschemaapi_shard1_replica1) [n:127.0.0.1:62237_solr c:testschemaapi s:shard1 r:core_node2 x:testschemaapi_shard1_replica1] o.a.s.c.SolrCore Looking for old index directories to cleanup for core testschemaapi_shard1_replica1 in /Users/jenkins/workspace/Lucene-Solr-master-MacOSX/solr/build/solr-core/test/J0/temp/solr.schema.TestManagedSchemaAPI_CA900C6A7C14BFB1-001/tempDir-001/node2/./testschemaapi_shard1_replica1/data/
   [junit4]   2> 1028312 WARN  (OldIndexDirectoryCleanupThreadForCore-testschemaapi_shard1_replica1) [n:127.0.0.1:62237_solr c:testschemaapi s:shard1 r:core_node2 x:testschemaapi_shard1_replica1] o.a.s.c.DirectoryFactory /Users/jenkins/workspace/Lucene-Solr-master-MacOSX/solr/build/solr-core/test/J0/temp/solr.schema.TestManagedSchemaAPI_CA900C6A7C14BFB1-001/tempDir-001/node2/./testschemaapi_shard1_replica1/data/ does not point to a valid data directory; skipping clean-up of old index directories.
   [junit4]   2> 1028313 INFO  (OldIndexDirectoryCleanupThreadForCore-testschemaapi_shard1_replica2) [n:127.0.0.1:62238_solr c:testschemaapi s:shard1 r:core_node1 x:testschemaapi_shard1_replica2] o.a.s.c.SolrCore Looking for old index directories to cleanup for core testschemaapi_shard1_replica2 in /Users/jenkins/workspace/Lucene-Solr-master-MacOSX/solr/build/solr-core/test/J0/temp/solr.schema.TestManagedSchemaAPI_CA900C6A7C14BFB1-001/tempDir-001/node1/./testschemaapi_shard1_replica2/data/
   [junit4]   2> 1028313 WARN  (OldIndexDirectoryCleanupThreadForCore-testschemaapi_shard1_replica2) [n:127.0.0.1:62238_solr c:testschemaapi s:shard1 r:core_node1 x:testschemaapi_shard1_replica2] o.a.s.c.DirectoryFactory /Users/jenkins/workspace/Lucene-Solr-master-MacOSX/solr/build/solr-core/test/J0/temp/solr.schema.TestManagedSchemaAPI_CA900C6A7C14BFB1-001/tempDir-001/node1/./testschemaapi_shard1_replica2/data/ does not point to a valid data directory; skipping clean-up of old index directories.
   [junit4]   2> 1028313 INFO  (qtp261402490-34686) [n:127.0.0.1:62237_solr c:testschemaapi s:shard1 r:core_node2 x:testschemaapi_shard1_replica1] o.a.s.c.SolrCore no updateRequestProcessorChain defined as default, creating implicit default
   [junit4]   2> 1028314 INFO  (qtp601604536-34697) [n:127.0.0.1:62238_solr c:testschemaapi s:shard1 r:core_node1 x:testschemaapi_shard1_replica2] o.a.s.c.SolrCore no updateRequestProcessorChain defined as default, creating implicit default
   [junit4]   2> 1028315 INFO  (qtp261402490-34686) [n:127.0.0.1:62237_solr c:testschemaapi s:shard1 r:core_node2 x:testschemaapi_shard1_replica1] o.a.s.h.l.XMLLoader xsltCacheLifetimeSeconds=60
   [junit4]   2> 1028315 INFO  (qtp601604536-34697) [n:127.0.0.1:62238_solr c:testschemaapi s:shard1 r:core_node1 x:testschemaapi_shard1_replica2] o.a.s.h.l.XMLLoader xsltCacheLifetimeSeconds=60
   [junit4]   2> 1028315 INFO  (qtp261402490-34686) [n:127.0.0.1:62237_solr c:testschemaapi s:shard1 r:core_node2 x:testschemaapi_shard1_replica1] o.a.s.h.l.XMLLoader xsltCacheLifetimeSeconds=60
   [junit4]   2> 1028316 INFO  (qtp601604536-34697) [n:127.0.0.1:62238_solr c:testschemaapi s:shard1 r:core_node1 x:testschemaapi_shard1_replica2] o.a.s.h.l.XMLLoader xsltCacheLifetimeSeconds=60
   [junit4]   2> 1028316 INFO  (qtp261402490-34686) [n:127.0.0.1:62237_solr c:testschemaapi s:shard1 r:core_node2 x:testschemaapi_shard1_replica1] o.a.s.h.l.XMLLoader xsltCacheLifetimeSeconds=60
   [junit4]   2> 1028317 INFO  (qtp601604536-34697) [n:127.0.0.1:62238_solr c:testschemaapi s:shard1 r:core_node1 x:testschemaapi_shard1_replica2] o.a.s.h.l.XMLLoader xsltCacheLifetimeSeconds=60
   [junit4]   2> 1028317 INFO  (qtp261402490-34686) [n:127.0.0.1:62237_solr c:testschemaapi s:shard1 r:core_node2 x:testschemaapi_shard1_replica1] o.a.s.h.l.XMLLoader xsltCacheLifetimeSeconds=60
   [junit4]   2> 1028318 INFO  (qtp601604536-34697) [n:127.0.0.1:62238_solr c:testschemaapi s:shard1 r:core_node1 x:testschemaapi_shard1_replica2] o.a.s.h.l.XMLLoader xsltCacheLifetimeSeconds=60
   [junit4]   2> 1028319 INFO  (qtp261402490-34686) [n:127.0.0.1:62237_solr c:testschemaapi s:shard1 r:core_node2 x:testschemaapi_shard1_replica1] o.a.s.c.RequestHandlers Registered paths: /admin/mbeans,/update/csv,/sql,/update/json/docs,/admin/luke,/graph,/export,/select,/admin/segments,/get,/admin/system,/replication,/admin/properties,/config,/stream,/schema,/admin/plugins,/admin/logging,/update/json,/admin/ping,/admin/threads,/update,/admin/file
   [junit4]   2> 1028319 INFO  (qtp261402490-34686) [n:127.0.0.1:62237_solr c:testschemaapi s:shard1 r:core_node2 x:testschemaapi_shard1_replica1] o.a.s.c.SolrCore Using default statsCache cache: org.apache.solr.search.stats.LocalStatsCache
   [junit4]   2> 1028320 INFO  (qtp601604536-34697) [n:127.0.0.1:62238_solr c:testschemaapi s:shard1 r:core_node1 x:testschemaapi_shard1_replica2] o.a.s.c.RequestHandlers Registered paths: /admin/mbeans,/update/csv,/sql,/update/json/docs,/admin/luke,/graph,/export,/select,/admin/segments,/get,/admin/system,/replication,/admin/properties,/config,/stream,/schema,/admin/plugins,/admin/logging,/update/json,/admin/ping,/admin/threads,/update,/admin/file
   [junit4]   2> 1028320 INFO  (qtp601604536-34697) [n:127.0.0.1:62238_solr c:testschemaapi s:shard1 r:core_node1 x:testschemaapi_shard1_replica2] o.a.s.c.SolrCore Using default statsCache cache: org.apache.solr.search.stats.LocalStatsCache
   [junit4]   2> 1028320 INFO  (qtp261402490-34686) [n:127.0.0.1:62237_solr c:testschemaapi s:shard1 r:core_node2 x:testschemaapi_shard1_replica1] o.a.s.u.UpdateHandler Using UpdateLog implementation: org.apache.solr.update.UpdateLog
   [junit4]   2> 1028320 INFO  (qtp261402490-34686) [n:127.0.0.1:62237_solr c:testschemaapi s:shard1 r:core_node2 x:testschemaapi_shard1_replica1] o.a.s.u.UpdateLog Initializing UpdateLog: dataDir=null defaultSyncLevel=FLUSH numRecordsToKeep=100 maxNumLogsToKeep=10 numVersionBuckets=65536
   [junit4]   2> 1028320 INFO  (qtp601604536-34697) [n:127.0.0.1:62238_solr c:testschemaapi s:shard1 r:core_node1 x:testschemaapi_shard1_replica2] o.a.s.u.UpdateHandler Using UpdateLog implementation: org.apache.solr.update.UpdateLog
   [junit4]   2> 1028320 INFO  (qtp601604536-34697) [n:127.0.0.1:62238_solr c:testschemaapi s:shard1 r:core_node1 x:testschemaapi_shard1_replica2] o.a.s.u.UpdateLog Initializing UpdateLog: dataDir=null defaultSyncLevel=FLUSH numRecordsToKeep=100 maxNumLogsToKeep=10 numVersionBuckets=65536
   [junit4]   2> 1028322 INFO  (qtp261402490-34686) [n:127.0.0.1:62237_solr c:testschemaapi s:shard1 r:core_node2 x:testschemaapi_shard1_replica1] o.a.s.u.CommitTracker Hard AutoCommit: disabled
   [junit4]   2> 1028322 INFO  (qtp261402490-34686) [n:127.0.0.1:62237_solr c:testschemaapi s:shard1 r:core_node2 x:testschemaapi_shard1_replica1] o.a.s.u.CommitTracker Soft AutoCommit: disabled
   [junit4]   2> 1028322 INFO  (qtp601604536-34697) [n:127.0.0.1:62238_solr c:testschemaapi s:shard1 r:core_node1 x:testschemaapi_shard1_replica2] o.a.s.u.CommitTracker Hard AutoCommit: disabled
   [junit4]   2> 1028322 INFO  (qtp601604536-34697) [n:127.0.0.1:62238_solr c:testschemaapi s:shard1 r:core_node1 x:testschemaapi_shard1_replica2] o.a.s.u.CommitTracker Soft AutoCommit: disabled
   [junit4]   2> 1028323 INFO  (qtp261402490-34686) [n:127.0.0.1:62237_solr c:testschemaapi s:shard1 r:core_node2 x:testschemaapi_shard1_replica1] o.a.s.c.SolrDeletionPolicy SolrDeletionPolicy.onInit: commits: num=1
   [junit4]   2> 	commit{dir=MockDirectoryWrapper(RAMDirectory@5774232f lockFactory=org.apache.lucene.store.SingleInstanceLockFactory@569c2d4),segFN=segments_1,generation=1}
   [junit4]   2> 1028323 INFO  (qtp261402490-34686) [n:127.0.0.1:62237_solr c:testschemaapi s:shard1 r:core_node2 x:testschemaapi_shard1_replica1] o.a.s.c.SolrDeletionPolicy newest commit generation = 1
   [junit4]   2> 1028323 INFO  (qtp261402490-34686) [n:127.0.0.1:62237_solr c:testschemaapi s:shard1 r:core_node2 x:testschemaapi_shard1_replica1] o.a.s.s.SolrIndexSearcher Opening [Searcher@3003f51[testschemaapi_shard1_replica1] main]
   [junit4]   2> 1028323 INFO  (qtp261402490-34686) [n:127.0.0.1:62237_solr c:testschemaapi s:shard1 r:core_node2 x:testschemaapi_shard1_replica1] o.a.s.c.c.ZkStateReader Load collection config from: [/collections/testschemaapi]
   [junit4]   2> 1028323 INFO  (qtp601604536-34697) [n:127.0.0.1:62238_solr c:testschemaapi s:shard1 r:core_node1 x:testschemaapi_shard1_replica2] o.a.s.c.SolrDeletionPolicy SolrDeletionPolicy.onInit: commits: num=1
   [junit4]   2> 	commit{dir=MockDirectoryWrapper(RAMDirectory@4bdeb7aa lockFactory=org.apache.lucene.store.SingleInstanceLockFactory@6bc89326),segFN=segments_1,generation=1}
   [junit4]   2> 1028323 INFO  (qtp601604536-34697) [n:127.0.0.1:62238_solr c:testschemaapi s:shard1 r:core_node1 x:testschemaapi_shard1_replica2] o.a.s.c.SolrDeletionPolicy newest commit generation = 1
   [junit4]   2> 1028323 INFO  (qtp601604536-34697) [n:127.0.0.1:62238_solr c:testschemaapi s:shard1 r:core_node1 x:testschemaapi_shard1_replica2] o.a.s.s.SolrIndexSearcher Opening [Searcher@1b4d2d82[testschemaapi_shard1_replica2] main]
   [junit4]   2> 1028323 INFO  (qtp601604536-34697) [n:127.0.0.1:62238_solr c:testschemaapi s:shard1 r:core_node1 x:testschemaapi_shard1_replica2] o.a.s.c.c.ZkStateReader Load collection config from: [/collections/testschemaapi]
   [junit4]   2> 1028324 INFO  (qtp261402490-34686) [n:127.0.0.1:62237_solr c:testschemaapi s:shard1 r:core_node2 x:testschemaapi_shard1_replica1] o.a.s.c.c.ZkStateReader path=[/collections/testschemaapi] [configName]=[conf1] specified config exists in ZooKeeper
   [junit4]   2> 1028324 INFO  (qtp261402490-34686) [n:127.0.0.1:62237_solr c:testschemaapi s:shard1 r:core_node2 x:testschemaapi_shard1_replica1] o.a.s.r.ManagedResourceStorage Setting up ZooKeeper-based storage for the RestManager with znodeBase: /configs/conf1
   [junit4]   2> 1028324 INFO  (qtp601604536-34697) [n:127.0.0.1:62238_solr c:testschemaapi s:shard1 r:core_node1 x:testschemaapi_shard1_replica2] o.a.s.c.c.ZkStateReader path=[/collections/testschemaapi] [configName]=[conf1] specified config exists in ZooKeeper
   [junit4]   2> 1028324 INFO  (qtp601604536-34697) [n:127.0.0.1:62238_solr c:testschemaapi s:shard1 r:core_node1 x:testschemaapi_shard1_replica2] o.a.s.r.ManagedResourceStorage Setting up ZooKeeper-based storage for the RestManager with znodeBase: /configs/conf1
   [junit4]   2> 1028325 INFO  (qtp261402490-34686) [n:127.0.0.1:62237_solr c:testschemaapi s:shard1 r:core_node2 x:testschemaapi_shard1_replica1] o.a.s.r.ManagedResourceStorage Configured ZooKeeperStorageIO with znodeBase: /configs/conf1
   [junit4]   2> 1028325 INFO  (qtp601604536-34697) [n:127.0.0.1:62238_solr c:testschemaapi s:shard1 r:core_node1 x:testschemaapi_shard1_replica2] o.a.s.r.ManagedResourceStorage Configured ZooKeeperStorageIO with znodeBase: /configs/conf1
   [junit4]   2> 1028325 INFO  (qtp261402490-34686) [n:127.0.0.1:62237_solr c:testschemaapi s:shard1 r:core_node2 x:testschemaapi_shard1_replica1] o.a.s.r.RestManager Initializing RestManager with initArgs: {}
   [junit4]   2> 1028325 INFO  (qtp601604536-34697) [n:127.0.0.1:62238_solr c:testschemaapi s:shard1 r:core_node1 x:testschemaapi_shard1_replica2] o.a.s.r.RestManager Initializing RestManager with initArgs: {}
   [junit4]   2> 1028325 INFO  (qtp261402490-34686) [n:127.0.0.1:62237_solr c:testschemaapi s:shard1 r:core_node2 x:testschemaapi_shard1_replica1] o.a.s.r.ManagedResourceStorage Reading _rest_managed.json using ZooKeeperStorageIO:path=/configs/conf1
   [junit4]   2> 1028325 INFO  (qtp601604536-34697) [n:127.0.0.1:62238_solr c:testschemaapi s:shard1 r:core_node1 x:testschemaapi_shard1_replica2] o.a.s.r.ManagedResourceStorage Reading _rest_managed.json using ZooKeeperStorageIO:path=/configs/conf1
   [junit4]   2> 1028325 INFO  (qtp261402490-34686) [n:127.0.0.1:62237_solr c:testschemaapi s:shard1 r:core_node2 x:testschemaapi_shard1_replica1] o.a.s.r.ManagedResourceStorage No data found for znode /configs/conf1/_rest_managed.json
   [junit4]   2> 1028325 INFO  (qtp601604536-34697) [n:127.0.0.1:62238_solr c:testschemaapi s:shard1 r:core_node1 x:testschemaapi_shard1_replica2] o.a.s.r.ManagedResourceStorage No data found for znode /configs/conf1/_rest_managed.json
   [junit4]   2> 1028326 INFO  (qtp261402490-34686) [n:127.0.0.1:62237_solr c:testschemaapi s:shard1 r:core_node2 x:testschemaapi_shard1_replica1] o.a.s.r.ManagedResourceStorage Loaded null at path _rest_managed.json using ZooKeeperStorageIO:path=/configs/conf1
   [junit4]   2> 1028326 INFO  (qtp261402490-34686) [n:127.0.0.1:62237_solr c:testschemaapi s:shard1 r:core_node2 x:testschemaapi_shard1_replica1] o.a.s.r.RestManager Initializing 0 registered ManagedResources
   [junit4]   2> 1028326 INFO  (qtp261402490-34686) [n:127.0.0.1:62237_solr c:testschemaapi s:shard1 r:core_node2 x:testschemaapi_shard1_replica1] o.a.s.s.ZkIndexSchemaReader Creating ZooKeeper watch for the managed schema at /configs/conf1/managed-schema
   [junit4]   2> 1028326 INFO  (qtp601604536-34697) [n:127.0.0.1:62238_solr c:testschemaapi s:shard1 r:core_node1 x:testschemaapi_shard1_replica2] o.a.s.r.ManagedResourceStorage Loaded null at path _rest_managed.json using ZooKeeperStorageIO:path=/configs/conf1
   [junit4]   2> 1028326 INFO  (qtp601604536-34697) [n:127.0.0.1:62238_solr c:testschemaapi s:shard1 r:core_node1 x:testschemaapi_shard1_replica2] o.a.s.r.RestManager Initializing 0 registered ManagedResources
   [junit4]   2> 1028326 INFO  (qtp601604536-34697) [n:127.0.0.1:62238_solr c:testschemaapi s:shard1 r:core_node1 x:testschemaapi_shard1_replica2] o.a.s.s.ZkIndexSchemaReader Creating ZooKeeper watch for the managed schema at /configs/conf1/managed-schema
   [junit4]   2> 1028326 INFO  (qtp261402490-34686) [n:127.0.0.1:62237_solr c:testschemaapi s:shard1 r:core_node2 x:testschemaapi_shard1_replica1] o.a.s.c.ZkController Added new OnReconnect listener ZkIndexSchemaReader: /configs/conf1/managed-schema, uniqueCoreId: testschemaapi_shard1_replica1:713571575904282
   [junit4]   2> 1028326 INFO  (qtp261402490-34686) [n:127.0.0.1:62237_solr c:testschemaapi s:shard1 r:core_node2 x:testschemaapi_shard1_replica1] o.a.s.h.ReplicationHandler Commits will be reserved for  10000
   [junit4]   2> 1028326 INFO  (qtp601604536-34697) [n:127.0.0.1:62238_solr c:testschemaapi s:shard1 r:core_node1 x:testschemaapi_shard1_replica2] o.a.s.c.ZkController Added new OnReconnect listener ZkIndexSchemaReader: /configs/conf1/managed-schema, uniqueCoreId: testschemaapi_shard1_replica2:713571575956115
   [junit4]   2> 1028326 INFO  (qtp601604536-34697) [n:127.0.0.1:62238_solr c:testschemaapi s:shard1 r:core_node1 x:testschemaapi_shard1_replica2] o.a.s.h.ReplicationHandler Commits will be reserved for  10000
   [junit4]   2> 1028326 INFO  (qtp261402490-34686) [n:127.0.0.1:62237_solr c:testschemaapi s:shard1 r:core_node2 x:testschemaapi_shard1_replica1] o.a.s.u.UpdateLog Looking up max value of version field to seed version buckets
   [junit4]   2> 1028327 INFO  (qtp261402490-34686) [n:127.0.0.1:62237_solr c:testschemaapi s:shard1 r:core_node2 x:testschemaapi_shard1_replica1] o.a.s.u.VersionInfo Refreshing highest value of _version_ for 65536 version buckets from index
   [junit4]   2> 1028327 INFO  (qtp261402490-34686) [n:127.0.0.1:62237_solr c:testschemaapi s:shard1 r:core_node2 x:testschemaapi_shard1_replica1] o.a.s.u.VersionInfo No terms found for _version_, cannot seed version bucket highest value from index
   [junit4]   2> 1028327 INFO  (searcherExecutor-4677-thread-1-processing-n:127.0.0.1:62238_solr x:testschemaapi_shard1_replica2 s:shard1 c:testschemaapi r:core_node1) [n:127.0.0.1:62238_solr c:testschemaapi s:shard1 r:core_node1 x:testschemaapi_shard1_replica2] o.a.s.c.SolrCore [testschemaapi_shard1_replica2] Registered new searcher Searcher@1b4d2d82[testschemaapi_shard1_replica2] main{ExitableDirectoryReader(UninvertingDirectoryReader())}
   [junit4]   2> 1028327 INFO  (qtp601604536-34697) [n:127.0.0.1:62238_solr c:testschemaapi s:shard1 r:core_node1 x:testschemaapi_shard1_replica2] o.a.s.u.UpdateLog Looking up max value of version field to seed version buckets
   [junit4]   2> 1028327 INFO  (qtp601604536-34697) [n:127.0.0.1:62238_solr c:testschemaapi s:shard1 r:core_node1 x:testschemaapi_shard1_replica2] o.a.s.u.VersionInfo Refreshing highest value of _version_ for 65536 version buckets from index
   [junit4]   2> 1028327 INFO  (searcherExecutor-4676-thread-1-processing-n:127.0.0.1:62237_solr x:testschemaapi_shard1_replica1 s:shard1 c:testschemaapi r:core_node2) [n:127.0.0.1:62237_solr c:testschemaapi s:shard1 r:core_node2 x:testschemaapi_shard1_replica1] o.a.s.c.SolrCore [testschemaapi_shard1_replica1] Registered new searcher Searcher@3003f51[testschemaapi_shard1_replica1] main{ExitableDirectoryReader(UninvertingDirectoryReader())}
   [junit4]   2> 1028327 INFO  (qtp601604536-34697) [n:127.0.0.1:62238_solr c:testschemaapi s:shard1 r:core_node1 x:testschemaapi_shard1_replica2] o.a.s.u.VersionInfo No terms found for _version_, cannot seed version bucket highest value from index
   [junit4]   2> 1028327 INFO  (qtp601604536-34697) [n:127.0.0.1:62238_solr c:testschemaapi s:shard1 r:core_node1 x:testschemaapi_shard1_replica2] o.a.s.u.UpdateLog Could not find max version in index or recent updates, using new clock 1537717685729624064
   [junit4]   2> 1028327 INFO  (qtp261402490-34686) [n:127.0.0.1:62237_solr c:testschemaapi s:shard1 r:core_node2 x:testschemaapi_shard1_replica1] o.a.s.u.UpdateLog Could not find max version in index or recent updates, using new clock 1537717685729624064
   [junit4]   2> 1028330 INFO  (qtp601604536-34697) [n:127.0.0.1:62238_solr c:testschemaapi s:shard1 r:core_node1 x:testschemaapi_shard1_replica2] o.a.s.u.UpdateLog Took 2.0ms to seed version buckets with highest version 1537717685729624064
   [junit4]   2> 1028330 INFO  (qtp261402490-34686) [n:127.0.0.1:62237_solr c:testschemaapi s:shard1 r:core_node2 x:testschemaapi_shard1_replica1] o.a.s.u.UpdateLog Took 3.0ms to seed version buckets with highest version 1537717685729624064
   [junit4]   2> 1028330 INFO  (qtp601604536-34697) [n:127.0.0.1:62238_solr c:testschemaapi s:shard1 r:core_node1 x:testschemaapi_shard1_replica2] o.a.s.c.ZkController watch zkdir /configs/conf1
   [junit4]   2> 1028330 INFO  (qtp261402490-34686) [n:127.0.0.1:62237_solr c:testschemaapi s:shard1 r:core_node2 x:testschemaapi_shard1_replica1] o.a.s.c.ZkController watch zkdir /configs/conf1
   [junit4]   2> 1028331 INFO  (qtp601604536-34697) [n:127.0.0.1:62238_solr c:testschemaapi s:shard1 r:core_node1 x:testschemaapi_shard1_replica2] o.a.s.c.CoreContainer registering core: testschemaapi_shard1_replica2
   [junit4]   2> 1028331 INFO  (qtp601604536-34697) [n:127.0.0.1:62238_solr c:testschemaapi s:shard1 r:core_node1 x:testschemaapi_shard1_replica2] o.a.s.c.ZkController Register replica - core:testschemaapi_shard1_replica2 address:http://127.0.0.1:62238/solr collection:testschemaapi shard:shard1
   [junit4]   2> 1028331 INFO  (qtp261402490-34686) [n:127.0.0.1:62237_solr c:testschemaapi s:shard1 r:core_node2 x:testschemaapi_shard1_replica1] o.a.s.c.CoreContainer registering core: testschemaapi_shard1_replica1
   [junit4]   2> 1028331 INFO  (qtp261402490-34686) [n:127.0.0.1:62237_solr c:testschemaapi s:shard1 r:core_node2 x:testschemaapi_shard1_replica1] o.a.s.c.ZkController Register replica - core:testschemaapi_shard1_replica1 address:http://127.0.0.1:62237/solr collection:testschemaapi shard:shard1
   [junit4]   2> 1028332 INFO  (qtp601604536-34697) [n:127.0.0.1:62238_solr c:testschemaapi s:shard1 r:core_node1 x:testschemaapi_shard1_replica2] o.a.s.c.c.SolrZkClient makePath: /collections/testschemaapi/leader_elect/shard1/election
   [junit4]   2> 1028332 INFO  (qtp261402490-34686) [n:127.0.0.1:62237_solr c:testschemaapi s:shard1 r:core_node2 x:testschemaapi_shard1_replica1] o.a.s.c.c.SolrZkClient makePath: /collections/testschemaapi/leader_elect/shard1/election
   [junit4]   2> 1028337 INFO  (qtp261402490-34686) [n:127.0.0.1:62237_solr c:testschemaapi s:shard1 r:core_node2 x:testschemaapi_shard1_replica1] o.a.s.c.LeaderElector Joined leadership election with path: /collections/testschemaapi/leader_elect/shard1/election/96107355195375621-core_node2-n_0000000000
   [junit4]   2> 1028337 INFO  (qtp601604536-34697) [n:127.0.0.1:62238_solr c:testschemaapi s:shard1 r:core_node1 x:testschemaapi_shard1_replica2] o.a.s.c.LeaderElector Joined leadership election with path: /collections/testschemaapi/leader_elect/shard1/election/96107355195375622-core_node1-n_0000000001
   [junit4]   2> 1028338 INFO  (qtp261402490-34686) [n:127.0.0.1:62237_solr c:testschemaapi s:shard1 r:core_node2 x:testschemaapi_shard1_replica1] o.a.s.c.ShardLeaderElectionContext Running the leader process for shard=shard1 and weAreReplacement=false and leaderVoteWait=10000
   [junit4]   2> 1028338 INFO  (qtp601604536-34697) [n:127.0.0.1:62238_solr c:testschemaapi s:shard1 r:core_node1 x:testschemaapi_shard1_replica2] o.a.s.c.LeaderElector Watching path /collections/testschemaapi/leader_elect/shard1/election/96107355195375621-core_node2-n_0000000000 to know if I could be the leader
   [junit4]   2> 1028340 INFO  (qtp261402490-34686) [n:127.0.0.1:62237_solr c:testschemaapi s:shard1 r:core_node2 x:testschemaapi_shard1_replica1] o.a.s.c.ShardLeaderElectionContext Enough replicas found to continue.
   [junit4]   2> 1028340 INFO  (qtp261402490-34686) [n:127.0.0.1:62237_solr c:testschemaapi s:shard1 r:core_node2 x:testschemaapi_shard1_replica1] o.a.s.c.ShardLeaderElectionContext I may be the new leader - try and sync
   [junit4]   2> 1028340 INFO  (qtp261402490-34686) [n:127.0.0.1:62237_solr c:testschemaapi s:shard1 r:core_node2 x:testschemaapi_shard1_replica1] o.a.s.c.SyncStrategy Sync replicas to http://127.0.0.1:62237/solr/testschemaapi_shard1_replica1/
   [junit4]   2> 1028340 INFO  (qtp261402490-34686) [n:127.0.0.1:62237_solr c:testschemaapi s:shard1 r:core_node2 x:testschemaapi_shard1_replica1] o.a.s.u.PeerSync PeerSync: core=testschemaapi_shard1_replica1 url=http://127.0.0.1:62237/solr START replicas=[http://127.0.0.1:62238/solr/testschemaapi_shard1_replica2/] nUpdates=100
   [junit4]   2> 1028341 INFO  (qtp261402490-34686) [n:127.0.0.1:62237_solr c:testschemaapi s:shard1 r:core_node2 x:testschemaapi_shard1_replica1] o.a.s.u.PeerSync PeerSync: core=testschemaapi_shard1_replica1 url=http://127.0.0.1:62237/solr DONE.  We have no versions.  sync failed.
   [junit4]   2> 1028341 INFO  (qtp261402490-34686) [n:127.0.0.1:62237_solr c:testschemaapi s:shard1 r:core_node2 x:testschemaapi_shard1_replica1] o.a.s.c.SyncStrategy Leader's attempt to sync with shard failed, moving to the next candidate
   [junit4]   2> 1028341 INFO  (qtp261402490-34686) [n:127.0.0.1:62237_solr c:testschemaapi s:shard1 r:core_node2 x:testschemaapi_shard1_replica1] o.a.s.c.ShardLeaderElectionContext We failed sync, but we have no versions - we can't sync in that case - we were active before, so become leader anyway
   [junit4]   2> 1028341 INFO  (OverseerStateUpdate-96107355195375621-127.0.0.1:62237_solr-n_0000000000) [n:127.0.0.1:62237_solr    ] o.a.s.c.Overseer processMessage: queueSize: 1, message = {
   [junit4]   2>   "operation":"leader",
   [junit4]   2>   "shard":"shard1",
   [junit4]   2>   "collection":"testschemaapi"} current state version: 0
   [junit4]   2> 1028342 INFO  (qtp261402490-34686) [n:127.0.0.1:62237_solr c:testschemaapi s:shard1 r:core_node2 x:testschemaapi_shard1_replica1] o.a.s.c.c.SolrZkClient makePath: /collections/testschemaapi/leaders/shard1
   [junit4]   2> 1028343 INFO  (qtp601604536-34699) [n:127.0.0.1:62238_solr c:testschemaapi s:shard1 r:core_node1 x:testschemaapi_shard1_replica2] o.a.s.c.S.Request [testschemaapi_shard1_replica2]  webapp=/solr path=/get params={distrib=false&qt=/get&fingerprint=false&getVersions=100&wt=javabin&version=2} status=0 QTime=0
   [junit4]   2> 1028347 INFO  (qtp261402490-34686) [n:127.0.0.1:62237_solr c:testschemaapi s:shard1 r:core_node2 x:testschemaapi_shard1_replica1] o.a.s.c.ShardLeaderElectionContextBase Creating leader registration node /collections/testschemaapi/leaders/shard1/leader after winning as /collections/testschemaapi/leader_elect/shard1/election/96107355195375621-core_node2-n_0000000000
   [junit4]   2> 1028350 INFO  (qtp261402490-34686) [n:127.0.0.1:62237_solr c:testschemaapi s:shard1 r:core_node2 x:testschemaapi_shard1_replica1] o.a.s.c.ShardLeaderElectionContext I am the new leader: http://127.0.0.1:62237/solr/testschemaapi_shard1_replica1/ shard1
   [junit4]   2> 1028351 INFO  (OverseerStateUpdate-96107355195375621-127.0.0.1:62237_solr-n_0000000000) [n:127.0.0.1:62237_solr    ] o.a.s.c.Overseer processMessage: queueSize: 1, message = {
   [junit4]   2>   "operation":"leader",
   [junit4]   2>   "shard":"shard1",
   [junit4]   2>   "collection":"testschemaapi",
   [junit4]   2>   "base_url":"http://127.0.0.1:62237/solr",
   [junit4]   2>   "core":"testschemaapi_shard1_replica1",
   [junit4]   2>   "state":"active"} current state version: 0
   [junit4]   2> 1028455 INFO  (OverseerStateUpdate-96107355195375621-127.0.0.1:62237_solr-n_0000000000) [n:127.0.0.1:62237_solr    ] o.a.s.c.o.ZkStateWriter going to update_collection /collections/testschemaapi/state.json version: 1
   [junit4]   2> 1028456 INFO  (zkCallback-8553-thread-1-processing-n:127.0.0.1:62238_solr) [n:127.0.0.1:62238_solr    ] o.a.s.c.c.ZkStateReader A cluster state change: [WatchedEvent state:SyncConnected type:NodeDataChanged path:/collections/testschemaapi/state.json] for collection [testschemaapi] has occurred - updating... (live nodes size: [2])
   [junit4]   2> 1028456 INFO  (zkCallback-8552-thread-2-processing-n:127.0.0.1:62237_solr) [n:127.0.0.1:62237_solr    ] o.a.s.c.c.ZkStateReader A cluster state change: [WatchedEvent state:SyncConnected type:NodeDataChanged path:/collections/testschemaapi/state.json] for collection [testschemaapi] has occurred - updating... (live nodes size: [2])
   [junit4]   2> 1028457 INFO  (zkCallback-8553-thread-1-processing-n:127.0.0.1:62238_solr) [n:127.0.0.1:62238_solr    ] o.a.s.c.c.ZkStateReader Updating data for [testschemaapi] from [1] to [2]
   [junit4]   2> 1028457 INFO  (zkCallback-8552-thread-2-processing-n:127.0.0.1:62237_solr) [n:127.0.0.1:62237_solr    ] o.a.s.c.c.ZkStateReader Updating data for [testschemaapi] from [1] to [2]
   [junit4]   2> 1028503 INFO  (qtp261402490-34686) [n:127.0.0.1:62237_solr c:testschemaapi s:shard1 r:core_node2 x:testschemaapi_shard1_replica1] o.a.s.c.ZkController We are http://127.0.0.1:62237/solr/testschemaapi_shard1_replica1/ and leader is http://127.0.0.1:62237/solr/testschemaapi_shard1_replica1/
   [junit4]   2> 1028503 INFO  (qtp261402490-34686) [n:127.0.0.1:62237_solr c:testschemaapi s:shard1 r:core_node2 x:testschemaapi_shard1_replica1] o.a.s.c.ZkController No LogReplay needed for core=testschemaapi_shard1_replica1 baseURL=http://127.0.0.1:62237/solr
   [junit4]   2> 1028503 INFO  (qtp261402490-34686) [n:127.0.0.1:62237_solr c:testschemaapi s:shard1 r:core_node2 x:testschemaapi_shard1_replica1] o.a.s.c.ZkController I am the leader, no recovery necessary
   [junit4]   2> 1028503 INFO  (qtp261402490-34686) [n:127.0.0.1:62237_solr c:testschemaapi s:shard1 r:core_node2 x:testschemaapi_shard1_replica1] o.a.s.c.ZkController publishing state=active
   [junit4]   2> 1028506 INFO  (OverseerStateUpdate-96107355195375621-127.0.0.1:62237_solr-n_0000000000) [n:127.0.0.1:62237_solr    ] o.a.s.c.Overseer processMessage: queueSize: 1, message = {
   [junit4]   2>   "core":"testschemaapi_shard1_replica1",
   [junit4]   2>   "core_node_name":"core_node2",
   [junit4]   2>   "roles":null,
   [junit4]   2>   "base_url":"http://127.0.0.1:62237/solr",
   [junit4]   2>   "node_name":"127.0.0.1:62237_solr",
   [junit4]   2>   "numShards":"1",
   [junit4]   2>   "state":"active",
   [junit4]   2>   "shard":"shard1",
   [junit4]   2>   "collection":"testschemaapi",
   [junit4]   2>   "operation":"state"} current state version: 0
   [junit4]   2> 1028506 INFO  (OverseerStateUpdate-96107355195375621-127.0.0.1:62237_solr-n_0000000000) [n:127.0.0.1:62237_solr    ] o.a.s.c.o.ReplicaMutator Update state numShards=1 message={
   [junit4]   2>   "core":"testschemaapi_shard1_replica1",
   [junit4]   2>   "core_node_name":"core_node2",
   [junit4]   2>   "roles":null,
   [junit4]   2>   "base_url":"http://127.0.0.1:62237/solr",
   [junit4]   2>   "node_name":"1

[...truncated too long message...]

ins/workspace/Lucene-Solr-master-MacOSX/solr/build/solr-core/test/J0/temp/solr.schema.TestManagedSchemaAPI_CA900C6A7C14BFB1-001/tempDir-001/node2/./testschemaapi_shard1_replica1/data
   [junit4]   2> 1039168 INFO  (Thread-2445) [n:127.0.0.1:62237_solr c:testschemaapi s:shard1 r:core_node2 x:testschemaapi_shard1_replica1] o.a.s.c.CachingDirectoryFactory looking to close /Users/jenkins/workspace/Lucene-Solr-master-MacOSX/solr/build/solr-core/test/J0/temp/solr.schema.TestManagedSchemaAPI_CA900C6A7C14BFB1-001/tempDir-001/node2/./testschemaapi_shard1_replica1/data/index [CachedDir<<refCount=0;path=/Users/jenkins/workspace/Lucene-Solr-master-MacOSX/solr/build/solr-core/test/J0/temp/solr.schema.TestManagedSchemaAPI_CA900C6A7C14BFB1-001/tempDir-001/node2/./testschemaapi_shard1_replica1/data/index;done=false>>]
   [junit4]   2> 1039169 INFO  (Thread-2445) [n:127.0.0.1:62237_solr c:testschemaapi s:shard1 r:core_node2 x:testschemaapi_shard1_replica1] o.a.s.c.CachingDirectoryFactory Closing directory, CoreContainer#isShutdown=true
   [junit4]   2> 1039169 INFO  (Thread-2445) [n:127.0.0.1:62237_solr c:testschemaapi s:shard1 r:core_node2 x:testschemaapi_shard1_replica1] o.a.s.c.CachingDirectoryFactory Closing directory: /Users/jenkins/workspace/Lucene-Solr-master-MacOSX/solr/build/solr-core/test/J0/temp/solr.schema.TestManagedSchemaAPI_CA900C6A7C14BFB1-001/tempDir-001/node2/./testschemaapi_shard1_replica1/data/index
   [junit4]   2> 1039169 WARN  (Thread-2445) [n:127.0.0.1:62237_solr c:testschemaapi s:shard1 r:core_node2 x:testschemaapi_shard1_replica1] o.a.s.c.ZkController listener throws error
   [junit4]   2> org.apache.solr.common.SolrException: Unable to reload core [testschemaapi_shard1_replica1]
   [junit4]   2> 	at org.apache.solr.core.CoreContainer.reload(CoreContainer.java:943)
   [junit4]   2> 	at org.apache.solr.core.SolrCore.lambda$getConfListener$6(SolrCore.java:2509)
   [junit4]   2> 	at org.apache.solr.cloud.ZkController$4.run(ZkController.java:2405)
   [junit4]   2> Caused by: org.apache.solr.common.SolrException: Could not find config name for collection:testschemaapi
   [junit4]   2> 	at org.apache.solr.core.SolrCore.<init>(SolrCore.java:772)
   [junit4]   2> 	at org.apache.solr.core.SolrCore.reload(SolrCore.java:461)
   [junit4]   2> 	at org.apache.solr.core.CoreContainer.reload(CoreContainer.java:937)
   [junit4]   2> 	... 2 more
   [junit4]   2> Caused by: org.apache.solr.common.SolrException: Could not find config name for collection:testschemaapi
   [junit4]   2> 	at org.apache.solr.rest.ManagedResourceStorage.newStorageIO(ManagedResourceStorage.java:101)
   [junit4]   2> 	at org.apache.solr.core.SolrCore.initRestManager(SolrCore.java:2304)
   [junit4]   2> 	at org.apache.solr.core.SolrCore.<init>(SolrCore.java:748)
   [junit4]   2> 	... 4 more
   [junit4]   2> 1040624 WARN  (zkCallback-8553-thread-1-processing-n:127.0.0.1:62238_solr) [n:127.0.0.1:62238_solr    ] o.a.s.c.LeaderElector 
   [junit4]   2> org.apache.zookeeper.KeeperException$SessionExpiredException: KeeperErrorCode = Session expired for /collections/testschemaapi/leader_elect/shard1/election
   [junit4]   2> 	at org.apache.zookeeper.KeeperException.create(KeeperException.java:127)
   [junit4]   2> 	at org.apache.zookeeper.KeeperException.create(KeeperException.java:51)
   [junit4]   2> 	at org.apache.zookeeper.ZooKeeper.getChildren(ZooKeeper.java:1472)
   [junit4]   2> 	at org.apache.solr.common.cloud.SolrZkClient$6.execute(SolrZkClient.java:330)
   [junit4]   2> 	at org.apache.solr.common.cloud.SolrZkClient$6.execute(SolrZkClient.java:327)
   [junit4]   2> 	at org.apache.solr.common.cloud.ZkCmdExecutor.retryOperation(ZkCmdExecutor.java:60)
   [junit4]   2> 	at org.apache.solr.common.cloud.SolrZkClient.getChildren(SolrZkClient.java:327)
   [junit4]   2> 	at org.apache.solr.cloud.LeaderElector.checkIfIamLeader(LeaderElector.java:105)
   [junit4]   2> 	at org.apache.solr.cloud.LeaderElector.access$200(LeaderElector.java:56)
   [junit4]   2> 	at org.apache.solr.cloud.LeaderElector$ElectionWatcher.process(LeaderElector.java:348)
   [junit4]   2> 	at org.apache.solr.common.cloud.SolrZkClient$3.lambda$process$0(SolrZkClient.java:265)
   [junit4]   2> 	at java.util.concurrent.Executors$RunnableAdapter.call(Executors.java:511)
   [junit4]   2> 	at java.util.concurrent.FutureTask.run(FutureTask.java:266)
   [junit4]   2> 	at org.apache.solr.common.util.ExecutorUtil$MDCAwareThreadPoolExecutor.lambda$execute$0(ExecutorUtil.java:229)
   [junit4]   2> 	at java.util.concurrent.ThreadPoolExecutor.runWorker(ThreadPoolExecutor.java:1142)
   [junit4]   2> 	at java.util.concurrent.ThreadPoolExecutor$Worker.run(ThreadPoolExecutor.java:617)
   [junit4]   2> 	at java.lang.Thread.run(Thread.java:745)
   [junit4]   2> 1040625 INFO  (jetty-launcher-8542-thread-2) [    ] o.e.j.s.h.ContextHandler Stopped o.e.j.s.ServletContextHandler@32c73d{/solr,null,UNAVAILABLE}
   [junit4]   2> 1040634 INFO  (SUITE-TestManagedSchemaAPI-seed#[CA900C6A7C14BFB1]-worker) [    ] o.a.s.c.ZkTestServer connecting to 127.0.0.1:62235 62235
   [junit4]   2> 1040651 INFO  (Thread-2412) [    ] o.a.s.c.ZkTestServer connecting to 127.0.0.1:62235 62235
   [junit4]   2> 1042087 WARN  (Thread-2412) [    ] o.a.s.c.ZkTestServer Watch limit violations: 
   [junit4]   2> Maximum concurrent create/delete watches above limit:
   [junit4]   2> 
   [junit4]   2> 	6	/solr/configs/conf1/managed-schema
   [junit4]   2> 	6	/solr/configs/conf1
   [junit4]   2> 	3	/solr/aliases.json
   [junit4]   2> 	3	/solr/clusterprops.json
   [junit4]   2> 	2	/solr/security.json
   [junit4]   2> 
   [junit4]   2> Maximum concurrent data watches above limit:
   [junit4]   2> 
   [junit4]   2> 	3	/solr/clusterstate.json
   [junit4]   2> 	2	/solr/collections/testschemaapi/state.json
   [junit4]   2> 
   [junit4]   2> Maximum concurrent children watches above limit:
   [junit4]   2> 
   [junit4]   2> 	9	/solr/overseer/queue
   [junit4]   2> 	9	/solr/overseer/collection-queue-work
   [junit4]   2> 	4	/solr/overseer/queue-work
   [junit4]   2> 	3	/solr/live_nodes
   [junit4]   2> 	3	/solr/collections
   [junit4]   2> 
   [junit4]   2> 1042088 INFO  (SUITE-TestManagedSchemaAPI-seed#[CA900C6A7C14BFB1]-worker) [    ] o.a.s.SolrTestCaseJ4 ###deleteCore
   [junit4]   2> NOTE: leaving temporary files on disk at: /Users/jenkins/workspace/Lucene-Solr-master-MacOSX/solr/build/solr-core/test/J0/temp/solr.schema.TestManagedSchemaAPI_CA900C6A7C14BFB1-001
   [junit4]   2> NOTE: test params are: codec=Asserting(Lucene62): {_version_=TestBloomFilteredLucenePostings(BloomFilteringPostingsFormat(Lucene50(blocksize=128))), id=FST50, myNewField=TestBloomFilteredLucenePostings(BloomFilteringPostingsFormat(Lucene50(blocksize=128)))}, docValues:{}, maxPointsInLeafNode=1840, maxMBSortInHeap=5.8539166356168835, sim=ClassicSimilarity, locale=ar-JO, timezone=Asia/Aden
   [junit4]   2> NOTE: Mac OS X 10.11.5 x86_64/Oracle Corporation 1.8.0_92 (64-bit)/cpus=3,threads=1,free=313289824,total=518979584
   [junit4]   2> NOTE: All tests run in this JVM: [TestDefaultStatsCache, TestSolrConfigHandlerConcurrent, TestNoOpRegenerator, CollectionsAPIAsyncDistributedZkTest, TestTestInjection, HdfsRecoverLeaseTest, TestSort, BadComponentTest, CdcrReplicationDistributedZkTest, TestCollectionAPI, TestDFRSimilarityFactory, TestPerFieldSimilarityWithDefaultOverride, TestCoreContainer, AlternateDirectoryTest, OutOfBoxZkACLAndCredentialsProvidersTest, TestFreeTextSuggestions, TestHighlightDedupGrouping, TestConfigSetProperties, TermsComponentTest, TestExtendedDismaxParser, TestChildDocTransformer, LeaderInitiatedRecoveryOnCommitTest, TimeZoneUtilsTest, TestLRUCache, MBeansHandlerTest, ConcurrentDeleteAndCreateCollectionTest, CustomCollectionTest, ClusterStateTest, TestManagedSynonymFilterFactory, VersionInfoTest, ExplicitHLLTest, TestJmxMonitoredMap, TestFieldResource, DistributedQueryElevationComponentTest, TestDynamicFieldResource, CircularListTest, TestBlendedInfixSuggestions, InfoHandlerTest, TestDocumentBuilder, TestStressLiveNodes, JSONWriterTest, TestReplicationHandler, ShardRoutingTest, TestDistributedSearch, EnumFieldTest, TestScoreJoinQPNoScore, TestSolrQueryParserDefaultOperatorResource, TestSolrQueryResponse, HttpPartitionTest, ZkControllerTest, CurrencyFieldXmlFileTest, TestFieldCacheWithThreads, TestDocSet, QueryEqualityTest, TestJsonRequest, TestConfigReload, ClusterStateUpdateTest, TestCollapseQParserPlugin, DistributedExpandComponentTest, SimpleFacetsTest, HdfsChaosMonkeyNothingIsSafeTest, TestComponentsName, TestJmxIntegration, SyncSliceTest, TestCryptoKeys, TestLuceneMatchVersion, TestCSVLoader, TestManagedSchemaAPI]
   [junit4] Completed [145/614 (1!)] on J0 in 16.27s, 1 test, 1 error <<< FAILURES!

[...truncated 1507 lines...]
BUILD FAILED
/Users/jenkins/workspace/Lucene-Solr-master-MacOSX/build.xml:740: The following error occurred while executing this line:
/Users/jenkins/workspace/Lucene-Solr-master-MacOSX/build.xml:684: The following error occurred while executing this line:
/Users/jenkins/workspace/Lucene-Solr-master-MacOSX/build.xml:59: The following error occurred while executing this line:
/Users/jenkins/workspace/Lucene-Solr-master-MacOSX/solr/build.xml:233: The following error occurred while executing this line:
/Users/jenkins/workspace/Lucene-Solr-master-MacOSX/solr/common-build.xml:530: The following error occurred while executing this line:
/Users/jenkins/workspace/Lucene-Solr-master-MacOSX/lucene/common-build.xml:1427: The following error occurred while executing this line:
/Users/jenkins/workspace/Lucene-Solr-master-MacOSX/lucene/common-build.xml:984: There were test failures: 614 suites (10 ignored), 2584 tests, 1 error, 122 ignored (72 assumptions) [seed: CA900C6A7C14BFB1]

Total time: 79 minutes 15 seconds
Build step 'Invoke Ant' marked build as failure
Archiving artifacts
[WARNINGS] Skipping publisher since build result is FAILURE
Recording test results
Email was triggered for: Failure - Any
Sending email for trigger: Failure - Any



Mime
View raw message