lucene-dev mailing list archives

Site index · List index
Message view « Date » · « Thread »
Top « Date » · « Thread »
From Apache Jenkins Server <jenk...@builds.apache.org>
Subject [JENKINS] Lucene-Solr-NightlyTests-master - Build # 1046 - Still Failing
Date Sun, 19 Jun 2016 17:20:56 GMT
Build: https://builds.apache.org/job/Lucene-Solr-NightlyTests-master/1046/

16 tests failed.
FAILED:  org.apache.solr.cloud.CollectionsAPIDistributedZkTest.test

Error Message:
Captured an uncaught exception in thread: Thread[id=59979, name=collection5, state=RUNNABLE, group=TGRP-CollectionsAPIDistributedZkTest]

Stack Trace:
com.carrotsearch.randomizedtesting.UncaughtExceptionError: Captured an uncaught exception in thread: Thread[id=59979, name=collection5, state=RUNNABLE, group=TGRP-CollectionsAPIDistributedZkTest]
Caused by: org.apache.solr.client.solrj.impl.HttpSolrClient$RemoteSolrException: Error from server at http://127.0.0.1:60318: collection already exists: awholynewstresscollection_collection5_5
	at __randomizedtesting.SeedInfo.seed([4E20909FE0E5459D]:0)
	at org.apache.solr.client.solrj.impl.HttpSolrClient.executeMethod(HttpSolrClient.java:606)
	at org.apache.solr.client.solrj.impl.HttpSolrClient.request(HttpSolrClient.java:259)
	at org.apache.solr.client.solrj.impl.HttpSolrClient.request(HttpSolrClient.java:248)
	at org.apache.solr.client.solrj.impl.LBHttpSolrClient.doRequest(LBHttpSolrClient.java:413)
	at org.apache.solr.client.solrj.impl.LBHttpSolrClient.request(LBHttpSolrClient.java:366)
	at org.apache.solr.client.solrj.impl.CloudSolrClient.sendRequest(CloudSolrClient.java:1228)
	at org.apache.solr.client.solrj.impl.CloudSolrClient.requestWithRetryOnStaleState(CloudSolrClient.java:998)
	at org.apache.solr.client.solrj.impl.CloudSolrClient.request(CloudSolrClient.java:934)
	at org.apache.solr.client.solrj.SolrClient.request(SolrClient.java:1219)
	at org.apache.solr.cloud.AbstractFullDistribZkTestBase.createCollection(AbstractFullDistribZkTestBase.java:1599)
	at org.apache.solr.cloud.AbstractFullDistribZkTestBase.createCollection(AbstractFullDistribZkTestBase.java:1620)
	at org.apache.solr.cloud.CollectionsAPIDistributedZkTest$1CollectionThread.run(CollectionsAPIDistributedZkTest.java:988)


FAILED:  org.apache.solr.cloud.FullSolrCloudDistribCmdsTest.test

Error Message:
Java heap space

Stack Trace:
java.lang.OutOfMemoryError: Java heap space
	at __randomizedtesting.SeedInfo.seed([4E20909FE0E5459D:C674AF454E192865]:0)
	at java.util.HashMap.resize(HashMap.java:703)
	at java.util.HashMap.putVal(HashMap.java:662)
	at java.util.HashMap.put(HashMap.java:611)
	at java.util.HashSet.add(HashSet.java:219)
	at org.apache.solr.cloud.CloudInspectUtil.showDiff(CloudInspectUtil.java:125)
	at org.apache.solr.cloud.CloudInspectUtil.compareResults(CloudInspectUtil.java:206)
	at org.apache.solr.cloud.CloudInspectUtil.compareResults(CloudInspectUtil.java:167)
	at org.apache.solr.cloud.FullSolrCloudDistribCmdsTest.testIndexingBatchPerRequestWithHttpSolrClient(FullSolrCloudDistribCmdsTest.java:676)
	at org.apache.solr.cloud.FullSolrCloudDistribCmdsTest.test(FullSolrCloudDistribCmdsTest.java:152)
	at sun.reflect.NativeMethodAccessorImpl.invoke0(Native Method)
	at sun.reflect.NativeMethodAccessorImpl.invoke(NativeMethodAccessorImpl.java:62)
	at sun.reflect.DelegatingMethodAccessorImpl.invoke(DelegatingMethodAccessorImpl.java:43)
	at java.lang.reflect.Method.invoke(Method.java:498)
	at com.carrotsearch.randomizedtesting.RandomizedRunner.invoke(RandomizedRunner.java:1764)
	at com.carrotsearch.randomizedtesting.RandomizedRunner$8.evaluate(RandomizedRunner.java:871)
	at com.carrotsearch.randomizedtesting.RandomizedRunner$9.evaluate(RandomizedRunner.java:907)
	at com.carrotsearch.randomizedtesting.RandomizedRunner$10.evaluate(RandomizedRunner.java:921)
	at org.apache.solr.BaseDistributedSearchTestCase$ShardsRepeatRule$ShardsFixedStatement.callStatement(BaseDistributedSearchTestCase.java:985)
	at org.apache.solr.BaseDistributedSearchTestCase$ShardsRepeatRule$ShardsStatement.evaluate(BaseDistributedSearchTestCase.java:960)
	at com.carrotsearch.randomizedtesting.rules.SystemPropertiesRestoreRule$1.evaluate(SystemPropertiesRestoreRule.java:57)
	at org.apache.lucene.util.TestRuleSetupTeardownChained$1.evaluate(TestRuleSetupTeardownChained.java:49)
	at org.apache.lucene.util.AbstractBeforeAfterRule$1.evaluate(AbstractBeforeAfterRule.java:45)
	at org.apache.lucene.util.TestRuleThreadAndTestName$1.evaluate(TestRuleThreadAndTestName.java:48)
	at org.apache.lucene.util.TestRuleIgnoreAfterMaxFailures$1.evaluate(TestRuleIgnoreAfterMaxFailures.java:64)
	at org.apache.lucene.util.TestRuleMarkFailure$1.evaluate(TestRuleMarkFailure.java:47)
	at com.carrotsearch.randomizedtesting.rules.StatementAdapter.evaluate(StatementAdapter.java:36)
	at com.carrotsearch.randomizedtesting.ThreadLeakControl$StatementRunner.run(ThreadLeakControl.java:367)
	at com.carrotsearch.randomizedtesting.ThreadLeakControl.forkTimeoutingTask(ThreadLeakControl.java:809)
	at com.carrotsearch.randomizedtesting.ThreadLeakControl$3.evaluate(ThreadLeakControl.java:460)
	at com.carrotsearch.randomizedtesting.RandomizedRunner.runSingleTest(RandomizedRunner.java:880)
	at com.carrotsearch.randomizedtesting.RandomizedRunner$5.evaluate(RandomizedRunner.java:781)
	at com.carrotsearch.randomizedtesting.RandomizedRunner$6.evaluate(RandomizedRunner.java:816)


FAILED:  org.apache.solr.cloud.hdfs.HdfsRestartWhileUpdatingTest.test

Error Message:
KeeperErrorCode = ConnectionLoss for /

Stack Trace:
org.apache.zookeeper.KeeperException$ConnectionLossException: KeeperErrorCode = ConnectionLoss for /
	at org.apache.zookeeper.KeeperException.create(KeeperException.java:99)
	at org.apache.zookeeper.KeeperException.create(KeeperException.java:51)
	at org.apache.zookeeper.ZooKeeper.getData(ZooKeeper.java:1155)
	at org.apache.solr.common.cloud.SolrZkClient$7.execute(SolrZkClient.java:347)
	at org.apache.solr.common.cloud.SolrZkClient$7.execute(SolrZkClient.java:344)
	at org.apache.solr.common.cloud.ZkCmdExecutor.retryOperation(ZkCmdExecutor.java:60)
	at org.apache.solr.common.cloud.SolrZkClient.getData(SolrZkClient.java:344)
	at org.apache.solr.common.cloud.SolrZkClient.printLayout(SolrZkClient.java:584)
	at org.apache.solr.common.cloud.SolrZkClient.printLayoutToStdOut(SolrZkClient.java:625)
	at org.apache.solr.cloud.AbstractDistribZkTestBase.waitForRecoveriesToFinish(AbstractDistribZkTestBase.java:181)
	at org.apache.solr.cloud.AbstractFullDistribZkTestBase.waitForRecoveriesToFinish(AbstractFullDistribZkTestBase.java:862)
	at org.apache.solr.cloud.AbstractFullDistribZkTestBase.waitForThingsToLevelOut(AbstractFullDistribZkTestBase.java:1418)
	at org.apache.solr.cloud.RestartWhileUpdatingTest.test(RestartWhileUpdatingTest.java:144)
	at sun.reflect.NativeMethodAccessorImpl.invoke0(Native Method)
	at sun.reflect.NativeMethodAccessorImpl.invoke(NativeMethodAccessorImpl.java:62)
	at sun.reflect.DelegatingMethodAccessorImpl.invoke(DelegatingMethodAccessorImpl.java:43)
	at java.lang.reflect.Method.invoke(Method.java:498)
	at com.carrotsearch.randomizedtesting.RandomizedRunner.invoke(RandomizedRunner.java:1764)
	at com.carrotsearch.randomizedtesting.RandomizedRunner$8.evaluate(RandomizedRunner.java:871)
	at com.carrotsearch.randomizedtesting.RandomizedRunner$9.evaluate(RandomizedRunner.java:907)
	at com.carrotsearch.randomizedtesting.RandomizedRunner$10.evaluate(RandomizedRunner.java:921)
	at org.apache.solr.BaseDistributedSearchTestCase$ShardsRepeatRule$ShardsFixedStatement.callStatement(BaseDistributedSearchTestCase.java:985)
	at org.apache.solr.BaseDistributedSearchTestCase$ShardsRepeatRule$ShardsStatement.evaluate(BaseDistributedSearchTestCase.java:960)
	at com.carrotsearch.randomizedtesting.rules.SystemPropertiesRestoreRule$1.evaluate(SystemPropertiesRestoreRule.java:57)
	at org.apache.lucene.util.TestRuleSetupTeardownChained$1.evaluate(TestRuleSetupTeardownChained.java:49)
	at org.apache.lucene.util.AbstractBeforeAfterRule$1.evaluate(AbstractBeforeAfterRule.java:45)
	at org.apache.lucene.util.TestRuleThreadAndTestName$1.evaluate(TestRuleThreadAndTestName.java:48)
	at org.apache.lucene.util.TestRuleIgnoreAfterMaxFailures$1.evaluate(TestRuleIgnoreAfterMaxFailures.java:64)
	at org.apache.lucene.util.TestRuleMarkFailure$1.evaluate(TestRuleMarkFailure.java:47)
	at com.carrotsearch.randomizedtesting.rules.StatementAdapter.evaluate(StatementAdapter.java:36)
	at com.carrotsearch.randomizedtesting.ThreadLeakControl$StatementRunner.run(ThreadLeakControl.java:367)
	at com.carrotsearch.randomizedtesting.ThreadLeakControl.forkTimeoutingTask(ThreadLeakControl.java:809)
	at com.carrotsearch.randomizedtesting.ThreadLeakControl$3.evaluate(ThreadLeakControl.java:460)
	at com.carrotsearch.randomizedtesting.RandomizedRunner.runSingleTest(RandomizedRunner.java:880)
	at com.carrotsearch.randomizedtesting.RandomizedRunner$5.evaluate(RandomizedRunner.java:781)
	at com.carrotsearch.randomizedtesting.RandomizedRunner$6.evaluate(RandomizedRunner.java:816)
	at com.carrotsearch.randomizedtesting.RandomizedRunner$7.evaluate(RandomizedRunner.java:827)
	at com.carrotsearch.randomizedtesting.rules.StatementAdapter.evaluate(StatementAdapter.java:36)
	at com.carrotsearch.randomizedtesting.rules.SystemPropertiesRestoreRule$1.evaluate(SystemPropertiesRestoreRule.java:57)
	at org.apache.lucene.util.AbstractBeforeAfterRule$1.evaluate(AbstractBeforeAfterRule.java:45)
	at com.carrotsearch.randomizedtesting.rules.StatementAdapter.evaluate(StatementAdapter.java:36)
	at org.apache.lucene.util.TestRuleStoreClassName$1.evaluate(TestRuleStoreClassName.java:41)
	at com.carrotsearch.randomizedtesting.rules.NoShadowingOrOverridesOnMethodsRule$1.evaluate(NoShadowingOrOverridesOnMethodsRule.java:40)
	at com.carrotsearch.randomizedtesting.rules.NoShadowingOrOverridesOnMethodsRule$1.evaluate(NoShadowingOrOverridesOnMethodsRule.java:40)
	at com.carrotsearch.randomizedtesting.rules.StatementAdapter.evaluate(StatementAdapter.java:36)
	at com.carrotsearch.randomizedtesting.rules.StatementAdapter.evaluate(StatementAdapter.java:36)
	at com.carrotsearch.randomizedtesting.rules.StatementAdapter.evaluate(StatementAdapter.java:36)
	at org.apache.lucene.util.TestRuleAssertionsRequired$1.evaluate(TestRuleAssertionsRequired.java:53)
	at org.apache.lucene.util.TestRuleMarkFailure$1.evaluate(TestRuleMarkFailure.java:47)
	at org.apache.lucene.util.TestRuleIgnoreAfterMaxFailures$1.evaluate(TestRuleIgnoreAfterMaxFailures.java:64)
	at org.apache.lucene.util.TestRuleIgnoreTestSuites$1.evaluate(TestRuleIgnoreTestSuites.java:54)
	at com.carrotsearch.randomizedtesting.rules.StatementAdapter.evaluate(StatementAdapter.java:36)
	at com.carrotsearch.randomizedtesting.ThreadLeakControl$StatementRunner.run(ThreadLeakControl.java:367)
	at java.lang.Thread.run(Thread.java:745)


FAILED:  junit.framework.TestSuite.org.apache.solr.cloud.hdfs.HdfsRestartWhileUpdatingTest

Error Message:
3 threads leaked from SUITE scope at org.apache.solr.cloud.hdfs.HdfsRestartWhileUpdatingTest:     1) Thread[id=56874, name=searcherExecutor-10753-thread-1, state=WAITING, group=TGRP-HdfsRestartWhileUpdatingTest]         at sun.misc.Unsafe.park(Native Method)         at java.util.concurrent.locks.LockSupport.park(LockSupport.java:175)         at java.util.concurrent.locks.AbstractQueuedSynchronizer$ConditionObject.await(AbstractQueuedSynchronizer.java:2039)         at java.util.concurrent.LinkedBlockingQueue.take(LinkedBlockingQueue.java:442)         at java.util.concurrent.ThreadPoolExecutor.getTask(ThreadPoolExecutor.java:1067)         at java.util.concurrent.ThreadPoolExecutor.runWorker(ThreadPoolExecutor.java:1127)         at java.util.concurrent.ThreadPoolExecutor$Worker.run(ThreadPoolExecutor.java:617)         at java.lang.Thread.run(Thread.java:745)    2) Thread[id=56837, name=searcherExecutor-10742-thread-1, state=WAITING, group=TGRP-HdfsRestartWhileUpdatingTest]         at sun.misc.Unsafe.park(Native Method)         at java.util.concurrent.locks.LockSupport.park(LockSupport.java:175)         at java.util.concurrent.locks.AbstractQueuedSynchronizer$ConditionObject.await(AbstractQueuedSynchronizer.java:2039)         at java.util.concurrent.LinkedBlockingQueue.take(LinkedBlockingQueue.java:442)         at java.util.concurrent.ThreadPoolExecutor.getTask(ThreadPoolExecutor.java:1067)         at java.util.concurrent.ThreadPoolExecutor.runWorker(ThreadPoolExecutor.java:1127)         at java.util.concurrent.ThreadPoolExecutor$Worker.run(ThreadPoolExecutor.java:617)         at java.lang.Thread.run(Thread.java:745)    3) Thread[id=56807, name=searcherExecutor-10731-thread-1, state=WAITING, group=TGRP-HdfsRestartWhileUpdatingTest]         at sun.misc.Unsafe.park(Native Method)         at java.util.concurrent.locks.LockSupport.park(LockSupport.java:175)         at java.util.concurrent.locks.AbstractQueuedSynchronizer$ConditionObject.await(AbstractQueuedSynchronizer.java:2039)         at java.util.concurrent.LinkedBlockingQueue.take(LinkedBlockingQueue.java:442)         at java.util.concurrent.ThreadPoolExecutor.getTask(ThreadPoolExecutor.java:1067)         at java.util.concurrent.ThreadPoolExecutor.runWorker(ThreadPoolExecutor.java:1127)         at java.util.concurrent.ThreadPoolExecutor$Worker.run(ThreadPoolExecutor.java:617)         at java.lang.Thread.run(Thread.java:745)

Stack Trace:
com.carrotsearch.randomizedtesting.ThreadLeakError: 3 threads leaked from SUITE scope at org.apache.solr.cloud.hdfs.HdfsRestartWhileUpdatingTest: 
   1) Thread[id=56874, name=searcherExecutor-10753-thread-1, state=WAITING, group=TGRP-HdfsRestartWhileUpdatingTest]
        at sun.misc.Unsafe.park(Native Method)
        at java.util.concurrent.locks.LockSupport.park(LockSupport.java:175)
        at java.util.concurrent.locks.AbstractQueuedSynchronizer$ConditionObject.await(AbstractQueuedSynchronizer.java:2039)
        at java.util.concurrent.LinkedBlockingQueue.take(LinkedBlockingQueue.java:442)
        at java.util.concurrent.ThreadPoolExecutor.getTask(ThreadPoolExecutor.java:1067)
        at java.util.concurrent.ThreadPoolExecutor.runWorker(ThreadPoolExecutor.java:1127)
        at java.util.concurrent.ThreadPoolExecutor$Worker.run(ThreadPoolExecutor.java:617)
        at java.lang.Thread.run(Thread.java:745)
   2) Thread[id=56837, name=searcherExecutor-10742-thread-1, state=WAITING, group=TGRP-HdfsRestartWhileUpdatingTest]
        at sun.misc.Unsafe.park(Native Method)
        at java.util.concurrent.locks.LockSupport.park(LockSupport.java:175)
        at java.util.concurrent.locks.AbstractQueuedSynchronizer$ConditionObject.await(AbstractQueuedSynchronizer.java:2039)
        at java.util.concurrent.LinkedBlockingQueue.take(LinkedBlockingQueue.java:442)
        at java.util.concurrent.ThreadPoolExecutor.getTask(ThreadPoolExecutor.java:1067)
        at java.util.concurrent.ThreadPoolExecutor.runWorker(ThreadPoolExecutor.java:1127)
        at java.util.concurrent.ThreadPoolExecutor$Worker.run(ThreadPoolExecutor.java:617)
        at java.lang.Thread.run(Thread.java:745)
   3) Thread[id=56807, name=searcherExecutor-10731-thread-1, state=WAITING, group=TGRP-HdfsRestartWhileUpdatingTest]
        at sun.misc.Unsafe.park(Native Method)
        at java.util.concurrent.locks.LockSupport.park(LockSupport.java:175)
        at java.util.concurrent.locks.AbstractQueuedSynchronizer$ConditionObject.await(AbstractQueuedSynchronizer.java:2039)
        at java.util.concurrent.LinkedBlockingQueue.take(LinkedBlockingQueue.java:442)
        at java.util.concurrent.ThreadPoolExecutor.getTask(ThreadPoolExecutor.java:1067)
        at java.util.concurrent.ThreadPoolExecutor.runWorker(ThreadPoolExecutor.java:1127)
        at java.util.concurrent.ThreadPoolExecutor$Worker.run(ThreadPoolExecutor.java:617)
        at java.lang.Thread.run(Thread.java:745)
	at __randomizedtesting.SeedInfo.seed([4E20909FE0E5459D]:0)


FAILED:  junit.framework.TestSuite.org.apache.solr.cloud.hdfs.HdfsRestartWhileUpdatingTest

Error Message:
There are still zombie threads that couldn't be terminated:    1) Thread[id=56874, name=searcherExecutor-10753-thread-1, state=WAITING, group=TGRP-HdfsRestartWhileUpdatingTest]         at sun.misc.Unsafe.park(Native Method)         at java.util.concurrent.locks.LockSupport.park(LockSupport.java:175)         at java.util.concurrent.locks.AbstractQueuedSynchronizer$ConditionObject.await(AbstractQueuedSynchronizer.java:2039)         at java.util.concurrent.LinkedBlockingQueue.take(LinkedBlockingQueue.java:442)         at java.util.concurrent.ThreadPoolExecutor.getTask(ThreadPoolExecutor.java:1067)         at java.util.concurrent.ThreadPoolExecutor.runWorker(ThreadPoolExecutor.java:1127)         at java.util.concurrent.ThreadPoolExecutor$Worker.run(ThreadPoolExecutor.java:617)         at java.lang.Thread.run(Thread.java:745)    2) Thread[id=56837, name=searcherExecutor-10742-thread-1, state=WAITING, group=TGRP-HdfsRestartWhileUpdatingTest]         at sun.misc.Unsafe.park(Native Method)         at java.util.concurrent.locks.LockSupport.park(LockSupport.java:175)         at java.util.concurrent.locks.AbstractQueuedSynchronizer$ConditionObject.await(AbstractQueuedSynchronizer.java:2039)         at java.util.concurrent.LinkedBlockingQueue.take(LinkedBlockingQueue.java:442)         at java.util.concurrent.ThreadPoolExecutor.getTask(ThreadPoolExecutor.java:1067)         at java.util.concurrent.ThreadPoolExecutor.runWorker(ThreadPoolExecutor.java:1127)         at java.util.concurrent.ThreadPoolExecutor$Worker.run(ThreadPoolExecutor.java:617)         at java.lang.Thread.run(Thread.java:745)    3) Thread[id=56807, name=searcherExecutor-10731-thread-1, state=WAITING, group=TGRP-HdfsRestartWhileUpdatingTest]         at sun.misc.Unsafe.park(Native Method)         at java.util.concurrent.locks.LockSupport.park(LockSupport.java:175)         at java.util.concurrent.locks.AbstractQueuedSynchronizer$ConditionObject.await(AbstractQueuedSynchronizer.java:2039)         at java.util.concurrent.LinkedBlockingQueue.take(LinkedBlockingQueue.java:442)         at java.util.concurrent.ThreadPoolExecutor.getTask(ThreadPoolExecutor.java:1067)         at java.util.concurrent.ThreadPoolExecutor.runWorker(ThreadPoolExecutor.java:1127)         at java.util.concurrent.ThreadPoolExecutor$Worker.run(ThreadPoolExecutor.java:617)         at java.lang.Thread.run(Thread.java:745)

Stack Trace:
com.carrotsearch.randomizedtesting.ThreadLeakError: There are still zombie threads that couldn't be terminated:
   1) Thread[id=56874, name=searcherExecutor-10753-thread-1, state=WAITING, group=TGRP-HdfsRestartWhileUpdatingTest]
        at sun.misc.Unsafe.park(Native Method)
        at java.util.concurrent.locks.LockSupport.park(LockSupport.java:175)
        at java.util.concurrent.locks.AbstractQueuedSynchronizer$ConditionObject.await(AbstractQueuedSynchronizer.java:2039)
        at java.util.concurrent.LinkedBlockingQueue.take(LinkedBlockingQueue.java:442)
        at java.util.concurrent.ThreadPoolExecutor.getTask(ThreadPoolExecutor.java:1067)
        at java.util.concurrent.ThreadPoolExecutor.runWorker(ThreadPoolExecutor.java:1127)
        at java.util.concurrent.ThreadPoolExecutor$Worker.run(ThreadPoolExecutor.java:617)
        at java.lang.Thread.run(Thread.java:745)
   2) Thread[id=56837, name=searcherExecutor-10742-thread-1, state=WAITING, group=TGRP-HdfsRestartWhileUpdatingTest]
        at sun.misc.Unsafe.park(Native Method)
        at java.util.concurrent.locks.LockSupport.park(LockSupport.java:175)
        at java.util.concurrent.locks.AbstractQueuedSynchronizer$ConditionObject.await(AbstractQueuedSynchronizer.java:2039)
        at java.util.concurrent.LinkedBlockingQueue.take(LinkedBlockingQueue.java:442)
        at java.util.concurrent.ThreadPoolExecutor.getTask(ThreadPoolExecutor.java:1067)
        at java.util.concurrent.ThreadPoolExecutor.runWorker(ThreadPoolExecutor.java:1127)
        at java.util.concurrent.ThreadPoolExecutor$Worker.run(ThreadPoolExecutor.java:617)
        at java.lang.Thread.run(Thread.java:745)
   3) Thread[id=56807, name=searcherExecutor-10731-thread-1, state=WAITING, group=TGRP-HdfsRestartWhileUpdatingTest]
        at sun.misc.Unsafe.park(Native Method)
        at java.util.concurrent.locks.LockSupport.park(LockSupport.java:175)
        at java.util.concurrent.locks.AbstractQueuedSynchronizer$ConditionObject.await(AbstractQueuedSynchronizer.java:2039)
        at java.util.concurrent.LinkedBlockingQueue.take(LinkedBlockingQueue.java:442)
        at java.util.concurrent.ThreadPoolExecutor.getTask(ThreadPoolExecutor.java:1067)
        at java.util.concurrent.ThreadPoolExecutor.runWorker(ThreadPoolExecutor.java:1127)
        at java.util.concurrent.ThreadPoolExecutor$Worker.run(ThreadPoolExecutor.java:617)
        at java.lang.Thread.run(Thread.java:745)
	at __randomizedtesting.SeedInfo.seed([4E20909FE0E5459D]:0)


FAILED:  junit.framework.TestSuite.org.apache.solr.handler.TestReplicationHandler

Error Message:
ObjectTracker found 6 object(s) that were not released!!! [NRTCachingDirectory, NRTCachingDirectory, NRTCachingDirectory, NRTCachingDirectory, NRTCachingDirectory, NRTCachingDirectory]

Stack Trace:
java.lang.AssertionError: ObjectTracker found 6 object(s) that were not released!!! [NRTCachingDirectory, NRTCachingDirectory, NRTCachingDirectory, NRTCachingDirectory, NRTCachingDirectory, NRTCachingDirectory]
	at __randomizedtesting.SeedInfo.seed([4E20909FE0E5459D]:0)
	at org.junit.Assert.fail(Assert.java:93)
	at org.junit.Assert.assertTrue(Assert.java:43)
	at org.junit.Assert.assertNull(Assert.java:551)
	at org.apache.solr.SolrTestCaseJ4.teardownTestCases(SolrTestCaseJ4.java:256)
	at sun.reflect.NativeMethodAccessorImpl.invoke0(Native Method)
	at sun.reflect.NativeMethodAccessorImpl.invoke(NativeMethodAccessorImpl.java:62)
	at sun.reflect.DelegatingMethodAccessorImpl.invoke(DelegatingMethodAccessorImpl.java:43)
	at java.lang.reflect.Method.invoke(Method.java:498)
	at com.carrotsearch.randomizedtesting.RandomizedRunner.invoke(RandomizedRunner.java:1764)
	at com.carrotsearch.randomizedtesting.RandomizedRunner$7.evaluate(RandomizedRunner.java:834)
	at com.carrotsearch.randomizedtesting.rules.StatementAdapter.evaluate(StatementAdapter.java:36)
	at com.carrotsearch.randomizedtesting.rules.SystemPropertiesRestoreRule$1.evaluate(SystemPropertiesRestoreRule.java:57)
	at org.apache.lucene.util.AbstractBeforeAfterRule$1.evaluate(AbstractBeforeAfterRule.java:45)
	at com.carrotsearch.randomizedtesting.rules.StatementAdapter.evaluate(StatementAdapter.java:36)
	at org.apache.lucene.util.TestRuleStoreClassName$1.evaluate(TestRuleStoreClassName.java:41)
	at com.carrotsearch.randomizedtesting.rules.NoShadowingOrOverridesOnMethodsRule$1.evaluate(NoShadowingOrOverridesOnMethodsRule.java:40)
	at com.carrotsearch.randomizedtesting.rules.NoShadowingOrOverridesOnMethodsRule$1.evaluate(NoShadowingOrOverridesOnMethodsRule.java:40)
	at com.carrotsearch.randomizedtesting.rules.StatementAdapter.evaluate(StatementAdapter.java:36)
	at com.carrotsearch.randomizedtesting.rules.StatementAdapter.evaluate(StatementAdapter.java:36)
	at com.carrotsearch.randomizedtesting.rules.StatementAdapter.evaluate(StatementAdapter.java:36)
	at org.apache.lucene.util.TestRuleAssertionsRequired$1.evaluate(TestRuleAssertionsRequired.java:53)
	at org.apache.lucene.util.TestRuleMarkFailure$1.evaluate(TestRuleMarkFailure.java:47)
	at org.apache.lucene.util.TestRuleIgnoreAfterMaxFailures$1.evaluate(TestRuleIgnoreAfterMaxFailures.java:64)
	at org.apache.lucene.util.TestRuleIgnoreTestSuites$1.evaluate(TestRuleIgnoreTestSuites.java:54)
	at com.carrotsearch.randomizedtesting.rules.StatementAdapter.evaluate(StatementAdapter.java:36)
	at com.carrotsearch.randomizedtesting.ThreadLeakControl$StatementRunner.run(ThreadLeakControl.java:367)
	at java.lang.Thread.run(Thread.java:745)


FAILED:  org.apache.solr.schema.TestManagedSchemaAPI.test

Error Message:
Error from server at https://127.0.0.1:53367/solr/testschemaapi_shard1_replica2: ERROR: [doc=2] unknown field 'myNewField1'

Stack Trace:
org.apache.solr.client.solrj.impl.CloudSolrClient$RouteException: Error from server at https://127.0.0.1:53367/solr/testschemaapi_shard1_replica2: ERROR: [doc=2] unknown field 'myNewField1'
	at __randomizedtesting.SeedInfo.seed([4E20909FE0E5459D:C674AF454E192865]:0)
	at org.apache.solr.client.solrj.impl.CloudSolrClient.directUpdate(CloudSolrClient.java:697)
	at org.apache.solr.client.solrj.impl.CloudSolrClient.sendRequest(CloudSolrClient.java:1109)
	at org.apache.solr.client.solrj.impl.CloudSolrClient.requestWithRetryOnStaleState(CloudSolrClient.java:998)
	at org.apache.solr.client.solrj.impl.CloudSolrClient.request(CloudSolrClient.java:934)
	at org.apache.solr.schema.TestManagedSchemaAPI.testAddFieldAndDocument(TestManagedSchemaAPI.java:86)
	at org.apache.solr.schema.TestManagedSchemaAPI.test(TestManagedSchemaAPI.java:55)
	at sun.reflect.NativeMethodAccessorImpl.invoke0(Native Method)
	at sun.reflect.NativeMethodAccessorImpl.invoke(NativeMethodAccessorImpl.java:62)
	at sun.reflect.DelegatingMethodAccessorImpl.invoke(DelegatingMethodAccessorImpl.java:43)
	at java.lang.reflect.Method.invoke(Method.java:498)
	at com.carrotsearch.randomizedtesting.RandomizedRunner.invoke(RandomizedRunner.java:1764)
	at com.carrotsearch.randomizedtesting.RandomizedRunner$8.evaluate(RandomizedRunner.java:871)
	at com.carrotsearch.randomizedtesting.RandomizedRunner$9.evaluate(RandomizedRunner.java:907)
	at com.carrotsearch.randomizedtesting.RandomizedRunner$10.evaluate(RandomizedRunner.java:921)
	at com.carrotsearch.randomizedtesting.rules.SystemPropertiesRestoreRule$1.evaluate(SystemPropertiesRestoreRule.java:57)
	at org.apache.lucene.util.TestRuleSetupTeardownChained$1.evaluate(TestRuleSetupTeardownChained.java:49)
	at org.apache.lucene.util.AbstractBeforeAfterRule$1.evaluate(AbstractBeforeAfterRule.java:45)
	at org.apache.lucene.util.TestRuleThreadAndTestName$1.evaluate(TestRuleThreadAndTestName.java:48)
	at org.apache.lucene.util.TestRuleIgnoreAfterMaxFailures$1.evaluate(TestRuleIgnoreAfterMaxFailures.java:64)
	at org.apache.lucene.util.TestRuleMarkFailure$1.evaluate(TestRuleMarkFailure.java:47)
	at com.carrotsearch.randomizedtesting.rules.StatementAdapter.evaluate(StatementAdapter.java:36)
	at com.carrotsearch.randomizedtesting.ThreadLeakControl$StatementRunner.run(ThreadLeakControl.java:367)
	at com.carrotsearch.randomizedtesting.ThreadLeakControl.forkTimeoutingTask(ThreadLeakControl.java:809)
	at com.carrotsearch.randomizedtesting.ThreadLeakControl$3.evaluate(ThreadLeakControl.java:460)
	at com.carrotsearch.randomizedtesting.RandomizedRunner.runSingleTest(RandomizedRunner.java:880)
	at com.carrotsearch.randomizedtesting.RandomizedRunner$5.evaluate(RandomizedRunner.java:781)
	at com.carrotsearch.randomizedtesting.RandomizedRunner$6.evaluate(RandomizedRunner.java:816)
	at com.carrotsearch.randomizedtesting.RandomizedRunner$7.evaluate(RandomizedRunner.java:827)
	at com.carrotsearch.randomizedtesting.rules.StatementAdapter.evaluate(StatementAdapter.java:36)
	at com.carrotsearch.randomizedtesting.rules.SystemPropertiesRestoreRule$1.evaluate(SystemPropertiesRestoreRule.java:57)
	at org.apache.lucene.util.AbstractBeforeAfterRule$1.evaluate(AbstractBeforeAfterRule.java:45)
	at com.carrotsearch.randomizedtesting.rules.StatementAdapter.evaluate(StatementAdapter.java:36)
	at org.apache.lucene.util.TestRuleStoreClassName$1.evaluate(TestRuleStoreClassName.java:41)
	at com.carrotsearch.randomizedtesting.rules.NoShadowingOrOverridesOnMethodsRule$1.evaluate(NoShadowingOrOverridesOnMethodsRule.java:40)
	at com.carrotsearch.randomizedtesting.rules.NoShadowingOrOverridesOnMethodsRule$1.evaluate(NoShadowingOrOverridesOnMethodsRule.java:40)
	at com.carrotsearch.randomizedtesting.rules.StatementAdapter.evaluate(StatementAdapter.java:36)
	at com.carrotsearch.randomizedtesting.rules.StatementAdapter.evaluate(StatementAdapter.java:36)
	at com.carrotsearch.randomizedtesting.rules.StatementAdapter.evaluate(StatementAdapter.java:36)
	at org.apache.lucene.util.TestRuleAssertionsRequired$1.evaluate(TestRuleAssertionsRequired.java:53)
	at org.apache.lucene.util.TestRuleMarkFailure$1.evaluate(TestRuleMarkFailure.java:47)
	at org.apache.lucene.util.TestRuleIgnoreAfterMaxFailures$1.evaluate(TestRuleIgnoreAfterMaxFailures.java:64)
	at org.apache.lucene.util.TestRuleIgnoreTestSuites$1.evaluate(TestRuleIgnoreTestSuites.java:54)
	at com.carrotsearch.randomizedtesting.rules.StatementAdapter.evaluate(StatementAdapter.java:36)
	at com.carrotsearch.randomizedtesting.ThreadLeakControl$StatementRunner.run(ThreadLeakControl.java:367)
	at java.lang.Thread.run(Thread.java:745)
Caused by: org.apache.solr.client.solrj.impl.HttpSolrClient$RemoteSolrException: Error from server at https://127.0.0.1:53367/solr/testschemaapi_shard1_replica2: ERROR: [doc=2] unknown field 'myNewField1'
	at org.apache.solr.client.solrj.impl.HttpSolrClient.executeMethod(HttpSolrClient.java:606)
	at org.apache.solr.client.solrj.impl.HttpSolrClient.request(HttpSolrClient.java:259)
	at org.apache.solr.client.solrj.impl.HttpSolrClient.request(HttpSolrClient.java:248)
	at org.apache.solr.client.solrj.impl.LBHttpSolrClient.doRequest(LBHttpSolrClient.java:413)
	at org.apache.solr.client.solrj.impl.LBHttpSolrClient.request(LBHttpSolrClient.java:366)
	at org.apache.solr.client.solrj.impl.CloudSolrClient.lambda$directUpdate$0(CloudSolrClient.java:674)
	at java.util.concurrent.FutureTask.run(FutureTask.java:266)
	at org.apache.solr.common.util.ExecutorUtil$MDCAwareThreadPoolExecutor.lambda$execute$0(ExecutorUtil.java:229)
	at java.util.concurrent.ThreadPoolExecutor.runWorker(ThreadPoolExecutor.java:1142)
	at java.util.concurrent.ThreadPoolExecutor$Worker.run(ThreadPoolExecutor.java:617)
	... 1 more


FAILED:  junit.framework.TestSuite.org.apache.solr.cloud.CdcrReplicationDistributedZkTest

Error Message:
ObjectTracker found 48 object(s) that were not released!!! [InternalHttpClient, InternalHttpClient, InternalHttpClient, InternalHttpClient, InternalHttpClient, InternalHttpClient, InternalHttpClient, InternalHttpClient, InternalHttpClient, InternalHttpClient, InternalHttpClient, InternalHttpClient, InternalHttpClient, InternalHttpClient, InternalHttpClient, InternalHttpClient, InternalHttpClient, InternalHttpClient, InternalHttpClient, InternalHttpClient, InternalHttpClient, InternalHttpClient, InternalHttpClient, InternalHttpClient, InternalHttpClient, InternalHttpClient, InternalHttpClient, InternalHttpClient, InternalHttpClient, InternalHttpClient, InternalHttpClient, InternalHttpClient, InternalHttpClient, InternalHttpClient, InternalHttpClient, InternalHttpClient, InternalHttpClient, InternalHttpClient, InternalHttpClient, InternalHttpClient, InternalHttpClient, InternalHttpClient, InternalHttpClient, InternalHttpClient, InternalHttpClient, InternalHttpClient, InternalHttpClient, InternalHttpClient]

Stack Trace:
java.lang.AssertionError: ObjectTracker found 48 object(s) that were not released!!! [InternalHttpClient, InternalHttpClient, InternalHttpClient, InternalHttpClient, InternalHttpClient, InternalHttpClient, InternalHttpClient, InternalHttpClient, InternalHttpClient, InternalHttpClient, InternalHttpClient, InternalHttpClient, InternalHttpClient, InternalHttpClient, InternalHttpClient, InternalHttpClient, InternalHttpClient, InternalHttpClient, InternalHttpClient, InternalHttpClient, InternalHttpClient, InternalHttpClient, InternalHttpClient, InternalHttpClient, InternalHttpClient, InternalHttpClient, InternalHttpClient, InternalHttpClient, InternalHttpClient, InternalHttpClient, InternalHttpClient, InternalHttpClient, InternalHttpClient, InternalHttpClient, InternalHttpClient, InternalHttpClient, InternalHttpClient, InternalHttpClient, InternalHttpClient, InternalHttpClient, InternalHttpClient, InternalHttpClient, InternalHttpClient, InternalHttpClient, InternalHttpClient, InternalHttpClient, InternalHttpClient, InternalHttpClient]
	at __randomizedtesting.SeedInfo.seed([4E20909FE0E5459D]:0)
	at org.junit.Assert.fail(Assert.java:93)
	at org.junit.Assert.assertTrue(Assert.java:43)
	at org.junit.Assert.assertNull(Assert.java:551)
	at org.apache.solr.SolrTestCaseJ4.teardownTestCases(SolrTestCaseJ4.java:256)
	at sun.reflect.GeneratedMethodAccessor42.invoke(Unknown Source)
	at sun.reflect.DelegatingMethodAccessorImpl.invoke(DelegatingMethodAccessorImpl.java:43)
	at java.lang.reflect.Method.invoke(Method.java:498)
	at com.carrotsearch.randomizedtesting.RandomizedRunner.invoke(RandomizedRunner.java:1764)
	at com.carrotsearch.randomizedtesting.RandomizedRunner$7.evaluate(RandomizedRunner.java:834)
	at com.carrotsearch.randomizedtesting.rules.StatementAdapter.evaluate(StatementAdapter.java:36)
	at com.carrotsearch.randomizedtesting.rules.SystemPropertiesRestoreRule$1.evaluate(SystemPropertiesRestoreRule.java:57)
	at org.apache.lucene.util.AbstractBeforeAfterRule$1.evaluate(AbstractBeforeAfterRule.java:45)
	at com.carrotsearch.randomizedtesting.rules.StatementAdapter.evaluate(StatementAdapter.java:36)
	at org.apache.lucene.util.TestRuleStoreClassName$1.evaluate(TestRuleStoreClassName.java:41)
	at com.carrotsearch.randomizedtesting.rules.NoShadowingOrOverridesOnMethodsRule$1.evaluate(NoShadowingOrOverridesOnMethodsRule.java:40)
	at com.carrotsearch.randomizedtesting.rules.NoShadowingOrOverridesOnMethodsRule$1.evaluate(NoShadowingOrOverridesOnMethodsRule.java:40)
	at com.carrotsearch.randomizedtesting.rules.StatementAdapter.evaluate(StatementAdapter.java:36)
	at com.carrotsearch.randomizedtesting.rules.StatementAdapter.evaluate(StatementAdapter.java:36)
	at com.carrotsearch.randomizedtesting.rules.StatementAdapter.evaluate(StatementAdapter.java:36)
	at org.apache.lucene.util.TestRuleAssertionsRequired$1.evaluate(TestRuleAssertionsRequired.java:53)
	at org.apache.lucene.util.TestRuleMarkFailure$1.evaluate(TestRuleMarkFailure.java:47)
	at org.apache.lucene.util.TestRuleIgnoreAfterMaxFailures$1.evaluate(TestRuleIgnoreAfterMaxFailures.java:64)
	at org.apache.lucene.util.TestRuleIgnoreTestSuites$1.evaluate(TestRuleIgnoreTestSuites.java:54)
	at com.carrotsearch.randomizedtesting.rules.StatementAdapter.evaluate(StatementAdapter.java:36)
	at com.carrotsearch.randomizedtesting.ThreadLeakControl$StatementRunner.run(ThreadLeakControl.java:367)
	at java.lang.Thread.run(Thread.java:745)


FAILED:  junit.framework.TestSuite.org.apache.solr.cloud.CdcrReplicationDistributedZkTest

Error Message:
48 threads leaked from SUITE scope at org.apache.solr.cloud.CdcrReplicationDistributedZkTest:     1) Thread[id=120880, name=Connection evictor, state=TIMED_WAITING, group=TGRP-CdcrReplicationDistributedZkTest]         at java.lang.Thread.sleep(Native Method)         at org.apache.http.impl.client.IdleConnectionEvictor$1.run(IdleConnectionEvictor.java:66)         at java.lang.Thread.run(Thread.java:745)    2) Thread[id=120878, name=Connection evictor, state=TIMED_WAITING, group=TGRP-CdcrReplicationDistributedZkTest]         at java.lang.Thread.sleep(Native Method)         at org.apache.http.impl.client.IdleConnectionEvictor$1.run(IdleConnectionEvictor.java:66)         at java.lang.Thread.run(Thread.java:745)    3) Thread[id=117039, name=Connection evictor, state=TIMED_WAITING, group=TGRP-CdcrReplicationDistributedZkTest]         at java.lang.Thread.sleep(Native Method)         at org.apache.http.impl.client.IdleConnectionEvictor$1.run(IdleConnectionEvictor.java:66)         at java.lang.Thread.run(Thread.java:745)    4) Thread[id=116862, name=Connection evictor, state=TIMED_WAITING, group=TGRP-CdcrReplicationDistributedZkTest]         at java.lang.Thread.sleep(Native Method)         at org.apache.http.impl.client.IdleConnectionEvictor$1.run(IdleConnectionEvictor.java:66)         at java.lang.Thread.run(Thread.java:745)    5) Thread[id=120587, name=Connection evictor, state=TIMED_WAITING, group=TGRP-CdcrReplicationDistributedZkTest]         at java.lang.Thread.sleep(Native Method)         at org.apache.http.impl.client.IdleConnectionEvictor$1.run(IdleConnectionEvictor.java:66)         at java.lang.Thread.run(Thread.java:745)    6) Thread[id=120879, name=Connection evictor, state=TIMED_WAITING, group=TGRP-CdcrReplicationDistributedZkTest]         at java.lang.Thread.sleep(Native Method)         at org.apache.http.impl.client.IdleConnectionEvictor$1.run(IdleConnectionEvictor.java:66)         at java.lang.Thread.run(Thread.java:745)    7) Thread[id=116865, name=Connection evictor, state=TIMED_WAITING, group=TGRP-CdcrReplicationDistributedZkTest]         at java.lang.Thread.sleep(Native Method)         at org.apache.http.impl.client.IdleConnectionEvictor$1.run(IdleConnectionEvictor.java:66)         at java.lang.Thread.run(Thread.java:745)    8) Thread[id=124504, name=Connection evictor, state=TIMED_WAITING, group=TGRP-CdcrReplicationDistributedZkTest]         at java.lang.Thread.sleep(Native Method)         at org.apache.http.impl.client.IdleConnectionEvictor$1.run(IdleConnectionEvictor.java:66)         at java.lang.Thread.run(Thread.java:745)    9) Thread[id=116509, name=Connection evictor, state=TIMED_WAITING, group=TGRP-CdcrReplicationDistributedZkTest]         at java.lang.Thread.sleep(Native Method)         at org.apache.http.impl.client.IdleConnectionEvictor$1.run(IdleConnectionEvictor.java:66)         at java.lang.Thread.run(Thread.java:745)   10) Thread[id=124505, name=Connection evictor, state=TIMED_WAITING, group=TGRP-CdcrReplicationDistributedZkTest]         at java.lang.Thread.sleep(Native Method)         at org.apache.http.impl.client.IdleConnectionEvictor$1.run(IdleConnectionEvictor.java:66)         at java.lang.Thread.run(Thread.java:745)   11) Thread[id=117788, name=Connection evictor, state=TIMED_WAITING, group=TGRP-CdcrReplicationDistributedZkTest]         at java.lang.Thread.sleep(Native Method)         at org.apache.http.impl.client.IdleConnectionEvictor$1.run(IdleConnectionEvictor.java:66)         at java.lang.Thread.run(Thread.java:745)   12) Thread[id=116863, name=Connection evictor, state=TIMED_WAITING, group=TGRP-CdcrReplicationDistributedZkTest]         at java.lang.Thread.sleep(Native Method)         at org.apache.http.impl.client.IdleConnectionEvictor$1.run(IdleConnectionEvictor.java:66)         at java.lang.Thread.run(Thread.java:745)   13) Thread[id=116511, name=Connection evictor, state=TIMED_WAITING, group=TGRP-CdcrReplicationDistributedZkTest]         at java.lang.Thread.sleep(Native Method)         at org.apache.http.impl.client.IdleConnectionEvictor$1.run(IdleConnectionEvictor.java:66)         at java.lang.Thread.run(Thread.java:745)   14) Thread[id=117268, name=Connection evictor, state=TIMED_WAITING, group=TGRP-CdcrReplicationDistributedZkTest]         at java.lang.Thread.sleep(Native Method)         at org.apache.http.impl.client.IdleConnectionEvictor$1.run(IdleConnectionEvictor.java:66)         at java.lang.Thread.run(Thread.java:745)   15) Thread[id=120588, name=Connection evictor, state=TIMED_WAITING, group=TGRP-CdcrReplicationDistributedZkTest]         at java.lang.Thread.sleep(Native Method)         at org.apache.http.impl.client.IdleConnectionEvictor$1.run(IdleConnectionEvictor.java:66)         at java.lang.Thread.run(Thread.java:745)   16) Thread[id=124506, name=Connection evictor, state=TIMED_WAITING, group=TGRP-CdcrReplicationDistributedZkTest]         at java.lang.Thread.sleep(Native Method)         at org.apache.http.impl.client.IdleConnectionEvictor$1.run(IdleConnectionEvictor.java:66)         at java.lang.Thread.run(Thread.java:745)   17) Thread[id=117269, name=Connection evictor, state=TIMED_WAITING, group=TGRP-CdcrReplicationDistributedZkTest]         at java.lang.Thread.sleep(Native Method)         at org.apache.http.impl.client.IdleConnectionEvictor$1.run(IdleConnectionEvictor.java:66)         at java.lang.Thread.run(Thread.java:745)   18) Thread[id=117789, name=Connection evictor, state=TIMED_WAITING, group=TGRP-CdcrReplicationDistributedZkTest]         at java.lang.Thread.sleep(Native Method)         at org.apache.http.impl.client.IdleConnectionEvictor$1.run(IdleConnectionEvictor.java:66)         at java.lang.Thread.run(Thread.java:745)   19) Thread[id=120586, name=Connection evictor, state=TIMED_WAITING, group=TGRP-CdcrReplicationDistributedZkTest]         at java.lang.Thread.sleep(Native Method)         at org.apache.http.impl.client.IdleConnectionEvictor$1.run(IdleConnectionEvictor.java:66)         at java.lang.Thread.run(Thread.java:745)   20) Thread[id=116508, name=Connection evictor, state=TIMED_WAITING, group=TGRP-CdcrReplicationDistributedZkTest]         at java.lang.Thread.sleep(Native Method)         at org.apache.http.impl.client.IdleConnectionEvictor$1.run(IdleConnectionEvictor.java:66)         at java.lang.Thread.run(Thread.java:745)   21) Thread[id=117041, name=Connection evictor, state=TIMED_WAITING, group=TGRP-CdcrReplicationDistributedZkTest]         at java.lang.Thread.sleep(Native Method)         at org.apache.http.impl.client.IdleConnectionEvictor$1.run(IdleConnectionEvictor.java:66)         at java.lang.Thread.run(Thread.java:745)   22) Thread[id=121012, name=Connection evictor, state=TIMED_WAITING, group=TGRP-CdcrReplicationDistributedZkTest]         at java.lang.Thread.sleep(Native Method)         at org.apache.http.impl.client.IdleConnectionEvictor$1.run(IdleConnectionEvictor.java:66)         at java.lang.Thread.run(Thread.java:745)   23) Thread[id=119396, name=Connection evictor, state=TIMED_WAITING, group=TGRP-CdcrReplicationDistributedZkTest]         at java.lang.Thread.sleep(Native Method)         at org.apache.http.impl.client.IdleConnectionEvictor$1.run(IdleConnectionEvictor.java:66)         at java.lang.Thread.run(Thread.java:745)   24) Thread[id=124959, name=Connection evictor, state=TIMED_WAITING, group=TGRP-CdcrReplicationDistributedZkTest]         at java.lang.Thread.sleep(Native Method)         at org.apache.http.impl.client.IdleConnectionEvictor$1.run(IdleConnectionEvictor.java:66)         at java.lang.Thread.run(Thread.java:745)   25) Thread[id=117040, name=Connection evictor, state=TIMED_WAITING, group=TGRP-CdcrReplicationDistributedZkTest]         at java.lang.Thread.sleep(Native Method)         at org.apache.http.impl.client.IdleConnectionEvictor$1.run(IdleConnectionEvictor.java:66)         at java.lang.Thread.run(Thread.java:745)   26) Thread[id=121263, name=Connection evictor, state=TIMED_WAITING, group=TGRP-CdcrReplicationDistributedZkTest]         at java.lang.Thread.sleep(Native Method)         at org.apache.http.impl.client.IdleConnectionEvictor$1.run(IdleConnectionEvictor.java:66)         at java.lang.Thread.run(Thread.java:745)   27) Thread[id=116864, name=Connection evictor, state=TIMED_WAITING, group=TGRP-CdcrReplicationDistributedZkTest]         at java.lang.Thread.sleep(Native Method)         at org.apache.http.impl.client.IdleConnectionEvictor$1.run(IdleConnectionEvictor.java:66)         at java.lang.Thread.run(Thread.java:745)   28) Thread[id=120881, name=Connection evictor, state=TIMED_WAITING, group=TGRP-CdcrReplicationDistributedZkTest]         at java.lang.Thread.sleep(Native Method)         at org.apache.http.impl.client.IdleConnectionEvictor$1.run(IdleConnectionEvictor.java:66)         at java.lang.Thread.run(Thread.java:745)   29) Thread[id=121262, name=Connection evictor, state=TIMED_WAITING, group=TGRP-CdcrReplicationDistributedZkTest]         at java.lang.Thread.sleep(Native Method)         at org.apache.http.impl.client.IdleConnectionEvictor$1.run(IdleConnectionEvictor.java:66)         at java.lang.Thread.run(Thread.java:745)   30) Thread[id=117038, name=Connection evictor, state=TIMED_WAITING, group=TGRP-CdcrReplicationDistributedZkTest]         at java.lang.Thread.sleep(Native Method)         at org.apache.http.impl.client.IdleConnectionEvictor$1.run(IdleConnectionEvictor.java:66)         at java.lang.Thread.run(Thread.java:745)   31) Thread[id=119397, name=Connection evictor, state=TIMED_WAITING, group=TGRP-CdcrReplicationDistributedZkTest]         at java.lang.Thread.sleep(Native Method)         at org.apache.http.impl.client.IdleConnectionEvictor$1.run(IdleConnectionEvictor.java:66)         at java.lang.Thread.run(Thread.java:745)   32) Thread[id=121013, name=Connection evictor, state=TIMED_WAITING, group=TGRP-CdcrReplicationDistributedZkTest]         at java.lang.Thread.sleep(Native Method)         at org.apache.http.impl.client.IdleConnectionEvictor$1.run(IdleConnectionEvictor.java:66)         at java.lang.Thread.run(Thread.java:745)   33) Thread[id=117270, name=Connection evictor, state=TIMED_WAITING, group=TGRP-CdcrReplicationDistributedZkTest]         at java.lang.Thread.sleep(Native Method)         at org.apache.http.impl.client.IdleConnectionEvictor$1.run(IdleConnectionEvictor.java:66)         at java.lang.Thread.run(Thread.java:745)   34) Thread[id=121011, name=Connection evictor, state=TIMED_WAITING, group=TGRP-CdcrReplicationDistributedZkTest]         at java.lang.Thread.sleep(Native Method)         at org.apache.http.impl.client.IdleConnectionEvictor$1.run(IdleConnectionEvictor.java:66)         at java.lang.Thread.run(Thread.java:745)   35) Thread[id=121261, name=Connection evictor, state=TIMED_WAITING, group=TGRP-CdcrReplicationDistributedZkTest]         at java.lang.Thread.sleep(Native Method)         at org.apache.http.impl.client.IdleConnectionEvictor$1.run(IdleConnectionEvictor.java:66)         at java.lang.Thread.run(Thread.java:745)   36) Thread[id=124960, name=Connection evictor, state=TIMED_WAITING, group=TGRP-CdcrReplicationDistributedZkTest]         at java.lang.Thread.sleep(Native Method)         at org.apache.http.impl.client.IdleConnectionEvictor$1.run(IdleConnectionEvictor.java:66)         at java.lang.Thread.run(Thread.java:745)   37) Thread[id=124961, name=Connection evictor, state=TIMED_WAITING, group=TGRP-CdcrReplicationDistributedZkTest]         at java.lang.Thread.sleep(Native Method)         at org.apache.http.impl.client.IdleConnectionEvictor$1.run(IdleConnectionEvictor.java:66)         at java.lang.Thread.run(Thread.java:745)   38) Thread[id=119394, name=Connection evictor, state=TIMED_WAITING, group=TGRP-CdcrReplicationDistributedZkTest]         at java.lang.Thread.sleep(Native Method)         at org.apache.http.impl.client.IdleConnectionEvictor$1.run(IdleConnectionEvictor.java:66)         at java.lang.Thread.run(Thread.java:745)   39) Thread[id=124962, name=Connection evictor, state=TIMED_WAITING, group=TGRP-CdcrReplicationDistributedZkTest]         at java.lang.Thread.sleep(Native Method)         at org.apache.http.impl.client.IdleConnectionEvictor$1.run(IdleConnectionEvictor.java:66)         at java.lang.Thread.run(Thread.java:745)   40) Thread[id=119395, name=Connection evictor, state=TIMED_WAITING, group=TGRP-CdcrReplicationDistributedZkTest]         at java.lang.Thread.sleep(Native Method)         at org.apache.http.impl.client.IdleConnectionEvictor$1.run(IdleConnectionEvictor.java:66)         at java.lang.Thread.run(Thread.java:745)   41) Thread[id=121260, name=Connection evictor, state=TIMED_WAITING, group=TGRP-CdcrReplicationDistributedZkTest]         at java.lang.Thread.sleep(Native Method)         at org.apache.http.impl.client.IdleConnectionEvictor$1.run(IdleConnectionEvictor.java:66)         at java.lang.Thread.run(Thread.java:745)   42) Thread[id=117787, name=Connection evictor, state=TIMED_WAITING, group=TGRP-CdcrReplicationDistributedZkTest]         at java.lang.Thread.sleep(Native Method)         at org.apache.http.impl.client.IdleConnectionEvictor$1.run(IdleConnectionEvictor.java:66)         at java.lang.Thread.run(Thread.java:745)   43) Thread[id=121010, name=Connection evictor, state=TIMED_WAITING, group=TGRP-CdcrReplicationDistributedZkTest]         at java.lang.Thread.sleep(Native Method)         at org.apache.http.impl.client.IdleConnectionEvictor$1.run(IdleConnectionEvictor.java:66)         at java.lang.Thread.run(Thread.java:745)   44) Thread[id=117271, name=Connection evictor, state=TIMED_WAITING, group=TGRP-CdcrReplicationDistributedZkTest]         at java.lang.Thread.sleep(Native Method)         at org.apache.http.impl.client.IdleConnectionEvictor$1.run(IdleConnectionEvictor.java:66)         at java.lang.Thread.run(Thread.java:745)   45) Thread[id=124503, name=Connection evictor, state=TIMED_WAITING, group=TGRP-CdcrReplicationDistributedZkTest]         at java.lang.Thread.sleep(Native Method)         at org.apache.http.impl.client.IdleConnectionEvictor$1.run(IdleConnectionEvictor.java:66)         at java.lang.Thread.run(Thread.java:745)   46) Thread[id=116510, name=Connection evictor, state=TIMED_WAITING, group=TGRP-CdcrReplicationDistributedZkTest]         at java.lang.Thread.sleep(Native Method)         at org.apache.http.impl.client.IdleConnectionEvictor$1.run(IdleConnectionEvictor.java:66)         at java.lang.Thread.run(Thread.java:745)   47) Thread[id=117790, name=Connection evictor, state=TIMED_WAITING, group=TGRP-CdcrReplicationDistributedZkTest]         at java.lang.Thread.sleep(Native Method)         at org.apache.http.impl.client.IdleConnectionEvictor$1.run(IdleConnectionEvictor.java:66)         at java.lang.Thread.run(Thread.java:745)   48) Thread[id=120585, name=Connection evictor, state=TIMED_WAITING, group=TGRP-CdcrReplicationDistributedZkTest]         at java.lang.Thread.sleep(Native Method)         at org.apache.http.impl.client.IdleConnectionEvictor$1.run(IdleConnectionEvictor.java:66)         at java.lang.Thread.run(Thread.java:745)

Stack Trace:
com.carrotsearch.randomizedtesting.ThreadLeakError: 48 threads leaked from SUITE scope at org.apache.solr.cloud.CdcrReplicationDistributedZkTest: 
   1) Thread[id=120880, name=Connection evictor, state=TIMED_WAITING, group=TGRP-CdcrReplicationDistributedZkTest]
        at java.lang.Thread.sleep(Native Method)
        at org.apache.http.impl.client.IdleConnectionEvictor$1.run(IdleConnectionEvictor.java:66)
        at java.lang.Thread.run(Thread.java:745)
   2) Thread[id=120878, name=Connection evictor, state=TIMED_WAITING, group=TGRP-CdcrReplicationDistributedZkTest]
        at java.lang.Thread.sleep(Native Method)
        at org.apache.http.impl.client.IdleConnectionEvictor$1.run(IdleConnectionEvictor.java:66)
        at java.lang.Thread.run(Thread.java:745)
   3) Thread[id=117039, name=Connection evictor, state=TIMED_WAITING, group=TGRP-CdcrReplicationDistributedZkTest]
        at java.lang.Thread.sleep(Native Method)
        at org.apache.http.impl.client.IdleConnectionEvictor$1.run(IdleConnectionEvictor.java:66)
        at java.lang.Thread.run(Thread.java:745)
   4) Thread[id=116862, name=Connection evictor, state=TIMED_WAITING, group=TGRP-CdcrReplicationDistributedZkTest]
        at java.lang.Thread.sleep(Native Method)
        at org.apache.http.impl.client.IdleConnectionEvictor$1.run(IdleConnectionEvictor.java:66)
        at java.lang.Thread.run(Thread.java:745)
   5) Thread[id=120587, name=Connection evictor, state=TIMED_WAITING, group=TGRP-CdcrReplicationDistributedZkTest]
        at java.lang.Thread.sleep(Native Method)
        at org.apache.http.impl.client.IdleConnectionEvictor$1.run(IdleConnectionEvictor.java:66)
        at java.lang.Thread.run(Thread.java:745)
   6) Thread[id=120879, name=Connection evictor, state=TIMED_WAITING, group=TGRP-CdcrReplicationDistributedZkTest]
        at java.lang.Thread.sleep(Native Method)
        at org.apache.http.impl.client.IdleConnectionEvictor$1.run(IdleConnectionEvictor.java:66)
        at java.lang.Thread.run(Thread.java:745)
   7) Thread[id=116865, name=Connection evictor, state=TIMED_WAITING, group=TGRP-CdcrReplicationDistributedZkTest]
        at java.lang.Thread.sleep(Native Method)
        at org.apache.http.impl.client.IdleConnectionEvictor$1.run(IdleConnectionEvictor.java:66)
        at java.lang.Thread.run(Thread.java:745)
   8) Thread[id=124504, name=Connection evictor, state=TIMED_WAITING, group=TGRP-CdcrReplicationDistributedZkTest]
        at java.lang.Thread.sleep(Native Method)
        at org.apache.http.impl.client.IdleConnectionEvictor$1.run(IdleConnectionEvictor.java:66)
        at java.lang.Thread.run(Thread.java:745)
   9) Thread[id=116509, name=Connection evictor, state=TIMED_WAITING, group=TGRP-CdcrReplicationDistributedZkTest]
        at java.lang.Thread.sleep(Native Method)
        at org.apache.http.impl.client.IdleConnectionEvictor$1.run(IdleConnectionEvictor.java:66)
        at java.lang.Thread.run(Thread.java:745)
  10) Thread[id=124505, name=Connection evictor, state=TIMED_WAITING, group=TGRP-CdcrReplicationDistributedZkTest]
        at java.lang.Thread.sleep(Native Method)
        at org.apache.http.impl.client.IdleConnectionEvictor$1.run(IdleConnectionEvictor.java:66)
        at java.lang.Thread.run(Thread.java:745)
  11) Thread[id=117788, name=Connection evictor, state=TIMED_WAITING, group=TGRP-CdcrReplicationDistributedZkTest]
        at java.lang.Thread.sleep(Native Method)
        at org.apache.http.impl.client.IdleConnectionEvictor$1.run(IdleConnectionEvictor.java:66)
        at java.lang.Thread.run(Thread.java:745)
  12) Thread[id=116863, name=Connection evictor, state=TIMED_WAITING, group=TGRP-CdcrReplicationDistributedZkTest]
        at java.lang.Thread.sleep(Native Method)
        at org.apache.http.impl.client.IdleConnectionEvictor$1.run(IdleConnectionEvictor.java:66)
        at java.lang.Thread.run(Thread.java:745)
  13) Thread[id=116511, name=Connection evictor, state=TIMED_WAITING, group=TGRP-CdcrReplicationDistributedZkTest]
        at java.lang.Thread.sleep(Native Method)
        at org.apache.http.impl.client.IdleConnectionEvictor$1.run(IdleConnectionEvictor.java:66)
        at java.lang.Thread.run(Thread.java:745)
  14) Thread[id=117268, name=Connection evictor, state=TIMED_WAITING, group=TGRP-CdcrReplicationDistributedZkTest]
        at java.lang.Thread.sleep(Native Method)
        at org.apache.http.impl.client.IdleConnectionEvictor$1.run(IdleConnectionEvictor.java:66)
        at java.lang.Thread.run(Thread.java:745)
  15) Thread[id=120588, name=Connection evictor, state=TIMED_WAITING, group=TGRP-CdcrReplicationDistributedZkTest]
        at java.lang.Thread.sleep(Native Method)
        at org.apache.http.impl.client.IdleConnectionEvictor$1.run(IdleConnectionEvictor.java:66)
        at java.lang.Thread.run(Thread.java:745)
  16) Thread[id=124506, name=Connection evictor, state=TIMED_WAITING, group=TGRP-CdcrReplicationDistributedZkTest]
        at java.lang.Thread.sleep(Native Method)
        at org.apache.http.impl.client.IdleConnectionEvictor$1.run(IdleConnectionEvictor.java:66)
        at java.lang.Thread.run(Thread.java:745)
  17) Thread[id=117269, name=Connection evictor, state=TIMED_WAITING, group=TGRP-CdcrReplicationDistributedZkTest]
        at java.lang.Thread.sleep(Native Method)
        at org.apache.http.impl.client.IdleConnectionEvictor$1.run(IdleConnectionEvictor.java:66)
        at java.lang.Thread.run(Thread.java:745)
  18) Thread[id=117789, name=Connection evictor, state=TIMED_WAITING, group=TGRP-CdcrReplicationDistributedZkTest]
        at java.lang.Thread.sleep(Native Method)
        at org.apache.http.impl.client.IdleConnectionEvictor$1.run(IdleConnectionEvictor.java:66)
        at java.lang.Thread.run(Thread.java:745)
  19) Thread[id=120586, name=Connection evictor, state=TIMED_WAITING, group=TGRP-CdcrReplicationDistributedZkTest]
        at java.lang.Thread.sleep(Native Method)
        at org.apache.http.impl.client.IdleConnectionEvictor$1.run(IdleConnectionEvictor.java:66)
        at java.lang.Thread.run(Thread.java:745)
  20) Thread[id=116508, name=Connection evictor, state=TIMED_WAITING, group=TGRP-CdcrReplicationDistributedZkTest]
        at java.lang.Thread.sleep(Native Method)
        at org.apache.http.impl.client.IdleConnectionEvictor$1.run(IdleConnectionEvictor.java:66)
        at java.lang.Thread.run(Thread.java:745)
  21) Thread[id=117041, name=Connection evictor, state=TIMED_WAITING, group=TGRP-CdcrReplicationDistributedZkTest]
        at java.lang.Thread.sleep(Native Method)
        at org.apache.http.impl.client.IdleConnectionEvictor$1.run(IdleConnectionEvictor.java:66)
        at java.lang.Thread.run(Thread.java:745)
  22) Thread[id=121012, name=Connection evictor, state=TIMED_WAITING, group=TGRP-CdcrReplicationDistributedZkTest]
        at java.lang.Thread.sleep(Native Method)
        at org.apache.http.impl.client.IdleConnectionEvictor$1.run(IdleConnectionEvictor.java:66)
        at java.lang.Thread.run(Thread.java:745)
  23) Thread[id=119396, name=Connection evictor, state=TIMED_WAITING, group=TGRP-CdcrReplicationDistributedZkTest]
        at java.lang.Thread.sleep(Native Method)
        at org.apache.http.impl.client.IdleConnectionEvictor$1.run(IdleConnectionEvictor.java:66)
        at java.lang.Thread.run(Thread.java:745)
  24) Thread[id=124959, name=Connection evictor, state=TIMED_WAITING, group=TGRP-CdcrReplicationDistributedZkTest]
        at java.lang.Thread.sleep(Native Method)
        at org.apache.http.impl.client.IdleConnectionEvictor$1.run(IdleConnectionEvictor.java:66)
        at java.lang.Thread.run(Thread.java:745)
  25) Thread[id=117040, name=Connection evictor, state=TIMED_WAITING, group=TGRP-CdcrReplicationDistributedZkTest]
        at java.lang.Thread.sleep(Native Method)
        at org.apache.http.impl.client.IdleConnectionEvictor$1.run(IdleConnectionEvictor.java:66)
        at java.lang.Thread.run(Thread.java:745)
  26) Thread[id=121263, name=Connection evictor, state=TIMED_WAITING, group=TGRP-CdcrReplicationDistributedZkTest]
        at java.lang.Thread.sleep(Native Method)
        at org.apache.http.impl.client.IdleConnectionEvictor$1.run(IdleConnectionEvictor.java:66)
        at java.lang.Thread.run(Thread.java:745)
  27) Thread[id=116864, name=Connection evictor, state=TIMED_WAITING, group=TGRP-CdcrReplicationDistributedZkTest]
        at java.lang.Thread.sleep(Native Method)
        at org.apache.http.impl.client.IdleConnectionEvictor$1.run(IdleConnectionEvictor.java:66)
        at java.lang.Thread.run(Thread.java:745)
  28) Thread[id=120881, name=Connection evictor, state=TIMED_WAITING, group=TGRP-CdcrReplicationDistributedZkTest]
        at java.lang.Thread.sleep(Native Method)
        at org.apache.http.impl.client.IdleConnectionEvictor$1.run(IdleConnectionEvictor.java:66)
        at java.lang.Thread.run(Thread.java:745)
  29) Thread[id=121262, name=Connection evictor, state=TIMED_WAITING, group=TGRP-CdcrReplicationDistributedZkTest]
        at java.lang.Thread.sleep(Native Method)
        at org.apache.http.impl.client.IdleConnectionEvictor$1.run(IdleConnectionEvictor.java:66)
        at java.lang.Thread.run(Thread.java:745)
  30) Thread[id=117038, name=Connection evictor, state=TIMED_WAITING, group=TGRP-CdcrReplicationDistributedZkTest]
        at java.lang.Thread.sleep(Native Method)
        at org.apache.http.impl.client.IdleConnectionEvictor$1.run(IdleConnectionEvictor.java:66)
        at java.lang.Thread.run(Thread.java:745)
  31) Thread[id=119397, name=Connection evictor, state=TIMED_WAITING, group=TGRP-CdcrReplicationDistributedZkTest]
        at java.lang.Thread.sleep(Native Method)
        at org.apache.http.impl.client.IdleConnectionEvictor$1.run(IdleConnectionEvictor.java:66)
        at java.lang.Thread.run(Thread.java:745)
  32) Thread[id=121013, name=Connection evictor, state=TIMED_WAITING, group=TGRP-CdcrReplicationDistributedZkTest]
        at java.lang.Thread.sleep(Native Method)
        at org.apache.http.impl.client.IdleConnectionEvictor$1.run(IdleConnectionEvictor.java:66)
        at java.lang.Thread.run(Thread.java:745)
  33) Thread[id=117270, name=Connection evictor, state=TIMED_WAITING, group=TGRP-CdcrReplicationDistributedZkTest]
        at java.lang.Thread.sleep(Native Method)
        at org.apache.http.impl.client.IdleConnectionEvictor$1.run(IdleConnectionEvictor.java:66)
        at java.lang.Thread.run(Thread.java:745)
  34) Thread[id=121011, name=Connection evictor, state=TIMED_WAITING, group=TGRP-CdcrReplicationDistributedZkTest]
        at java.lang.Thread.sleep(Native Method)
        at org.apache.http.impl.client.IdleConnectionEvictor$1.run(IdleConnectionEvictor.java:66)
        at java.lang.Thread.run(Thread.java:745)
  35) Thread[id=121261, name=Connection evictor, state=TIMED_WAITING, group=TGRP-CdcrReplicationDistributedZkTest]
        at java.lang.Thread.sleep(Native Method)
        at org.apache.http.impl.client.IdleConnectionEvictor$1.run(IdleConnectionEvictor.java:66)
        at java.lang.Thread.run(Thread.java:745)
  36) Thread[id=124960, name=Connection evictor, state=TIMED_WAITING, group=TGRP-CdcrReplicationDistributedZkTest]
        at java.lang.Thread.sleep(Native Method)
        at org.apache.http.impl.client.IdleConnectionEvictor$1.run(IdleConnectionEvictor.java:66)
        at java.lang.Thread.run(Thread.java:745)
  37) Thread[id=124961, name=Connection evictor, state=TIMED_WAITING, group=TGRP-CdcrReplicationDistributedZkTest]
        at java.lang.Thread.sleep(Native Method)
        at org.apache.http.impl.client.IdleConnectionEvictor$1.run(IdleConnectionEvictor.java:66)
        at java.lang.Thread.run(Thread.java:745)
  38) Thread[id=119394, name=Connection evictor, state=TIMED_WAITING, group=TGRP-CdcrReplicationDistributedZkTest]
        at java.lang.Thread.sleep(Native Method)
        at org.apache.http.impl.client.IdleConnectionEvictor$1.run(IdleConnectionEvictor.java:66)
        at java.lang.Thread.run(Thread.java:745)
  39) Thread[id=124962, name=Connection evictor, state=TIMED_WAITING, group=TGRP-CdcrReplicationDistributedZkTest]
        at java.lang.Thread.sleep(Native Method)
        at org.apache.http.impl.client.IdleConnectionEvictor$1.run(IdleConnectionEvictor.java:66)
        at java.lang.Thread.run(Thread.java:745)
  40) Thread[id=119395, name=Connection evictor, state=TIMED_WAITING, group=TGRP-CdcrReplicationDistributedZkTest]
        at java.lang.Thread.sleep(Native Method)
        at org.apache.http.impl.client.IdleConnectionEvictor$1.run(IdleConnectionEvictor.java:66)
        at java.lang.Thread.run(Thread.java:745)
  41) Thread[id=121260, name=Connection evictor, state=TIMED_WAITING, group=TGRP-CdcrReplicationDistributedZkTest]
        at java.lang.Thread.sleep(Native Method)
        at org.apache.http.impl.client.IdleConnectionEvictor$1.run(IdleConnectionEvictor.java:66)
        at java.lang.Thread.run(Thread.java:745)
  42) Thread[id=117787, name=Connection evictor, state=TIMED_WAITING, group=TGRP-CdcrReplicationDistributedZkTest]
        at java.lang.Thread.sleep(Native Method)
        at org.apache.http.impl.client.IdleConnectionEvictor$1.run(IdleConnectionEvictor.java:66)
        at java.lang.Thread.run(Thread.java:745)
  43) Thread[id=121010, name=Connection evictor, state=TIMED_WAITING, group=TGRP-CdcrReplicationDistributedZkTest]
        at java.lang.Thread.sleep(Native Method)
        at org.apache.http.impl.client.IdleConnectionEvictor$1.run(IdleConnectionEvictor.java:66)
        at java.lang.Thread.run(Thread.java:745)
  44) Thread[id=117271, name=Connection evictor, state=TIMED_WAITING, group=TGRP-CdcrReplicationDistributedZkTest]
        at java.lang.Thread.sleep(Native Method)
        at org.apache.http.impl.client.IdleConnectionEvictor$1.run(IdleConnectionEvictor.java:66)
        at java.lang.Thread.run(Thread.java:745)
  45) Thread[id=124503, name=Connection evictor, state=TIMED_WAITING, group=TGRP-CdcrReplicationDistributedZkTest]
        at java.lang.Thread.sleep(Native Method)
        at org.apache.http.impl.client.IdleConnectionEvictor$1.run(IdleConnectionEvictor.java:66)
        at java.lang.Thread.run(Thread.java:745)
  46) Thread[id=116510, name=Connection evictor, state=TIMED_WAITING, group=TGRP-CdcrReplicationDistributedZkTest]
        at java.lang.Thread.sleep(Native Method)
        at org.apache.http.impl.client.IdleConnectionEvictor$1.run(IdleConnectionEvictor.java:66)
        at java.lang.Thread.run(Thread.java:745)
  47) Thread[id=117790, name=Connection evictor, state=TIMED_WAITING, group=TGRP-CdcrReplicationDistributedZkTest]
        at java.lang.Thread.sleep(Native Method)
        at org.apache.http.impl.client.IdleConnectionEvictor$1.run(IdleConnectionEvictor.java:66)
        at java.lang.Thread.run(Thread.java:745)
  48) Thread[id=120585, name=Connection evictor, state=TIMED_WAITING, group=TGRP-CdcrReplicationDistributedZkTest]
        at java.lang.Thread.sleep(Native Method)
        at org.apache.http.impl.client.IdleConnectionEvictor$1.run(IdleConnectionEvictor.java:66)
        at java.lang.Thread.run(Thread.java:745)
	at __randomizedtesting.SeedInfo.seed([4E20909FE0E5459D]:0)


FAILED:  junit.framework.TestSuite.org.apache.solr.cloud.CdcrReplicationHandlerTest

Error Message:
ObjectTracker found 12 object(s) that were not released!!! [InternalHttpClient, InternalHttpClient, InternalHttpClient, InternalHttpClient, InternalHttpClient, InternalHttpClient, InternalHttpClient, InternalHttpClient, InternalHttpClient, InternalHttpClient, InternalHttpClient, InternalHttpClient]

Stack Trace:
java.lang.AssertionError: ObjectTracker found 12 object(s) that were not released!!! [InternalHttpClient, InternalHttpClient, InternalHttpClient, InternalHttpClient, InternalHttpClient, InternalHttpClient, InternalHttpClient, InternalHttpClient, InternalHttpClient, InternalHttpClient, InternalHttpClient, InternalHttpClient]
	at __randomizedtesting.SeedInfo.seed([4E20909FE0E5459D]:0)
	at org.junit.Assert.fail(Assert.java:93)
	at org.junit.Assert.assertTrue(Assert.java:43)
	at org.junit.Assert.assertNull(Assert.java:551)
	at org.apache.solr.SolrTestCaseJ4.teardownTestCases(SolrTestCaseJ4.java:256)
	at sun.reflect.GeneratedMethodAccessor80.invoke(Unknown Source)
	at sun.reflect.DelegatingMethodAccessorImpl.invoke(DelegatingMethodAccessorImpl.java:43)
	at java.lang.reflect.Method.invoke(Method.java:498)
	at com.carrotsearch.randomizedtesting.RandomizedRunner.invoke(RandomizedRunner.java:1764)
	at com.carrotsearch.randomizedtesting.RandomizedRunner$7.evaluate(RandomizedRunner.java:834)
	at com.carrotsearch.randomizedtesting.rules.StatementAdapter.evaluate(StatementAdapter.java:36)
	at com.carrotsearch.randomizedtesting.rules.SystemPropertiesRestoreRule$1.evaluate(SystemPropertiesRestoreRule.java:57)
	at org.apache.lucene.util.AbstractBeforeAfterRule$1.evaluate(AbstractBeforeAfterRule.java:45)
	at com.carrotsearch.randomizedtesting.rules.StatementAdapter.evaluate(StatementAdapter.java:36)
	at org.apache.lucene.util.TestRuleStoreClassName$1.evaluate(TestRuleStoreClassName.java:41)
	at com.carrotsearch.randomizedtesting.rules.NoShadowingOrOverridesOnMethodsRule$1.evaluate(NoShadowingOrOverridesOnMethodsRule.java:40)
	at com.carrotsearch.randomizedtesting.rules.NoShadowingOrOverridesOnMethodsRule$1.evaluate(NoShadowingOrOverridesOnMethodsRule.java:40)
	at com.carrotsearch.randomizedtesting.rules.StatementAdapter.evaluate(StatementAdapter.java:36)
	at com.carrotsearch.randomizedtesting.rules.StatementAdapter.evaluate(StatementAdapter.java:36)
	at com.carrotsearch.randomizedtesting.rules.StatementAdapter.evaluate(StatementAdapter.java:36)
	at org.apache.lucene.util.TestRuleAssertionsRequired$1.evaluate(TestRuleAssertionsRequired.java:53)
	at org.apache.lucene.util.TestRuleMarkFailure$1.evaluate(TestRuleMarkFailure.java:47)
	at org.apache.lucene.util.TestRuleIgnoreAfterMaxFailures$1.evaluate(TestRuleIgnoreAfterMaxFailures.java:64)
	at org.apache.lucene.util.TestRuleIgnoreTestSuites$1.evaluate(TestRuleIgnoreTestSuites.java:54)
	at com.carrotsearch.randomizedtesting.rules.StatementAdapter.evaluate(StatementAdapter.java:36)
	at com.carrotsearch.randomizedtesting.ThreadLeakControl$StatementRunner.run(ThreadLeakControl.java:367)
	at java.lang.Thread.run(Thread.java:745)


FAILED:  junit.framework.TestSuite.org.apache.solr.cloud.CdcrReplicationHandlerTest

Error Message:
12 threads leaked from SUITE scope at org.apache.solr.cloud.CdcrReplicationHandlerTest:     1) Thread[id=47007, name=Connection evictor, state=TIMED_WAITING, group=TGRP-CdcrReplicationHandlerTest]         at java.lang.Thread.sleep(Native Method)         at org.apache.http.impl.client.IdleConnectionEvictor$1.run(IdleConnectionEvictor.java:66)         at java.lang.Thread.run(Thread.java:745)    2) Thread[id=45536, name=Connection evictor, state=TIMED_WAITING, group=TGRP-CdcrReplicationHandlerTest]         at java.lang.Thread.sleep(Native Method)         at org.apache.http.impl.client.IdleConnectionEvictor$1.run(IdleConnectionEvictor.java:66)         at java.lang.Thread.run(Thread.java:745)    3) Thread[id=47802, name=Connection evictor, state=TIMED_WAITING, group=TGRP-CdcrReplicationHandlerTest]         at java.lang.Thread.sleep(Native Method)         at org.apache.http.impl.client.IdleConnectionEvictor$1.run(IdleConnectionEvictor.java:66)         at java.lang.Thread.run(Thread.java:745)    4) Thread[id=46885, name=Connection evictor, state=TIMED_WAITING, group=TGRP-CdcrReplicationHandlerTest]         at java.lang.Thread.sleep(Native Method)         at org.apache.http.impl.client.IdleConnectionEvictor$1.run(IdleConnectionEvictor.java:66)         at java.lang.Thread.run(Thread.java:745)    5) Thread[id=47006, name=Connection evictor, state=TIMED_WAITING, group=TGRP-CdcrReplicationHandlerTest]         at java.lang.Thread.sleep(Native Method)         at org.apache.http.impl.client.IdleConnectionEvictor$1.run(IdleConnectionEvictor.java:66)         at java.lang.Thread.run(Thread.java:745)    6) Thread[id=47529, name=Connection evictor, state=TIMED_WAITING, group=TGRP-CdcrReplicationHandlerTest]         at java.lang.Thread.sleep(Native Method)         at org.apache.http.impl.client.IdleConnectionEvictor$1.run(IdleConnectionEvictor.java:66)         at java.lang.Thread.run(Thread.java:745)    7) Thread[id=47255, name=Connection evictor, state=TIMED_WAITING, group=TGRP-CdcrReplicationHandlerTest]         at java.lang.Thread.sleep(Native Method)         at org.apache.http.impl.client.IdleConnectionEvictor$1.run(IdleConnectionEvictor.java:66)         at java.lang.Thread.run(Thread.java:745)    8) Thread[id=45537, name=Connection evictor, state=TIMED_WAITING, group=TGRP-CdcrReplicationHandlerTest]         at java.lang.Thread.sleep(Native Method)         at org.apache.http.impl.client.IdleConnectionEvictor$1.run(IdleConnectionEvictor.java:66)         at java.lang.Thread.run(Thread.java:745)    9) Thread[id=46886, name=Connection evictor, state=TIMED_WAITING, group=TGRP-CdcrReplicationHandlerTest]         at java.lang.Thread.sleep(Native Method)         at org.apache.http.impl.client.IdleConnectionEvictor$1.run(IdleConnectionEvictor.java:66)         at java.lang.Thread.run(Thread.java:745)   10) Thread[id=47528, name=Connection evictor, state=TIMED_WAITING, group=TGRP-CdcrReplicationHandlerTest]         at java.lang.Thread.sleep(Native Method)         at org.apache.http.impl.client.IdleConnectionEvictor$1.run(IdleConnectionEvictor.java:66)         at java.lang.Thread.run(Thread.java:745)   11) Thread[id=47803, name=Connection evictor, state=TIMED_WAITING, group=TGRP-CdcrReplicationHandlerTest]         at java.lang.Thread.sleep(Native Method)         at org.apache.http.impl.client.IdleConnectionEvictor$1.run(IdleConnectionEvictor.java:66)         at java.lang.Thread.run(Thread.java:745)   12) Thread[id=47256, name=Connection evictor, state=TIMED_WAITING, group=TGRP-CdcrReplicationHandlerTest]         at java.lang.Thread.sleep(Native Method)         at org.apache.http.impl.client.IdleConnectionEvictor$1.run(IdleConnectionEvictor.java:66)         at java.lang.Thread.run(Thread.java:745)

Stack Trace:
com.carrotsearch.randomizedtesting.ThreadLeakError: 12 threads leaked from SUITE scope at org.apache.solr.cloud.CdcrReplicationHandlerTest: 
   1) Thread[id=47007, name=Connection evictor, state=TIMED_WAITING, group=TGRP-CdcrReplicationHandlerTest]
        at java.lang.Thread.sleep(Native Method)
        at org.apache.http.impl.client.IdleConnectionEvictor$1.run(IdleConnectionEvictor.java:66)
        at java.lang.Thread.run(Thread.java:745)
   2) Thread[id=45536, name=Connection evictor, state=TIMED_WAITING, group=TGRP-CdcrReplicationHandlerTest]
        at java.lang.Thread.sleep(Native Method)
        at org.apache.http.impl.client.IdleConnectionEvictor$1.run(IdleConnectionEvictor.java:66)
        at java.lang.Thread.run(Thread.java:745)
   3) Thread[id=47802, name=Connection evictor, state=TIMED_WAITING, group=TGRP-CdcrReplicationHandlerTest]
        at java.lang.Thread.sleep(Native Method)
        at org.apache.http.impl.client.IdleConnectionEvictor$1.run(IdleConnectionEvictor.java:66)
        at java.lang.Thread.run(Thread.java:745)
   4) Thread[id=46885, name=Connection evictor, state=TIMED_WAITING, group=TGRP-CdcrReplicationHandlerTest]
        at java.lang.Thread.sleep(Native Method)
        at org.apache.http.impl.client.IdleConnectionEvictor$1.run(IdleConnectionEvictor.java:66)
        at java.lang.Thread.run(Thread.java:745)
   5) Thread[id=47006, name=Connection evictor, state=TIMED_WAITING, group=TGRP-CdcrReplicationHandlerTest]
        at java.lang.Thread.sleep(Native Method)
        at org.apache.http.impl.client.IdleConnectionEvictor$1.run(IdleConnectionEvictor.java:66)
        at java.lang.Thread.run(Thread.java:745)
   6) Thread[id=47529, name=Connection evictor, state=TIMED_WAITING, group=TGRP-CdcrReplicationHandlerTest]
        at java.lang.Thread.sleep(Native Method)
        at org.apache.http.impl.client.IdleConnectionEvictor$1.run(IdleConnectionEvictor.java:66)
        at java.lang.Thread.run(Thread.java:745)
   7) Thread[id=47255, name=Connection evictor, state=TIMED_WAITING, group=TGRP-CdcrReplicationHandlerTest]
        at java.lang.Thread.sleep(Native Method)
        at org.apache.http.impl.client.IdleConnectionEvictor$1.run(IdleConnectionEvictor.java:66)
        at java.lang.Thread.run(Thread.java:745)
   8) Thread[id=45537, name=Connection evictor, state=TIMED_WAITING, group=TGRP-CdcrReplicationHandlerTest]
        at java.lang.Thread.sleep(Native Method)
        at org.apache.http.impl.client.IdleConnectionEvictor$1.run(IdleConnectionEvictor.java:66)
        at java.lang.Thread.run(Thread.java:745)
   9) Thread[id=46886, name=Connection evictor, state=TIMED_WAITING, group=TGRP-CdcrReplicationHandlerTest]
        at java.lang.Thread.sleep(Native Method)
        at org.apache.http.impl.client.IdleConnectionEvictor$1.run(IdleConnectionEvictor.java:66)
        at java.lang.Thread.run(Thread.java:745)
  10) Thread[id=47528, name=Connection evictor, state=TIMED_WAITING, group=TGRP-CdcrReplicationHandlerTest]
        at java.lang.Thread.sleep(Native Method)
        at org.apache.http.impl.client.IdleConnectionEvictor$1.run(IdleConnectionEvictor.java:66)
        at java.lang.Thread.run(Thread.java:745)
  11) Thread[id=47803, name=Connection evictor, state=TIMED_WAITING, group=TGRP-CdcrReplicationHandlerTest]
        at java.lang.Thread.sleep(Native Method)
        at org.apache.http.impl.client.IdleConnectionEvictor$1.run(IdleConnectionEvictor.java:66)
        at java.lang.Thread.run(Thread.java:745)
  12) Thread[id=47256, name=Connection evictor, state=TIMED_WAITING, group=TGRP-CdcrReplicationHandlerTest]
        at java.lang.Thread.sleep(Native Method)
        at org.apache.http.impl.client.IdleConnectionEvictor$1.run(IdleConnectionEvictor.java:66)
        at java.lang.Thread.run(Thread.java:745)
	at __randomizedtesting.SeedInfo.seed([4E20909FE0E5459D]:0)


FAILED:  junit.framework.TestSuite.org.apache.solr.cloud.CdcrRequestHandlerTest

Error Message:
ObjectTracker found 8 object(s) that were not released!!! [InternalHttpClient, InternalHttpClient, InternalHttpClient, InternalHttpClient, InternalHttpClient, InternalHttpClient, InternalHttpClient, InternalHttpClient]

Stack Trace:
java.lang.AssertionError: ObjectTracker found 8 object(s) that were not released!!! [InternalHttpClient, InternalHttpClient, InternalHttpClient, InternalHttpClient, InternalHttpClient, InternalHttpClient, InternalHttpClient, InternalHttpClient]
	at __randomizedtesting.SeedInfo.seed([4E20909FE0E5459D]:0)
	at org.junit.Assert.fail(Assert.java:93)
	at org.junit.Assert.assertTrue(Assert.java:43)
	at org.junit.Assert.assertNull(Assert.java:551)
	at org.apache.solr.SolrTestCaseJ4.teardownTestCases(SolrTestCaseJ4.java:256)
	at sun.reflect.GeneratedMethodAccessor42.invoke(Unknown Source)
	at sun.reflect.DelegatingMethodAccessorImpl.invoke(DelegatingMethodAccessorImpl.java:43)
	at java.lang.reflect.Method.invoke(Method.java:498)
	at com.carrotsearch.randomizedtesting.RandomizedRunner.invoke(RandomizedRunner.java:1764)
	at com.carrotsearch.randomizedtesting.RandomizedRunner$7.evaluate(RandomizedRunner.java:834)
	at com.carrotsearch.randomizedtesting.rules.StatementAdapter.evaluate(StatementAdapter.java:36)
	at com.carrotsearch.randomizedtesting.rules.SystemPropertiesRestoreRule$1.evaluate(SystemPropertiesRestoreRule.java:57)
	at org.apache.lucene.util.AbstractBeforeAfterRule$1.evaluate(AbstractBeforeAfterRule.java:45)
	at com.carrotsearch.randomizedtesting.rules.StatementAdapter.evaluate(StatementAdapter.java:36)
	at org.apache.lucene.util.TestRuleStoreClassName$1.evaluate(TestRuleStoreClassName.java:41)
	at com.carrotsearch.randomizedtesting.rules.NoShadowingOrOverridesOnMethodsRule$1.evaluate(NoShadowingOrOverridesOnMethodsRule.java:40)
	at com.carrotsearch.randomizedtesting.rules.NoShadowingOrOverridesOnMethodsRule$1.evaluate(NoShadowingOrOverridesOnMethodsRule.java:40)
	at com.carrotsearch.randomizedtesting.rules.StatementAdapter.evaluate(StatementAdapter.java:36)
	at com.carrotsearch.randomizedtesting.rules.StatementAdapter.evaluate(StatementAdapter.java:36)
	at com.carrotsearch.randomizedtesting.rules.StatementAdapter.evaluate(StatementAdapter.java:36)
	at org.apache.lucene.util.TestRuleAssertionsRequired$1.evaluate(TestRuleAssertionsRequired.java:53)
	at org.apache.lucene.util.TestRuleMarkFailure$1.evaluate(TestRuleMarkFailure.java:47)
	at org.apache.lucene.util.TestRuleIgnoreAfterMaxFailures$1.evaluate(TestRuleIgnoreAfterMaxFailures.java:64)
	at org.apache.lucene.util.TestRuleIgnoreTestSuites$1.evaluate(TestRuleIgnoreTestSuites.java:54)
	at com.carrotsearch.randomizedtesting.rules.StatementAdapter.evaluate(StatementAdapter.java:36)
	at com.carrotsearch.randomizedtesting.ThreadLeakControl$StatementRunner.run(ThreadLeakControl.java:367)
	at java.lang.Thread.run(Thread.java:745)


FAILED:  junit.framework.TestSuite.org.apache.solr.cloud.CdcrRequestHandlerTest

Error Message:
8 threads leaked from SUITE scope at org.apache.solr.cloud.CdcrRequestHandlerTest:     1) Thread[id=191167, name=Connection evictor, state=TIMED_WAITING, group=TGRP-CdcrRequestHandlerTest]         at java.lang.Thread.sleep(Native Method)         at org.apache.http.impl.client.IdleConnectionEvictor$1.run(IdleConnectionEvictor.java:66)         at java.lang.Thread.run(Thread.java:745)    2) Thread[id=191164, name=Connection evictor, state=TIMED_WAITING, group=TGRP-CdcrRequestHandlerTest]         at java.lang.Thread.sleep(Native Method)         at org.apache.http.impl.client.IdleConnectionEvictor$1.run(IdleConnectionEvictor.java:66)         at java.lang.Thread.run(Thread.java:745)    3) Thread[id=191165, name=Connection evictor, state=TIMED_WAITING, group=TGRP-CdcrRequestHandlerTest]         at java.lang.Thread.sleep(Native Method)         at org.apache.http.impl.client.IdleConnectionEvictor$1.run(IdleConnectionEvictor.java:66)         at java.lang.Thread.run(Thread.java:745)    4) Thread[id=191552, name=Connection evictor, state=TIMED_WAITING, group=TGRP-CdcrRequestHandlerTest]         at java.lang.Thread.sleep(Native Method)         at org.apache.http.impl.client.IdleConnectionEvictor$1.run(IdleConnectionEvictor.java:66)         at java.lang.Thread.run(Thread.java:745)    5) Thread[id=191554, name=Connection evictor, state=TIMED_WAITING, group=TGRP-CdcrRequestHandlerTest]         at java.lang.Thread.sleep(Native Method)         at org.apache.http.impl.client.IdleConnectionEvictor$1.run(IdleConnectionEvictor.java:66)         at java.lang.Thread.run(Thread.java:745)    6) Thread[id=191555, name=Connection evictor, state=TIMED_WAITING, group=TGRP-CdcrRequestHandlerTest]         at java.lang.Thread.sleep(Native Method)         at org.apache.http.impl.client.IdleConnectionEvictor$1.run(IdleConnectionEvictor.java:66)         at java.lang.Thread.run(Thread.java:745)    7) Thread[id=191166, name=Connection evictor, state=TIMED_WAITING, group=TGRP-CdcrRequestHandlerTest]         at java.lang.Thread.sleep(Native Method)         at org.apache.http.impl.client.IdleConnectionEvictor$1.run(IdleConnectionEvictor.java:66)         at java.lang.Thread.run(Thread.java:745)    8) Thread[id=191553, name=Connection evictor, state=TIMED_WAITING, group=TGRP-CdcrRequestHandlerTest]         at java.lang.Thread.sleep(Native Method)         at org.apache.http.impl.client.IdleConnectionEvictor$1.run(IdleConnectionEvictor.java:66)         at java.lang.Thread.run(Thread.java:745)

Stack Trace:
com.carrotsearch.randomizedtesting.ThreadLeakError: 8 threads leaked from SUITE scope at org.apache.solr.cloud.CdcrRequestHandlerTest: 
   1) Thread[id=191167, name=Connection evictor, state=TIMED_WAITING, group=TGRP-CdcrRequestHandlerTest]
        at java.lang.Thread.sleep(Native Method)
        at org.apache.http.impl.client.IdleConnectionEvictor$1.run(IdleConnectionEvictor.java:66)
        at java.lang.Thread.run(Thread.java:745)
   2) Thread[id=191164, name=Connection evictor, state=TIMED_WAITING, group=TGRP-CdcrRequestHandlerTest]
        at java.lang.Thread.sleep(Native Method)
        at org.apache.http.impl.client.IdleConnectionEvictor$1.run(IdleConnectionEvictor.java:66)
        at java.lang.Thread.run(Thread.java:745)
   3) Thread[id=191165, name=Connection evictor, state=TIMED_WAITING, group=TGRP-CdcrRequestHandlerTest]
        at java.lang.Thread.sleep(Native Method)
        at org.apache.http.impl.client.IdleConnectionEvictor$1.run(IdleConnectionEvictor.java:66)
        at java.lang.Thread.run(Thread.java:745)
   4) Thread[id=191552, name=Connection evictor, state=TIMED_WAITING, group=TGRP-CdcrRequestHandlerTest]
        at java.lang.Thread.sleep(Native Method)
        at org.apache.http.impl.client.IdleConnectionEvictor$1.run(IdleConnectionEvictor.java:66)
        at java.lang.Thread.run(Thread.java:745)
   5) Thread[id=191554, name=Connection evictor, state=TIMED_WAITING, group=TGRP-CdcrRequestHandlerTest]
        at java.lang.Thread.sleep(Native Method)
        at org.apache.http.impl.client.IdleConnectionEvictor$1.run(IdleConnectionEvictor.java:66)
        at java.lang.Thread.run(Thread.java:745)
   6) Thread[id=191555, name=Connection evictor, state=TIMED_WAITING, group=TGRP-CdcrRequestHandlerTest]
        at java.lang.Thread.sleep(Native Method)
        at org.apache.http.impl.client.IdleConnectionEvictor$1.run(IdleConnectionEvictor.java:66)
        at java.lang.Thread.run(Thread.java:745)
   7) Thread[id=191166, name=Connection evictor, state=TIMED_WAITING, group=TGRP-CdcrRequestHandlerTest]
        at java.lang.Thread.sleep(Native Method)
        at org.apache.http.impl.client.IdleConnectionEvictor$1.run(IdleConnectionEvictor.java:66)
        at java.lang.Thread.run(Thread.java:745)
   8) Thread[id=191553, name=Connection evictor, state=TIMED_WAITING, group=TGRP-CdcrRequestHandlerTest]
        at java.lang.Thread.sleep(Native Method)
        at org.apache.http.impl.client.IdleConnectionEvictor$1.run(IdleConnectionEvictor.java:66)
        at java.lang.Thread.run(Thread.java:745)
	at __randomizedtesting.SeedInfo.seed([4E20909FE0E5459D]:0)


FAILED:  junit.framework.TestSuite.org.apache.solr.cloud.ConcurrentDeleteAndCreateCollectionTest

Error Message:
ObjectTracker found 10 object(s) that were not released!!! [InternalHttpClient, InternalHttpClient, InternalHttpClient, InternalHttpClient, InternalHttpClient, InternalHttpClient, InternalHttpClient, InternalHttpClient, InternalHttpClient, InternalHttpClient]

Stack Trace:
java.lang.AssertionError: ObjectTracker found 10 object(s) that were not released!!! [InternalHttpClient, InternalHttpClient, InternalHttpClient, InternalHttpClient, InternalHttpClient, InternalHttpClient, InternalHttpClient, InternalHttpClient, InternalHttpClient, InternalHttpClient]
	at __randomizedtesting.SeedInfo.seed([4E20909FE0E5459D]:0)
	at org.junit.Assert.fail(Assert.java:93)
	at org.junit.Assert.assertTrue(Assert.java:43)
	at org.junit.Assert.assertNull(Assert.java:551)
	at org.apache.solr.SolrTestCaseJ4.teardownTestCases(SolrTestCaseJ4.java:256)
	at sun.reflect.GeneratedMethodAccessor42.invoke(Unknown Source)
	at sun.reflect.DelegatingMethodAccessorImpl.invoke(DelegatingMethodAccessorImpl.java:43)
	at java.lang.reflect.Method.invoke(Method.java:498)
	at com.carrotsearch.randomizedtesting.RandomizedRunner.invoke(RandomizedRunner.java:1764)
	at com.carrotsearch.randomizedtesting.RandomizedRunner$7.evaluate(RandomizedRunner.java:834)
	at com.carrotsearch.randomizedtesting.rules.StatementAdapter.evaluate(StatementAdapter.java:36)
	at com.carrotsearch.randomizedtesting.rules.SystemPropertiesRestoreRule$1.evaluate(SystemPropertiesRestoreRule.java:57)
	at org.apache.lucene.util.AbstractBeforeAfterRule$1.evaluate(AbstractBeforeAfterRule.java:45)
	at com.carrotsearch.randomizedtesting.rules.StatementAdapter.evaluate(StatementAdapter.java:36)
	at org.apache.lucene.util.TestRuleStoreClassName$1.evaluate(TestRuleStoreClassName.java:41)
	at com.carrotsearch.randomizedtesting.rules.NoShadowingOrOverridesOnMethodsRule$1.evaluate(NoShadowingOrOverridesOnMethodsRule.java:40)
	at com.carrotsearch.randomizedtesting.rules.NoShadowingOrOverridesOnMethodsRule$1.evaluate(NoShadowingOrOverridesOnMethodsRule.java:40)
	at com.carrotsearch.randomizedtesting.rules.StatementAdapter.evaluate(StatementAdapter.java:36)
	at com.carrotsearch.randomizedtesting.rules.StatementAdapter.evaluate(StatementAdapter.java:36)
	at com.carrotsearch.randomizedtesting.rules.StatementAdapter.evaluate(StatementAdapter.java:36)
	at org.apache.lucene.util.TestRuleAssertionsRequired$1.evaluate(TestRuleAssertionsRequired.java:53)
	at org.apache.lucene.util.TestRuleMarkFailure$1.evaluate(TestRuleMarkFailure.java:47)
	at org.apache.lucene.util.TestRuleIgnoreAfterMaxFailures$1.evaluate(TestRuleIgnoreAfterMaxFailures.java:64)
	at org.apache.lucene.util.TestRuleIgnoreTestSuites$1.evaluate(TestRuleIgnoreTestSuites.java:54)
	at com.carrotsearch.randomizedtesting.rules.StatementAdapter.evaluate(StatementAdapter.java:36)
	at com.carrotsearch.randomizedtesting.ThreadLeakControl$StatementRunner.run(ThreadLeakControl.java:367)
	at java.lang.Thread.run(Thread.java:745)


FAILED:  junit.framework.TestSuite.org.apache.solr.cloud.ConcurrentDeleteAndCreateCollectionTest

Error Message:
10 threads leaked from SUITE scope at org.apache.solr.cloud.ConcurrentDeleteAndCreateCollectionTest:     1) Thread[id=129080, name=Connection evictor, state=TIMED_WAITING, group=TGRP-ConcurrentDeleteAndCreateCollectionTest]         at java.lang.Thread.sleep(Native Method)         at org.apache.http.impl.client.IdleConnectionEvictor$1.run(IdleConnectionEvictor.java:66)         at java.lang.Thread.run(Thread.java:745)    2) Thread[id=129075, name=Connection evictor, state=TIMED_WAITING, group=TGRP-ConcurrentDeleteAndCreateCollectionTest]         at java.lang.Thread.sleep(Native Method)         at org.apache.http.impl.client.IdleConnectionEvictor$1.run(IdleConnectionEvictor.java:66)         at java.lang.Thread.run(Thread.java:745)    3) Thread[id=129045, name=Connection evictor, state=TIMED_WAITING, group=TGRP-ConcurrentDeleteAndCreateCollectionTest]         at java.lang.Thread.sleep(Native Method)         at org.apache.http.impl.client.IdleConnectionEvictor$1.run(IdleConnectionEvictor.java:66)         at java.lang.Thread.run(Thread.java:745)    4) Thread[id=129050, name=Connection evictor, state=TIMED_WAITING, group=TGRP-ConcurrentDeleteAndCreateCollectionTest]         at java.lang.Thread.sleep(Native Method)         at org.apache.http.impl.client.IdleConnectionEvictor$1.run(IdleConnectionEvictor.java:66)         at java.lang.Thread.run(Thread.java:745)    5) Thread[id=129055, name=Connection evictor, state=TIMED_WAITING, group=TGRP-ConcurrentDeleteAndCreateCollectionTest]         at java.lang.Thread.sleep(Native Method)         at org.apache.http.impl.client.IdleConnectionEvictor$1.run(IdleConnectionEvictor.java:66)         at java.lang.Thread.run(Thread.java:745)    6) Thread[id=129085, name=Connection evictor, state=TIMED_WAITING, group=TGRP-ConcurrentDeleteAndCreateCollectionTest]         at java.lang.Thread.sleep(Native Method)         at org.apache.http.impl.client.IdleConnectionEvictor$1.run(IdleConnectionEvictor.java:66)         at java.lang.Thread.run(Thread.java:745)    7) Thread[id=129060, name=Connection evictor, state=TIMED_WAITING, group=TGRP-ConcurrentDeleteAndCreateCollectionTest]         at java.lang.Thread.sleep(Native Method)         at org.apache.http.impl.client.IdleConnectionEvictor$1.run(IdleConnectionEvictor.java:66)         at java.lang.Thread.run(Thread.java:745)    8) Thread[id=129070, name=Connection evictor, state=TIMED_WAITING, group=TGRP-ConcurrentDeleteAndCreateCollectionTest]         at java.lang.Thread.sleep(Native Method)         at org.apache.http.impl.client.IdleConnectionEvictor$1.run(IdleConnectionEvictor.java:66)         at java.lang.Thread.run(Thread.java:745)    9) Thread[id=129065, name=Connection evictor, state=TIMED_WAITING, group=TGRP-ConcurrentDeleteAndCreateCollectionTest]         at java.lang.Thread.sleep(Native Method)         at org.apache.http.impl.client.IdleConnectionEvictor$1.run(IdleConnectionEvictor.java:66)         at java.lang.Thread.run(Thread.java:745)   10) Thread[id=129040, name=Connection evictor, state=TIMED_WAITING, group=TGRP-ConcurrentDeleteAndCreateCollectionTest]         at java.lang.Thread.sleep(Native Method)         at org.apache.http.impl.client.IdleConnectionEvictor$1.run(IdleConnectionEvictor.java:66)         at java.lang.Thread.run(Thread.java:745)

Stack Trace:
com.carrotsearch.randomizedtesting.ThreadLeakError: 10 threads leaked from SUITE scope at org.apache.solr.cloud.ConcurrentDeleteAndCreateCollectionTest: 
   1) Thread[id=129080, name=Connection evictor, state=TIMED_WAITING, group=TGRP-ConcurrentDeleteAndCreat

[...truncated too long message...]

stHandlerTest, StandardRequestHandlerTest, TestReversedWildcardFilterFactory, TermsComponentTest, RequestHandlersTest, RequiredFieldsTest, LoggingHandlerTest, RegexBoostProcessorTest, UpdateRequestProcessorFactoryTest, JsonLoaderTest, TestComponentsName, SearchHandlerTest, TestMergePolicyConfig, MultiTermTest, SampleTest, TestConfig, TestPostingsSolrHighlighter, DirectSolrConnectionTest, TestCodecSupport, TestBM25SimilarityFactory, URLClassifyProcessorTest, TestFastLRUCache, PreAnalyzedFieldTest, TestSuggestSpellingConverter, RAMDirectoryFactoryTest, TestUtils, SliceStateTest, SystemInfoHandlerTest, FileUtilsTest, TestRTGBase, CursorPagingTest, SolrTestCaseJ4Test, TestCrossCoreJoin, TestCursorMarkWithoutUniqueKey, TestSimpleTrackingShardHandler, TestTolerantSearch, ConnectionReuseTest, TestEmbeddedSolrServerConstructors, ActionThrottleTest, AliasIntegrationTest, CdcrReplicationHandlerTest, CollectionTooManyReplicasTest, CollectionsAPISolrJTest, DeleteStatusTest, DistribCursorPagingTest, DistribJoinFromCollectionTest, ForceLeaderTest, ReplicationFactorTest, RestartWhileUpdatingTest, TestRebalanceLeaders, TestSolrCloudWithKerberosAlt, TestTolerantUpdateProcessorCloud, TriLevelCompositeIdRoutingTest, VMParamsZkACLAndCredentialsProvidersTest, HdfsBasicDistributedZk2Test, HdfsChaosMonkeySafeLeaderTest, HdfsRestartWhileUpdatingTest]
   [junit4]   2> NOTE: download the large Jenkins line-docs file by running 'ant get-jenkins-line-docs' in the lucene directory.
   [junit4]   2> NOTE: reproduce with: ant test  -Dtestcase=HdfsRestartWhileUpdatingTest -Dtests.seed=4E20909FE0E5459D -Dtests.multiplier=2 -Dtests.nightly=true -Dtests.slow=true -Dtests.linedocsfile=/x1/jenkins/lucene-data/enwiki.random.lines.txt -Dtests.locale=ar-TN -Dtests.timezone=Chile/Continental -Dtests.asserts=true -Dtests.file.encoding=UTF-8
   [junit4] ERROR   0.00s J2 | HdfsRestartWhileUpdatingTest (suite) <<<
   [junit4]    > Throwable #1: com.carrotsearch.randomizedtesting.ThreadLeakError: 3 threads leaked from SUITE scope at org.apache.solr.cloud.hdfs.HdfsRestartWhileUpdatingTest: 
   [junit4]    >    1) Thread[id=56874, name=searcherExecutor-10753-thread-1, state=WAITING, group=TGRP-HdfsRestartWhileUpdatingTest]
   [junit4]    >         at sun.misc.Unsafe.park(Native Method)
   [junit4]    >         at java.util.concurrent.locks.LockSupport.park(LockSupport.java:175)
   [junit4]    >         at java.util.concurrent.locks.AbstractQueuedSynchronizer$ConditionObject.await(AbstractQueuedSynchronizer.java:2039)
   [junit4]    >         at java.util.concurrent.LinkedBlockingQueue.take(LinkedBlockingQueue.java:442)
   [junit4]    >         at java.util.concurrent.ThreadPoolExecutor.getTask(ThreadPoolExecutor.java:1067)
   [junit4]    >         at java.util.concurrent.ThreadPoolExecutor.runWorker(ThreadPoolExecutor.java:1127)
   [junit4]    >         at java.util.concurrent.ThreadPoolExecutor$Worker.run(ThreadPoolExecutor.java:617)
   [junit4]    >         at java.lang.Thread.run(Thread.java:745)
   [junit4]    >    2) Thread[id=56837, name=searcherExecutor-10742-thread-1, state=WAITING, group=TGRP-HdfsRestartWhileUpdatingTest]
   [junit4]    >         at sun.misc.Unsafe.park(Native Method)
   [junit4]    >         at java.util.concurrent.locks.LockSupport.park(LockSupport.java:175)
   [junit4]    >         at java.util.concurrent.locks.AbstractQueuedSynchronizer$ConditionObject.await(AbstractQueuedSynchronizer.java:2039)
   [junit4]    >         at java.util.concurrent.LinkedBlockingQueue.take(LinkedBlockingQueue.java:442)
   [junit4]    >         at java.util.concurrent.ThreadPoolExecutor.getTask(ThreadPoolExecutor.java:1067)
   [junit4]    >         at java.util.concurrent.ThreadPoolExecutor.runWorker(ThreadPoolExecutor.java:1127)
   [junit4]    >         at java.util.concurrent.ThreadPoolExecutor$Worker.run(ThreadPoolExecutor.java:617)
   [junit4]    >         at java.lang.Thread.run(Thread.java:745)
   [junit4]    >    3) Thread[id=56807, name=searcherExecutor-10731-thread-1, state=WAITING, group=TGRP-HdfsRestartWhileUpdatingTest]
   [junit4]    >         at sun.misc.Unsafe.park(Native Method)
   [junit4]    >         at java.util.concurrent.locks.LockSupport.park(LockSupport.java:175)
   [junit4]    >         at java.util.concurrent.locks.AbstractQueuedSynchronizer$ConditionObject.await(AbstractQueuedSynchronizer.java:2039)
   [junit4]    >         at java.util.concurrent.LinkedBlockingQueue.take(LinkedBlockingQueue.java:442)
   [junit4]    >         at java.util.concurrent.ThreadPoolExecutor.getTask(ThreadPoolExecutor.java:1067)
   [junit4]    >         at java.util.concurrent.ThreadPoolExecutor.runWorker(ThreadPoolExecutor.java:1127)
   [junit4]    >         at java.util.concurrent.ThreadPoolExecutor$Worker.run(ThreadPoolExecutor.java:617)
   [junit4]    >         at java.lang.Thread.run(Thread.java:745)
   [junit4]    > 	at __randomizedtesting.SeedInfo.seed([4E20909FE0E5459D]:0)Throwable #2: com.carrotsearch.randomizedtesting.ThreadLeakError: There are still zombie threads that couldn't be terminated:
   [junit4]    >    1) Thread[id=56874, name=searcherExecutor-10753-thread-1, state=WAITING, group=TGRP-HdfsRestartWhileUpdatingTest]
   [junit4]    >         at sun.misc.Unsafe.park(Native Method)
   [junit4]    >         at java.util.concurrent.locks.LockSupport.park(LockSupport.java:175)
   [junit4]    >         at java.util.concurrent.locks.AbstractQueuedSynchronizer$ConditionObject.await(AbstractQueuedSynchronizer.java:2039)
   [junit4]    >         at java.util.concurrent.LinkedBlockingQueue.take(LinkedBlockingQueue.java:442)
   [junit4]    >         at java.util.concurrent.ThreadPoolExecutor.getTask(ThreadPoolExecutor.java:1067)
   [junit4]    >         at java.util.concurrent.ThreadPoolExecutor.runWorker(ThreadPoolExecutor.java:1127)
   [junit4]    >         at java.util.concurrent.ThreadPoolExecutor$Worker.run(ThreadPoolExecutor.java:617)
   [junit4]    >         at java.lang.Thread.run(Thread.java:745)
   [junit4]    >    2) Thread[id=56837, name=searcherExecutor-10742-thread-1, state=WAITING, group=TGRP-HdfsRestartWhileUpdatingTest]
   [junit4]    >         at sun.misc.Unsafe.park(Native Method)
   [junit4]    >         at java.util.concurrent.locks.LockSupport.park(LockSupport.java:175)
   [junit4]    >         at java.util.concurrent.locks.AbstractQueuedSynchronizer$ConditionObject.await(AbstractQueuedSynchronizer.java:2039)
   [junit4]    >         at java.util.concurrent.LinkedBlockingQueue.take(LinkedBlockingQueue.java:442)
   [junit4]    >         at java.util.concurrent.ThreadPoolExecutor.getTask(ThreadPoolExecutor.java:1067)
   [junit4]    >         at java.util.concurrent.ThreadPoolExecutor.runWorker(ThreadPoolExecutor.java:1127)
   [junit4]    >         at java.util.concurrent.ThreadPoolExecutor$Worker.run(ThreadPoolExecutor.java:617)
   [junit4]    >         at java.lang.Thread.run(Thread.java:745)
   [junit4]    >    3) Thread[id=56807, name=searcherExecutor-10731-thread-1, state=WAITING, group=TGRP-HdfsRestartWhileUpdatingTest]
   [junit4]    >         at sun.misc.Unsafe.park(Native Method)
   [junit4]    >         at java.util.concurrent.locks.LockSupport.park(LockSupport.java:175)
   [junit4]    >         at java.util.concurrent.locks.AbstractQueuedSynchronizer$ConditionObject.await(AbstractQueuedSynchronizer.java:2039)
   [junit4]    >         at java.util.concurrent.LinkedBlockingQueue.take(LinkedBlockingQueue.java:442)
   [junit4]    >         at java.util.concurrent.ThreadPoolExecutor.getTask(ThreadPoolExecutor.java:1067)
   [junit4]    >         at java.util.concurrent.ThreadPoolExecutor.runWorker(ThreadPoolExecutor.java:1127)
   [junit4]    >         at java.util.concurrent.ThreadPoolExecutor$Worker.run(ThreadPoolExecutor.java:617)
   [junit4]    >         at java.lang.Thread.run(Thread.java:745)
   [junit4]    > 	at __randomizedtesting.SeedInfo.seed([4E20909FE0E5459D]:0)
   [junit4] Completed [614/614 (10!)] on J2 in 1053.93s, 1 test, 3 errors <<< FAILURES!

[...truncated 1 lines...]
   [junit4] JVM J2: stdout was not empty, see: /x1/jenkins/jenkins-slave/workspace/Lucene-Solr-NightlyTests-master/solr/build/solr-core/test/temp/junit4-J2-20160619_153730_970.sysout
   [junit4] >>> JVM J2 emitted unexpected output (verbatim) ----
   [junit4] java.lang.OutOfMemoryError: Java heap space
   [junit4] Dumping heap to /x1/jenkins/jenkins-slave/workspace/Lucene-Solr-NightlyTests-master/heapdumps/java_pid4479.hprof ...
   [junit4] Heap dump file created [602432626 bytes in 6.233 secs]
   [junit4] <<< JVM J2: EOF ----

[...truncated 19 lines...]
BUILD FAILED
/x1/jenkins/jenkins-slave/workspace/Lucene-Solr-NightlyTests-master/build.xml:747: The following error occurred while executing this line:
/x1/jenkins/jenkins-slave/workspace/Lucene-Solr-NightlyTests-master/build.xml:684: The following error occurred while executing this line:
/x1/jenkins/jenkins-slave/workspace/Lucene-Solr-NightlyTests-master/build.xml:59: The following error occurred while executing this line:
/x1/jenkins/jenkins-slave/workspace/Lucene-Solr-NightlyTests-master/solr/build.xml:233: The following error occurred while executing this line:
/x1/jenkins/jenkins-slave/workspace/Lucene-Solr-NightlyTests-master/solr/common-build.xml:531: The following error occurred while executing this line:
/x1/jenkins/jenkins-slave/workspace/Lucene-Solr-NightlyTests-master/lucene/common-build.xml:1427: The following error occurred while executing this line:
/x1/jenkins/jenkins-slave/workspace/Lucene-Solr-NightlyTests-master/lucene/common-build.xml:984: There were test failures: 614 suites (10 ignored), 2584 tests, 11 suite-level errors, 5 errors, 33 ignored (18 assumptions) [seed: 4E20909FE0E5459D]

Total time: 258 minutes 21 seconds
Build step 'Invoke Ant' marked build as failure
Archiving artifacts
No prior successful build to compare, so performing full copy of artifacts
Recording test results
Email was triggered for: Failure - Any
Sending email for trigger: Failure - Any




Mime
View raw message