lucene-dev mailing list archives

Site index · List index
Message view « Date » · « Thread »
Top « Date » · « Thread »
From Policeman Jenkins Server <jenk...@thetaphi.de>
Subject [JENKINS] Lucene-Solr-master-Windows (32bit/jdk1.8.0_92) - Build # 5943 - Still Failing!
Date Wed, 29 Jun 2016 07:30:44 GMT
Build: http://jenkins.thetaphi.de/job/Lucene-Solr-master-Windows/5943/
Java: 32bit/jdk1.8.0_92 -server -XX:+UseParallelGC

3 tests failed.
FAILED:  junit.framework.TestSuite.org.apache.solr.schema.TestManagedSchemaAPI

Error Message:
ObjectTracker found 8 object(s) that were not released!!! [MDCAwareThreadPoolExecutor, MockDirectoryWrapper, TransactionLog, MDCAwareThreadPoolExecutor, TransactionLog, MockDirectoryWrapper, MockDirectoryWrapper, MockDirectoryWrapper]

Stack Trace:
java.lang.AssertionError: ObjectTracker found 8 object(s) that were not released!!! [MDCAwareThreadPoolExecutor, MockDirectoryWrapper, TransactionLog, MDCAwareThreadPoolExecutor, TransactionLog, MockDirectoryWrapper, MockDirectoryWrapper, MockDirectoryWrapper]
	at __randomizedtesting.SeedInfo.seed([AE17F471E70AEC35]:0)
	at org.junit.Assert.fail(Assert.java:93)
	at org.junit.Assert.assertTrue(Assert.java:43)
	at org.junit.Assert.assertNull(Assert.java:551)
	at org.apache.solr.SolrTestCaseJ4.teardownTestCases(SolrTestCaseJ4.java:256)
	at sun.reflect.GeneratedMethodAccessor17.invoke(Unknown Source)
	at sun.reflect.DelegatingMethodAccessorImpl.invoke(DelegatingMethodAccessorImpl.java:43)
	at java.lang.reflect.Method.invoke(Method.java:498)
	at com.carrotsearch.randomizedtesting.RandomizedRunner.invoke(RandomizedRunner.java:1764)
	at com.carrotsearch.randomizedtesting.RandomizedRunner$7.evaluate(RandomizedRunner.java:834)
	at com.carrotsearch.randomizedtesting.rules.StatementAdapter.evaluate(StatementAdapter.java:36)
	at com.carrotsearch.randomizedtesting.rules.SystemPropertiesRestoreRule$1.evaluate(SystemPropertiesRestoreRule.java:57)
	at org.apache.lucene.util.AbstractBeforeAfterRule$1.evaluate(AbstractBeforeAfterRule.java:45)
	at com.carrotsearch.randomizedtesting.rules.StatementAdapter.evaluate(StatementAdapter.java:36)
	at org.apache.lucene.util.TestRuleStoreClassName$1.evaluate(TestRuleStoreClassName.java:41)
	at com.carrotsearch.randomizedtesting.rules.NoShadowingOrOverridesOnMethodsRule$1.evaluate(NoShadowingOrOverridesOnMethodsRule.java:40)
	at com.carrotsearch.randomizedtesting.rules.NoShadowingOrOverridesOnMethodsRule$1.evaluate(NoShadowingOrOverridesOnMethodsRule.java:40)
	at com.carrotsearch.randomizedtesting.rules.StatementAdapter.evaluate(StatementAdapter.java:36)
	at com.carrotsearch.randomizedtesting.rules.StatementAdapter.evaluate(StatementAdapter.java:36)
	at com.carrotsearch.randomizedtesting.rules.StatementAdapter.evaluate(StatementAdapter.java:36)
	at org.apache.lucene.util.TestRuleAssertionsRequired$1.evaluate(TestRuleAssertionsRequired.java:53)
	at org.apache.lucene.util.TestRuleMarkFailure$1.evaluate(TestRuleMarkFailure.java:47)
	at org.apache.lucene.util.TestRuleIgnoreAfterMaxFailures$1.evaluate(TestRuleIgnoreAfterMaxFailures.java:64)
	at org.apache.lucene.util.TestRuleIgnoreTestSuites$1.evaluate(TestRuleIgnoreTestSuites.java:54)
	at com.carrotsearch.randomizedtesting.rules.StatementAdapter.evaluate(StatementAdapter.java:36)
	at com.carrotsearch.randomizedtesting.ThreadLeakControl$StatementRunner.run(ThreadLeakControl.java:367)
	at java.lang.Thread.run(Thread.java:745)


FAILED:  junit.framework.TestSuite.org.apache.solr.schema.TestManagedSchemaAPI

Error Message:
Could not remove the following files (in the order of attempts):    C:\Users\jenkins\workspace\Lucene-Solr-master-Windows\solr\build\solr-core\test\J0\temp\solr.schema.TestManagedSchemaAPI_AE17F471E70AEC35-001\tempDir-001\node2\testschemaapi_shard1_replica1\data\tlog\tlog.0000000000000000000: java.nio.file.FileSystemException: C:\Users\jenkins\workspace\Lucene-Solr-master-Windows\solr\build\solr-core\test\J0\temp\solr.schema.TestManagedSchemaAPI_AE17F471E70AEC35-001\tempDir-001\node2\testschemaapi_shard1_replica1\data\tlog\tlog.0000000000000000000: The process cannot access the file because it is being used by another process.     C:\Users\jenkins\workspace\Lucene-Solr-master-Windows\solr\build\solr-core\test\J0\temp\solr.schema.TestManagedSchemaAPI_AE17F471E70AEC35-001\tempDir-001\node2\testschemaapi_shard1_replica1\data\tlog: java.nio.file.DirectoryNotEmptyException: C:\Users\jenkins\workspace\Lucene-Solr-master-Windows\solr\build\solr-core\test\J0\temp\solr.schema.TestManagedSchemaAPI_AE17F471E70AEC35-001\tempDir-001\node2\testschemaapi_shard1_replica1\data\tlog    C:\Users\jenkins\workspace\Lucene-Solr-master-Windows\solr\build\solr-core\test\J0\temp\solr.schema.TestManagedSchemaAPI_AE17F471E70AEC35-001\tempDir-001\node2\testschemaapi_shard1_replica1\data: java.nio.file.DirectoryNotEmptyException: C:\Users\jenkins\workspace\Lucene-Solr-master-Windows\solr\build\solr-core\test\J0\temp\solr.schema.TestManagedSchemaAPI_AE17F471E70AEC35-001\tempDir-001\node2\testschemaapi_shard1_replica1\data    C:\Users\jenkins\workspace\Lucene-Solr-master-Windows\solr\build\solr-core\test\J0\temp\solr.schema.TestManagedSchemaAPI_AE17F471E70AEC35-001\tempDir-001\node2\testschemaapi_shard1_replica1: java.nio.file.DirectoryNotEmptyException: C:\Users\jenkins\workspace\Lucene-Solr-master-Windows\solr\build\solr-core\test\J0\temp\solr.schema.TestManagedSchemaAPI_AE17F471E70AEC35-001\tempDir-001\node2\testschemaapi_shard1_replica1    C:\Users\jenkins\workspace\Lucene-Solr-master-Windows\solr\build\solr-core\test\J0\temp\solr.schema.TestManagedSchemaAPI_AE17F471E70AEC35-001\tempDir-001\node2: java.nio.file.DirectoryNotEmptyException: C:\Users\jenkins\workspace\Lucene-Solr-master-Windows\solr\build\solr-core\test\J0\temp\solr.schema.TestManagedSchemaAPI_AE17F471E70AEC35-001\tempDir-001\node2    C:\Users\jenkins\workspace\Lucene-Solr-master-Windows\solr\build\solr-core\test\J0\temp\solr.schema.TestManagedSchemaAPI_AE17F471E70AEC35-001\tempDir-001\node1\testschemaapi_shard1_replica2\data\tlog\tlog.0000000000000000001: java.nio.file.FileSystemException: C:\Users\jenkins\workspace\Lucene-Solr-master-Windows\solr\build\solr-core\test\J0\temp\solr.schema.TestManagedSchemaAPI_AE17F471E70AEC35-001\tempDir-001\node1\testschemaapi_shard1_replica2\data\tlog\tlog.0000000000000000001: The process cannot access the file because it is being used by another process.     C:\Users\jenkins\workspace\Lucene-Solr-master-Windows\solr\build\solr-core\test\J0\temp\solr.schema.TestManagedSchemaAPI_AE17F471E70AEC35-001\tempDir-001\node1\testschemaapi_shard1_replica2\data\tlog: java.nio.file.DirectoryNotEmptyException: C:\Users\jenkins\workspace\Lucene-Solr-master-Windows\solr\build\solr-core\test\J0\temp\solr.schema.TestManagedSchemaAPI_AE17F471E70AEC35-001\tempDir-001\node1\testschemaapi_shard1_replica2\data\tlog    C:\Users\jenkins\workspace\Lucene-Solr-master-Windows\solr\build\solr-core\test\J0\temp\solr.schema.TestManagedSchemaAPI_AE17F471E70AEC35-001\tempDir-001\node1\testschemaapi_shard1_replica2\data: java.nio.file.DirectoryNotEmptyException: C:\Users\jenkins\workspace\Lucene-Solr-master-Windows\solr\build\solr-core\test\J0\temp\solr.schema.TestManagedSchemaAPI_AE17F471E70AEC35-001\tempDir-001\node1\testschemaapi_shard1_replica2\data    C:\Users\jenkins\workspace\Lucene-Solr-master-Windows\solr\build\solr-core\test\J0\temp\solr.schema.TestManagedSchemaAPI_AE17F471E70AEC35-001\tempDir-001\node1\testschemaapi_shard1_replica2: java.nio.file.DirectoryNotEmptyException: C:\Users\jenkins\workspace\Lucene-Solr-master-Windows\solr\build\solr-core\test\J0\temp\solr.schema.TestManagedSchemaAPI_AE17F471E70AEC35-001\tempDir-001\node1\testschemaapi_shard1_replica2    C:\Users\jenkins\workspace\Lucene-Solr-master-Windows\solr\build\solr-core\test\J0\temp\solr.schema.TestManagedSchemaAPI_AE17F471E70AEC35-001\tempDir-001\node1: java.nio.file.DirectoryNotEmptyException: C:\Users\jenkins\workspace\Lucene-Solr-master-Windows\solr\build\solr-core\test\J0\temp\solr.schema.TestManagedSchemaAPI_AE17F471E70AEC35-001\tempDir-001\node1    C:\Users\jenkins\workspace\Lucene-Solr-master-Windows\solr\build\solr-core\test\J0\temp\solr.schema.TestManagedSchemaAPI_AE17F471E70AEC35-001\tempDir-001: java.nio.file.DirectoryNotEmptyException: C:\Users\jenkins\workspace\Lucene-Solr-master-Windows\solr\build\solr-core\test\J0\temp\solr.schema.TestManagedSchemaAPI_AE17F471E70AEC35-001\tempDir-001    C:\Users\jenkins\workspace\Lucene-Solr-master-Windows\solr\build\solr-core\test\J0\temp\solr.schema.TestManagedSchemaAPI_AE17F471E70AEC35-001: java.nio.file.DirectoryNotEmptyException: C:\Users\jenkins\workspace\Lucene-Solr-master-Windows\solr\build\solr-core\test\J0\temp\solr.schema.TestManagedSchemaAPI_AE17F471E70AEC35-001 

Stack Trace:
java.io.IOException: Could not remove the following files (in the order of attempts):
   C:\Users\jenkins\workspace\Lucene-Solr-master-Windows\solr\build\solr-core\test\J0\temp\solr.schema.TestManagedSchemaAPI_AE17F471E70AEC35-001\tempDir-001\node2\testschemaapi_shard1_replica1\data\tlog\tlog.0000000000000000000: java.nio.file.FileSystemException: C:\Users\jenkins\workspace\Lucene-Solr-master-Windows\solr\build\solr-core\test\J0\temp\solr.schema.TestManagedSchemaAPI_AE17F471E70AEC35-001\tempDir-001\node2\testschemaapi_shard1_replica1\data\tlog\tlog.0000000000000000000: The process cannot access the file because it is being used by another process.

   C:\Users\jenkins\workspace\Lucene-Solr-master-Windows\solr\build\solr-core\test\J0\temp\solr.schema.TestManagedSchemaAPI_AE17F471E70AEC35-001\tempDir-001\node2\testschemaapi_shard1_replica1\data\tlog: java.nio.file.DirectoryNotEmptyException: C:\Users\jenkins\workspace\Lucene-Solr-master-Windows\solr\build\solr-core\test\J0\temp\solr.schema.TestManagedSchemaAPI_AE17F471E70AEC35-001\tempDir-001\node2\testschemaapi_shard1_replica1\data\tlog
   C:\Users\jenkins\workspace\Lucene-Solr-master-Windows\solr\build\solr-core\test\J0\temp\solr.schema.TestManagedSchemaAPI_AE17F471E70AEC35-001\tempDir-001\node2\testschemaapi_shard1_replica1\data: java.nio.file.DirectoryNotEmptyException: C:\Users\jenkins\workspace\Lucene-Solr-master-Windows\solr\build\solr-core\test\J0\temp\solr.schema.TestManagedSchemaAPI_AE17F471E70AEC35-001\tempDir-001\node2\testschemaapi_shard1_replica1\data
   C:\Users\jenkins\workspace\Lucene-Solr-master-Windows\solr\build\solr-core\test\J0\temp\solr.schema.TestManagedSchemaAPI_AE17F471E70AEC35-001\tempDir-001\node2\testschemaapi_shard1_replica1: java.nio.file.DirectoryNotEmptyException: C:\Users\jenkins\workspace\Lucene-Solr-master-Windows\solr\build\solr-core\test\J0\temp\solr.schema.TestManagedSchemaAPI_AE17F471E70AEC35-001\tempDir-001\node2\testschemaapi_shard1_replica1
   C:\Users\jenkins\workspace\Lucene-Solr-master-Windows\solr\build\solr-core\test\J0\temp\solr.schema.TestManagedSchemaAPI_AE17F471E70AEC35-001\tempDir-001\node2: java.nio.file.DirectoryNotEmptyException: C:\Users\jenkins\workspace\Lucene-Solr-master-Windows\solr\build\solr-core\test\J0\temp\solr.schema.TestManagedSchemaAPI_AE17F471E70AEC35-001\tempDir-001\node2
   C:\Users\jenkins\workspace\Lucene-Solr-master-Windows\solr\build\solr-core\test\J0\temp\solr.schema.TestManagedSchemaAPI_AE17F471E70AEC35-001\tempDir-001\node1\testschemaapi_shard1_replica2\data\tlog\tlog.0000000000000000001: java.nio.file.FileSystemException: C:\Users\jenkins\workspace\Lucene-Solr-master-Windows\solr\build\solr-core\test\J0\temp\solr.schema.TestManagedSchemaAPI_AE17F471E70AEC35-001\tempDir-001\node1\testschemaapi_shard1_replica2\data\tlog\tlog.0000000000000000001: The process cannot access the file because it is being used by another process.

   C:\Users\jenkins\workspace\Lucene-Solr-master-Windows\solr\build\solr-core\test\J0\temp\solr.schema.TestManagedSchemaAPI_AE17F471E70AEC35-001\tempDir-001\node1\testschemaapi_shard1_replica2\data\tlog: java.nio.file.DirectoryNotEmptyException: C:\Users\jenkins\workspace\Lucene-Solr-master-Windows\solr\build\solr-core\test\J0\temp\solr.schema.TestManagedSchemaAPI_AE17F471E70AEC35-001\tempDir-001\node1\testschemaapi_shard1_replica2\data\tlog
   C:\Users\jenkins\workspace\Lucene-Solr-master-Windows\solr\build\solr-core\test\J0\temp\solr.schema.TestManagedSchemaAPI_AE17F471E70AEC35-001\tempDir-001\node1\testschemaapi_shard1_replica2\data: java.nio.file.DirectoryNotEmptyException: C:\Users\jenkins\workspace\Lucene-Solr-master-Windows\solr\build\solr-core\test\J0\temp\solr.schema.TestManagedSchemaAPI_AE17F471E70AEC35-001\tempDir-001\node1\testschemaapi_shard1_replica2\data
   C:\Users\jenkins\workspace\Lucene-Solr-master-Windows\solr\build\solr-core\test\J0\temp\solr.schema.TestManagedSchemaAPI_AE17F471E70AEC35-001\tempDir-001\node1\testschemaapi_shard1_replica2: java.nio.file.DirectoryNotEmptyException: C:\Users\jenkins\workspace\Lucene-Solr-master-Windows\solr\build\solr-core\test\J0\temp\solr.schema.TestManagedSchemaAPI_AE17F471E70AEC35-001\tempDir-001\node1\testschemaapi_shard1_replica2
   C:\Users\jenkins\workspace\Lucene-Solr-master-Windows\solr\build\solr-core\test\J0\temp\solr.schema.TestManagedSchemaAPI_AE17F471E70AEC35-001\tempDir-001\node1: java.nio.file.DirectoryNotEmptyException: C:\Users\jenkins\workspace\Lucene-Solr-master-Windows\solr\build\solr-core\test\J0\temp\solr.schema.TestManagedSchemaAPI_AE17F471E70AEC35-001\tempDir-001\node1
   C:\Users\jenkins\workspace\Lucene-Solr-master-Windows\solr\build\solr-core\test\J0\temp\solr.schema.TestManagedSchemaAPI_AE17F471E70AEC35-001\tempDir-001: java.nio.file.DirectoryNotEmptyException: C:\Users\jenkins\workspace\Lucene-Solr-master-Windows\solr\build\solr-core\test\J0\temp\solr.schema.TestManagedSchemaAPI_AE17F471E70AEC35-001\tempDir-001
   C:\Users\jenkins\workspace\Lucene-Solr-master-Windows\solr\build\solr-core\test\J0\temp\solr.schema.TestManagedSchemaAPI_AE17F471E70AEC35-001: java.nio.file.DirectoryNotEmptyException: C:\Users\jenkins\workspace\Lucene-Solr-master-Windows\solr\build\solr-core\test\J0\temp\solr.schema.TestManagedSchemaAPI_AE17F471E70AEC35-001

	at org.apache.lucene.util.IOUtils.rm(IOUtils.java:323)
	at org.apache.lucene.util.TestRuleTemporaryFilesCleanup.afterAlways(TestRuleTemporaryFilesCleanup.java:216)
	at com.carrotsearch.randomizedtesting.rules.TestRuleAdapter$1.afterAlways(TestRuleAdapter.java:31)
	at com.carrotsearch.randomizedtesting.rules.StatementAdapter.evaluate(StatementAdapter.java:43)
	at com.carrotsearch.randomizedtesting.rules.StatementAdapter.evaluate(StatementAdapter.java:36)
	at org.apache.lucene.util.TestRuleAssertionsRequired$1.evaluate(TestRuleAssertionsRequired.java:53)
	at org.apache.lucene.util.TestRuleMarkFailure$1.evaluate(TestRuleMarkFailure.java:47)
	at org.apache.lucene.util.TestRuleIgnoreAfterMaxFailures$1.evaluate(TestRuleIgnoreAfterMaxFailures.java:64)
	at org.apache.lucene.util.TestRuleIgnoreTestSuites$1.evaluate(TestRuleIgnoreTestSuites.java:54)
	at com.carrotsearch.randomizedtesting.rules.StatementAdapter.evaluate(StatementAdapter.java:36)
	at com.carrotsearch.randomizedtesting.ThreadLeakControl$StatementRunner.run(ThreadLeakControl.java:367)
	at java.lang.Thread.run(Thread.java:745)


FAILED:  junit.framework.TestSuite.org.apache.solr.cloud.CdcrVersionReplicationTest

Error Message:
ObjectTracker found 1 object(s) that were not released!!! [InternalHttpClient]

Stack Trace:
java.lang.AssertionError: ObjectTracker found 1 object(s) that were not released!!! [InternalHttpClient]
	at __randomizedtesting.SeedInfo.seed([AE17F471E70AEC35]:0)
	at org.junit.Assert.fail(Assert.java:93)
	at org.junit.Assert.assertTrue(Assert.java:43)
	at org.junit.Assert.assertNull(Assert.java:551)
	at org.apache.solr.SolrTestCaseJ4.teardownTestCases(SolrTestCaseJ4.java:256)
	at sun.reflect.GeneratedMethodAccessor17.invoke(Unknown Source)
	at sun.reflect.DelegatingMethodAccessorImpl.invoke(DelegatingMethodAccessorImpl.java:43)
	at java.lang.reflect.Method.invoke(Method.java:498)
	at com.carrotsearch.randomizedtesting.RandomizedRunner.invoke(RandomizedRunner.java:1764)
	at com.carrotsearch.randomizedtesting.RandomizedRunner$7.evaluate(RandomizedRunner.java:834)
	at com.carrotsearch.randomizedtesting.rules.StatementAdapter.evaluate(StatementAdapter.java:36)
	at com.carrotsearch.randomizedtesting.rules.SystemPropertiesRestoreRule$1.evaluate(SystemPropertiesRestoreRule.java:57)
	at org.apache.lucene.util.AbstractBeforeAfterRule$1.evaluate(AbstractBeforeAfterRule.java:45)
	at com.carrotsearch.randomizedtesting.rules.StatementAdapter.evaluate(StatementAdapter.java:36)
	at org.apache.lucene.util.TestRuleStoreClassName$1.evaluate(TestRuleStoreClassName.java:41)
	at com.carrotsearch.randomizedtesting.rules.NoShadowingOrOverridesOnMethodsRule$1.evaluate(NoShadowingOrOverridesOnMethodsRule.java:40)
	at com.carrotsearch.randomizedtesting.rules.NoShadowingOrOverridesOnMethodsRule$1.evaluate(NoShadowingOrOverridesOnMethodsRule.java:40)
	at com.carrotsearch.randomizedtesting.rules.StatementAdapter.evaluate(StatementAdapter.java:36)
	at com.carrotsearch.randomizedtesting.rules.StatementAdapter.evaluate(StatementAdapter.java:36)
	at com.carrotsearch.randomizedtesting.rules.StatementAdapter.evaluate(StatementAdapter.java:36)
	at org.apache.lucene.util.TestRuleAssertionsRequired$1.evaluate(TestRuleAssertionsRequired.java:53)
	at org.apache.lucene.util.TestRuleMarkFailure$1.evaluate(TestRuleMarkFailure.java:47)
	at org.apache.lucene.util.TestRuleIgnoreAfterMaxFailures$1.evaluate(TestRuleIgnoreAfterMaxFailures.java:64)
	at org.apache.lucene.util.TestRuleIgnoreTestSuites$1.evaluate(TestRuleIgnoreTestSuites.java:54)
	at com.carrotsearch.randomizedtesting.rules.StatementAdapter.evaluate(StatementAdapter.java:36)
	at com.carrotsearch.randomizedtesting.ThreadLeakControl$StatementRunner.run(ThreadLeakControl.java:367)
	at java.lang.Thread.run(Thread.java:745)




Build Log:
[...truncated 10968 lines...]
   [junit4] Suite: org.apache.solr.schema.TestManagedSchemaAPI
   [junit4]   2> Creating dataDir: C:\Users\jenkins\workspace\Lucene-Solr-master-Windows\solr\build\solr-core\test\J0\temp\solr.schema.TestManagedSchemaAPI_AE17F471E70AEC35-001\init-core-data-001
   [junit4]   2> 698219 INFO  (SUITE-TestManagedSchemaAPI-seed#[AE17F471E70AEC35]-worker) [    ] o.a.s.SolrTestCaseJ4 Randomized ssl (false) and clientAuth (true) via: @org.apache.solr.util.RandomizeSSL(reason=, value=NaN, ssl=NaN, clientAuth=NaN)
   [junit4]   2> 698224 INFO  (SUITE-TestManagedSchemaAPI-seed#[AE17F471E70AEC35]-worker) [    ] o.a.s.c.ZkTestServer STARTING ZK TEST SERVER
   [junit4]   2> 698225 INFO  (Thread-2881) [    ] o.a.s.c.ZkTestServer client port:0.0.0.0/0.0.0.0:0
   [junit4]   2> 698225 INFO  (Thread-2881) [    ] o.a.s.c.ZkTestServer Starting server
   [junit4]   2> 698324 INFO  (SUITE-TestManagedSchemaAPI-seed#[AE17F471E70AEC35]-worker) [    ] o.a.s.c.ZkTestServer start zk server on port:50263
   [junit4]   2> 698324 INFO  (SUITE-TestManagedSchemaAPI-seed#[AE17F471E70AEC35]-worker) [    ] o.a.s.c.c.SolrZkClient Using default ZkCredentialsProvider
   [junit4]   2> 698327 INFO  (SUITE-TestManagedSchemaAPI-seed#[AE17F471E70AEC35]-worker) [    ] o.a.s.c.c.ConnectionManager Waiting for client to connect to ZooKeeper
   [junit4]   2> 698341 INFO  (zkCallback-1189-thread-1) [    ] o.a.s.c.c.ConnectionManager Watcher org.apache.solr.common.cloud.ConnectionManager@1214287 name:ZooKeeperConnection Watcher:127.0.0.1:50263 got event WatchedEvent state:SyncConnected type:None path:null path:null type:None
   [junit4]   2> 698341 INFO  (SUITE-TestManagedSchemaAPI-seed#[AE17F471E70AEC35]-worker) [    ] o.a.s.c.c.ConnectionManager Client is connected to ZooKeeper
   [junit4]   2> 698341 INFO  (SUITE-TestManagedSchemaAPI-seed#[AE17F471E70AEC35]-worker) [    ] o.a.s.c.c.SolrZkClient Using default ZkACLProvider
   [junit4]   2> 698341 INFO  (SUITE-TestManagedSchemaAPI-seed#[AE17F471E70AEC35]-worker) [    ] o.a.s.c.c.SolrZkClient makePath: /solr/solr.xml
   [junit4]   2> 698358 INFO  (jetty-launcher-1188-thread-2) [    ] o.e.j.s.Server jetty-9.3.8.v20160314
   [junit4]   2> 698358 INFO  (jetty-launcher-1188-thread-1) [    ] o.e.j.s.Server jetty-9.3.8.v20160314
   [junit4]   2> 698359 INFO  (jetty-launcher-1188-thread-1) [    ] o.e.j.s.h.ContextHandler Started o.e.j.s.ServletContextHandler@b94adf{/solr,null,AVAILABLE}
   [junit4]   2> 698360 INFO  (jetty-launcher-1188-thread-2) [    ] o.e.j.s.h.ContextHandler Started o.e.j.s.ServletContextHandler@f8a72a{/solr,null,AVAILABLE}
   [junit4]   2> 698361 INFO  (jetty-launcher-1188-thread-1) [    ] o.e.j.s.ServerConnector Started ServerConnector@1fb88ac{HTTP/1.1,[http/1.1]}{127.0.0.1:50268}
   [junit4]   2> 698361 INFO  (jetty-launcher-1188-thread-2) [    ] o.e.j.s.ServerConnector Started ServerConnector@1a1630c{HTTP/1.1,[http/1.1]}{127.0.0.1:50267}
   [junit4]   2> 698361 INFO  (jetty-launcher-1188-thread-1) [    ] o.e.j.s.Server Started @702794ms
   [junit4]   2> 698361 INFO  (jetty-launcher-1188-thread-2) [    ] o.e.j.s.Server Started @702794ms
   [junit4]   2> 698361 INFO  (jetty-launcher-1188-thread-1) [    ] o.a.s.c.s.e.JettySolrRunner Jetty properties: {hostContext=/solr, hostPort=50268}
   [junit4]   2> 698361 INFO  (jetty-launcher-1188-thread-2) [    ] o.a.s.c.s.e.JettySolrRunner Jetty properties: {hostContext=/solr, hostPort=50267}
   [junit4]   2> 698361 INFO  (jetty-launcher-1188-thread-1) [    ] o.a.s.s.SolrDispatchFilter SolrDispatchFilter.init(): sun.misc.Launcher$AppClassLoader@1d16e93
   [junit4]   2> 698361 INFO  (jetty-launcher-1188-thread-2) [    ] o.a.s.s.SolrDispatchFilter SolrDispatchFilter.init(): sun.misc.Launcher$AppClassLoader@1d16e93
   [junit4]   2> 698361 INFO  (jetty-launcher-1188-thread-1) [    ] o.a.s.c.SolrResourceLoader new SolrResourceLoader for directory: 'C:\Users\jenkins\workspace\Lucene-Solr-master-Windows\solr\build\solr-core\test\J0\temp\solr.schema.TestManagedSchemaAPI_AE17F471E70AEC35-001\tempDir-001\node1'
   [junit4]   2> 698361 INFO  (jetty-launcher-1188-thread-2) [    ] o.a.s.c.SolrResourceLoader new SolrResourceLoader for directory: 'C:\Users\jenkins\workspace\Lucene-Solr-master-Windows\solr\build\solr-core\test\J0\temp\solr.schema.TestManagedSchemaAPI_AE17F471E70AEC35-001\tempDir-001\node2'
   [junit4]   2> 698363 INFO  (jetty-launcher-1188-thread-1) [    ] o.a.s.c.SolrResourceLoader JNDI not configured for solr (NoInitialContextEx)
   [junit4]   2> 698363 INFO  (jetty-launcher-1188-thread-1) [    ] o.a.s.c.SolrResourceLoader solr home defaulted to 'solr/' (could not find system property or JNDI)
   [junit4]   2> 698363 INFO  (jetty-launcher-1188-thread-2) [    ] o.a.s.c.SolrResourceLoader JNDI not configured for solr (NoInitialContextEx)
   [junit4]   2> 698363 INFO  (jetty-launcher-1188-thread-2) [    ] o.a.s.c.SolrResourceLoader solr home defaulted to 'solr/' (could not find system property or JNDI)
   [junit4]   2> 698364 INFO  (jetty-launcher-1188-thread-1) [    ] o.a.s.c.c.SolrZkClient Using default ZkCredentialsProvider
   [junit4]   2> 698364 INFO  (jetty-launcher-1188-thread-2) [    ] o.a.s.c.c.SolrZkClient Using default ZkCredentialsProvider
   [junit4]   2> 698366 INFO  (jetty-launcher-1188-thread-1) [    ] o.a.s.c.c.ConnectionManager Waiting for client to connect to ZooKeeper
   [junit4]   2> 698366 INFO  (jetty-launcher-1188-thread-2) [    ] o.a.s.c.c.ConnectionManager Waiting for client to connect to ZooKeeper
   [junit4]   2> 698380 INFO  (zkCallback-1191-thread-1) [    ] o.a.s.c.c.ConnectionManager Watcher org.apache.solr.common.cloud.ConnectionManager@1e61e48 name:ZooKeeperConnection Watcher:127.0.0.1:50263/solr got event WatchedEvent state:SyncConnected type:None path:null path:null type:None
   [junit4]   2> 698380 INFO  (jetty-launcher-1188-thread-2) [    ] o.a.s.c.c.ConnectionManager Client is connected to ZooKeeper
   [junit4]   2> 698380 INFO  (jetty-launcher-1188-thread-2) [    ] o.a.s.c.c.SolrZkClient Using default ZkACLProvider
   [junit4]   2> 698381 INFO  (jetty-launcher-1188-thread-2) [    ] o.a.s.s.SolrDispatchFilter solr.xml found in ZooKeeper. Loading...
   [junit4]   2> 698383 INFO  (zkCallback-1190-thread-1) [    ] o.a.s.c.c.ConnectionManager Watcher org.apache.solr.common.cloud.ConnectionManager@15f1f6a name:ZooKeeperConnection Watcher:127.0.0.1:50263/solr got event WatchedEvent state:SyncConnected type:None path:null path:null type:None
   [junit4]   2> 698383 INFO  (jetty-launcher-1188-thread-1) [    ] o.a.s.c.c.ConnectionManager Client is connected to ZooKeeper
   [junit4]   2> 698384 INFO  (jetty-launcher-1188-thread-1) [    ] o.a.s.c.c.SolrZkClient Using default ZkACLProvider
   [junit4]   2> 698384 INFO  (jetty-launcher-1188-thread-1) [    ] o.a.s.s.SolrDispatchFilter solr.xml found in ZooKeeper. Loading...
   [junit4]   2> 698400 INFO  (jetty-launcher-1188-thread-2) [    ] o.a.s.c.CorePropertiesLocator Config-defined core root directory: C:\Users\jenkins\workspace\Lucene-Solr-master-Windows\solr\build\solr-core\test\J0\temp\solr.schema.TestManagedSchemaAPI_AE17F471E70AEC35-001\tempDir-001\node2\.
   [junit4]   2> 698400 INFO  (jetty-launcher-1188-thread-2) [    ] o.a.s.c.CoreContainer New CoreContainer 29834419
   [junit4]   2> 698400 INFO  (jetty-launcher-1188-thread-2) [    ] o.a.s.c.CoreContainer Loading cores into CoreContainer [instanceDir=C:\Users\jenkins\workspace\Lucene-Solr-master-Windows\solr\build\solr-core\test\J0\temp\solr.schema.TestManagedSchemaAPI_AE17F471E70AEC35-001\tempDir-001\node2]
   [junit4]   2> 698400 WARN  (jetty-launcher-1188-thread-2) [    ] o.a.s.c.CoreContainer Couldn't add files from C:\Users\jenkins\workspace\Lucene-Solr-master-Windows\solr\build\solr-core\test\J0\temp\solr.schema.TestManagedSchemaAPI_AE17F471E70AEC35-001\tempDir-001\node2\lib to classpath: C:\Users\jenkins\workspace\Lucene-Solr-master-Windows\solr\build\solr-core\test\J0\temp\solr.schema.TestManagedSchemaAPI_AE17F471E70AEC35-001\tempDir-001\node2\lib
   [junit4]   2> 698400 INFO  (jetty-launcher-1188-thread-2) [    ] o.a.s.h.c.HttpShardHandlerFactory created with socketTimeout : 90000,urlScheme : ,connTimeout : 15000,maxConnectionsPerHost : 20,maxConnections : 10000,corePoolSize : 0,maximumPoolSize : 2147483647,maxThreadIdleTime : 5,sizeOfQueue : -1,fairnessPolicy : false,
   [junit4]   2> 698408 INFO  (jetty-launcher-1188-thread-2) [    ] o.a.s.u.UpdateShardHandler Creating UpdateShardHandler HTTP client with params: 
   [junit4]   2> 698409 INFO  (jetty-launcher-1188-thread-2) [    ] o.a.s.l.LogWatcher SLF4J impl is org.slf4j.impl.Log4jLoggerFactory
   [junit4]   2> 698409 INFO  (jetty-launcher-1188-thread-2) [    ] o.a.s.l.LogWatcher Registering Log Listener [Log4j (org.slf4j.impl.Log4jLoggerFactory)]
   [junit4]   2> 698409 INFO  (jetty-launcher-1188-thread-2) [    ] o.a.s.c.ZkContainer Zookeeper client=127.0.0.1:50263/solr
   [junit4]   2> 698409 INFO  (jetty-launcher-1188-thread-2) [    ] o.a.s.c.ZkController zkHost includes chroot
   [junit4]   2> 698409 INFO  (jetty-launcher-1188-thread-2) [    ] o.a.s.c.c.SolrZkClient Using default ZkCredentialsProvider
   [junit4]   2> 698410 INFO  (jetty-launcher-1188-thread-2) [    ] o.a.s.c.c.ConnectionManager Waiting for client to connect to ZooKeeper
   [junit4]   2> 698413 WARN  (NIOServerCxn.Factory:0.0.0.0/0.0.0.0:0) [    ] o.a.z.s.NIOServerCnxn caught end of stream exception
   [junit4]   2> EndOfStreamException: Unable to read additional data from client sessionid 0x1559ae903060002, likely client has closed socket
   [junit4]   2> 	at org.apache.zookeeper.server.NIOServerCnxn.doIO(NIOServerCnxn.java:228)
   [junit4]   2> 	at org.apache.zookeeper.server.NIOServerCnxnFactory.run(NIOServerCnxnFactory.java:208)
   [junit4]   2> 	at java.lang.Thread.run(Thread.java:745)
   [junit4]   2> 698413 INFO  (jetty-launcher-1188-thread-1) [    ] o.a.s.c.CorePropertiesLocator Config-defined core root directory: C:\Users\jenkins\workspace\Lucene-Solr-master-Windows\solr\build\solr-core\test\J0\temp\solr.schema.TestManagedSchemaAPI_AE17F471E70AEC35-001\tempDir-001\node1\.
   [junit4]   2> 698413 INFO  (jetty-launcher-1188-thread-1) [    ] o.a.s.c.CoreContainer New CoreContainer 417328
   [junit4]   2> 698413 INFO  (jetty-launcher-1188-thread-1) [    ] o.a.s.c.CoreContainer Loading cores into CoreContainer [instanceDir=C:\Users\jenkins\workspace\Lucene-Solr-master-Windows\solr\build\solr-core\test\J0\temp\solr.schema.TestManagedSchemaAPI_AE17F471E70AEC35-001\tempDir-001\node1]
   [junit4]   2> 698414 WARN  (jetty-launcher-1188-thread-1) [    ] o.a.s.c.CoreContainer Couldn't add files from C:\Users\jenkins\workspace\Lucene-Solr-master-Windows\solr\build\solr-core\test\J0\temp\solr.schema.TestManagedSchemaAPI_AE17F471E70AEC35-001\tempDir-001\node1\lib to classpath: C:\Users\jenkins\workspace\Lucene-Solr-master-Windows\solr\build\solr-core\test\J0\temp\solr.schema.TestManagedSchemaAPI_AE17F471E70AEC35-001\tempDir-001\node1\lib
   [junit4]   2> 698414 INFO  (jetty-launcher-1188-thread-1) [    ] o.a.s.h.c.HttpShardHandlerFactory created with socketTimeout : 90000,urlScheme : ,connTimeout : 15000,maxConnectionsPerHost : 20,maxConnections : 10000,corePoolSize : 0,maximumPoolSize : 2147483647,maxThreadIdleTime : 5,sizeOfQueue : -1,fairnessPolicy : false,
   [junit4]   2> 698416 INFO  (jetty-launcher-1188-thread-1) [    ] o.a.s.u.UpdateShardHandler Creating UpdateShardHandler HTTP client with params: 
   [junit4]   2> 698417 INFO  (jetty-launcher-1188-thread-1) [    ] o.a.s.l.LogWatcher SLF4J impl is org.slf4j.impl.Log4jLoggerFactory
   [junit4]   2> 698417 INFO  (jetty-launcher-1188-thread-1) [    ] o.a.s.l.LogWatcher Registering Log Listener [Log4j (org.slf4j.impl.Log4jLoggerFactory)]
   [junit4]   2> 698417 INFO  (zkCallback-1194-thread-1) [    ] o.a.s.c.c.ConnectionManager Watcher org.apache.solr.common.cloud.ConnectionManager@14642ab name:ZooKeeperConnection Watcher:127.0.0.1:50263 got event WatchedEvent state:SyncConnected type:None path:null path:null type:None
   [junit4]   2> 698417 INFO  (jetty-launcher-1188-thread-1) [    ] o.a.s.c.ZkContainer Zookeeper client=127.0.0.1:50263/solr
   [junit4]   2> 698417 INFO  (jetty-launcher-1188-thread-1) [    ] o.a.s.c.ZkController zkHost includes chroot
   [junit4]   2> 698417 INFO  (jetty-launcher-1188-thread-1) [    ] o.a.s.c.c.SolrZkClient Using default ZkCredentialsProvider
   [junit4]   2> 698418 INFO  (jetty-launcher-1188-thread-2) [    ] o.a.s.c.c.ConnectionManager Client is connected to ZooKeeper
   [junit4]   2> 698418 INFO  (jetty-launcher-1188-thread-2) [    ] o.a.s.c.c.SolrZkClient Using default ZkACLProvider
   [junit4]   2> 698419 INFO  (jetty-launcher-1188-thread-1) [    ] o.a.s.c.c.ConnectionManager Waiting for client to connect to ZooKeeper
   [junit4]   2> 698420 WARN  (NIOServerCxn.Factory:0.0.0.0/0.0.0.0:0) [    ] o.a.z.s.NIOServerCnxn caught end of stream exception
   [junit4]   2> EndOfStreamException: Unable to read additional data from client sessionid 0x1559ae903060003, likely client has closed socket
   [junit4]   2> 	at org.apache.zookeeper.server.NIOServerCnxn.doIO(NIOServerCnxn.java:228)
   [junit4]   2> 	at org.apache.zookeeper.server.NIOServerCnxnFactory.run(NIOServerCnxnFactory.java:208)
   [junit4]   2> 	at java.lang.Thread.run(Thread.java:745)
   [junit4]   2> 698421 INFO  (jetty-launcher-1188-thread-2) [n:127.0.0.1:50267_solr    ] o.a.s.c.ZkController Added new OnReconnect listener org.apache.solr.cloud.ZkController$$Lambda$25/2539184@19e2a15
   [junit4]   2> 698422 INFO  (jetty-launcher-1188-thread-2) [n:127.0.0.1:50267_solr    ] o.a.s.c.c.ConnectionManager Waiting for client to connect to ZooKeeper
   [junit4]   2> 698424 INFO  (zkCallback-1197-thread-1) [    ] o.a.s.c.c.ConnectionManager Watcher org.apache.solr.common.cloud.ConnectionManager@a11e07 name:ZooKeeperConnection Watcher:127.0.0.1:50263 got event WatchedEvent state:SyncConnected type:None path:null path:null type:None
   [junit4]   2> 698424 INFO  (jetty-launcher-1188-thread-1) [    ] o.a.s.c.c.ConnectionManager Client is connected to ZooKeeper
   [junit4]   2> 698424 INFO  (jetty-launcher-1188-thread-1) [    ] o.a.s.c.c.SolrZkClient Using default ZkACLProvider
   [junit4]   2> 698426 INFO  (zkCallback-1198-thread-1-processing-n:127.0.0.1:50267_solr) [n:127.0.0.1:50267_solr    ] o.a.s.c.c.ConnectionManager Watcher org.apache.solr.common.cloud.ConnectionManager@4cf869 name:ZooKeeperConnection Watcher:127.0.0.1:50263/solr got event WatchedEvent state:SyncConnected type:None path:null path:null type:None
   [junit4]   2> 698426 INFO  (jetty-launcher-1188-thread-2) [n:127.0.0.1:50267_solr    ] o.a.s.c.c.ConnectionManager Client is connected to ZooKeeper
   [junit4]   2> 698428 INFO  (jetty-launcher-1188-thread-1) [n:127.0.0.1:50268_solr    ] o.a.s.c.ZkController Added new OnReconnect listener org.apache.solr.cloud.ZkController$$Lambda$25/2539184@bfe243
   [junit4]   2> 698429 INFO  (jetty-launcher-1188-thread-1) [n:127.0.0.1:50268_solr    ] o.a.s.c.c.ConnectionManager Waiting for client to connect to ZooKeeper
   [junit4]   2> 698430 INFO  (jetty-launcher-1188-thread-2) [n:127.0.0.1:50267_solr    ] o.a.s.c.c.SolrZkClient makePath: /overseer/queue
   [junit4]   2> 698433 INFO  (zkCallback-1199-thread-1-processing-n:127.0.0.1:50268_solr) [n:127.0.0.1:50268_solr    ] o.a.s.c.c.ConnectionManager Watcher org.apache.solr.common.cloud.ConnectionManager@6412cf name:ZooKeeperConnection Watcher:127.0.0.1:50263/solr got event WatchedEvent state:SyncConnected type:None path:null path:null type:None
   [junit4]   2> 698433 INFO  (jetty-launcher-1188-thread-1) [n:127.0.0.1:50268_solr    ] o.a.s.c.c.ConnectionManager Client is connected to ZooKeeper
   [junit4]   2> 698433 INFO  (jetty-launcher-1188-thread-2) [n:127.0.0.1:50267_solr    ] o.a.s.c.c.SolrZkClient makePath: /overseer/collection-queue-work
   [junit4]   2> 698440 INFO  (jetty-launcher-1188-thread-2) [n:127.0.0.1:50267_solr    ] o.a.s.c.c.SolrZkClient makePath: /overseer/collection-map-running
   [junit4]   2> 698440 INFO  (jetty-launcher-1188-thread-1) [n:127.0.0.1:50268_solr    ] o.a.s.c.c.SolrZkClient makePath: /overseer/collection-map-running
   [junit4]   2> 698444 INFO  (jetty-launcher-1188-thread-2) [n:127.0.0.1:50267_solr    ] o.a.s.c.c.SolrZkClient makePath: /overseer/collection-map-completed
   [junit4]   2> 698444 INFO  (jetty-launcher-1188-thread-1) [n:127.0.0.1:50268_solr    ] o.a.s.c.c.SolrZkClient makePath: /overseer/collection-map-completed
   [junit4]   2> 698448 INFO  (jetty-launcher-1188-thread-2) [n:127.0.0.1:50267_solr    ] o.a.s.c.c.SolrZkClient makePath: /overseer/collection-map-failure
   [junit4]   2> 698449 INFO  (jetty-launcher-1188-thread-1) [n:127.0.0.1:50268_solr    ] o.a.s.c.c.SolrZkClient makePath: /overseer/collection-map-failure
   [junit4]   2> 698450 INFO  (jetty-launcher-1188-thread-1) [n:127.0.0.1:50268_solr    ] o.a.s.c.c.SolrZkClient makePath: /live_nodes
   [junit4]   2> 698451 INFO  (jetty-launcher-1188-thread-2) [n:127.0.0.1:50267_solr    ] o.a.s.c.c.SolrZkClient makePath: /live_nodes
   [junit4]   2> 698453 INFO  (jetty-launcher-1188-thread-1) [n:127.0.0.1:50268_solr    ] o.a.s.c.c.SolrZkClient makePath: /collections
   [junit4]   2> 698455 INFO  (jetty-launcher-1188-thread-2) [n:127.0.0.1:50267_solr    ] o.a.s.c.c.SolrZkClient makePath: /collections
   [junit4]   2> 698457 INFO  (jetty-launcher-1188-thread-1) [n:127.0.0.1:50268_solr    ] o.a.s.c.c.SolrZkClient makePath: /aliases.json
   [junit4]   2> 698457 INFO  (jetty-launcher-1188-thread-2) [n:127.0.0.1:50267_solr    ] o.a.s.c.c.SolrZkClient makePath: /aliases.json
   [junit4]   2> 698460 INFO  (jetty-launcher-1188-thread-2) [n:127.0.0.1:50267_solr    ] o.a.s.c.c.SolrZkClient makePath: /clusterstate.json
   [junit4]   2> 698460 INFO  (jetty-launcher-1188-thread-1) [n:127.0.0.1:50268_solr    ] o.a.s.c.c.SolrZkClient makePath: /clusterstate.json
   [junit4]   2> 698462 INFO  (jetty-launcher-1188-thread-2) [n:127.0.0.1:50267_solr    ] o.a.s.c.c.SolrZkClient makePath: /security.json
   [junit4]   2> 698462 INFO  (jetty-launcher-1188-thread-1) [n:127.0.0.1:50268_solr    ] o.a.s.c.c.SolrZkClient makePath: /security.json
   [junit4]   2> 698464 INFO  (jetty-launcher-1188-thread-2) [n:127.0.0.1:50267_solr    ] o.a.s.c.c.ZkStateReader Updating cluster state from ZooKeeper... 
   [junit4]   2> 698464 INFO  (jetty-launcher-1188-thread-1) [n:127.0.0.1:50268_solr    ] o.a.s.c.c.ZkStateReader Updating cluster state from ZooKeeper... 
   [junit4]   2> 698465 INFO  (jetty-launcher-1188-thread-1) [n:127.0.0.1:50268_solr    ] o.a.s.c.c.ZkStateReader Loaded empty cluster properties
   [junit4]   2> 698465 INFO  (jetty-launcher-1188-thread-2) [n:127.0.0.1:50267_solr    ] o.a.s.c.c.ZkStateReader Loaded empty cluster properties
   [junit4]   2> 698467 INFO  (jetty-launcher-1188-thread-1) [n:127.0.0.1:50268_solr    ] o.a.s.c.c.ZkStateReader Updated live nodes from ZooKeeper... (0) -> (0)
   [junit4]   2> 698468 INFO  (jetty-launcher-1188-thread-2) [n:127.0.0.1:50267_solr    ] o.a.s.c.c.ZkStateReader Updated live nodes from ZooKeeper... (0) -> (0)
   [junit4]   2> 698472 INFO  (jetty-launcher-1188-thread-1) [n:127.0.0.1:50268_solr    ] o.a.s.c.c.SolrZkClient makePath: /overseer_elect
   [junit4]   2> 698476 INFO  (jetty-launcher-1188-thread-1) [n:127.0.0.1:50268_solr    ] o.a.s.c.c.SolrZkClient makePath: /overseer_elect/election
   [junit4]   2> 698477 INFO  (jetty-launcher-1188-thread-2) [n:127.0.0.1:50267_solr    ] o.a.s.c.c.SolrZkClient makePath: /overseer_elect/election
   [junit4]   2> 698479 INFO  (jetty-launcher-1188-thread-1) [n:127.0.0.1:50268_solr    ] o.a.s.c.Overseer Overseer (id=null) closing
   [junit4]   2> 698480 INFO  (jetty-launcher-1188-thread-1) [n:127.0.0.1:50268_solr    ] o.a.s.c.LeaderElector Joined leadership election with path: /overseer_elect/election/96153292627116038-127.0.0.1:50268_solr-n_0000000000
   [junit4]   2> 698481 INFO  (jetty-launcher-1188-thread-2) [n:127.0.0.1:50267_solr    ] o.a.s.c.Overseer Overseer (id=null) closing
   [junit4]   2> 698481 INFO  (jetty-launcher-1188-thread-1) [n:127.0.0.1:50268_solr    ] o.a.s.c.OverseerElectionContext I am going to be the leader 127.0.0.1:50268_solr
   [junit4]   2> 698481 INFO  (jetty-launcher-1188-thread-1) [n:127.0.0.1:50268_solr    ] o.a.s.c.c.SolrZkClient makePath: /overseer_elect/leader
   [junit4]   2> 698482 INFO  (jetty-launcher-1188-thread-2) [n:127.0.0.1:50267_solr    ] o.a.s.c.LeaderElector Joined leadership election with path: /overseer_elect/election/96153292627116037-127.0.0.1:50267_solr-n_0000000001
   [junit4]   2> 698483 INFO  (jetty-launcher-1188-thread-2) [n:127.0.0.1:50267_solr    ] o.a.s.c.LeaderElector Watching path /overseer_elect/election/96153292627116038-127.0.0.1:50268_solr-n_0000000000 to know if I could be the leader
   [junit4]   2> 698483 INFO  (jetty-launcher-1188-thread-1) [n:127.0.0.1:50268_solr    ] o.a.s.c.Overseer Overseer (id=96153292627116038-127.0.0.1:50268_solr-n_0000000000) starting
   [junit4]   2> 698484 INFO  (jetty-launcher-1188-thread-2) [n:127.0.0.1:50267_solr    ] o.a.s.c.ZkController Register node as live in ZooKeeper:/live_nodes/127.0.0.1:50267_solr
   [junit4]   2> 698485 INFO  (jetty-launcher-1188-thread-2) [n:127.0.0.1:50267_solr    ] o.a.s.c.c.SolrZkClient makePath: /live_nodes/127.0.0.1:50267_solr
   [junit4]   2> 698487 INFO  (jetty-launcher-1188-thread-1) [n:127.0.0.1:50268_solr    ] o.a.s.c.c.SolrZkClient makePath: /overseer/queue-work
   [junit4]   2> 698490 INFO  (zkCallback-1198-thread-1-processing-n:127.0.0.1:50267_solr) [n:127.0.0.1:50267_solr    ] o.a.s.c.c.ZkStateReader A live node change: [WatchedEvent state:SyncConnected type:NodeChildrenChanged path:/live_nodes], has occurred - updating... (live nodes size: [0])
   [junit4]   2> 698491 INFO  (zkCallback-1199-thread-1-processing-n:127.0.0.1:50268_solr) [n:127.0.0.1:50268_solr    ] o.a.s.c.c.ZkStateReader A live node change: [WatchedEvent state:SyncConnected type:NodeChildrenChanged path:/live_nodes], has occurred - updating... (live nodes size: [0])
   [junit4]   2> 698496 INFO  (zkCallback-1198-thread-1-processing-n:127.0.0.1:50267_solr) [n:127.0.0.1:50267_solr    ] o.a.s.c.c.ZkStateReader Updated live nodes from ZooKeeper... (0) -> (1)
   [junit4]   2> 698498 INFO  (zkCallback-1199-thread-1-processing-n:127.0.0.1:50268_solr) [n:127.0.0.1:50268_solr    ] o.a.s.c.c.ZkStateReader Updated live nodes from ZooKeeper... (0) -> (1)
   [junit4]   2> 698527 INFO  (jetty-launcher-1188-thread-1) [n:127.0.0.1:50268_solr    ] o.a.s.c.OverseerAutoReplicaFailoverThread Starting OverseerAutoReplicaFailoverThread autoReplicaFailoverWorkLoopDelay=10000 autoReplicaFailoverWaitAfterExpiration=30000 autoReplicaFailoverBadNodeExpiration=60000
   [junit4]   2> 698529 INFO  (jetty-launcher-1188-thread-2) [n:127.0.0.1:50267_solr    ] o.a.s.c.CoreContainer Security conf doesn't exist. Skipping setup for authorization module.
   [junit4]   2> 698529 INFO  (jetty-launcher-1188-thread-2) [n:127.0.0.1:50267_solr    ] o.a.s.c.CoreContainer No authentication plugin used.
   [junit4]   2> 698530 INFO  (jetty-launcher-1188-thread-2) [n:127.0.0.1:50267_solr    ] o.a.s.c.CorePropertiesLocator Looking for core definitions underneath C:\Users\jenkins\workspace\Lucene-Solr-master-Windows\solr\build\solr-core\test\J0\temp\solr.schema.TestManagedSchemaAPI_AE17F471E70AEC35-001\tempDir-001\node2\.
   [junit4]   2> 698530 INFO  (jetty-launcher-1188-thread-2) [n:127.0.0.1:50267_solr    ] o.a.s.c.CorePropertiesLocator Found 0 core definitions
   [junit4]   2> 698530 INFO  (jetty-launcher-1188-thread-1) [n:127.0.0.1:50268_solr    ] o.a.s.c.ZkController Publish node=127.0.0.1:50268_solr as DOWN
   [junit4]   2> 698531 INFO  (jetty-launcher-1188-thread-2) [n:127.0.0.1:50267_solr    ] o.a.s.s.SolrDispatchFilter user.dir=C:\Users\jenkins\workspace\Lucene-Solr-master-Windows\solr\build\solr-core\test\J0
   [junit4]   2> 698531 INFO  (jetty-launcher-1188-thread-2) [n:127.0.0.1:50267_solr    ] o.a.s.s.SolrDispatchFilter SolrDispatchFilter.init() done
   [junit4]   2> 698536 INFO  (OverseerCollectionConfigSetProcessor-96153292627116038-127.0.0.1:50268_solr-n_0000000000) [n:127.0.0.1:50268_solr    ] o.a.s.c.OverseerTaskProcessor Process current queue of overseer operations
   [junit4]   2> 698536 INFO  (OverseerStateUpdate-96153292627116038-127.0.0.1:50268_solr-n_0000000000) [n:127.0.0.1:50268_solr    ] o.a.s.c.Overseer Starting to work on the main queue
   [junit4]   2> 698539 INFO  (OverseerStateUpdate-96153292627116038-127.0.0.1:50268_solr-n_0000000000) [n:127.0.0.1:50268_solr    ] o.a.s.c.c.ZkStateReader Updated live nodes from ZooKeeper... (1) -> (1)
   [junit4]   2> 698541 INFO  (OverseerStateUpdate-96153292627116038-127.0.0.1:50268_solr-n_0000000000) [n:127.0.0.1:50268_solr    ] o.a.s.c.Overseer processMessage: queueSize: 1, message = {
   [junit4]   2>   "operation":"downnode",
   [junit4]   2>   "node_name":"127.0.0.1:50268_solr"} current state version: 0
   [junit4]   2> 698541 INFO  (OverseerStateUpdate-96153292627116038-127.0.0.1:50268_solr-n_0000000000) [n:127.0.0.1:50268_solr    ] o.a.s.c.o.NodeMutator DownNode state invoked for node: 127.0.0.1:50268_solr
   [junit4]   2> 699533 INFO  (jetty-launcher-1188-thread-1) [n:127.0.0.1:50268_solr    ] o.a.s.c.ZkController Register node as live in ZooKeeper:/live_nodes/127.0.0.1:50268_solr
   [junit4]   2> 699533 INFO  (jetty-launcher-1188-thread-1) [n:127.0.0.1:50268_solr    ] o.a.s.c.c.SolrZkClient makePath: /live_nodes/127.0.0.1:50268_solr
   [junit4]   2> 699535 INFO  (zkCallback-1198-thread-1-processing-n:127.0.0.1:50267_solr) [n:127.0.0.1:50267_solr    ] o.a.s.c.c.ZkStateReader A live node change: [WatchedEvent state:SyncConnected type:NodeChildrenChanged path:/live_nodes], has occurred - updating... (live nodes size: [1])
   [junit4]   2> 699535 INFO  (zkCallback-1199-thread-1-processing-n:127.0.0.1:50268_solr) [n:127.0.0.1:50268_solr    ] o.a.s.c.c.ZkStateReader A live node change: [WatchedEvent state:SyncConnected type:NodeChildrenChanged path:/live_nodes], has occurred - updating... (live nodes size: [1])
   [junit4]   2> 699536 INFO  (zkCallback-1198-thread-1-processing-n:127.0.0.1:50267_solr) [n:127.0.0.1:50267_solr    ] o.a.s.c.c.ZkStateReader Updated live nodes from ZooKeeper... (1) -> (2)
   [junit4]   2> 699536 INFO  (zkCallback-1199-thread-1-processing-n:127.0.0.1:50268_solr) [n:127.0.0.1:50268_solr    ] o.a.s.c.c.ZkStateReader Updated live nodes from ZooKeeper... (1) -> (2)
   [junit4]   2> 699550 INFO  (jetty-launcher-1188-thread-1) [n:127.0.0.1:50268_solr    ] o.a.s.c.CoreContainer Security conf doesn't exist. Skipping setup for authorization module.
   [junit4]   2> 699550 INFO  (jetty-launcher-1188-thread-1) [n:127.0.0.1:50268_solr    ] o.a.s.c.CoreContainer No authentication plugin used.
   [junit4]   2> 699551 INFO  (jetty-launcher-1188-thread-1) [n:127.0.0.1:50268_solr    ] o.a.s.c.CorePropertiesLocator Looking for core definitions underneath C:\Users\jenkins\workspace\Lucene-Solr-master-Windows\solr\build\solr-core\test\J0\temp\solr.schema.TestManagedSchemaAPI_AE17F471E70AEC35-001\tempDir-001\node1\.
   [junit4]   2> 699551 INFO  (jetty-launcher-1188-thread-1) [n:127.0.0.1:50268_solr    ] o.a.s.c.CorePropertiesLocator Found 0 core definitions
   [junit4]   2> 699552 INFO  (jetty-launcher-1188-thread-1) [n:127.0.0.1:50268_solr    ] o.a.s.s.SolrDispatchFilter user.dir=C:\Users\jenkins\workspace\Lucene-Solr-master-Windows\solr\build\solr-core\test\J0
   [junit4]   2> 699552 INFO  (jetty-launcher-1188-thread-1) [n:127.0.0.1:50268_solr    ] o.a.s.s.SolrDispatchFilter SolrDispatchFilter.init() done
   [junit4]   2> 699552 INFO  (SUITE-TestManagedSchemaAPI-seed#[AE17F471E70AEC35]-worker) [    ] o.a.s.c.c.SolrZkClient Using default ZkCredentialsProvider
   [junit4]   2> 699553 INFO  (SUITE-TestManagedSchemaAPI-seed#[AE17F471E70AEC35]-worker) [    ] o.a.s.c.c.ConnectionManager Waiting for client to connect to ZooKeeper
   [junit4]   2> 699554 INFO  (zkCallback-1202-thread-1) [    ] o.a.s.c.c.ConnectionManager Watcher org.apache.solr.common.cloud.ConnectionManager@227c10 name:ZooKeeperConnection Watcher:127.0.0.1:50263 got event WatchedEvent state:SyncConnected type:None path:null path:null type:None
   [junit4]   2> 699554 INFO  (SUITE-TestManagedSchemaAPI-seed#[AE17F471E70AEC35]-worker) [    ] o.a.s.c.c.ConnectionManager Client is connected to ZooKeeper
   [junit4]   2> 699555 INFO  (SUITE-TestManagedSchemaAPI-seed#[AE17F471E70AEC35]-worker) [    ] o.a.s.c.c.SolrZkClient Using default ZkACLProvider
   [junit4]   2> 699555 WARN  (NIOServerCxn.Factory:0.0.0.0/0.0.0.0:0) [    ] o.a.z.s.NIOServerCnxn caught end of stream exception
   [junit4]   2> EndOfStreamException: Unable to read additional data from client sessionid 0x1559ae903060007, likely client has closed socket
   [junit4]   2> 	at org.apache.zookeeper.server.NIOServerCnxn.doIO(NIOServerCnxn.java:228)
   [junit4]   2> 	at org.apache.zookeeper.server.NIOServerCnxnFactory.run(NIOServerCnxnFactory.java:208)
   [junit4]   2> 	at java.lang.Thread.run(Thread.java:745)
   [junit4]   2> 699555 INFO  (SUITE-TestManagedSchemaAPI-seed#[AE17F471E70AEC35]-worker) [    ] o.a.s.c.s.i.CloudSolrClient Final constructed zkHost string: 127.0.0.1:50263/solr
   [junit4]   2> 699557 INFO  (SUITE-TestManagedSchemaAPI-seed#[AE17F471E70AEC35]-worker) [    ] o.a.s.c.c.SolrZkClient Using default ZkCredentialsProvider
   [junit4]   2> 699558 INFO  (SUITE-TestManagedSchemaAPI-seed#[AE17F471E70AEC35]-worker) [    ] o.a.s.c.c.ConnectionManager Waiting for client to connect to ZooKeeper
   [junit4]   2> 699559 INFO  (zkCallback-1205-thread-1) [    ] o.a.s.c.c.ConnectionManager Watcher org.apache.solr.common.cloud.ConnectionManager@1aef3a1 name:ZooKeeperConnection Watcher:127.0.0.1:50263/solr got event WatchedEvent state:SyncConnected type:None path:null path:null type:None
   [junit4]   2> 699560 INFO  (SUITE-TestManagedSchemaAPI-seed#[AE17F471E70AEC35]-worker) [    ] o.a.s.c.c.ConnectionManager Client is connected to ZooKeeper
   [junit4]   2> 699560 INFO  (SUITE-TestManagedSchemaAPI-seed#[AE17F471E70AEC35]-worker) [    ] o.a.s.c.c.SolrZkClient Using default ZkACLProvider
   [junit4]   2> 699560 INFO  (SUITE-TestManagedSchemaAPI-seed#[AE17F471E70AEC35]-worker) [    ] o.a.s.c.c.ZkStateReader Updating cluster state from ZooKeeper... 
   [junit4]   2> 699561 INFO  (SUITE-TestManagedSchemaAPI-seed#[AE17F471E70AEC35]-worker) [    ] o.a.s.c.c.ZkStateReader Loaded empty cluster properties
   [junit4]   2> 699561 INFO  (SUITE-TestManagedSchemaAPI-seed#[AE17F471E70AEC35]-worker) [    ] o.a.s.c.c.ZkStateReader Updated live nodes from ZooKeeper... (0) -> (2)
   [junit4]   2> 699564 INFO  (SUITE-TestManagedSchemaAPI-seed#[AE17F471E70AEC35]-worker) [    ] o.a.s.c.c.SolrZkClient makePath: /configs/conf1/managed-schema
   [junit4]   2> 699568 INFO  (SUITE-TestManagedSchemaAPI-seed#[AE17F471E70AEC35]-worker) [    ] o.a.s.c.c.SolrZkClient makePath: /configs/conf1/solrconfig.xml
   [junit4]   2> 699584 INFO  (TEST-TestManagedSchemaAPI.test-seed#[AE17F471E70AEC35]) [    ] o.a.s.SolrTestCaseJ4 ###Starting test
   [junit4]   2> 699587 INFO  (qtp32526932-8082) [n:127.0.0.1:50267_solr    ] o.a.s.h.a.CollectionsHandler Invoked Collection Action :create with params replicationFactor=2&collection.configName=conf1&name=testschemaapi&action=CREATE&numShards=1&wt=javabin&version=2 and sendToOCPQueue=true
   [junit4]   2> 699590 INFO  (OverseerCollectionConfigSetProcessor-96153292627116038-127.0.0.1:50268_solr-n_0000000000) [n:127.0.0.1:50268_solr    ] o.a.s.c.OverseerTaskProcessor Overseer Collection Message Handler: Get the message id:/overseer/collection-queue-work/qn-0000000000 message:{
   [junit4]   2>   "name":"testschemaapi",
   [junit4]   2>   "fromApi":"true",
   [junit4]   2>   "replicationFactor":"2",
   [junit4]   2>   "collection.configName":"conf1",
   [junit4]   2>   "numShards":"1",
   [junit4]   2>   "stateFormat":"2",
   [junit4]   2>   "operation":"create"}
   [junit4]   2> 699590 INFO  (OverseerThreadFactory-3468-thread-1-processing-n:127.0.0.1:50268_solr) [n:127.0.0.1:50268_solr    ] o.a.s.c.OverseerCollectionMessageHandler OverseerCollectionMessageHandler.processMessage : create , {
   [junit4]   2>   "name":"testschemaapi",
   [junit4]   2>   "fromApi":"true",
   [junit4]   2>   "replicationFactor":"2",
   [junit4]   2>   "collection.configName":"conf1",
   [junit4]   2>   "numShards":"1",
   [junit4]   2>   "stateFormat":"2",
   [junit4]   2>   "operation":"create"}
   [junit4]   2> 699591 INFO  (OverseerThreadFactory-3468-thread-1-processing-n:127.0.0.1:50268_solr) [n:127.0.0.1:50268_solr    ] o.a.s.c.OverseerCollectionMessageHandler Create collection testschemaapi
   [junit4]   2> 699592 INFO  (OverseerThreadFactory-3468-thread-1-processing-n:127.0.0.1:50268_solr) [n:127.0.0.1:50268_solr    ] o.a.s.c.OverseerCollectionMessageHandler creating collections conf node /collections/testschemaapi 
   [junit4]   2> 699592 INFO  (OverseerThreadFactory-3468-thread-1-processing-n:127.0.0.1:50268_solr) [n:127.0.0.1:50268_solr    ] o.a.s.c.c.SolrZkClient makePath: /collections/testschemaapi
   [junit4]   2> 699595 INFO  (zkCallback-1205-thread-1) [    ] o.a.s.c.c.ZkStateReader A collections change: [WatchedEvent state:SyncConnected type:NodeChildrenChanged path:/collections], has occurred - updating...
   [junit4]   2> 699595 INFO  (zkCallback-1198-thread-1-processing-n:127.0.0.1:50267_solr) [n:127.0.0.1:50267_solr    ] o.a.s.c.c.ZkStateReader A collections change: [WatchedEvent state:SyncConnected type:NodeChildrenChanged path:/collections], has occurred - updating...
   [junit4]   2> 699595 INFO  (zkCallback-1199-thread-1-processing-n:127.0.0.1:50268_solr) [n:127.0.0.1:50268_solr    ] o.a.s.c.c.ZkStateReader A collections change: [WatchedEvent state:SyncConnected type:NodeChildrenChanged path:/collections], has occurred - updating...
   [junit4]   2> 699598 INFO  (OverseerStateUpdate-96153292627116038-127.0.0.1:50268_solr-n_0000000000) [n:127.0.0.1:50268_solr    ] o.a.s.c.Overseer processMessage: queueSize: 1, message = {
   [junit4]   2>   "name":"testschemaapi",
   [junit4]   2>   "fromApi":"true",
   [junit4]   2>   "replicationFactor":"2",
   [junit4]   2>   "collection.configName":"conf1",
   [junit4]   2>   "numShards":"1",
   [junit4]   2>   "stateFormat":"2",
   [junit4]   2>   "operation":"create"} current state version: 0
   [junit4]   2> 699598 INFO  (OverseerStateUpdate-96153292627116038-127.0.0.1:50268_solr-n_0000000000) [n:127.0.0.1:50268_solr    ] o.a.s.c.o.ClusterStateMutator building a new cName: testschemaapi
   [junit4]   2> 699600 INFO  (OverseerStateUpdate-96153292627116038-127.0.0.1:50268_solr-n_0000000000) [n:127.0.0.1:50268_solr    ] o.a.s.c.o.ZkStateWriter going to create_collection /collections/testschemaapi/state.json
   [junit4]   2> 699698 INFO  (OverseerThreadFactory-3468-thread-1-processing-n:127.0.0.1:50268_solr) [n:127.0.0.1:50268_solr    ] o.a.s.c.OverseerCollectionMessageHandler Creating SolrCores for new collection testschemaapi, shardNames [shard1] , replicationFactor : 2
   [junit4]   2> 699698 INFO  (OverseerThreadFactory-3468-thread-1-processing-n:127.0.0.1:50268_solr) [n:127.0.0.1:50268_solr    ] o.a.s.c.OverseerCollectionMessageHandler Creating core testschemaapi_shard1_replica2 as part of shard shard1 of collection testschemaapi on 127.0.0.1:50268_solr
   [junit4]   2> 699699 INFO  (OverseerThreadFactory-3468-thread-1-processing-n:127.0.0.1:50268_solr) [n:127.0.0.1:50268_solr    ] o.a.s.c.OverseerCollectionMessageHandler Creating core testschemaapi_shard1_replica1 as part of shard shard1 of collection testschemaapi on 127.0.0.1:50267_solr
   [junit4]   2> 699701 INFO  (qtp32526932-8065) [n:127.0.0.1:50267_solr    ] o.a.s.h.a.CoreAdminOperation core create command qt=/admin/cores&collection.configName=conf1&name=testschemaapi_shard1_replica1&action=CREATE&numShards=1&collection=testschemaapi&shard=shard1&wt=javabin&version=2
   [junit4]   2> 699702 INFO  (qtp23925167-8074) [n:127.0.0.1:50268_solr    ] o.a.s.h.a.CoreAdminOperation core create command qt=/admin/cores&collection.configName=conf1&name=testschemaapi_shard1_replica2&action=CREATE&numShards=1&collection=testschemaapi&shard=shard1&wt=javabin&version=2
   [junit4]   2> 699705 INFO  (qtp23925167-8074) [n:127.0.0.1:50268_solr    ] o.a.s.c.CoreDescriptor Created CoreDescriptor: {name=testschemaapi_shard1_replica2, collection.configName=conf1, config=solrconfig.xml, transient=false, schema=schema.xml, loadOnStartup=true, configSetProperties=configsetprops.json, collection=testschemaapi, numShards=1, dataDir=data\, shard=shard1}
   [junit4]   2> 699707 INFO  (qtp32526932-8065) [n:127.0.0.1:50267_solr    ] o.a.s.c.CoreDescriptor Created CoreDescriptor: {name=testschemaapi_shard1_replica1, collection.configName=conf1, config=solrconfig.xml, transient=false, schema=schema.xml, loadOnStartup=true, configSetProperties=configsetprops.json, collection=testschemaapi, numShards=1, dataDir=data\, shard=shard1}
   [junit4]   2> 699708 INFO  (qtp23925167-8074) [n:127.0.0.1:50268_solr c:testschemaapi s:shard1  x:testschemaapi_shard1_replica2] o.a.s.c.ZkController publishing state=down
   [junit4]   2> 699708 INFO  (qtp32526932-8065) [n:127.0.0.1:50267_solr c:testschemaapi s:shard1  x:testschemaapi_shard1_replica1] o.a.s.c.ZkController publishing state=down
   [junit4]   2> 699710 INFO  (qtp32526932-8065) [n:127.0.0.1:50267_solr c:testschemaapi s:shard1  x:testschemaapi_shard1_replica1] o.a.s.c.ZkController Registering watch for collection testschemaapi
   [junit4]   2> 699710 INFO  (qtp23925167-8074) [n:127.0.0.1:50268_solr c:testschemaapi s:shard1  x:testschemaapi_shard1_replica2] o.a.s.c.ZkController Registering watch for collection testschemaapi
   [junit4]   2> 699711 INFO  (qtp32526932-8065) [n:127.0.0.1:50267_solr c:testschemaapi s:shard1  x:testschemaapi_shard1_replica1] o.a.s.c.c.ZkStateReader Add data for [testschemaapi] ver [0]
   [junit4]   2> 699711 INFO  (qtp23925167-8074) [n:127.0.0.1:50268_solr c:testschemaapi s:shard1  x:testschemaapi_shard1_replica2] o.a.s.c.c.ZkStateReader Add data for [testschemaapi] ver [0]
   [junit4]   2> 699711 INFO  (qtp32526932-8065) [n:127.0.0.1:50267_solr c:testschemaapi s:shard1  x:testschemaapi_shard1_replica1] o.a.s.c.ZkController look for our core node name
   [junit4]   2> 699711 INFO  (qtp23925167-8074) [n:127.0.0.1:50268_solr c:testschemaapi s:shard1  x:testschemaapi_shard1_replica2] o.a.s.c.ZkController look for our core node name
   [junit4]   2> 699711 INFO  (OverseerStateUpdate-96153292627116038-127.0.0.1:50268_solr-n_0000000000) [n:127.0.0.1:50268_solr    ] o.a.s.c.Overseer processMessage: queueSize: 2, message = {
   [junit4]   2>   "core":"testschemaapi_shard1_replica2",
   [junit4]   2>   "roles":null,
   [junit4]   2>   "base_url":"http://127.0.0.1:50268/solr",
   [junit4]   2>   "node_name":"127.0.0.1:50268_solr",
   [junit4]   2>   "numShards":"1",
   [junit4]   2>   "state":"down",
   [junit4]   2>   "shard":"shard1",
   [junit4]   2>   "collection":"testschemaapi",
   [junit4]   2>   "operation":"state"} current state version: 0
   [junit4]   2> 699711 INFO  (OverseerStateUpdate-96153292627116038-127.0.0.1:50268_solr-n_0000000000) [n:127.0.0.1:50268_solr    ] o.a.s.c.o.ReplicaMutator Update state numShards=1 message={
   [junit4]   2>   "core":"testschemaapi_shard1_replica2",
   [junit4]   2>   "roles":null,
   [junit4]   2>   "base_url":"http://127.0.0.1:50268/solr",
   [junit4]   2>   "node_name":"127.0.0.1:50268_solr",
   [junit4]   2>   "numShards":"1",
   [junit4]   2>   "state":"down",
   [junit4]   2>   "shard":"shard1",
   [junit4]   2>   "collection":"testschemaapi",
   [junit4]   2>   "operation":"state"}
   [junit4]   2> 699716 INFO  (OverseerStateUpdate-96153292627116038-127.0.0.1:50268_solr-n_0000000000) [n:127.0.0.1:50268_solr    ] o.a.s.c.Overseer processMessage: queueSize: 1, message = {
   [junit4]   2>   "core":"testschemaapi_shard1_replica1",
   [junit4]   2>   "roles":null,
   [junit4]   2>   "base_url":"http://127.0.0.1:50267/solr",
   [junit4]   2>   "node_name":"127.0.0.1:50267_solr",
   [junit4]   2>   "numShards":"1",
   [junit4]   2>   "state":"down",
   [junit4]   2>   "shard":"shard1",
   [junit4]   2>   "collection":"testschemaapi",
   [junit4]   2>   "operation":"state"} current state version: 0
   [junit4]   2> 699716 INFO  (OverseerStateUpdate-96153292627116038-127.0.0.1:50268_solr-n_0000000000) [n:127.0.0.1:50268_solr    ] o.a.s.c.o.ReplicaMutator Update state numShards=1 message={
   [junit4]   2>   "core":"testschemaapi_shard1_replica1",
   [junit4]   2>   "roles":null,
   [junit4]   2>   "base_url":"http://127.0.0.1:50267/solr",
   [junit4]   2>   "node_name":"127.0.0.1:50267_solr",
   [junit4]   2>   "numShards":"1",
   [junit4]   2>   "state":"down",
   [junit4]   2>   "shard":"shard1",
   [junit4]   2>   "collection":"testschemaapi",
   [junit4]   2>   "operation":"state"}
   [junit4]   2> 699826 INFO  (OverseerStateUpdate-96153292627116038-127.0.0.1:50268_solr-n_0000000000) [n:127.0.0.1:50268_solr    ] o.a.s.c.o.ZkStateWriter going to update_collection /collections/testschemaapi/state.json version: 0
   [junit4]   2> 699827 INFO  (zkCallback-1198-thread-1-processing-n:127.0.0.1:50267_solr) [n:127.0.0.1:50267_solr    ] o.a.s.c.c.ZkStateReader A cluster state change: [WatchedEvent state:SyncConnected type:NodeDataChanged path:/collections/testschemaapi/state.json] for collection [testschemaapi] has occurred - updating... (live nodes size: [2])
   [junit4]   2> 699827 INFO  (zkCallback-1199-thread-2-processing-n:127.0.0.1:50268_solr) [n:127.0.0.1:50268_solr    ] o.a.s.c.c.ZkStateReader A cluster state change: [WatchedEvent state:SyncConnected type:NodeDataChanged path:/collections/testschemaapi/state.json] for collection [testschemaapi] has occurred - updating... (live nodes size: [2])
   [junit4]   2> 699828 INFO  (zkCallback-1198-thread-1-processing-n:127.0.0.1:50267_solr) [n:127.0.0.1:50267_solr    ] o.a.s.c.c.ZkStateReader Updating data for [testschemaapi] from [0] to [1]
   [junit4]   2> 699828 INFO  (zkCallback-1199-thread-2-processing-n:127.0.0.1:50268_solr) [n:127.0.0.1:50268_solr    ] o.a.s.c.c.ZkStateReader Updating data for [testschemaapi] from [0] to [1]
   [junit4]   2> 700712 INFO  (qtp23925167-8074) [n:127.0.0.1:50268_solr c:testschemaapi s:shard1  x:testschemaapi_shard1_replica2] o.a.s.c.ZkController waiting to find shard id in clusterstate for testschemaapi_shard1_replica2
   [junit4]   2> 700712 INFO  (qtp23925167-8074) [n:127.0.0.1:50268_solr c:testschemaapi s:shard1  x:testschemaapi_shard1_replica2] o.a.s.c.ZkController Check for collection zkNode:testschemaapi
   [junit4]   2> 700712 INFO  (qtp32526932-8065) [n:127.0.0.1:50267_solr c:testschemaapi s:shard1  x:testschemaapi_shard1_replica1] o.a.s.c.ZkController waiting to find shard id in clusterstate for testschemaapi_shard1_replica1
   [junit4]   2> 700712 INFO  (qtp32526932-8065) [n:127.0.0.1:50267_solr c:testschemaapi s:shard1  x:testschemaapi_shard1_replica1] o.a.s.c.ZkController Check for collection zkNode:testschemaapi
   [junit4]   2> 700712 INFO  (qtp23925167-8074) [n:127.0.0.1:50268_solr c:testschemaapi s:shard1  x:testschemaapi_shard1_replica2] o.a.s.c.ZkController Collection zkNode exists
   [junit4]   2> 700712 INFO  (qtp23925167-8074) [n:127.0.0.1:50268_solr c:testschemaapi s:shard1  x:testschemaapi_shard1_replica2] o.a.s.c.c.ZkStateReader Load collection config from: [/collections/testschemaapi]
   [junit4]   2> 700713 INFO  (qtp32526932-8065) [n:127.0.0.1:50267_solr c:testschemaapi s:shard1  x:testschemaapi_shard1_replica1] o.a.s.c.ZkController Collection zkNode exists
   [junit4]   2> 700713 INFO  (qtp32526932-8065) [n:127.0.0.1:50267_solr c:testschemaapi s:shard1  x:testschemaapi_shard1_replica1] o.a.s.c.c.ZkStateReader Load collection config from: [/collections/testschemaapi]
   [junit4]   2> 700714 INFO  (qtp23925167-8074) [n:127.0.0.1:50268_solr c:testschemaapi s:shard1  x:testschemaapi_shard1_replica2] o.a.s.c.c.ZkStateReader path=[/collections/testschemaapi] [configName]=[conf1] specified config exists in ZooKeeper
   [junit4]   2> 700714 INFO  (qtp23925167-8074) [n:127.0.0.1:50268_solr c:testschemaapi s:shard1  x:testschemaapi_shard1_replica2] o.a.s.c.SolrResourceLoader new SolrResourceLoader for directory: 'C:\Users\jenkins\workspace\Lucene-Solr-master-Windows\solr\build\solr-core\test\J0\temp\solr.schema.TestManagedSchemaAPI_AE17F471E70AEC35-001\tempDir-001\node1\testschemaapi_shard1_replica2'
   [junit4]   2> 700714 INFO  (qtp23925167-8074) [n:127.0.0.1:50268_solr c:testschemaapi s:shard1  x:testschemaapi_shard1_replica2] o.a.s.c.SolrResourceLoader JNDI not configured for solr (NoInitialContextEx)
   [junit4]   2> 700714 INFO  (qtp23925167-8074) [n:127.0.0.1:50268_solr c:testschemaapi s:shard1  x:testschemaapi_shard1_replica2] o.a.s.c.SolrResourceLoader solr home defaulted to 'solr/' (could not find system property or JNDI)
   [junit4]   2> 700715 INFO  (qtp32526932-8065) [n:127.0.0.1:50267_solr c:testschemaapi s:shard1  x:testschemaapi_shard1_replica1] o.a.s.c.c.ZkStateReader path=[/collections/testschemaapi] [configName]=[conf1] specified config exists in ZooKeeper
   [junit4]   2> 700715 INFO  (qtp32526932-8065) [n:127.0.0.1:50267_solr c:testschemaapi s:shard1  x:testschemaapi_shard1_replica1] o.a.s.c.SolrResourceLoader new SolrResourceLoader for directory: 'C:\Users\jenkins\workspace\Lucene-Solr-master-Windows\solr\build\solr-core\test\J0\temp\solr.schema.TestManagedSchemaAPI_AE17F471E70AEC35-001\tempDir-001\node2\testschemaapi_shard1_replica1'
   [junit4]   2> 700715 INFO  (qtp32526932-8065) [n:127.0.0.1:50267_solr c:testschemaapi s:shard1  x:testschemaapi_shard1_replica1] o.a.s.c.SolrResourceLoader JNDI not configured for solr (NoInitialContextEx)
   [junit4]   2> 700715 INFO  (qtp32526932-8065) [n:127.0.0.1:50267_solr c:testschemaapi s:shard1  x:testschemaapi_shard1_replica1] o.a.s.c.SolrResourceLoader solr home defaulted to 'solr/' (could not find system property or JNDI)
   [junit4]   2> 700718 INFO  (qtp23925167-8074) [n:127.0.0.1:50268_solr c:testschemaapi s:shard1  x:testschemaapi_shard1_replica2] o.a.s.c.Config loaded config solrconfig.xml with version 0 
   [junit4]   2> 700726 INFO  (qtp32526932-8065) [n:127.0.0.1:50267_solr c:testschemaapi s:shard1  x:testschemaapi_shard1_replica1] o.a.s.c.Config loaded config solrconfig.xml with version 0 
   [junit4]   2> 700731 INFO  (qtp23925167-8074) [n:127.0.0.1:50268_solr c:testschemaapi s:shard1  x:testschemaapi_shard1_replica2] o.a.s.c.SolrConfig current version of requestparams : -1
   [junit4]   2> 700751 INFO  (qtp23925167-8074) [n:127.0.0.1:50268_solr c:testschemaapi s:shard1  x:testschemaapi_shard1_replica2] o.a.s.c.SolrConfig Using Lucene MatchVersion: 7.0.0
   [junit4]   2> 700753 INFO  (qtp32526932-8065) [n:127.0.0.1:50267_solr c:testschemaapi s:shard1  x:testschemaapi_shard1_replica1] o.a.s.c.SolrConfig current version of requestparams : -1
   [junit4]   2> 700755 INFO  (qtp32526932-8065) [n:127.0.0.1:50267_solr c:testschemaapi s:shard1  x:testschemaapi_shard1_replica1] o.a.s.c.SolrConfig Using Lucene MatchVersion: 7.0.0
   [junit4]   2> 700755 INFO  (qtp23925167-8074) [n:127.0.0.1:50268_solr c:testschemaapi s:shard1  x:testschemaapi_shard1_replica2] o.a.s.c.SolrConfig Loaded SolrConfig: solrconfig.xml
   [junit4]   2> 700759 INFO  (qtp32526932-8065) [n:127.0.0.1:50267_solr c:testschemaapi s:shard1  x:testschemaapi_shard1_replica1] o.a.s.c.SolrConfig Loaded SolrConfig: solrconfig.xml
   [junit4]   2> 700781 INFO  (qtp23925167-8074) [n:127.0.0.1:50268_solr c:testschemaapi s:shard1  x:testschemaapi_shard1_replica2] o.a.s.s.IndexSchema [testschemaapi_shard1_replica2] Schema name=minimal
   [junit4]   2> 700782 INFO  (qtp32526932-8065) [n:127.0.0.1:50267_solr c:testschemaapi s:shard1  x:testschemaapi_shard1_replica1] o.a.s.s.IndexSchema [testschemaapi_shard1_replica1] Schema name=minimal
   [junit4]   2> 700789 INFO  (qtp23925167-8074) [n:127.0.0.1:50268_solr c:testschemaapi s:shard1  x:testschemaapi_shard1_replica2] o.a.s.s.IndexSchema unique key field: id
   [junit4]   2> 700791 INFO  (qtp32526932-8065) [n:127.0.0.1:50267_solr c:testschemaapi s:shard1  x:testschemaapi_shard1_replica1] o.a.s.s.IndexSchema unique key field: id
   [junit4]   2> 700796 INFO  (qtp23925167-8074) [n:127.0.0.1:50268_solr c:testschemaapi s:shard1  x:testschemaapi_shard1_replica2] o.a.s.c.ConfigSetProperties Did not find ConfigSet properties, assuming default properties: Can't find resource 'configsetprops.json' in classpath or '/configs/conf1', cwd=C:\Users\jenkins\workspace\Lucene-Solr-master-Windows\solr\build\solr-core\test\J0
   [junit4]   2> 700796 INFO  (qtp23925167-8074) [n:127.0.0.1:50268_solr c:testschemaapi s:shard1  x:testschemaapi_shard1_replica2] o.a.s.c.CoreContainer Creating SolrCore 'testschemaapi_shard1_replica2' using configuration from collection testschemaapi
   [junit4]   2> 700797 INFO  (qtp32526932-8065) [n:127.0.0.1:50267_solr c:testschemaapi s:shard1  x:testschemaapi_shard1_replica1] o.a.s.c.ConfigSetProperties Did not find ConfigSet properties, assuming default properties: Can't find resource 'configsetprops.json' in classpath or '/configs/conf1', cwd=C:\Users\jenkins\workspace\Lucene-Solr-master-Windows\solr\build\solr-core\test\J0
   [junit4]   2> 700797 INFO  (qtp32526932-8065) [n:127.0.0.1:50267_solr c:testschemaapi s:shard1  x:testschemaapi_shard1_replica1] o.a.s.c.CoreContainer Creating SolrCore 'testschemaapi_shard1_replica1' using configuration from collection testschemaapi
   [junit4]   2> 700797 INFO  (qtp23925167-8074) [n:127.0.0.1:50268_solr c:testschemaapi s:shard1 r:core_node1 x:testschemaapi_shard1_replica2] o.a.s.c.SolrCore org.apache.solr.core.MockDirectoryFactory
   [junit4]   2> 700797 INFO  (qtp23925167-8074) [n:127.0.0.1:50268_solr c:testschemaapi s:shard1 r:core_node1 x:testschemaapi_shard1_replica2] o.a.s.c.SolrCore [[testschemaapi_shard1_replica2] ] Opening new SolrCore at [C:\Users\jenkins\workspace\Lucene-Solr-master-Windows\solr\build\solr-core\test\J0\temp\solr.schema.TestManagedSchemaAPI_AE17F471E70AEC35-001\tempDir-001\node1\testschemaapi_shard1_replica2], dataDir=[C:\Users\jenkins\workspace\Lucene-Solr-master-Windows\solr\build\solr-core\test\J0\temp\solr.schema.TestManagedSchemaAPI_AE17F471E70AEC35-001\tempDir-001\node1\.\testschemaapi_shard1_replica2\data\]
   [junit4]   2> 700797 INFO  (qtp32526932-8065) [n:127.0.0.1:50267_solr c:testschemaapi s:shard1 r:core_node2 x:testschemaapi_shard1_replica1] o.a.s.c.SolrCore org.apache.solr.core.MockDirectoryFactory
   [junit4]   2> 700797 INFO  (qtp23925167-8074) [n:127.0.0.1:50268_solr c:testschemaapi s:shard1 r:core_node1 x:testschemaapi_shard1_replica2] o.a.s.c.SolrCore JMX monitoring not detected for core: testschemaapi_shard1_replica2
   [junit4]   2> 700797 INFO  (qtp32526932-8065) [n:127.0.0.1:50267_solr c:testschemaapi s:shard1 r:core_node2 x:testschemaapi_shard1_replica1] o.a.s.c.SolrCore [[testschemaapi_shard1_replica1] ] Opening new SolrCore at [C:\Users\jenkins\workspace\Lucene-Solr-master-Windows\solr\build\solr-core\test\J0\temp\solr.schema.TestManagedSchemaAPI_AE17F471E70AEC35-001\tempDir-001\node2\testschemaapi_shard1_replica1], dataDir=[C:\Users\jenkins\workspace\Lucene-Solr-master-Windows\solr\build\solr-core\test\J0\temp\solr.schema.TestManagedSchemaAPI_AE17F471E70AEC35-001\tempDir-001\node2\.\testschemaapi_shard1_replica1\data\]
   [junit4]   2> 700798 INFO  (qtp32526932-8065) [n:127.0.0.1:50267_solr c:testschemaapi s:shard1 r:core_node2 x:testschemaapi_shard1_replica1] o.a.s.c.SolrCore JMX monitoring not detected for core: testschemaapi_shard1_replica1
   [junit4]   2> 700798 INFO  (qtp23925167-8074) [n:127.0.0.1:50268_solr c:testschemaapi s:shard1 r:core_node1 x:testschemaapi_shard1_replica2] o.a.s.c.CachingDirectoryFactory return new directory for C:\Users\jenkins\workspace\Lucene-Solr-master-Windows\solr\build\solr-core\test\J0\temp\solr.schema.TestManagedSchemaAPI_AE17F471E70AEC35-001\tempDir-001\node1\.\testschemaapi_shard1_replica2\data\
   [junit4]   2> 700798 INFO  (qtp32526932-8065) [n:127.0.0.1:50267_solr c:testschemaapi s:shard1 r:core_node2 x:testschemaapi_shard1_replica1] o.a.s.c.CachingDirectoryFactory return new directory for C:\Users\jenkins\workspace\Lucene-Solr-master-Windows\solr\build\solr-core\test\J0\temp\solr.schema.TestManagedSchemaAPI_AE17F471E70AEC35-001\tempDir-001\node2\.\testschemaapi_shard1_replica1\data\
   [junit4]   2> 700799 INFO  (qtp23925167-8074) [n:127.0.0.1:50268_solr c:testschemaapi s:shard1 r:core_node1 x:testschemaapi_shard1_replica2] o.a.s.c.SolrCore New index directory detected: old=null new=C:\Users\jenkins\workspace\Lucene-Solr-master-Windows\solr\build\solr-core\test\J0\temp\solr.schema.TestManagedSchemaAPI_AE17F471E70AEC35-001\tempDir-001\node1\.\testschemaapi_shard1_replica2\data\index/
   [junit4]   2> 700799 WARN  (qtp23925167-8074) [n:127.0.0.1:50268_solr c:testschemaapi s:shard1 r:core_node1 x:testschemaapi_shard1_replica2] o.a.s.c.SolrCore [testschemaapi_shard1_replica2] Solr index directory 'C:\Users\jenkins\workspace\Lucene-Solr-master-Windows\solr\build\solr-core\test\J0\temp\solr.schema.TestManagedSchemaAPI_AE17F471E70AEC35-001\tempDir-001\node1\.\testschemaapi_shard1_replica2\data\index' doesn't exist. Creating new index...
   [junit4]   2> 700799 INFO  (qtp32526932-8065) [n:127.0.0.1:50267_solr c:testschemaapi s:shard1 r:core_node2 x:testschemaapi_shard1_replica1] o.a.s.c.SolrCore New index directory detected: old=null new=C:\Users\jenkins\workspace\Lucene-Solr-master-Windows\solr\build\solr-core\test\J0\temp\solr.schema.TestManagedSchemaAPI_AE17F471E70AEC35-001\tempDir-001\node2\.\testschemaapi_shard1_replica1\data\index/
   [junit4]   2> 700799 INFO  (qtp23925167-8074) [n:127.0.0.1:50268_solr c:testschemaapi s:shard1 r:core_node1 x:testschemaapi_shard1_replica2] o.a.s.c.CachingDirectoryFactory return new directory for C:\Users\jenkins\workspace\Lucene-Solr-master-Windows\solr\build\solr-core\test\J0\temp\solr.schema.TestManagedSchemaAPI_AE17F471E70AEC35-001\tempDir-001\node1\.\testschemaapi_shard1_replica2\data\index
   [junit4]   2> 700799 WARN  (qtp32526932-8065) [n:127.0.0.1:50267_solr c:testschemaapi s:shard1 r:core_node2 x:testschemaapi_shard1_replica1] o.a.s.c.SolrCore [testschemaapi_shard1_replica1] Solr index directory 'C:\Users\jenkins\workspace\Lucene-Solr-master-Windows\solr\build\solr-core\test\J0\temp\solr.schema.TestManagedSchemaAPI_AE17F471E70AEC35-001\tempDir-001\node2\.\testschemaapi_shard1_replica1\data\index' doesn't exist. Creating new index...
   [junit4]   2> 700800 INFO  (qtp32526932-8065) [n:127.0.0.1:50267_solr c:testschemaapi s:shard1 r:core_node2 x:testschemaapi_shard1_replica1] o.a.s.c.CachingDirectoryFactory return new directory for C:\Users\jenkins\workspace\Lucene-Solr-master-Windows\solr\build\solr-core\test\J0\temp\solr.schema.TestManagedSchemaAPI_AE17F471E70AEC35-001\tempDir-001\node2\.\testschemaapi_shard1_replica1\data\index
   [junit4]   2> 700800 INFO  (qtp23925167-8074) [n:127.0.0.1:50268_solr c:testschemaapi s:shard1 r:core_node1 x:testschemaapi_shard1_replica2] o.a.s.c.SolrDeletionPolicy SolrDeletionPolicy.onCommit: commits: num=1
   [junit4]   2> 	commit{dir=MockDirectoryWrapper(RAMDirectory@1dab45a lockFactory=org.apache.lucene.store.SingleInstanceLockFactory@16a0c55),segFN=segments_1,generation=1}
   [junit4]   2> 700800 INFO  (qtp23925167-8074) [n:127.0.0.1:50268_solr c:testschemaapi s:shard1 r:core_node1 x:testschemaapi_shard1_replica2] o.a.s.c.SolrDeletionPolicy newest commit generation = 1
   [junit4]   2> 700801 INFO  (qtp32526932-8065) [n:127.0.0.1:50267_solr c:testschemaapi s:shard1 r:core_node2 x:testschemaapi_shard1_replica1] o.a.s.c.SolrDeletionPolicy SolrDeletionPolicy.onCommit: commits: num=1
   [junit4]   2> 	commit{dir=MockDirectoryWrapper(RAMDirectory@ad5a93 lockFactory=org.apache.lucene.store.SingleInstanceLockFactory@1f5db19),segFN=segments_1,generation=1}
   [junit4]   2> 700801 INFO  (qtp32526932-8065) [n:127.0.0.1:50267_solr c:testschemaapi s:shard1 r:core_node2 x:testschemaapi_shard1_replica1] o.a.s.c.SolrDeletionPolicy newest commit generation = 1
   [junit4]   2> 700802 INFO  (qtp23925167-8074) [n:127.0.0.1:50268_solr c:testschemaapi s:shard1 r:core_node1 x:testschemaapi_shard1_replica2] o.a.s.c.SolrCore no updateRequestProcessorChain defined as default, creating implicit default
   [junit4]   2> 700803 INFO  (qtp32526932-8065) [n:127.0.0.1:50267_solr c:testschemaapi s:shard1 r:core_node2 x:testschemaapi_shard1_replica1] o.a.s.c.SolrCore no updateRequestProcessorChain defined as default, creating implicit default
   [junit4]   2> 700808 INFO  (qtp32526932-8065) [n:127.0.0.1:50267_solr c:testschemaapi s:shard1 r:core_node2 x:testschemaapi_shard1_replica1] o.a.s.h.l.XMLLoader xsltCacheLifetimeSeconds=60
   [junit4]   2> 700809 INFO  (qtp23925167-8074) [n:127.0.0.1:50268_solr c:testschemaapi s:shard1 r:core_node1 x:testschemaapi_shard1_replica2] o.a.s.h.l.XMLLoader xsltCacheLifetimeSeconds=60
   [junit4]   2> 700810 INFO  (qtp32526932-8065) [n:127.0.0.1:50267_solr c:testschemaapi s:shard1 r:core_node2 x:testschemaapi_shard1_replica1] o.a.s.h.l.XMLLoader xsltCacheLifetimeSeconds=60
   [junit4]   2> 700810 INFO  (qtp23925167-8074) [n:127.0.0.1:50268_solr c:testschemaapi s:shard1 r:core_node1 x:testschemaapi_shard1_replica2] o.a.s.h.l.XMLLoader xsltCacheLifetimeSeconds=60
   [junit4]   2> 700811 INFO  (qtp32526932-8065) [n:127.0.0.1:50267_solr c:testschemaapi s:shard1 r:core_node2 x:testschemaapi_shard1_replica1] o.a.s.h.l.XMLLoader xsltCacheLifetimeSeconds=60
   [junit4]   2> 700812 INFO  (qtp32526932-8065) [n:127.0.0.1:50267_solr c:testschemaapi s:shard1 r:core_node2 x:testschemaapi_shard1_replica1] o.a.s.h.l.XMLLoader xsltCacheLifetimeSeconds=60
   [junit4]   2> 700812 INFO  (qtp23925167-8074) [n:127.0.0.1:50268_solr c:testschemaapi s:shard1 r:core_node1 x:testschemaapi_shard1_replica2] o.a.s.h.l.XMLLoader xsltCacheLifetimeSeconds=60
   [junit4]   2> 700813 INFO  (qtp32526932-8065) [n:127.0.0.1:50267_solr c:testschemaapi s:shard1 r:core_node2 x:testschemaapi_shard1_replica1] o.a.s.c.RequestHandlers Registered paths: /admin/mbeans,/update/csv,/sql,/update/json/docs,/admin/luke,/graph,/export,/select,/admin/segments,/get,/admin/system,/replication,/admin/properties,/config,/stream,/schema,/admin/plugins,/admin/logging,/update/json,/admin/ping,/admin/threads,/update,/admin/file
   [junit4]   2> 700813 INFO  (qtp32526932-8065) [n:127.0.0.1:50267_solr c:testschemaapi s:shard1 r:core_node2 x:testschemaapi_shard1_replica1] o.a.s.c.SolrCore Using default statsCache cache: org.apache.solr.search.stats.LocalStatsCache
   [junit4]   2> 700814 INFO  (qtp23925167-8074) [n:127.0.0.1:50268_solr c:testschemaapi s:shard1 r:core_node1 x:testschemaapi_shard1_replica2] o.a.s.h.l.XMLLoader xsltCacheLifetimeSeconds=60
   [junit4]   2> 700815 INFO  (qtp32526932-8065) [n:127.0.0.1:50267_solr c:testschemaapi s:shard1 r:core_node2 x:testschemaapi_shard1_replica1] o.a.s.u.UpdateHandler Using UpdateLog implementation: org.apache.solr.update.UpdateLog
   [junit4]   2> 700815 INFO  (qtp32526932-8065) [n:127.0.0.1:50267_solr c:testschemaapi s:shard1 r:core_node2 x:testschemaapi_shard1_replica1] o.a.s.u.UpdateLog Initializing UpdateLog: dataDir=null defaultSyncLevel=FLUSH numRecordsToKeep=100 maxNumLogsToKeep=10 numVersionBuckets=65536
   [junit4]   2> 700815 INFO  (qtp23925167-8074) [n:127.0.0.1:50268_solr c:testschemaapi s:shard1 r:core_node1 x:testschemaapi_shard1_replica2] o.a.s.c.RequestHandlers Registered paths: /admin/mbeans,/update/csv,/sql,/update/json/docs,/admin/luke,/graph,/export,/select,/admin/segments,/get,/admin/system,/replication,/admin/properties,/config,/stream,/schema,/admin/plugins,/admin/logging,/update/json,/admin/ping,/admin/threads,/update,/admin/file
   [junit4]   2> 700815 INFO  (qtp23925167-8074) [n:127.0.0.1:50268_solr c:testschemaapi s:shard1 r:core_node1 x:testschemaapi_shard1_replica2] o.a.s.c.SolrCore Using default statsCache cache: org.apache.solr.search.stats.LocalStatsCache
   [junit4]   2> 700816 INFO  (OldIndexDirectoryCleanupThreadForCore-testschemaapi_shard1_replica1) [n:127.0.0.1:50267_solr c:testschemaapi s:shard1 r:core_node2 x:testschemaapi_shard1_replica1] o.a.s.c.SolrCore Looking for old index directories to cleanup for core testschemaapi_shard1_replica1 in C:\Users\jenkins\workspace\Lucene-Solr-master-Windows\solr\build\solr-core\test\J0\temp\solr.schema.TestManagedSchemaAPI_AE17F471E70AEC35-001\tempDir-001\node2\.\testschemaapi_shard1_replica1\data\
   [junit4]   2> 700816 INFO  (OldIndexDirectoryCleanupThreadForCore-testschemaapi_shard1_replica2) [n:127.0.0.1:50268_solr c:testschemaapi s:shard1 r:core_node1 x:testschemaapi_shard1_replica2] o.a.s.c.SolrCore Looking for old index directories to cleanup for core testschemaapi_shard1_replica2 in C:\Users\jenkins\workspace\Lucene-Solr-master-Windows\solr\build\solr-core\test\J0\temp\solr.schema.TestManagedSchemaAPI_AE17F471E70AEC35-001\tempDir-001\node1\.\testschemaapi_shard1_replica2\data\
   [junit4]   2> 700818 INFO  (qtp23925167-8074) [n:127.0.0.1:50268_solr c:testschemaapi s:shard1 r:core_node1 x:testschemaapi_shard1_replica2] o.a.s.u.UpdateHandler Using UpdateLog implementation: org.apache.solr.update.UpdateLog
   [junit4]   2> 700818 INFO  (qtp23925167-8074) [n:127.0.0.1:50268_solr c:testschemaapi s:shard1 r:core_node1 x:testschemaapi_shard1_replica2] o.a.s.u.UpdateLog Initializing UpdateLog: dataDir=null defaultSyncLevel=FLUSH numRecordsToKeep=100 maxNumLogsToKeep=10 numVersionBuckets=65536
   [junit4]   2> 700819 WARN  (OldIndexDirectoryCleanupThreadForCore-testschemaapi_shard1_replica2) [n:127.0.0.1:50268_solr c:testschemaapi s:shard1 r:core_node1 x:testschemaapi_shard1_replica2] o.a.s.c.DirectoryFactory C:\Users\jenkins\workspace\Lucene-Solr-master-Windows\solr\build\solr-core\test\J0\temp\solr.schema.TestManagedSchemaAPI_AE17F471E70AEC35-001\tempDir-001\node1\.\testschemaapi_shard1_replica2\data\ does not point to a valid data directory; skipping clean-up of old index directories.
   [junit4]   2> 700823 INFO  (qtp32526932-8065) [n:127.0.0.1:50267_solr c:testschemaapi s:shard1 r:core_node2 x:testschemaapi_shard1_replica1] o.a.s.u.CommitTracker Hard AutoCommit: disabled
   [junit4]   2> 700823 INFO  (qtp32526932-8065) [n:127.0.0.1:50267_solr c:testschemaapi s:shard1 r:core_node2 x:testschemaapi_shard1_replica1] o.a.s.u.CommitTracker Soft AutoCommit: disabled
   [junit4]   2> 700823 INFO  (qtp32526932-8065) [n:127.0.0.1:50267_solr c:testschemaapi s:shard1 r:core_node2 x:testschemaapi_shard1_replica1] o.a.s.c.SolrDeletionPolicy SolrDeletionPolicy.onInit: commits: num=1
   [junit4]   2> 	commit{dir=MockDirectoryWrapper(RAMDirectory@ad5a93 lockFactory=org.apache.lucene.store.SingleInstanceLockFactory@1f5db19),segFN=segments_1,generation=1}
   [junit4]   2> 700823 INFO  (qtp32526932-8065) [n:127.0.0.1:50267_solr c:testschemaapi s:shard1 r:core_node2 x:testschemaapi_shard1_replica1] o.a.s.c.SolrDeletionPolicy newest commit generation = 1
   [junit4]   2> 700824 INFO  (qtp23925167-8074) [n:127.0.0.1:50268_solr c:testschemaapi s:shard1 r:core_node1 x:testschemaapi_shard1_replica2] o.a.s.u.CommitTracker Hard AutoCommit: disabled
   [junit4]   2> 700825 INFO  (qtp23925167-8074) [n:127.0.0.1:50268_solr c:testschemaapi s:shard1 r:core_node1 x:testschemaapi_shard1_replica2] o.a.s.u.CommitTracker Soft AutoCommit: disabled
   [junit4]   2> 700825 INFO  (qtp32526932-8065) [n:127.0.0.1:50267_solr c:testschemaapi s:shard1 r:core_node2 x:testschemaapi_shard1_replica1] o.a.s.s.SolrIndexSearcher Opening [Searcher@1a68c6d[testschemaapi_shard1_replica1] main]
   [junit4]   2> 700825 INFO  (qtp32526932-8065) [n:127.0.0.1:50267_solr c:testschemaapi s:shard1 r:core_node2 x:testschemaapi_shard1_replica1] o.a.s.c.c.ZkStateReader Load collection config from: [/collections/testschemaapi]
   [junit4]   2> 700826 INFO  (qtp23925167-8074) [n:127.0.0.1:50268_solr c:testschemaapi s:shard1 r:core_node1 x:testschemaapi_shard1_replica2] o.a.s.c.SolrDeletionPolicy SolrDeletionPolicy.onInit: commits: num=1
   [junit4]   2> 	commit{dir=MockDirectoryWrapper(RAMDirectory@1dab45a lockFactory=org.apache.lucene.store.SingleInstanceLockFactory@16a0c55),segFN=segments_1,generation=1}
   [junit4]   2> 700826 INFO  (qtp23925167-8074) [n:127.0.0.1:50268_solr c:testschemaapi s:shard1 r:core_node1 x:testschemaapi_shard1_replica2] o.a.s.c.SolrDeletionPolicy newest commit generation = 1
   [junit4]   2> 700826 INFO  (qtp23925167-8074) [n:127.0.0.1:50268_solr c:testschemaapi s:shard1 r:core_node1 x:testschemaapi_shard1_replica2] o.a.s.s.SolrIndexSearcher Opening [Searcher@1da94b0[testschemaapi_shard1_replica2] main]
   [junit4]   2> 700827 INFO  (qtp23925167-8074) [n:127.0.0.1:50268_solr c:testschemaapi s:shard1 r:core_node1 x:testschemaapi_shard1_replica2] o.a.s.c.c.ZkStateReader Load collection config from: [/collections/testschemaapi]
   [junit4]   2> 700827 INFO  (qtp32526932-8065) [n:127.0.0.1:50267_solr c:testschemaapi s:shard1 r:core_node2 x:testschemaapi_shard1_replica1] o.a.s.c.c.ZkStateReader path=[/collections/testschemaapi] [configName]=[conf1] specified config exists in ZooKeeper
   [junit4]   2> 700827 INFO  (qtp32526932-8065) [n:127.0.0.1:50267_solr c:testschemaapi s:shard1 r:core_node2 x:testschemaapi_shard1_replica1] o.a.s.r.ManagedResourceStorage Setting up ZooKeeper-based storage for the RestManager with znodeBase: /configs/conf1
   [junit4]   2> 700827 INFO  (qtp32526932-8065) [n:127.0.0.1:50267_solr c:testschemaapi s:shard1 r:core_node2 x:testschemaapi_shard1_replica1] o.a.s.r.ManagedResourceStorage Configured ZooKeeperStorageIO with znodeBase: /configs/conf1
   [junit4]   2> 700828 INFO  (qtp32526932-8065) [n:127.0.0.1:50267_solr c:testschemaapi s:shard1 r:core_node2 x:testschemaapi_shard1_replica1] o.a.s.r.RestManager Initializing RestManager with initArgs: {}
   [junit4]   2> 700828 INFO  (qtp32526932-8065) [n:127.0.0.1:50267_solr c:testschemaapi s:shard1 r:core_node2 x:testschemaapi_shard1_replica1] o.a.s.r.ManagedResourceStorage Reading _rest_managed.json using ZooKeeperStorageIO:path=/configs/conf1
   [junit4]   2> 700828 INFO  (qtp32526932-8065) [n:127.0.0.1:50267_solr c:testschemaapi s:shard1 r:core_node2 x:testschemaapi_shard1_replica1] o.a.s.r.ManagedResourceStorage No data found for znode /configs/conf1/_rest_managed.json
   [junit4]   2> 700829 INFO  (qtp32526932-8065) [n:127.0.0.1:50267_solr c:testschemaapi s:shard1 r:core_node2 x:testschemaapi_shard1_replica1] o.a.s.r.ManagedResourceStorage Loaded null at path _rest_managed.json using ZooKeeperStorageIO:path=/configs/conf1
   [junit4]   2> 700829 INFO  (qtp32526932-8065) [n:127.0.0.1:50267_solr c:testschemaapi s:shard1 r:core_node2 x:testschemaapi_shard1_replica1] o.a.s.r.RestManager Initializing 0 registered ManagedResources
   [junit4]   2> 700829 INFO  (qtp32526932-8065) [n:127.0.0.1:50267_solr c:testschemaapi s:shard1 r:core_node2 x:testschemaapi_shard1_replica1] o.a.s.s.ZkIndexSchemaReader Creating ZooKeeper watch for the managed schema at /configs/conf1/managed-schema
   [junit4]   2> 700829 INFO  (qtp23925167-8074) [n:127.0.0.1:50268_solr c:testschemaapi s:shard1 r:core_node1 x:testschemaapi_shard1_replica2] o.a.s.c.c.ZkStateReader path=[/collections/testschemaapi] [configName]=[conf1] specified config exists in ZooKeeper
   [junit4]   2> 700829 INFO  (qtp23925167-8074) [n:127.0.0.1:50268_solr c:testschemaapi s:shard1 r:core_node1 x:testschemaapi_shard1_replica2] o.a.s.r.ManagedResourceStorage Setting up ZooKeeper-based storage for the RestManager with znodeBase: /configs/conf1
   [junit4]   2> 700829 INFO  (qtp32526932-8065) [n:127.0.0.1:50267_solr c:testschemaapi s:shard1 r:core_node2 x:testschemaapi_shard1_replica1] o.a.s.c.ZkController Added new OnReconnect listener ZkIndexSchemaReader: /configs/conf1/managed-schema, uniqueCoreId: testschemaapi_shard1_replica1:325461996887718
   [junit4]   2> 700830 INFO  (qtp32526932-8065) [n:127.0.0.1:50267_solr c:testschemaapi s:shard1 r:core_node2 x:testschemaapi_shard1_replica1] o.a.s.h.ReplicationHandler Commits will be reserved for  10000
   [junit4]   2> 700830 INFO  (qtp32526932-8065) [n:127.0.0.1:50267_solr c:testschemaapi s:shard1 r:core_node2 x:testschemaapi_shard1_replica1] o.a.s.u.UpdateLog Looking up max value of version field to seed version buckets
   [junit4]   2> 700830 INFO  (qtp32526932-8065) [n:127.0.0.1:50267_solr c:testschemaapi s:shard1 r:core_node2 x:testschemaapi_shard1_replica1] o.a.s.u.VersionInfo Refreshing highest value of _version_ for 65536 version buckets from index
   [junit4]   2> 700830 INFO  (searcherExecutor-3472-thread-1-processing-n:127.0.0.1:50267_solr x:testschemaapi_shard1_replica1 s:shard1 c:testschemaapi r:core_node2) [n:127.0.0.1:50267_solr c:testschemaapi s:shard1 r:core_node2 x:testschemaapi_shard1_replica1] o.a.s.c.SolrCore [testschemaapi_shard1_replica1] Registered new searcher Searcher@1a68c6d[testschemaapi_shard1_replica1] main{ExitableDirectoryReader(UninvertingDirectoryReader())}
   [junit4]   2> 700830 INFO  (qtp32526932-8065) [n:127.0.0.1:50267_solr c:testschemaapi s:shard1 r:core_node2 x:testschemaapi_shard1_replica1] o.a.s.u.VersionInfo No terms found for _version_, cannot seed version bucket highest value from index
   [junit4]   2> 700830 INFO  (qtp32526932-8065) [n:127.0.0.1:50267_solr c:testschemaapi s:shard1 r:core_node2 x:testschemaapi_shard1_replica1] o.a.s.u.UpdateLog Could not find max version in index or recent updates, using new clock 1538452684758056960
   [junit4]   2> 700831 INFO  (qtp23925167-8074) [n:127.0.0.1:50268_solr c:testschemaapi s:shard1 r:core_node1 x:testschemaapi_shard1_replica2] o.a.s.r.ManagedResourceStorage Configured ZooKeeperStorageIO with znodeBase: /configs/conf1
   [junit4]   2> 700831 INFO  (qtp23925167-8074) [n:127.0.0.1:50268_solr c:testschemaapi s:shard1 r:core_node1 x:testschemaapi_shard1_replica2] o.a.s.r.RestManager Initializing RestManager with initArgs: {}
   [junit4]   2> 700831 INFO  (qtp23925167-8074) [n:127.0.0.1:50268_solr c:testschemaapi s:shard1 r:core_node1 x:testschemaapi_shard1_replica2] o.a.s.r.ManagedResourceStorage Reading _rest_managed.json using ZooKeeperStorageIO:path=/configs/conf1
   [junit4]   2> 700831 INFO  (qtp23925167-8074) [n:127.0.0.1:50268_solr c:testschemaapi s:shard1 r:core_node1 x:testschemaapi_shard1_replica2] o.a.s.r.ManagedResourceStorage No data found for znode /configs/conf1/_rest_managed.json
   [junit4]   2> 700832 INFO  (qtp23925167-8074) [n:127.0.0.1:50268_solr c:testschemaapi s:shard1 r:core_node1 x:testschemaapi_shard1_replica2] o.a.s.r.ManagedResourceStorage Loaded null at path _rest_managed.json using ZooKeeperStorageIO:path=/configs/conf1
   [junit4]   2> 700832 INFO  (qtp23925167-8074) [n:127.0.0.1:50268_solr c:testschemaapi s:shard1 r:core_node1 x:testschemaapi_shard1_replica2] o.a.s.r.RestManager Initializing 0 registered ManagedResources
   [junit4]   2> 700832 INFO  (qtp23925167-8074) [n:127.0.0.1:50268_solr c:testschemaapi s:shard1 r:core_node1 x:testschemaapi_shard1_replica2] o.a.s.s.ZkIndexSchemaReader Creating ZooKeeper watch for the managed schema at /configs/conf1/managed-schema
   [junit4]   2> 700832 INFO  (qtp32526932-8065) [n:127.0.0.1:50267_solr c:testschemaapi s:shard1 r:core_node2 x:testschemaapi_shard1_replica1] o.a.s.u.UpdateLog Took 2.0ms to seed version buckets with highest version 1538452684758056960
   [junit4]   2> 700832 INFO  (qtp32526932-8065) [n:127.0.0.1:50267_solr c:testschemaapi s:shard1 r:core_node2 x:testschemaapi_shard1_replica1] o.a.s.c.ZkController watch zkdir /configs/conf1
   [junit4]   2> 700833 INFO  (qtp23925167-8074) [n:127.0.0.1:50268_solr c:testschemaapi s:shard1 r:core_node1 x:testschemaapi_shard1_replica2] o.a.s.c.ZkController Added new OnReconnect listener ZkIndexSchemaReader: /configs/conf1/managed-schema, uniqueCoreId: testschemaapi_shard1_replica2:325461996589988
   [junit4]   2> 700833 INFO  (qtp23925167-8074) [n:127.0.0.1:50268_solr c:testsch

[...truncated too long message...]

ledFutureTask.run(ScheduledThreadPoolExecutor.java:294)
   [junit4]   2> 	at java.util.concurrent.ThreadPoolExecutor.runWorker(ThreadPoolExecutor.java:1142)
   [junit4]   2> 	at java.util.concurrent.ThreadPoolExecutor$Worker.run(ThreadPoolExecutor.java:617)
   [junit4]   2> 	at java.lang.Thread.run(Thread.java:745)
   [junit4]   2> 
   [junit4]   2> Jun 29, 2016 7:08:29 AM com.carrotsearch.randomizedtesting.ThreadLeakControl checkThreadLeaks
   [junit4]   2> WARNING: Will linger awaiting termination of 2 leaked thread(s).
   [junit4]   2> 1997704 WARN  (cdcr-update-log-synchronizer-9313-thread-1) [n:127.0.0.1:57433_ c:source_collection s:shard2 r:core_node2 x:source_collection_shard2_replica2] o.a.s.h.CdcrUpdateLogSynchronizer Couldn't get last processed version from leader http://127.0.0.1:57421/source_collection_shard2_replica1/: Server refused connection at: http://127.0.0.1:57421/source_collection_shard2_replica1
   [junit4]   2> NOTE: test params are: codec=Asserting(Lucene62): {_version_=PostingsFormat(name=Asserting), id=PostingsFormat(name=LuceneVarGapFixedInterval)}, docValues:{}, maxPointsInLeafNode=878, maxMBSortInHeap=5.67525933372834, sim=RandomSimilarity(queryNorm=true,coord=no): {}, locale=de-LU, timezone=WET
   [junit4]   2> NOTE: Windows 10 10.0 x86/Oracle Corporation 1.8.0_92 (32-bit)/cpus=3,threads=1,free=117640616,total=369885184
   [junit4]   2> NOTE: All tests run in this JVM: [CircularListTest, CloneFieldUpdateProcessorFactoryTest, RecoveryAfterSoftCommitTest, TestLockTree, TestCSVLoader, TestReplicaProperties, IndexSchemaTest, TestDocumentBuilder, TestSolrConfigHandlerConcurrent, TestLFUCache, TestPartialUpdateDeduplication, TestScoreJoinQPNoScore, MigrateRouteKeyTest, ZkCLITest, SpatialFilterTest, TestDefaultStatsCache, TestStressReorder, SyncSliceTest, SpatialHeatmapFacetsTest, TestPKIAuthenticationPlugin, HighlighterMaxOffsetTest, TestSweetSpotSimilarityFactory, ExplicitHLLTest, ClusterStateUpdateTest, RollingRestartTest, SolrRequestParserTest, TestHighlightDedupGrouping, TestSolrFieldCacheMBean, OverseerStatusTest, TestLRUStatsCache, TestMaxScoreQueryParser, TestDocSet, ReturnFieldsTest, TestLeaderElectionZkExpiry, HardAutoCommitTest, TestGeoJSONResponseWriter, DirectUpdateHandlerTest, TestFieldCacheWithThreads, SolrTestCaseJ4Test, TolerantUpdateProcessorTest, TestReplicationHandler, TestLMDirichletSimilarityFactory, HdfsDirectoryFactoryTest, TestEmbeddedSolrServerConstructors, TestMiniSolrCloudClusterSSL, TestStressVersions, TestBackupRepositoryFactory, TestCloudInspectUtil, TestTolerantSearch, TestImplicitCoreProperties, CurrencyFieldXmlFileTest, StandardRequestHandlerTest, DocumentAnalysisRequestHandlerTest, SegmentsInfoRequestHandlerTest, TestFunctionQuery, TestCodecSupport, TestJmxIntegration, TestFastLRUCache, TestConfigSets, ConnectionManagerTest, TestCryptoKeys, SOLR749Test, RulesTest, TestFieldCacheSortRandom, CoreAdminRequestStatusTest, TestManagedSchemaAPI, TestFieldCache, ChaosMonkeyNothingIsSafeTest, ScriptEngineTest, TestComponentsName, TestRawResponseWriter, HdfsLockFactoryTest, TestReqParamsAPI, TestUpdate, SimpleCollectionCreateDeleteTest, SoftAutoCommitTest, LeaderInitiatedRecoveryOnCommitTest, TestSurroundQueryParser, TestUniqueKeyFieldResource, JsonLoaderTest, TestConfigSetImmutable, DistribCursorPagingTest, AnalyticsMergeStrategyTest, DistributedExpandComponentTest, TestFieldTypeResource, TestSubQueryTransformerCrossCore, TestIBSimilarityFactory, DistributedFacetPivotSmallTest, TestShortCircuitedRequests, HighlighterTest, ConcurrentDeleteAndCreateCollectionTest, TestCoreContainer, RankQueryTest, ShardRoutingTest, BlockCacheTest, DisMaxRequestHandlerTest, PolyFieldTest, DistributedSpellCheckComponentTest, PingRequestHandlerTest, DateRangeFieldTest, DirectoryFactoryTest, HdfsCollectionsAPIDistributedZkTest, HdfsUnloadDistributedZkTest, TestSearcherReuse, TestCollationFieldDocValues, ExternalFileFieldSortTest, BufferStoreTest, OverseerCollectionConfigSetProcessorTest, TestCollapseQParserPlugin, HttpPartitionTest, AsyncMigrateRouteKeyTest, UpdateParamsTest, HdfsThreadLeakTest, TestPseudoReturnFields, TestSolrQueryParserDefaultOperatorResource, PreAnalyzedFieldTest, TestRestManager, TestSolrConfigHandler, SliceStateTest, TestSort, TestExtendedDismaxParser, TestHdfsBackupRestoreCore, OverseerTest, TestRandomRequestDistribution, DeleteShardTest, AlternateDirectoryTest, TestDefaultSearchFieldResource, AtomicUpdatesTest, HdfsBasicDistributedZk2Test, TestRequestStatusCollectionAPI, TestBlendedInfixSuggestions, TestExpandComponent, SolrXmlInZkTest, TestNumericTerms32, TestHashPartitioner, SimpleMLTQParserTest, FastVectorHighlighterTest, HdfsRestartWhileUpdatingTest, IndexBasedSpellCheckerTest, ReplicationFactorTest, SolrCoreTest, PKIAuthenticationIntegrationTest, AssignTest, TestSchemaResource, BasicDistributedZkTest, UnloadDistributedZkTest, LeaderElectionIntegrationTest, BasicZkTest, RecoveryZkTest, LeaderElectionTest, TestZkChroot, TestRandomDVFaceting, ShardRoutingCustomTest, TestDistributedSearch, AutoCommitTest, TestDistributedGrouping, TestFaceting, TermVectorComponentDistributedTest, ZkControllerTest, TestRealTimeGet, TestJoin, TestReload, SimpleFacetsTest, SpellCheckComponentTest, TestGroupingSearch, QueryElevationComponentTest, PeerSyncTest, ConvertedLegacyTest, TestFiltering, BasicFunctionalityTest, TestLazyCores, DistributedQueryElevationComponentTest, SolrIndexSplitterTest, SimplePostToolTest, AnalysisAfterCoreReloadTest, SignatureUpdateProcessorFactoryTest, SuggesterFSTTest, DocValuesTest, SuggesterTest, TestStressLucene, TestTrie, SuggesterWFSTTest, NoCacheHeaderTest, WordBreakSolrSpellCheckerTest, SchemaVersionSpecificBehaviorTest, FieldMutatingUpdateProcessorTest, TestWordDelimiterFilterFactory, QueryEqualityTest, DirectUpdateHandlerOptimizeTest, StatelessScriptUpdateProcessorFactoryTest, SortByFunctionTest, TestRemoteStreaming, DocValuesMultiTest, DistanceFunctionTest, TestSolrDeletionPolicy1, SolrInfoMBeanTest, XsltUpdateRequestHandlerTest, DebugComponentTest, DirectSolrSpellCheckerTest, TestReversedWildcardFilterFactory, TestQueryTypes, PrimitiveFieldTypeTest, TestOmitPositions, TermsComponentTest, XmlUpdateRequestHandlerTest, DocumentBuilderTest, PathHierarchyTokenizerFactoryTest, MoreLikeThisHandlerTest, RequiredFieldsTest, FieldAnalysisRequestHandlerTest, TestSolrQueryParser, TestArbitraryIndexDir, IndexSchemaRuntimeFieldTest, RegexBoostProcessorTest, SolrPluginUtilsTest, JSONWriterTest, MBeansHandlerTest, TestAnalyzedSuggestions, BinaryUpdateRequestHandlerTest, TestPHPSerializedResponseWriter, HighlighterConfigTest, TestSolrIndexConfig, TestQuerySenderNoQuery, CopyFieldTest, ResponseLogComponentTest, SolrIndexConfigTest, BadComponentTest, TestMergePolicyConfig, TestSolrDeletionPolicy2, MultiTermTest, SampleTest, TestSearchPerf, TestElisionMultitermQuery, TestConfig, OutputWriterTest, TestFuzzyAnalyzedSuggestions, TestSolrCoreProperties, TestPostingsSolrHighlighter, TestLuceneMatchVersion, TestPhraseSuggestions, SpellPossibilityIteratorTest, SynonymTokenizerTest, TestXIncludeConfig, EchoParamsTest, TestDFRSimilarityFactory, TestPerFieldSimilarity, TestLMJelinekMercerSimilarityFactory, TestBM25SimilarityFactory, TestFastWriter, TestJmxMonitoredMap, TimeZoneUtilsTest, ResourceLoaderTest, TestFastOutputStream, OpenExchangeRatesOrgProviderTest, URLClassifyProcessorTest, DateMathParserTest, TestSystemIdResolver, PrimUtilsTest, TestSuggestSpellingConverter, DOMUtilTest, ClusterStateTest, TestLRUCache, TestUtils, ZkNodePropsTest, SystemInfoHandlerTest, UUIDFieldTest, DistributedMLTComponentTest, TestRTGBase, CursorPagingTest, TestCursorMarkWithoutUniqueKey, TestSimpleTrackingShardHandler, ActionThrottleTest, AliasIntegrationTest, AsyncCallRequestStatusResponseTest, BaseCdcrDistributedZkTest, CdcrReplicationDistributedZkTest, CdcrReplicationHandlerTest, CdcrRequestHandlerTest, CdcrVersionReplicationTest]
   [junit4]   2> NOTE: reproduce with: ant test  -Dtestcase=CdcrVersionReplicationTest -Dtests.seed=AE17F471E70AEC35 -Dtests.slow=true -Dtests.locale=de-LU -Dtests.timezone=WET -Dtests.asserts=true -Dtests.file.encoding=ISO-8859-1
   [junit4] ERROR   0.00s J0 | CdcrVersionReplicationTest (suite) <<<
   [junit4]    > Throwable #1: java.lang.AssertionError: ObjectTracker found 1 object(s) that were not released!!! [InternalHttpClient]
   [junit4]    > 	at __randomizedtesting.SeedInfo.seed([AE17F471E70AEC35]:0)
   [junit4]    > 	at org.apache.solr.SolrTestCaseJ4.teardownTestCases(SolrTestCaseJ4.java:256)
   [junit4]    > 	at java.lang.Thread.run(Thread.java:745)
   [junit4] Completed [434/616 (2!)] on J0 in 20.97s, 1 test, 1 failure <<< FAILURES!

[...truncated 593 lines...]
BUILD FAILED
C:\Users\jenkins\workspace\Lucene-Solr-master-Windows\build.xml:740: The following error occurred while executing this line:
C:\Users\jenkins\workspace\Lucene-Solr-master-Windows\build.xml:684: The following error occurred while executing this line:
C:\Users\jenkins\workspace\Lucene-Solr-master-Windows\build.xml:59: The following error occurred while executing this line:
C:\Users\jenkins\workspace\Lucene-Solr-master-Windows\solr\build.xml:233: The following error occurred while executing this line:
C:\Users\jenkins\workspace\Lucene-Solr-master-Windows\solr\common-build.xml:530: The following error occurred while executing this line:
C:\Users\jenkins\workspace\Lucene-Solr-master-Windows\lucene\common-build.xml:1427: The following error occurred while executing this line:
C:\Users\jenkins\workspace\Lucene-Solr-master-Windows\lucene\common-build.xml:984: There were test failures: 616 suites (10 ignored), 2590 tests, 3 suite-level errors, 127 ignored (82 assumptions) [seed: AE17F471E70AEC35]

Total time: 80 minutes 2 seconds
Build step 'Invoke Ant' marked build as failure
Archiving artifacts
[WARNINGS] Skipping publisher since build result is FAILURE
Recording test results
Email was triggered for: Failure - Any
Sending email for trigger: Failure - Any



Mime
View raw message