lucene-dev mailing list archives

Site index · List index
Message view « Date » · « Thread »
Top « Date » · « Thread »
From Policeman Jenkins Server <jenk...@thetaphi.de>
Subject [JENKINS] Lucene-Solr-master-Solaris (64bit/jdk1.8.0) - Build # 656 - Still Failing!
Date Sat, 18 Jun 2016 18:31:31 GMT
Build: http://jenkins.thetaphi.de/job/Lucene-Solr-master-Solaris/656/
Java: 64bit/jdk1.8.0 -XX:-UseCompressedOops -XX:+UseG1GC

1 tests failed.
FAILED:  org.apache.solr.cloud.TestCryptoKeys.test

Error Message:
Could not find collection:.system

Stack Trace:
java.lang.AssertionError: Could not find collection:.system
	at __randomizedtesting.SeedInfo.seed([8A141FED64EA135:80F57E2478B2CCCD]:0)
	at org.junit.Assert.fail(Assert.java:93)
	at org.junit.Assert.assertTrue(Assert.java:43)
	at org.junit.Assert.assertNotNull(Assert.java:526)
	at org.apache.solr.cloud.AbstractDistribZkTestBase.waitForRecoveriesToFinish(AbstractDistribZkTestBase.java:154)
	at org.apache.solr.cloud.AbstractDistribZkTestBase.waitForRecoveriesToFinish(AbstractDistribZkTestBase.java:139)
	at org.apache.solr.cloud.AbstractDistribZkTestBase.waitForRecoveriesToFinish(AbstractDistribZkTestBase.java:134)
	at org.apache.solr.cloud.AbstractFullDistribZkTestBase.waitForRecoveriesToFinish(AbstractFullDistribZkTestBase.java:856)
	at org.apache.solr.cloud.TestCryptoKeys.test(TestCryptoKeys.java:117)
	at sun.reflect.NativeMethodAccessorImpl.invoke0(Native Method)
	at sun.reflect.NativeMethodAccessorImpl.invoke(NativeMethodAccessorImpl.java:62)
	at sun.reflect.DelegatingMethodAccessorImpl.invoke(DelegatingMethodAccessorImpl.java:43)
	at java.lang.reflect.Method.invoke(Method.java:498)
	at com.carrotsearch.randomizedtesting.RandomizedRunner.invoke(RandomizedRunner.java:1764)
	at com.carrotsearch.randomizedtesting.RandomizedRunner$8.evaluate(RandomizedRunner.java:871)
	at com.carrotsearch.randomizedtesting.RandomizedRunner$9.evaluate(RandomizedRunner.java:907)
	at com.carrotsearch.randomizedtesting.RandomizedRunner$10.evaluate(RandomizedRunner.java:921)
	at org.apache.solr.BaseDistributedSearchTestCase$ShardsRepeatRule$ShardsFixedStatement.callStatement(BaseDistributedSearchTestCase.java:985)
	at org.apache.solr.BaseDistributedSearchTestCase$ShardsRepeatRule$ShardsStatement.evaluate(BaseDistributedSearchTestCase.java:960)
	at com.carrotsearch.randomizedtesting.rules.SystemPropertiesRestoreRule$1.evaluate(SystemPropertiesRestoreRule.java:57)
	at org.apache.lucene.util.TestRuleSetupTeardownChained$1.evaluate(TestRuleSetupTeardownChained.java:49)
	at org.apache.lucene.util.AbstractBeforeAfterRule$1.evaluate(AbstractBeforeAfterRule.java:45)
	at org.apache.lucene.util.TestRuleThreadAndTestName$1.evaluate(TestRuleThreadAndTestName.java:48)
	at org.apache.lucene.util.TestRuleIgnoreAfterMaxFailures$1.evaluate(TestRuleIgnoreAfterMaxFailures.java:64)
	at org.apache.lucene.util.TestRuleMarkFailure$1.evaluate(TestRuleMarkFailure.java:47)
	at com.carrotsearch.randomizedtesting.rules.StatementAdapter.evaluate(StatementAdapter.java:36)
	at com.carrotsearch.randomizedtesting.ThreadLeakControl$StatementRunner.run(ThreadLeakControl.java:367)
	at com.carrotsearch.randomizedtesting.ThreadLeakControl.forkTimeoutingTask(ThreadLeakControl.java:809)
	at com.carrotsearch.randomizedtesting.ThreadLeakControl$3.evaluate(ThreadLeakControl.java:460)
	at com.carrotsearch.randomizedtesting.RandomizedRunner.runSingleTest(RandomizedRunner.java:880)
	at com.carrotsearch.randomizedtesting.RandomizedRunner$5.evaluate(RandomizedRunner.java:781)
	at com.carrotsearch.randomizedtesting.RandomizedRunner$6.evaluate(RandomizedRunner.java:816)
	at com.carrotsearch.randomizedtesting.RandomizedRunner$7.evaluate(RandomizedRunner.java:827)
	at com.carrotsearch.randomizedtesting.rules.StatementAdapter.evaluate(StatementAdapter.java:36)
	at com.carrotsearch.randomizedtesting.rules.SystemPropertiesRestoreRule$1.evaluate(SystemPropertiesRestoreRule.java:57)
	at org.apache.lucene.util.AbstractBeforeAfterRule$1.evaluate(AbstractBeforeAfterRule.java:45)
	at com.carrotsearch.randomizedtesting.rules.StatementAdapter.evaluate(StatementAdapter.java:36)
	at org.apache.lucene.util.TestRuleStoreClassName$1.evaluate(TestRuleStoreClassName.java:41)
	at com.carrotsearch.randomizedtesting.rules.NoShadowingOrOverridesOnMethodsRule$1.evaluate(NoShadowingOrOverridesOnMethodsRule.java:40)
	at com.carrotsearch.randomizedtesting.rules.NoShadowingOrOverridesOnMethodsRule$1.evaluate(NoShadowingOrOverridesOnMethodsRule.java:40)
	at com.carrotsearch.randomizedtesting.rules.StatementAdapter.evaluate(StatementAdapter.java:36)
	at com.carrotsearch.randomizedtesting.rules.StatementAdapter.evaluate(StatementAdapter.java:36)
	at com.carrotsearch.randomizedtesting.rules.StatementAdapter.evaluate(StatementAdapter.java:36)
	at org.apache.lucene.util.TestRuleAssertionsRequired$1.evaluate(TestRuleAssertionsRequired.java:53)
	at org.apache.lucene.util.TestRuleMarkFailure$1.evaluate(TestRuleMarkFailure.java:47)
	at org.apache.lucene.util.TestRuleIgnoreAfterMaxFailures$1.evaluate(TestRuleIgnoreAfterMaxFailures.java:64)
	at org.apache.lucene.util.TestRuleIgnoreTestSuites$1.evaluate(TestRuleIgnoreTestSuites.java:54)
	at com.carrotsearch.randomizedtesting.rules.StatementAdapter.evaluate(StatementAdapter.java:36)
	at com.carrotsearch.randomizedtesting.ThreadLeakControl$StatementRunner.run(ThreadLeakControl.java:367)
	at java.lang.Thread.run(Thread.java:745)




Build Log:
[...truncated 11992 lines...]
   [junit4] Suite: org.apache.solr.cloud.TestCryptoKeys
   [junit4]   2> Creating dataDir: /export/home/jenkins/workspace/Lucene-Solr-master-Solaris/solr/build/solr-core/test/J1/temp/solr.cloud.TestCryptoKeys_8A141FED64EA135-001/init-core-data-001
   [junit4]   2> 2637119 INFO  (SUITE-TestCryptoKeys-seed#[8A141FED64EA135]-worker) [    ] o.a.s.SolrTestCaseJ4 Randomized ssl (false) and clientAuth (false) via: @org.apache.solr.util.RandomizeSSL(reason=, value=NaN, ssl=NaN, clientAuth=NaN)
   [junit4]   2> 2637119 INFO  (SUITE-TestCryptoKeys-seed#[8A141FED64EA135]-worker) [    ] o.a.s.BaseDistributedSearchTestCase Setting hostContext system property: /
   [junit4]   2> 2637122 INFO  (TEST-TestCryptoKeys.test-seed#[8A141FED64EA135]) [    ] o.a.s.c.ZkTestServer STARTING ZK TEST SERVER
   [junit4]   2> 2637123 INFO  (Thread-9347) [    ] o.a.s.c.ZkTestServer client port:0.0.0.0/0.0.0.0:0
   [junit4]   2> 2637123 INFO  (Thread-9347) [    ] o.a.s.c.ZkTestServer Starting server
   [junit4]   2> 2637223 INFO  (TEST-TestCryptoKeys.test-seed#[8A141FED64EA135]) [    ] o.a.s.c.ZkTestServer start zk server on port:51435
   [junit4]   2> 2637223 INFO  (TEST-TestCryptoKeys.test-seed#[8A141FED64EA135]) [    ] o.a.s.c.c.SolrZkClient Using default ZkCredentialsProvider
   [junit4]   2> 2637224 INFO  (TEST-TestCryptoKeys.test-seed#[8A141FED64EA135]) [    ] o.a.s.c.c.ConnectionManager Waiting for client to connect to ZooKeeper
   [junit4]   2> 2637227 INFO  (zkCallback-3051-thread-1) [    ] o.a.s.c.c.ConnectionManager Watcher org.apache.solr.common.cloud.ConnectionManager@e55d2d0 name:ZooKeeperConnection Watcher:127.0.0.1:51435 got event WatchedEvent state:SyncConnected type:None path:null path:null type:None
   [junit4]   2> 2637227 INFO  (TEST-TestCryptoKeys.test-seed#[8A141FED64EA135]) [    ] o.a.s.c.c.ConnectionManager Client is connected to ZooKeeper
   [junit4]   2> 2637228 INFO  (TEST-TestCryptoKeys.test-seed#[8A141FED64EA135]) [    ] o.a.s.c.c.SolrZkClient Using default ZkACLProvider
   [junit4]   2> 2637228 INFO  (TEST-TestCryptoKeys.test-seed#[8A141FED64EA135]) [    ] o.a.s.c.c.SolrZkClient makePath: /solr
   [junit4]   2> 2637232 INFO  (TEST-TestCryptoKeys.test-seed#[8A141FED64EA135]) [    ] o.a.s.c.c.SolrZkClient Using default ZkCredentialsProvider
   [junit4]   2> 2637234 INFO  (TEST-TestCryptoKeys.test-seed#[8A141FED64EA135]) [    ] o.a.s.c.c.ConnectionManager Waiting for client to connect to ZooKeeper
   [junit4]   2> 2637236 INFO  (zkCallback-3052-thread-1) [    ] o.a.s.c.c.ConnectionManager Watcher org.apache.solr.common.cloud.ConnectionManager@1d15dcb5 name:ZooKeeperConnection Watcher:127.0.0.1:51435/solr got event WatchedEvent state:SyncConnected type:None path:null path:null type:None
   [junit4]   2> 2637236 INFO  (TEST-TestCryptoKeys.test-seed#[8A141FED64EA135]) [    ] o.a.s.c.c.ConnectionManager Client is connected to ZooKeeper
   [junit4]   2> 2637236 INFO  (TEST-TestCryptoKeys.test-seed#[8A141FED64EA135]) [    ] o.a.s.c.c.SolrZkClient Using default ZkACLProvider
   [junit4]   2> 2637236 INFO  (TEST-TestCryptoKeys.test-seed#[8A141FED64EA135]) [    ] o.a.s.c.c.SolrZkClient makePath: /collections/collection1
   [junit4]   2> 2637240 INFO  (TEST-TestCryptoKeys.test-seed#[8A141FED64EA135]) [    ] o.a.s.c.c.SolrZkClient makePath: /collections/collection1/shards
   [junit4]   2> 2637244 INFO  (TEST-TestCryptoKeys.test-seed#[8A141FED64EA135]) [    ] o.a.s.c.c.SolrZkClient makePath: /collections/control_collection
   [junit4]   2> 2637246 INFO  (TEST-TestCryptoKeys.test-seed#[8A141FED64EA135]) [    ] o.a.s.c.c.SolrZkClient makePath: /collections/control_collection/shards
   [junit4]   2> 2637250 INFO  (TEST-TestCryptoKeys.test-seed#[8A141FED64EA135]) [    ] o.a.s.c.AbstractZkTestCase put /export/home/jenkins/workspace/Lucene-Solr-master-Solaris/solr/core/src/test-files/solr/collection1/conf/solrconfig-tlog.xml to /configs/conf1/solrconfig.xml
   [junit4]   2> 2637250 INFO  (TEST-TestCryptoKeys.test-seed#[8A141FED64EA135]) [    ] o.a.s.c.c.SolrZkClient makePath: /configs/conf1/solrconfig.xml
   [junit4]   2> 2637255 INFO  (TEST-TestCryptoKeys.test-seed#[8A141FED64EA135]) [    ] o.a.s.c.AbstractZkTestCase put /export/home/jenkins/workspace/Lucene-Solr-master-Solaris/solr/core/src/test-files/solr/collection1/conf/schema.xml to /configs/conf1/schema.xml
   [junit4]   2> 2637256 INFO  (TEST-TestCryptoKeys.test-seed#[8A141FED64EA135]) [    ] o.a.s.c.c.SolrZkClient makePath: /configs/conf1/schema.xml
   [junit4]   2> 2637259 INFO  (TEST-TestCryptoKeys.test-seed#[8A141FED64EA135]) [    ] o.a.s.c.AbstractZkTestCase put /export/home/jenkins/workspace/Lucene-Solr-master-Solaris/solr/core/src/test-files/solr/collection1/conf/solrconfig.snippet.randomindexconfig.xml to /configs/conf1/solrconfig.snippet.randomindexconfig.xml
   [junit4]   2> 2637259 INFO  (TEST-TestCryptoKeys.test-seed#[8A141FED64EA135]) [    ] o.a.s.c.c.SolrZkClient makePath: /configs/conf1/solrconfig.snippet.randomindexconfig.xml
   [junit4]   2> 2637262 INFO  (TEST-TestCryptoKeys.test-seed#[8A141FED64EA135]) [    ] o.a.s.c.AbstractZkTestCase put /export/home/jenkins/workspace/Lucene-Solr-master-Solaris/solr/core/src/test-files/solr/collection1/conf/stopwords.txt to /configs/conf1/stopwords.txt
   [junit4]   2> 2637262 INFO  (TEST-TestCryptoKeys.test-seed#[8A141FED64EA135]) [    ] o.a.s.c.c.SolrZkClient makePath: /configs/conf1/stopwords.txt
   [junit4]   2> 2637265 INFO  (TEST-TestCryptoKeys.test-seed#[8A141FED64EA135]) [    ] o.a.s.c.AbstractZkTestCase put /export/home/jenkins/workspace/Lucene-Solr-master-Solaris/solr/core/src/test-files/solr/collection1/conf/protwords.txt to /configs/conf1/protwords.txt
   [junit4]   2> 2637265 INFO  (TEST-TestCryptoKeys.test-seed#[8A141FED64EA135]) [    ] o.a.s.c.c.SolrZkClient makePath: /configs/conf1/protwords.txt
   [junit4]   2> 2637269 INFO  (TEST-TestCryptoKeys.test-seed#[8A141FED64EA135]) [    ] o.a.s.c.AbstractZkTestCase put /export/home/jenkins/workspace/Lucene-Solr-master-Solaris/solr/core/src/test-files/solr/collection1/conf/currency.xml to /configs/conf1/currency.xml
   [junit4]   2> 2637269 INFO  (TEST-TestCryptoKeys.test-seed#[8A141FED64EA135]) [    ] o.a.s.c.c.SolrZkClient makePath: /configs/conf1/currency.xml
   [junit4]   2> 2637273 INFO  (TEST-TestCryptoKeys.test-seed#[8A141FED64EA135]) [    ] o.a.s.c.AbstractZkTestCase put /export/home/jenkins/workspace/Lucene-Solr-master-Solaris/solr/core/src/test-files/solr/collection1/conf/enumsConfig.xml to /configs/conf1/enumsConfig.xml
   [junit4]   2> 2637274 INFO  (TEST-TestCryptoKeys.test-seed#[8A141FED64EA135]) [    ] o.a.s.c.c.SolrZkClient makePath: /configs/conf1/enumsConfig.xml
   [junit4]   2> 2637277 INFO  (TEST-TestCryptoKeys.test-seed#[8A141FED64EA135]) [    ] o.a.s.c.AbstractZkTestCase put /export/home/jenkins/workspace/Lucene-Solr-master-Solaris/solr/core/src/test-files/solr/collection1/conf/open-exchange-rates.json to /configs/conf1/open-exchange-rates.json
   [junit4]   2> 2637277 INFO  (TEST-TestCryptoKeys.test-seed#[8A141FED64EA135]) [    ] o.a.s.c.c.SolrZkClient makePath: /configs/conf1/open-exchange-rates.json
   [junit4]   2> 2637280 INFO  (TEST-TestCryptoKeys.test-seed#[8A141FED64EA135]) [    ] o.a.s.c.AbstractZkTestCase put /export/home/jenkins/workspace/Lucene-Solr-master-Solaris/solr/core/src/test-files/solr/collection1/conf/mapping-ISOLatin1Accent.txt to /configs/conf1/mapping-ISOLatin1Accent.txt
   [junit4]   2> 2637281 INFO  (TEST-TestCryptoKeys.test-seed#[8A141FED64EA135]) [    ] o.a.s.c.c.SolrZkClient makePath: /configs/conf1/mapping-ISOLatin1Accent.txt
   [junit4]   2> 2637284 INFO  (TEST-TestCryptoKeys.test-seed#[8A141FED64EA135]) [    ] o.a.s.c.AbstractZkTestCase put /export/home/jenkins/workspace/Lucene-Solr-master-Solaris/solr/core/src/test-files/solr/collection1/conf/old_synonyms.txt to /configs/conf1/old_synonyms.txt
   [junit4]   2> 2637284 INFO  (TEST-TestCryptoKeys.test-seed#[8A141FED64EA135]) [    ] o.a.s.c.c.SolrZkClient makePath: /configs/conf1/old_synonyms.txt
   [junit4]   2> 2637288 INFO  (TEST-TestCryptoKeys.test-seed#[8A141FED64EA135]) [    ] o.a.s.c.AbstractZkTestCase put /export/home/jenkins/workspace/Lucene-Solr-master-Solaris/solr/core/src/test-files/solr/collection1/conf/synonyms.txt to /configs/conf1/synonyms.txt
   [junit4]   2> 2637288 INFO  (TEST-TestCryptoKeys.test-seed#[8A141FED64EA135]) [    ] o.a.s.c.c.SolrZkClient makePath: /configs/conf1/synonyms.txt
   [junit4]   2> 2637429 INFO  (TEST-TestCryptoKeys.test-seed#[8A141FED64EA135]) [    ] o.a.s.SolrTestCaseJ4 Writing core.properties file to /export/home/jenkins/workspace/Lucene-Solr-master-Solaris/solr/build/solr-core/test/J1/temp/solr.cloud.TestCryptoKeys_8A141FED64EA135-001/control-001/cores/collection1
   [junit4]   2> 2637430 INFO  (TEST-TestCryptoKeys.test-seed#[8A141FED64EA135]) [    ] o.e.j.s.Server jetty-9.3.8.v20160314
   [junit4]   2> 2637431 INFO  (TEST-TestCryptoKeys.test-seed#[8A141FED64EA135]) [    ] o.e.j.s.h.ContextHandler Started o.e.j.s.ServletContextHandler@ab8cb3c{/,null,AVAILABLE}
   [junit4]   2> 2637433 INFO  (TEST-TestCryptoKeys.test-seed#[8A141FED64EA135]) [    ] o.e.j.s.ServerConnector Started ServerConnector@669a064d{HTTP/1.1,[http/1.1]}{127.0.0.1:32962}
   [junit4]   2> 2637433 INFO  (TEST-TestCryptoKeys.test-seed#[8A141FED64EA135]) [    ] o.e.j.s.Server Started @2643635ms
   [junit4]   2> 2637433 INFO  (TEST-TestCryptoKeys.test-seed#[8A141FED64EA135]) [    ] o.a.s.c.s.e.JettySolrRunner Jetty properties: {solr.data.dir=/export/home/jenkins/workspace/Lucene-Solr-master-Solaris/solr/build/solr-core/test/J1/temp/solr.cloud.TestCryptoKeys_8A141FED64EA135-001/tempDir-001/control/data, hostContext=/, hostPort=32962, coreRootDirectory=/export/home/jenkins/workspace/Lucene-Solr-master-Solaris/solr/build/solr-core/test/J1/../../../../../../../../../../export/home/jenkins/workspace/Lucene-Solr-master-Solaris/solr/build/solr-core/test/J1/temp/solr.cloud.TestCryptoKeys_8A141FED64EA135-001/control-001/cores}
   [junit4]   2> 2637434 INFO  (TEST-TestCryptoKeys.test-seed#[8A141FED64EA135]) [    ] o.a.s.s.SolrDispatchFilter SolrDispatchFilter.init(): sun.misc.Launcher$AppClassLoader@6d06d69c
   [junit4]   2> 2637434 INFO  (TEST-TestCryptoKeys.test-seed#[8A141FED64EA135]) [    ] o.a.s.c.SolrResourceLoader new SolrResourceLoader for directory: '/export/home/jenkins/workspace/Lucene-Solr-master-Solaris/solr/build/solr-core/test/J1/temp/solr.cloud.TestCryptoKeys_8A141FED64EA135-001/control-001'
   [junit4]   2> 2637434 INFO  (TEST-TestCryptoKeys.test-seed#[8A141FED64EA135]) [    ] o.a.s.c.SolrResourceLoader JNDI not configured for solr (NoInitialContextEx)
   [junit4]   2> 2637434 INFO  (TEST-TestCryptoKeys.test-seed#[8A141FED64EA135]) [    ] o.a.s.c.SolrResourceLoader solr home defaulted to 'solr/' (could not find system property or JNDI)
   [junit4]   2> 2637434 INFO  (TEST-TestCryptoKeys.test-seed#[8A141FED64EA135]) [    ] o.a.s.c.c.SolrZkClient Using default ZkCredentialsProvider
   [junit4]   2> 2637435 INFO  (TEST-TestCryptoKeys.test-seed#[8A141FED64EA135]) [    ] o.a.s.c.c.ConnectionManager Waiting for client to connect to ZooKeeper
   [junit4]   2> 2637436 INFO  (zkCallback-3053-thread-1) [    ] o.a.s.c.c.ConnectionManager Watcher org.apache.solr.common.cloud.ConnectionManager@6114f555 name:ZooKeeperConnection Watcher:127.0.0.1:51435/solr got event WatchedEvent state:SyncConnected type:None path:null path:null type:None
   [junit4]   2> 2637436 INFO  (TEST-TestCryptoKeys.test-seed#[8A141FED64EA135]) [    ] o.a.s.c.c.ConnectionManager Client is connected to ZooKeeper
   [junit4]   2> 2637437 INFO  (TEST-TestCryptoKeys.test-seed#[8A141FED64EA135]) [    ] o.a.s.c.c.SolrZkClient Using default ZkACLProvider
   [junit4]   2> 2637439 INFO  (TEST-TestCryptoKeys.test-seed#[8A141FED64EA135]) [    ] o.a.s.s.SolrDispatchFilter Loading solr.xml from SolrHome (not found in ZooKeeper)
   [junit4]   2> 2637439 INFO  (TEST-TestCryptoKeys.test-seed#[8A141FED64EA135]) [    ] o.a.s.c.SolrXmlConfig Loading container configuration from /export/home/jenkins/workspace/Lucene-Solr-master-Solaris/solr/build/solr-core/test/J1/temp/solr.cloud.TestCryptoKeys_8A141FED64EA135-001/control-001/solr.xml
   [junit4]   2> 2637454 INFO  (TEST-TestCryptoKeys.test-seed#[8A141FED64EA135]) [    ] o.a.s.c.CorePropertiesLocator Config-defined core root directory: /export/home/jenkins/workspace/Lucene-Solr-master-Solaris/solr/build/solr-core/test/J1/../../../../../../../../../../export/home/jenkins/workspace/Lucene-Solr-master-Solaris/solr/build/solr-core/test/J1/temp/solr.cloud.TestCryptoKeys_8A141FED64EA135-001/control-001/cores
   [junit4]   2> 2637454 INFO  (TEST-TestCryptoKeys.test-seed#[8A141FED64EA135]) [    ] o.a.s.c.CoreContainer New CoreContainer 1042272758
   [junit4]   2> 2637455 INFO  (TEST-TestCryptoKeys.test-seed#[8A141FED64EA135]) [    ] o.a.s.c.CoreContainer Loading cores into CoreContainer [instanceDir=/export/home/jenkins/workspace/Lucene-Solr-master-Solaris/solr/build/solr-core/test/J1/temp/solr.cloud.TestCryptoKeys_8A141FED64EA135-001/control-001]
   [junit4]   2> 2637455 WARN  (TEST-TestCryptoKeys.test-seed#[8A141FED64EA135]) [    ] o.a.s.c.CoreContainer Couldn't add files from /export/home/jenkins/workspace/Lucene-Solr-master-Solaris/solr/build/solr-core/test/J1/temp/solr.cloud.TestCryptoKeys_8A141FED64EA135-001/control-001/lib to classpath: /export/home/jenkins/workspace/Lucene-Solr-master-Solaris/solr/build/solr-core/test/J1/temp/solr.cloud.TestCryptoKeys_8A141FED64EA135-001/control-001/lib
   [junit4]   2> 2637455 INFO  (TEST-TestCryptoKeys.test-seed#[8A141FED64EA135]) [    ] o.a.s.h.c.HttpShardHandlerFactory created with socketTimeout : 90000,urlScheme : ,connTimeout : 15000,maxConnectionsPerHost : 20,maxConnections : 10000,corePoolSize : 0,maximumPoolSize : 2147483647,maxThreadIdleTime : 5,sizeOfQueue : -1,fairnessPolicy : false,
   [junit4]   2> 2637456 INFO  (TEST-TestCryptoKeys.test-seed#[8A141FED64EA135]) [    ] o.a.s.u.UpdateShardHandler Creating UpdateShardHandler HTTP client with params: 
   [junit4]   2> 2637457 INFO  (TEST-TestCryptoKeys.test-seed#[8A141FED64EA135]) [    ] o.a.s.l.LogWatcher SLF4J impl is org.slf4j.impl.Log4jLoggerFactory
   [junit4]   2> 2637457 INFO  (TEST-TestCryptoKeys.test-seed#[8A141FED64EA135]) [    ] o.a.s.l.LogWatcher Registering Log Listener [Log4j (org.slf4j.impl.Log4jLoggerFactory)]
   [junit4]   2> 2637457 INFO  (TEST-TestCryptoKeys.test-seed#[8A141FED64EA135]) [    ] o.a.s.c.ZkContainer Zookeeper client=127.0.0.1:51435/solr
   [junit4]   2> 2637457 INFO  (TEST-TestCryptoKeys.test-seed#[8A141FED64EA135]) [    ] o.a.s.c.ZkController zkHost includes chroot
   [junit4]   2> 2637457 INFO  (TEST-TestCryptoKeys.test-seed#[8A141FED64EA135]) [    ] o.a.s.c.c.SolrZkClient Using default ZkCredentialsProvider
   [junit4]   2> 2637458 INFO  (TEST-TestCryptoKeys.test-seed#[8A141FED64EA135]) [    ] o.a.s.c.c.ConnectionManager Waiting for client to connect to ZooKeeper
   [junit4]   2> 2637460 INFO  (zkCallback-3056-thread-1) [    ] o.a.s.c.c.ConnectionManager Watcher org.apache.solr.common.cloud.ConnectionManager@457812be name:ZooKeeperConnection Watcher:127.0.0.1:51435 got event WatchedEvent state:SyncConnected type:None path:null path:null type:None
   [junit4]   2> 2637460 INFO  (TEST-TestCryptoKeys.test-seed#[8A141FED64EA135]) [    ] o.a.s.c.c.ConnectionManager Client is connected to ZooKeeper
   [junit4]   2> 2637460 INFO  (TEST-TestCryptoKeys.test-seed#[8A141FED64EA135]) [    ] o.a.s.c.c.SolrZkClient Using default ZkACLProvider
   [junit4]   2> 2637462 INFO  (TEST-TestCryptoKeys.test-seed#[8A141FED64EA135]) [n:127.0.0.1:32962_    ] o.a.s.c.ZkController Added new OnReconnect listener org.apache.solr.cloud.ZkController$$Lambda$48/1352787704@2f0de3de
   [junit4]   2> 2637462 INFO  (TEST-TestCryptoKeys.test-seed#[8A141FED64EA135]) [n:127.0.0.1:32962_    ] o.a.s.c.c.ConnectionManager Waiting for client to connect to ZooKeeper
   [junit4]   2> 2637463 INFO  (zkCallback-3057-thread-1-processing-n:127.0.0.1:32962_) [n:127.0.0.1:32962_    ] o.a.s.c.c.ConnectionManager Watcher org.apache.solr.common.cloud.ConnectionManager@214181e2 name:ZooKeeperConnection Watcher:127.0.0.1:51435/solr got event WatchedEvent state:SyncConnected type:None path:null path:null type:None
   [junit4]   2> 2637463 INFO  (TEST-TestCryptoKeys.test-seed#[8A141FED64EA135]) [n:127.0.0.1:32962_    ] o.a.s.c.c.ConnectionManager Client is connected to ZooKeeper
   [junit4]   2> 2637465 INFO  (TEST-TestCryptoKeys.test-seed#[8A141FED64EA135]) [n:127.0.0.1:32962_    ] o.a.s.c.c.SolrZkClient makePath: /overseer/queue
   [junit4]   2> 2637467 INFO  (TEST-TestCryptoKeys.test-seed#[8A141FED64EA135]) [n:127.0.0.1:32962_    ] o.a.s.c.c.SolrZkClient makePath: /overseer/collection-queue-work
   [junit4]   2> 2637472 INFO  (TEST-TestCryptoKeys.test-seed#[8A141FED64EA135]) [n:127.0.0.1:32962_    ] o.a.s.c.c.SolrZkClient makePath: /overseer/collection-map-running
   [junit4]   2> 2637475 INFO  (TEST-TestCryptoKeys.test-seed#[8A141FED64EA135]) [n:127.0.0.1:32962_    ] o.a.s.c.c.SolrZkClient makePath: /overseer/collection-map-completed
   [junit4]   2> 2637478 INFO  (TEST-TestCryptoKeys.test-seed#[8A141FED64EA135]) [n:127.0.0.1:32962_    ] o.a.s.c.c.SolrZkClient makePath: /overseer/collection-map-failure
   [junit4]   2> 2637480 INFO  (TEST-TestCryptoKeys.test-seed#[8A141FED64EA135]) [n:127.0.0.1:32962_    ] o.a.s.c.c.SolrZkClient makePath: /live_nodes
   [junit4]   2> 2637482 INFO  (TEST-TestCryptoKeys.test-seed#[8A141FED64EA135]) [n:127.0.0.1:32962_    ] o.a.s.c.c.SolrZkClient makePath: /aliases.json
   [junit4]   2> 2637484 INFO  (TEST-TestCryptoKeys.test-seed#[8A141FED64EA135]) [n:127.0.0.1:32962_    ] o.a.s.c.c.SolrZkClient makePath: /clusterstate.json
   [junit4]   2> 2637486 INFO  (TEST-TestCryptoKeys.test-seed#[8A141FED64EA135]) [n:127.0.0.1:32962_    ] o.a.s.c.c.SolrZkClient makePath: /security.json
   [junit4]   2> 2637488 INFO  (TEST-TestCryptoKeys.test-seed#[8A141FED64EA135]) [n:127.0.0.1:32962_    ] o.a.s.c.c.ZkStateReader Updating cluster state from ZooKeeper... 
   [junit4]   2> 2637489 INFO  (TEST-TestCryptoKeys.test-seed#[8A141FED64EA135]) [n:127.0.0.1:32962_    ] o.a.s.c.c.ZkStateReader Loaded empty cluster properties
   [junit4]   2> 2637490 INFO  (TEST-TestCryptoKeys.test-seed#[8A141FED64EA135]) [n:127.0.0.1:32962_    ] o.a.s.c.c.ZkStateReader Updated live nodes from ZooKeeper... (0) -> (0)
   [junit4]   2> 2637494 INFO  (TEST-TestCryptoKeys.test-seed#[8A141FED64EA135]) [n:127.0.0.1:32962_    ] o.a.s.c.c.SolrZkClient makePath: /overseer_elect
   [junit4]   2> 2637496 INFO  (TEST-TestCryptoKeys.test-seed#[8A141FED64EA135]) [n:127.0.0.1:32962_    ] o.a.s.c.c.SolrZkClient makePath: /overseer_elect/election
   [junit4]   2> 2637498 INFO  (TEST-TestCryptoKeys.test-seed#[8A141FED64EA135]) [n:127.0.0.1:32962_    ] o.a.s.c.Overseer Overseer (id=null) closing
   [junit4]   2> 2637499 INFO  (TEST-TestCryptoKeys.test-seed#[8A141FED64EA135]) [n:127.0.0.1:32962_    ] o.a.s.c.LeaderElector Joined leadership election with path: /overseer_elect/election/96093729352187908-127.0.0.1:32962_-n_0000000000
   [junit4]   2> 2637499 INFO  (TEST-TestCryptoKeys.test-seed#[8A141FED64EA135]) [n:127.0.0.1:32962_    ] o.a.s.c.OverseerElectionContext I am going to be the leader 127.0.0.1:32962_
   [junit4]   2> 2637499 INFO  (TEST-TestCryptoKeys.test-seed#[8A141FED64EA135]) [n:127.0.0.1:32962_    ] o.a.s.c.c.SolrZkClient makePath: /overseer_elect/leader
   [junit4]   2> 2637501 INFO  (TEST-TestCryptoKeys.test-seed#[8A141FED64EA135]) [n:127.0.0.1:32962_    ] o.a.s.c.Overseer Overseer (id=96093729352187908-127.0.0.1:32962_-n_0000000000) starting
   [junit4]   2> 2637504 INFO  (TEST-TestCryptoKeys.test-seed#[8A141FED64EA135]) [n:127.0.0.1:32962_    ] o.a.s.c.c.SolrZkClient makePath: /overseer/queue-work
   [junit4]   2> 2637513 INFO  (TEST-TestCryptoKeys.test-seed#[8A141FED64EA135]) [n:127.0.0.1:32962_    ] o.a.s.c.OverseerAutoReplicaFailoverThread Starting OverseerAutoReplicaFailoverThread autoReplicaFailoverWorkLoopDelay=10000 autoReplicaFailoverWaitAfterExpiration=30000 autoReplicaFailoverBadNodeExpiration=60000
   [junit4]   2> 2637515 INFO  (OverseerCollectionConfigSetProcessor-96093729352187908-127.0.0.1:32962_-n_0000000000) [n:127.0.0.1:32962_    ] o.a.s.c.OverseerTaskProcessor Process current queue of overseer operations
   [junit4]   2> 2637515 INFO  (TEST-TestCryptoKeys.test-seed#[8A141FED64EA135]) [n:127.0.0.1:32962_    ] o.a.s.c.ZkController Register node as live in ZooKeeper:/live_nodes/127.0.0.1:32962_
   [junit4]   2> 2637516 INFO  (OverseerStateUpdate-96093729352187908-127.0.0.1:32962_-n_0000000000) [n:127.0.0.1:32962_    ] o.a.s.c.Overseer Starting to work on the main queue
   [junit4]   2> 2637516 INFO  (TEST-TestCryptoKeys.test-seed#[8A141FED64EA135]) [n:127.0.0.1:32962_    ] o.a.s.c.c.SolrZkClient makePath: /live_nodes/127.0.0.1:32962_
   [junit4]   2> 2637520 INFO  (zkCallback-3057-thread-1-processing-n:127.0.0.1:32962_) [n:127.0.0.1:32962_    ] o.a.s.c.c.ZkStateReader A live node change: [WatchedEvent state:SyncConnected type:NodeChildrenChanged path:/live_nodes], has occurred - updating... (live nodes size: [0])
   [junit4]   2> 2637520 INFO  (OverseerStateUpdate-96093729352187908-127.0.0.1:32962_-n_0000000000) [n:127.0.0.1:32962_    ] o.a.s.c.c.ZkStateReader Updated live nodes from ZooKeeper... (0) -> (1)
   [junit4]   2> 2637521 INFO  (zkCallback-3057-thread-1-processing-n:127.0.0.1:32962_) [n:127.0.0.1:32962_    ] o.a.s.c.c.ZkStateReader Updated live nodes from ZooKeeper... (1) -> (1)
   [junit4]   2> 2637544 INFO  (TEST-TestCryptoKeys.test-seed#[8A141FED64EA135]) [n:127.0.0.1:32962_    ] o.a.s.c.CoreContainer Security conf doesn't exist. Skipping setup for authorization module.
   [junit4]   2> 2637544 INFO  (TEST-TestCryptoKeys.test-seed#[8A141FED64EA135]) [n:127.0.0.1:32962_    ] o.a.s.c.CoreContainer No authentication plugin used.
   [junit4]   2> 2637545 INFO  (TEST-TestCryptoKeys.test-seed#[8A141FED64EA135]) [n:127.0.0.1:32962_    ] o.a.s.c.CorePropertiesLocator Looking for core definitions underneath /export/home/jenkins/workspace/Lucene-Solr-master-Solaris/solr/build/solr-core/test/J1/../../../../../../../../../../export/home/jenkins/workspace/Lucene-Solr-master-Solaris/solr/build/solr-core/test/J1/temp/solr.cloud.TestCryptoKeys_8A141FED64EA135-001/control-001/cores
   [junit4]   2> 2637546 INFO  (TEST-TestCryptoKeys.test-seed#[8A141FED64EA135]) [n:127.0.0.1:32962_    ] o.a.s.c.CoreDescriptor Created CoreDescriptor: {name=collection1, config=solrconfig.xml, transient=false, schema=schema.xml, loadOnStartup=true, configSetProperties=configsetprops.json, collection=control_collection, coreNodeName=, dataDir=data/, shard=}
   [junit4]   2> 2637547 INFO  (TEST-TestCryptoKeys.test-seed#[8A141FED64EA135]) [n:127.0.0.1:32962_    ] o.a.s.c.CorePropertiesLocator Found core collection1 in /export/home/jenkins/workspace/Lucene-Solr-master-Solaris/solr/build/solr-core/test/J1/../../../../../../../../../../export/home/jenkins/workspace/Lucene-Solr-master-Solaris/solr/build/solr-core/test/J1/temp/solr.cloud.TestCryptoKeys_8A141FED64EA135-001/control-001/cores/collection1
   [junit4]   2> 2637547 INFO  (TEST-TestCryptoKeys.test-seed#[8A141FED64EA135]) [n:127.0.0.1:32962_    ] o.a.s.c.CorePropertiesLocator Found 1 core definitions
   [junit4]   2> 2637548 INFO  (TEST-TestCryptoKeys.test-seed#[8A141FED64EA135]) [n:127.0.0.1:32962_    ] o.a.s.s.SolrDispatchFilter user.dir=/export/home/jenkins/workspace/Lucene-Solr-master-Solaris/solr/build/solr-core/test/J1
   [junit4]   2> 2637548 INFO  (TEST-TestCryptoKeys.test-seed#[8A141FED64EA135]) [n:127.0.0.1:32962_    ] o.a.s.s.SolrDispatchFilter SolrDispatchFilter.init() done
   [junit4]   2> 2637549 INFO  (coreLoadExecutor-7707-thread-1-processing-n:127.0.0.1:32962_) [n:127.0.0.1:32962_ c:control_collection   x:collection1] o.a.s.c.ZkController publishing state=down
   [junit4]   2> 2637549 INFO  (coreLoadExecutor-7707-thread-1-processing-n:127.0.0.1:32962_) [n:127.0.0.1:32962_ c:control_collection   x:collection1] o.a.s.c.ZkController numShards not found on descriptor - reading it from system property
   [junit4]   2> 2637550 INFO  (coreLoadExecutor-7707-thread-1-processing-n:127.0.0.1:32962_) [n:127.0.0.1:32962_ c:control_collection   x:collection1] o.a.s.c.ZkController Collection control_collection not visible yet, but flagging it so a watch is registered when it becomes visible
   [junit4]   2> 2637551 INFO  (OverseerStateUpdate-96093729352187908-127.0.0.1:32962_-n_0000000000) [n:127.0.0.1:32962_    ] o.a.s.c.Overseer processMessage: queueSize: 1, message = {
   [junit4]   2>   "core":"collection1",
   [junit4]   2>   "roles":null,
   [junit4]   2>   "base_url":"http://127.0.0.1:32962",
   [junit4]   2>   "node_name":"127.0.0.1:32962_",
   [junit4]   2>   "numShards":"1",
   [junit4]   2>   "state":"down",
   [junit4]   2>   "shard":null,
   [junit4]   2>   "collection":"control_collection",
   [junit4]   2>   "operation":"state"} current state version: 0
   [junit4]   2> 2637551 INFO  (OverseerStateUpdate-96093729352187908-127.0.0.1:32962_-n_0000000000) [n:127.0.0.1:32962_    ] o.a.s.c.o.ReplicaMutator Update state numShards=1 message={
   [junit4]   2>   "core":"collection1",
   [junit4]   2>   "roles":null,
   [junit4]   2>   "base_url":"http://127.0.0.1:32962",
   [junit4]   2>   "node_name":"127.0.0.1:32962_",
   [junit4]   2>   "numShards":"1",
   [junit4]   2>   "state":"down",
   [junit4]   2>   "shard":null,
   [junit4]   2>   "collection":"control_collection",
   [junit4]   2>   "operation":"state"}
   [junit4]   2> 2637551 INFO  (coreLoadExecutor-7707-thread-1-processing-n:127.0.0.1:32962_) [n:127.0.0.1:32962_ c:control_collection   x:collection1] o.a.s.c.c.ZkStateReader Deleting data for [control_collection]
   [junit4]   2> 2637552 INFO  (OverseerStateUpdate-96093729352187908-127.0.0.1:32962_-n_0000000000) [n:127.0.0.1:32962_    ] o.a.s.c.o.ClusterStateMutator building a new cName: control_collection
   [junit4]   2> 2637553 INFO  (OverseerStateUpdate-96093729352187908-127.0.0.1:32962_-n_0000000000) [n:127.0.0.1:32962_    ] o.a.s.c.o.ReplicaMutator Assigning new node to shard shard=shard1
   [junit4]   2> 2637553 INFO  (coreLoadExecutor-7707-thread-1-processing-n:127.0.0.1:32962_) [n:127.0.0.1:32962_ c:control_collection   x:collection1] o.a.s.c.ZkController look for our core node name
   [junit4]   2> 2637556 INFO  (zkCallback-3057-thread-1-processing-n:127.0.0.1:32962_) [n:127.0.0.1:32962_    ] o.a.s.c.c.ZkStateReader A cluster state change: [WatchedEvent state:SyncConnected type:NodeDataChanged path:/clusterstate.json], has occurred - updating... (live nodes size: [1])
   [junit4]   2> 2638558 INFO  (coreLoadExecutor-7707-thread-1-processing-n:127.0.0.1:32962_) [n:127.0.0.1:32962_ c:control_collection   x:collection1] o.a.s.c.ZkController waiting to find shard id in clusterstate for collection1
   [junit4]   2> 2638559 INFO  (coreLoadExecutor-7707-thread-1-processing-n:127.0.0.1:32962_) [n:127.0.0.1:32962_ c:control_collection   x:collection1] o.a.s.c.ZkController Check for collection zkNode:control_collection
   [junit4]   2> 2638560 INFO  (coreLoadExecutor-7707-thread-1-processing-n:127.0.0.1:32962_) [n:127.0.0.1:32962_ c:control_collection   x:collection1] o.a.s.c.ZkController Collection zkNode exists
   [junit4]   2> 2638560 INFO  (coreLoadExecutor-7707-thread-1-processing-n:127.0.0.1:32962_) [n:127.0.0.1:32962_ c:control_collection   x:collection1] o.a.s.c.c.ZkStateReader Load collection config from: [/collections/control_collection]
   [junit4]   2> 2638562 INFO  (coreLoadExecutor-7707-thread-1-processing-n:127.0.0.1:32962_) [n:127.0.0.1:32962_ c:control_collection   x:collection1] o.a.s.c.c.ZkStateReader path=[/collections/control_collection] [configName]=[conf1] specified config exists in ZooKeeper
   [junit4]   2> 2638562 INFO  (coreLoadExecutor-7707-thread-1-processing-n:127.0.0.1:32962_) [n:127.0.0.1:32962_ c:control_collection   x:collection1] o.a.s.c.SolrResourceLoader new SolrResourceLoader for directory: '/export/home/jenkins/workspace/Lucene-Solr-master-Solaris/solr/build/solr-core/test/J1/temp/solr.cloud.TestCryptoKeys_8A141FED64EA135-001/control-001/cores/collection1'
   [junit4]   2> 2638562 INFO  (coreLoadExecutor-7707-thread-1-processing-n:127.0.0.1:32962_) [n:127.0.0.1:32962_ c:control_collection   x:collection1] o.a.s.c.SolrResourceLoader JNDI not configured for solr (NoInitialContextEx)
   [junit4]   2> 2638562 INFO  (coreLoadExecutor-7707-thread-1-processing-n:127.0.0.1:32962_) [n:127.0.0.1:32962_ c:control_collection   x:collection1] o.a.s.c.SolrResourceLoader solr home defaulted to 'solr/' (could not find system property or JNDI)
   [junit4]   2> 2638565 INFO  (coreLoadExecutor-7707-thread-1-processing-n:127.0.0.1:32962_) [n:127.0.0.1:32962_ c:control_collection   x:collection1] o.a.s.c.Config loaded config solrconfig.xml with version 0 
   [junit4]   2> 2638575 INFO  (coreLoadExecutor-7707-thread-1-processing-n:127.0.0.1:32962_) [n:127.0.0.1:32962_ c:control_collection   x:collection1] o.a.s.c.SolrConfig current version of requestparams : -1
   [junit4]   2> 2638580 INFO  (coreLoadExecutor-7707-thread-1-processing-n:127.0.0.1:32962_) [n:127.0.0.1:32962_ c:control_collection   x:collection1] o.a.s.c.SolrConfig Using Lucene MatchVersion: 7.0.0
   [junit4]   2> 2638592 INFO  (coreLoadExecutor-7707-thread-1-processing-n:127.0.0.1:32962_) [n:127.0.0.1:32962_ c:control_collection   x:collection1] o.a.s.c.SolrConfig Loaded SolrConfig: solrconfig.xml
   [junit4]   2> 2638602 INFO  (coreLoadExecutor-7707-thread-1-processing-n:127.0.0.1:32962_) [n:127.0.0.1:32962_ c:control_collection   x:collection1] o.a.s.s.IndexSchema [collection1] Schema name=test
   [junit4]   2> 2638708 INFO  (coreLoadExecutor-7707-thread-1-processing-n:127.0.0.1:32962_) [n:127.0.0.1:32962_ c:control_collection   x:collection1] o.a.s.s.OpenExchangeRatesOrgProvider Initialized with rates=open-exchange-rates.json, refreshInterval=1440.
   [junit4]   2> 2638718 INFO  (coreLoadExecutor-7707-thread-1-processing-n:127.0.0.1:32962_) [n:127.0.0.1:32962_ c:control_collection   x:collection1] o.a.s.s.IndexSchema default search field in schema is text
   [junit4]   2> 2638720 INFO  (coreLoadExecutor-7707-thread-1-processing-n:127.0.0.1:32962_) [n:127.0.0.1:32962_ c:control_collection   x:collection1] o.a.s.s.IndexSchema unique key field: id
   [junit4]   2> 2638737 INFO  (coreLoadExecutor-7707-thread-1-processing-n:127.0.0.1:32962_) [n:127.0.0.1:32962_ c:control_collection   x:collection1] o.a.s.s.FileExchangeRateProvider Reloading exchange rates from file currency.xml
   [junit4]   2> 2638740 INFO  (coreLoadExecutor-7707-thread-1-processing-n:127.0.0.1:32962_) [n:127.0.0.1:32962_ c:control_collection   x:collection1] o.a.s.s.FileExchangeRateProvider Reloading exchange rates from file currency.xml
   [junit4]   2> 2638745 INFO  (coreLoadExecutor-7707-thread-1-processing-n:127.0.0.1:32962_) [n:127.0.0.1:32962_ c:control_collection   x:collection1] o.a.s.s.OpenExchangeRatesOrgProvider Reloading exchange rates from open-exchange-rates.json
   [junit4]   2> 2638746 INFO  (coreLoadExecutor-7707-thread-1-processing-n:127.0.0.1:32962_) [n:127.0.0.1:32962_ c:control_collection   x:collection1] o.a.s.s.OpenExchangeRatesOrgProvider Reloading exchange rates from open-exchange-rates.json
   [junit4]   2> 2638750 INFO  (coreLoadExecutor-7707-thread-1-processing-n:127.0.0.1:32962_) [n:127.0.0.1:32962_ c:control_collection   x:collection1] o.a.s.c.ConfigSetProperties Did not find ConfigSet properties, assuming default properties: Can't find resource 'configsetprops.json' in classpath or '/configs/conf1', cwd=/export/home/jenkins/workspace/Lucene-Solr-master-Solaris/solr/build/solr-core/test/J1
   [junit4]   2> 2638750 INFO  (coreLoadExecutor-7707-thread-1-processing-n:127.0.0.1:32962_) [n:127.0.0.1:32962_ c:control_collection   x:collection1] o.a.s.c.CoreContainer Creating SolrCore 'collection1' using configuration from collection control_collection
   [junit4]   2> 2638750 INFO  (coreLoadExecutor-7707-thread-1-processing-n:127.0.0.1:32962_) [n:127.0.0.1:32962_ c:control_collection s:shard1 r:core_node1 x:collection1] o.a.s.c.SolrCore org.apache.solr.core.MockDirectoryFactory
   [junit4]   2> 2638750 INFO  (coreLoadExecutor-7707-thread-1-processing-n:127.0.0.1:32962_) [n:127.0.0.1:32962_ c:control_collection s:shard1 r:core_node1 x:collection1] o.a.s.c.SolrCore [[collection1] ] Opening new SolrCore at [/export/home/jenkins/workspace/Lucene-Solr-master-Solaris/solr/build/solr-core/test/J1/temp/solr.cloud.TestCryptoKeys_8A141FED64EA135-001/control-001/cores/collection1], dataDir=[/export/home/jenkins/workspace/Lucene-Solr-master-Solaris/solr/build/solr-core/test/J1/../../../../../../../../../../export/home/jenkins/workspace/Lucene-Solr-master-Solaris/solr/build/solr-core/test/J1/temp/solr.cloud.TestCryptoKeys_8A141FED64EA135-001/control-001/cores/collection1/data/]
   [junit4]   2> 2638750 INFO  (coreLoadExecutor-7707-thread-1-processing-n:127.0.0.1:32962_) [n:127.0.0.1:32962_ c:control_collection s:shard1 r:core_node1 x:collection1] o.a.s.c.JmxMonitoredMap JMX monitoring is enabled. Adding Solr mbeans to JMX Server: com.sun.jmx.mbeanserver.JmxMBeanServer@6c85835f
   [junit4]   2> 2638751 INFO  (coreLoadExecutor-7707-thread-1-processing-n:127.0.0.1:32962_) [n:127.0.0.1:32962_ c:control_collection s:shard1 r:core_node1 x:collection1] o.a.s.c.CachingDirectoryFactory return new directory for /export/home/jenkins/workspace/Lucene-Solr-master-Solaris/solr/build/solr-core/test/J1/../../../../../../../../../../export/home/jenkins/workspace/Lucene-Solr-master-Solaris/solr/build/solr-core/test/J1/temp/solr.cloud.TestCryptoKeys_8A141FED64EA135-001/control-001/cores/collection1/data
   [junit4]   2> 2638751 INFO  (coreLoadExecutor-7707-thread-1-processing-n:127.0.0.1:32962_) [n:127.0.0.1:32962_ c:control_collection s:shard1 r:core_node1 x:collection1] o.a.s.c.SolrCore New index directory detected: old=null new=/export/home/jenkins/workspace/Lucene-Solr-master-Solaris/solr/build/solr-core/test/J1/../../../../../../../../../../export/home/jenkins/workspace/Lucene-Solr-master-Solaris/solr/build/solr-core/test/J1/temp/solr.cloud.TestCryptoKeys_8A141FED64EA135-001/control-001/cores/collection1/data/index/
   [junit4]   2> 2638751 WARN  (coreLoadExecutor-7707-thread-1-processing-n:127.0.0.1:32962_) [n:127.0.0.1:32962_ c:control_collection s:shard1 r:core_node1 x:collection1] o.a.s.c.SolrCore [collection1] Solr index directory '/export/home/jenkins/workspace/Lucene-Solr-master-Solaris/solr/build/solr-core/test/J1/../../../../../../../../../../export/home/jenkins/workspace/Lucene-Solr-master-Solaris/solr/build/solr-core/test/J1/temp/solr.cloud.TestCryptoKeys_8A141FED64EA135-001/control-001/cores/collection1/data/index' doesn't exist. Creating new index...
   [junit4]   2> 2638751 INFO  (coreLoadExecutor-7707-thread-1-processing-n:127.0.0.1:32962_) [n:127.0.0.1:32962_ c:control_collection s:shard1 r:core_node1 x:collection1] o.a.s.c.CachingDirectoryFactory return new directory for /export/home/jenkins/workspace/Lucene-Solr-master-Solaris/solr/build/solr-core/test/J1/../../../../../../../../../../export/home/jenkins/workspace/Lucene-Solr-master-Solaris/solr/build/solr-core/test/J1/temp/solr.cloud.TestCryptoKeys_8A141FED64EA135-001/control-001/cores/collection1/data/index
   [junit4]   2> 2638752 INFO  (coreLoadExecutor-7707-thread-1-processing-n:127.0.0.1:32962_) [n:127.0.0.1:32962_ c:control_collection s:shard1 r:core_node1 x:collection1] o.a.s.u.RandomMergePolicy RandomMergePolicy wrapping class org.apache.lucene.index.LogByteSizeMergePolicy: [LogByteSizeMergePolicy: minMergeSize=1677721, mergeFactor=23, maxMergeSize=2147483648, maxMergeSizeForForcedMerge=9223372036854775807, calibrateSizeByDeletes=false, maxMergeDocs=2147483647, maxCFSSegmentSizeMB=8.796093022207999E12, noCFSRatio=0.0]
   [junit4]   2> 2638752 INFO  (coreLoadExecutor-7707-thread-1-processing-n:127.0.0.1:32962_) [n:127.0.0.1:32962_ c:control_collection s:shard1 r:core_node1 x:collection1] o.a.s.c.SolrDeletionPolicy SolrDeletionPolicy.onCommit: commits: num=1
   [junit4]   2> 	commit{dir=MockDirectoryWrapper(RAMDirectory@42d37916 lockFactory=org.apache.lucene.store.SingleInstanceLockFactory@6669c274),segFN=segments_1,generation=1}
   [junit4]   2> 2638752 INFO  (coreLoadExecutor-7707-thread-1-processing-n:127.0.0.1:32962_) [n:127.0.0.1:32962_ c:control_collection s:shard1 r:core_node1 x:collection1] o.a.s.c.SolrDeletionPolicy newest commit generation = 1
   [junit4]   2> 2638753 INFO  (OldIndexDirectoryCleanupThreadForCore-collection1) [n:127.0.0.1:32962_ c:control_collection s:shard1 r:core_node1 x:collection1] o.a.s.c.SolrCore Looking for old index directories to cleanup for core collection1 in /export/home/jenkins/workspace/Lucene-Solr-master-Solaris/solr/build/solr-core/test/J1/../../../../../../../../../../export/home/jenkins/workspace/Lucene-Solr-master-Solaris/solr/build/solr-core/test/J1/temp/solr.cloud.TestCryptoKeys_8A141FED64EA135-001/control-001/cores/collection1/data/
   [junit4]   2> 2638753 WARN  (OldIndexDirectoryCleanupThreadForCore-collection1) [n:127.0.0.1:32962_ c:control_collection s:shard1 r:core_node1 x:collection1] o.a.s.c.DirectoryFactory /export/home/jenkins/workspace/Lucene-Solr-master-Solaris/solr/build/solr-core/test/J1/../../../../../../../../../../export/home/jenkins/workspace/Lucene-Solr-master-Solaris/solr/build/solr-core/test/J1/temp/solr.cloud.TestCryptoKeys_8A141FED64EA135-001/control-001/cores/collection1/data/ does not point to a valid data directory; skipping clean-up of old index directories.
   [junit4]   2> 2638757 INFO  (coreLoadExecutor-7707-thread-1-processing-n:127.0.0.1:32962_) [n:127.0.0.1:32962_ c:control_collection s:shard1 r:core_node1 x:collection1] o.a.s.u.p.UpdateRequestProcessorChain creating updateRequestProcessorChain "nodistrib"
   [junit4]   2> 2638757 INFO  (coreLoadExecutor-7707-thread-1-processing-n:127.0.0.1:32962_) [n:127.0.0.1:32962_ c:control_collection s:shard1 r:core_node1 x:collection1] o.a.s.u.p.UpdateRequestProcessorChain creating updateRequestProcessorChain "dedupe"
   [junit4]   2> 2638758 INFO  (coreLoadExecutor-7707-thread-1-processing-n:127.0.0.1:32962_) [n:127.0.0.1:32962_ c:control_collection s:shard1 r:core_node1 x:collection1] o.a.s.u.p.UpdateRequestProcessorChain inserting DistributedUpdateProcessorFactory into updateRequestProcessorChain "dedupe"
   [junit4]   2> 2638758 INFO  (coreLoadExecutor-7707-thread-1-processing-n:127.0.0.1:32962_) [n:127.0.0.1:32962_ c:control_collection s:shard1 r:core_node1 x:collection1] o.a.s.u.p.UpdateRequestProcessorChain creating updateRequestProcessorChain "stored_sig"
   [junit4]   2> 2638758 INFO  (coreLoadExecutor-7707-thread-1-processing-n:127.0.0.1:32962_) [n:127.0.0.1:32962_ c:control_collection s:shard1 r:core_node1 x:collection1] o.a.s.u.p.UpdateRequestProcessorChain inserting DistributedUpdateProcessorFactory into updateRequestProcessorChain "stored_sig"
   [junit4]   2> 2638758 INFO  (coreLoadExecutor-7707-thread-1-processing-n:127.0.0.1:32962_) [n:127.0.0.1:32962_ c:control_collection s:shard1 r:core_node1 x:collection1] o.a.s.u.p.UpdateRequestProcessorChain creating updateRequestProcessorChain "distrib-dup-test-chain-explicit"
   [junit4]   2> 2638758 INFO  (coreLoadExecutor-7707-thread-1-processing-n:127.0.0.1:32962_) [n:127.0.0.1:32962_ c:control_collection s:shard1 r:core_node1 x:collection1] o.a.s.u.p.UpdateRequestProcessorChain creating updateRequestProcessorChain "distrib-dup-test-chain-implicit"
   [junit4]   2> 2638758 INFO  (coreLoadExecutor-7707-thread-1-processing-n:127.0.0.1:32962_) [n:127.0.0.1:32962_ c:control_collection s:shard1 r:core_node1 x:collection1] o.a.s.u.p.UpdateRequestProcessorChain inserting DistributedUpdateProcessorFactory into updateRequestProcessorChain "distrib-dup-test-chain-implicit"
   [junit4]   2> 2638758 INFO  (coreLoadExecutor-7707-thread-1-processing-n:127.0.0.1:32962_) [n:127.0.0.1:32962_ c:control_collection s:shard1 r:core_node1 x:collection1] o.a.s.c.SolrCore no updateRequestProcessorChain defined as default, creating implicit default
   [junit4]   2> 2638758 WARN  (coreLoadExecutor-7707-thread-1-processing-n:127.0.0.1:32962_) [n:127.0.0.1:32962_ c:control_collection s:shard1 r:core_node1 x:collection1] o.a.s.c.RequestHandlers INVALID paramSet a in requestHandler {type = requestHandler,name = /dump,class = DumpRequestHandler,args = {defaults={a=A,b=B}}}
   [junit4]   2> 2638762 INFO  (coreLoadExecutor-7707-thread-1-processing-n:127.0.0.1:32962_) [n:127.0.0.1:32962_ c:control_collection s:shard1 r:core_node1 x:collection1] o.a.s.h.l.XMLLoader xsltCacheLifetimeSeconds=60
   [junit4]   2> 2638763 INFO  (coreLoadExecutor-7707-thread-1-processing-n:127.0.0.1:32962_) [n:127.0.0.1:32962_ c:control_collection s:shard1 r:core_node1 x:collection1] o.a.s.h.l.XMLLoader xsltCacheLifetimeSeconds=60
   [junit4]   2> 2638765 INFO  (coreLoadExecutor-7707-thread-1-processing-n:127.0.0.1:32962_) [n:127.0.0.1:32962_ c:control_collection s:shard1 r:core_node1 x:collection1] o.a.s.h.l.XMLLoader xsltCacheLifetimeSeconds=60
   [junit4]   2> 2638766 INFO  (coreLoadExecutor-7707-thread-1-processing-n:127.0.0.1:32962_) [n:127.0.0.1:32962_ c:control_collection s:shard1 r:core_node1 x:collection1] o.a.s.h.l.XMLLoader xsltCacheLifetimeSeconds=60
   [junit4]   2> 2638771 INFO  (coreLoadExecutor-7707-thread-1-processing-n:127.0.0.1:32962_) [n:127.0.0.1:32962_ c:control_collection s:shard1 r:core_node1 x:collection1] o.a.s.c.RequestHandlers Registered paths: /admin/mbeans,standard,/update/json/docs,/admin/luke,/export,/get,/admin/properties,/update/json,/admin/threads,/dump,/update/csv,/sql,/graph,/admin/segments,/admin/system,/replication,/config,/stream,/schema,/admin/plugins,/admin/logging,/admin/ping,/update,/admin/file
   [junit4]   2> 2638771 INFO  (coreLoadExecutor-7707-thread-1-processing-n:127.0.0.1:32962_) [n:127.0.0.1:32962_ c:control_collection s:shard1 r:core_node1 x:collection1] o.a.s.c.SolrCore Using default statsCache cache: org.apache.solr.search.stats.LocalStatsCache
   [junit4]   2> 2638772 INFO  (coreLoadExecutor-7707-thread-1-processing-n:127.0.0.1:32962_) [n:127.0.0.1:32962_ c:control_collection s:shard1 r:core_node1 x:collection1] o.a.s.u.UpdateHandler Using UpdateLog implementation: org.apache.solr.update.UpdateLog
   [junit4]   2> 2638772 INFO  (coreLoadExecutor-7707-thread-1-processing-n:127.0.0.1:32962_) [n:127.0.0.1:32962_ c:control_collection s:shard1 r:core_node1 x:collection1] o.a.s.u.UpdateLog Initializing UpdateLog: dataDir= defaultSyncLevel=FLUSH numRecordsToKeep=100 maxNumLogsToKeep=10 numVersionBuckets=65536
   [junit4]   2> 2638774 INFO  (coreLoadExecutor-7707-thread-1-processing-n:127.0.0.1:32962_) [n:127.0.0.1:32962_ c:control_collection s:shard1 r:core_node1 x:collection1] o.a.s.u.CommitTracker Hard AutoCommit: disabled
   [junit4]   2> 2638775 INFO  (coreLoadExecutor-7707-thread-1-processing-n:127.0.0.1:32962_) [n:127.0.0.1:32962_ c:control_collection s:shard1 r:core_node1 x:collection1] o.a.s.u.CommitTracker Soft AutoCommit: disabled
   [junit4]   2> 2638775 INFO  (coreLoadExecutor-7707-thread-1-processing-n:127.0.0.1:32962_) [n:127.0.0.1:32962_ c:control_collection s:shard1 r:core_node1 x:collection1] o.a.s.u.RandomMergePolicy RandomMergePolicy wrapping class org.apache.lucene.index.AlcoholicMergePolicy: [AlcoholicMergePolicy: minMergeSize=0, mergeFactor=10, maxMergeSize=257527426, maxMergeSizeForForcedMerge=9223372036854775807, calibrateSizeByDeletes=true, maxMergeDocs=2147483647, maxCFSSegmentSizeMB=8.796093022207999E12, noCFSRatio=0.1]
   [junit4]   2> 2638776 INFO  (coreLoadExecutor-7707-thread-1-processing-n:127.0.0.1:32962_) [n:127.0.0.1:32962_ c:control_collection s:shard1 r:core_node1 x:collection1] o.a.s.c.SolrDeletionPolicy SolrDeletionPolicy.onInit: commits: num=1
   [junit4]   2> 	commit{dir=MockDirectoryWrapper(RAMDirectory@42d37916 lockFactory=org.apache.lucene.store.SingleInstanceLockFactory@6669c274),segFN=segments_1,generation=1}
   [junit4]   2> 2638776 INFO  (coreLoadExecutor-7707-thread-1-processing-n:127.0.0.1:32962_) [n:127.0.0.1:32962_ c:control_collection s:shard1 r:core_node1 x:collection1] o.a.s.c.SolrDeletionPolicy newest commit generation = 1
   [junit4]   2> 2638776 INFO  (coreLoadExecutor-7707-thread-1-processing-n:127.0.0.1:32962_) [n:127.0.0.1:32962_ c:control_collection s:shard1 r:core_node1 x:collection1] o.a.s.s.SolrIndexSearcher Opening [Searcher@7fbd6326[collection1] main]
   [junit4]   2> 2638776 INFO  (coreLoadExecutor-7707-thread-1-processing-n:127.0.0.1:32962_) [n:127.0.0.1:32962_ c:control_collection s:shard1 r:core_node1 x:collection1] o.a.s.c.c.ZkStateReader Load collection config from: [/collections/control_collection]
   [junit4]   2> 2638777 INFO  (coreLoadExecutor-7707-thread-1-processing-n:127.0.0.1:32962_) [n:127.0.0.1:32962_ c:control_collection s:shard1 r:core_node1 x:collection1] o.a.s.c.c.ZkStateReader path=[/collections/control_collection] [configName]=[conf1] specified config exists in ZooKeeper
   [junit4]   2> 2638778 INFO  (coreLoadExecutor-7707-thread-1-processing-n:127.0.0.1:32962_) [n:127.0.0.1:32962_ c:control_collection s:shard1 r:core_node1 x:collection1] o.a.s.r.ManagedResourceStorage Setting up ZooKeeper-based storage for the RestManager with znodeBase: /configs/conf1
   [junit4]   2> 2638778 INFO  (coreLoadExecutor-7707-thread-1-processing-n:127.0.0.1:32962_) [n:127.0.0.1:32962_ c:control_collection s:shard1 r:core_node1 x:collection1] o.a.s.r.ManagedResourceStorage Configured ZooKeeperStorageIO with znodeBase: /configs/conf1
   [junit4]   2> 2638778 INFO  (coreLoadExecutor-7707-thread-1-processing-n:127.0.0.1:32962_) [n:127.0.0.1:32962_ c:control_collection s:shard1 r:core_node1 x:collection1] o.a.s.r.RestManager Initializing RestManager with initArgs: {}
   [junit4]   2> 2638778 INFO  (coreLoadExecutor-7707-thread-1-processing-n:127.0.0.1:32962_) [n:127.0.0.1:32962_ c:control_collection s:shard1 r:core_node1 x:collection1] o.a.s.r.ManagedResourceStorage Reading _rest_managed.json using ZooKeeperStorageIO:path=/configs/conf1
   [junit4]   2> 2638780 INFO  (coreLoadExecutor-7707-thread-1-processing-n:127.0.0.1:32962_) [n:127.0.0.1:32962_ c:control_collection s:shard1 r:core_node1 x:collection1] o.a.s.r.ManagedResourceStorage No data found for znode /configs/conf1/_rest_managed.json
   [junit4]   2> 2638780 INFO  (coreLoadExecutor-7707-thread-1-processing-n:127.0.0.1:32962_) [n:127.0.0.1:32962_ c:control_collection s:shard1 r:core_node1 x:collection1] o.a.s.r.ManagedResourceStorage Loaded null at path _rest_managed.json using ZooKeeperStorageIO:path=/configs/conf1
   [junit4]   2> 2638780 INFO  (coreLoadExecutor-7707-thread-1-processing-n:127.0.0.1:32962_) [n:127.0.0.1:32962_ c:control_collection s:shard1 r:core_node1 x:collection1] o.a.s.r.RestManager Initializing 0 registered ManagedResources
   [junit4]   2> 2638780 INFO  (coreLoadExecutor-7707-thread-1-processing-n:127.0.0.1:32962_) [n:127.0.0.1:32962_ c:control_collection s:shard1 r:core_node1 x:collection1] o.a.s.h.ReplicationHandler Commits will be reserved for  10000
   [junit4]   2> 2638781 INFO  (searcherExecutor-7708-thread-1-processing-n:127.0.0.1:32962_ x:collection1 s:shard1 c:control_collection r:core_node1) [n:127.0.0.1:32962_ c:control_collection s:shard1 r:core_node1 x:collection1] o.a.s.c.SolrCore [collection1] Registered new searcher Searcher@7fbd6326[collection1] main{ExitableDirectoryReader(UninvertingDirectoryReader())}
   [junit4]   2> 2638781 INFO  (coreLoadExecutor-7707-thread-1-processing-n:127.0.0.1:32962_) [n:127.0.0.1:32962_ c:control_collection s:shard1 r:core_node1 x:collection1] o.a.s.u.UpdateLog Looking up max value of version field to seed version buckets
   [junit4]   2> 2638781 INFO  (coreLoadExecutor-7707-thread-1-processing-n:127.0.0.1:32962_) [n:127.0.0.1:32962_ c:control_collection s:shard1 r:core_node1 x:collection1] o.a.s.u.VersionInfo Refreshing highest value of _version_ for 65536 version buckets from index
   [junit4]   2> 2638781 INFO  (coreLoadExecutor-7707-thread-1-processing-n:127.0.0.1:32962_) [n:127.0.0.1:32962_ c:control_collection s:shard1 r:core_node1 x:collection1] o.a.s.u.VersionInfo No terms found for _version_, cannot seed version bucket highest value from index
   [junit4]   2> 2638782 INFO  (coreLoadExecutor-7707-thread-1-processing-n:127.0.0.1:32962_) [n:127.0.0.1:32962_ c:control_collection s:shard1 r:core_node1 x:collection1] o.a.s.u.UpdateLog Could not find max version in index or recent updates, using new clock 1537499671371448320
   [junit4]   2> 2638783 INFO  (coreLoadExecutor-7707-thread-1-processing-n:127.0.0.1:32962_) [n:127.0.0.1:32962_ c:control_collection s:shard1 r:core_node1 x:collection1] o.a.s.u.UpdateLog Took 2.0ms to seed version buckets with highest version 1537499671371448320
   [junit4]   2> 2638783 INFO  (coreLoadExecutor-7707-thread-1-processing-n:127.0.0.1:32962_) [n:127.0.0.1:32962_ c:control_collection s:shard1 r:core_node1 x:collection1] o.a.s.c.ZkController watch zkdir /configs/conf1
   [junit4]   2> 2638784 INFO  (coreLoadExecutor-7707-thread-1-processing-n:127.0.0.1:32962_) [n:127.0.0.1:32962_ c:control_collection s:shard1 r:core_node1 x:collection1] o.a.s.c.CoreContainer registering core: collection1
   [junit4]   2> 2638785 INFO  (coreZkRegister-7701-thread-1-processing-n:127.0.0.1:32962_ x:collection1 s:shard1 c:control_collection r:core_node1) [n:127.0.0.1:32962_ c:control_collection s:shard1 r:core_node1 x:collection1] o.a.s.c.ZkController Register replica - core:collection1 address:http://127.0.0.1:32962 collection:control_collection shard:shard1
   [junit4]   2> 2638786 INFO  (coreZkRegister-7701-thread-1-processing-n:127.0.0.1:32962_ x:collection1 s:shard1 c:control_collection r:core_node1) [n:127.0.0.1:32962_ c:control_collection s:shard1 r:core_node1 x:collection1] o.a.s.c.c.SolrZkClient makePath: /collections/control_collection/leader_elect/shard1/election
   [junit4]   2> 2638794 INFO  (coreZkRegister-7701-thread-1-processing-n:127.0.0.1:32962_ x:collection1 s:shard1 c:control_collection r:core_node1) [n:127.0.0.1:32962_ c:control_collection s:shard1 r:core_node1 x:collection1] o.a.s.c.LeaderElector Joined leadership election with path: /collections/control_collection/leader_elect/shard1/election/96093729352187908-core_node1-n_0000000000
   [junit4]   2> 2638795 INFO  (coreZkRegister-7701-thread-1-processing-n:127.0.0.1:32962_ x:collection1 s:shard1 c:control_collection r:core_node1) [n:127.0.0.1:32962_ c:control_collection s:shard1 r:core_node1 x:collection1] o.a.s.c.ShardLeaderElectionContext Running the leader process for shard=shard1 and weAreReplacement=false and leaderVoteWait=10000
   [junit4]   2> 2638798 INFO  (coreZkRegister-7701-thread-1-processing-n:127.0.0.1:32962_ x:collection1 s:shard1 c:control_collection r:core_node1) [n:127.0.0.1:32962_ c:control_collection s:shard1 r:core_node1 x:collection1] o.a.s.c.ShardLeaderElectionContext Enough replicas found to continue.
   [junit4]   2> 2638798 INFO  (coreZkRegister-7701-thread-1-processing-n:127.0.0.1:32962_ x:collection1 s:shard1 c:control_collection r:core_node1) [n:127.0.0.1:32962_ c:control_collection s:shard1 r:core_node1 x:collection1] o.a.s.c.ShardLeaderElectionContext I may be the new leader - try and sync
   [junit4]   2> 2638799 INFO  (coreZkRegister-7701-thread-1-processing-n:127.0.0.1:32962_ x:collection1 s:shard1 c:control_collection r:core_node1) [n:127.0.0.1:32962_ c:control_collection s:shard1 r:core_node1 x:collection1] o.a.s.c.SyncStrategy Sync replicas to http://127.0.0.1:32962/collection1/
   [junit4]   2> 2638799 INFO  (coreZkRegister-7701-thread-1-processing-n:127.0.0.1:32962_ x:collection1 s:shard1 c:control_collection r:core_node1) [n:127.0.0.1:32962_ c:control_collection s:shard1 r:core_node1 x:collection1] o.a.s.c.SyncStrategy Sync Success - now sync replicas to me
   [junit4]   2> 2638799 INFO  (coreZkRegister-7701-thread-1-processing-n:127.0.0.1:32962_ x:collection1 s:shard1 c:control_collection r:core_node1) [n:127.0.0.1:32962_ c:control_collection s:shard1 r:core_node1 x:collection1] o.a.s.c.SyncStrategy http://127.0.0.1:32962/collection1/ has no replicas
   [junit4]   2> 2638799 INFO  (OverseerStateUpdate-96093729352187908-127.0.0.1:32962_-n_0000000000) [n:127.0.0.1:32962_    ] o.a.s.c.Overseer processMessage: queueSize: 1, message = {
   [junit4]   2>   "operation":"leader",
   [junit4]   2>   "shard":"shard1",
   [junit4]   2>   "collection":"control_collection"} current state version: 1
   [junit4]   2> 2638805 INFO  (coreZkRegister-7701-thread-1-processing-n:127.0.0.1:32962_ x:collection1 s:shard1 c:control_collection r:core_node1) [n:127.0.0.1:32962_ c:control_collection s:shard1 r:core_node1 x:collection1] o.a.s.c.c.SolrZkClient makePath: /collections/control_collection/leaders/shard1
   [junit4]   2> 2638811 INFO  (coreZkRegister-7701-thread-1-processing-n:127.0.0.1:32962_ x:collection1 s:shard1 c:control_collection r:core_node1) [n:127.0.0.1:32962_ c:control_collection s:shard1 r:core_node1 x:collection1] o.a.s.c.ShardLeaderElectionContextBase Creating leader registration node /collections/control_collection/leaders/shard1/leader after winning as /collections/control_collection/leader_elect/shard1/election/96093729352187908-core_node1-n_0000000000
   [junit4]   2> 2638816 INFO  (coreZkRegister-7701-thread-1-processing-n:127.0.0.1:32962_ x:collection1 s:shard1 c:control_collection r:core_node1) [n:127.0.0.1:32962_ c:control_collection s:shard1 r:core_node1 x:collection1] o.a.s.c.ShardLeaderElectionContext I am the new leader: http://127.0.0.1:32962/collection1/ shard1
   [junit4]   2> 2638818 INFO  (OverseerStateUpdate-96093729352187908-127.0.0.1:32962_-n_0000000000) [n:127.0.0.1:32962_    ] o.a.s.c.Overseer processMessage: queueSize: 1, message = {
   [junit4]   2>   "operation":"leader",
   [junit4]   2>   "shard":"shard1",
   [junit4]   2>   "collection":"control_collection",
   [junit4]   2>   "base_url":"http://127.0.0.1:32962",
   [junit4]   2>   "core":"collection1",
   [junit4]   2>   "state":"active"} current state version: 1
   [junit4]   2> 2638924 INFO  (zkCallback-3057-thread-2-processing-n:127.0.0.1:32962_) [n:127.0.0.1:32962_    ] o.a.s.c.c.ZkStateReader A cluster state change: [WatchedEvent state:SyncConnected type:NodeDataChanged path:/clusterstate.json], has occurred - updating... (live nodes size: [1])
   [junit4]   2> 2638972 INFO  (coreZkRegister-7701-thread-1-processing-n:127.0.0.1:32962_ x:collection1 s:shard1 c:control_collection r:core_node1) [n:127.0.0.1:32962_ c:control_collection s:shard1 r:core_node1 x:collection1] o.a.s.c.ZkController We are http://127.0.0.1:32962/collection1/ and leader is http://127.0.0.1:32962/collection1/
   [junit4]   2> 2638972 INFO  (coreZkRegister-7701-thread-1-processing-n:127.0.0.1:32962_ x:collection1 s:shard1 c:control_collection r:core_node1) [n:127.0.0.1:32962_ c:control_collection s:shard1 r:core_node1 x:collection1] o.a.s.c.ZkController No LogReplay needed for core=collection1 baseURL=http://127.0.0.1:32962
   [junit4]   2> 2638972 INFO  (coreZkRegister-7701-thread-1-processing-n:127.0.0.1:32962_ x:collection1 s:shard1 c:control_collection r:core_node1) [n:127.0.0.1:32962_ c:control_collection s:shard1 r:core_node1 x:collection1] o.a.s.c.ZkController I am the leader, no recovery necessary
   [junit4]   2> 2638972 INFO  (coreZkRegister-7701-thread-1-processing-n:127.0.0.1:32962_ x:collection1 s:shard1 c:control_collection r:core_node1) [n:127.0.0.1:32962_ c:control_collection s:shard1 r:core_node1 x:collection1] o.a.s.c.ZkController publishing state=active
   [junit4]   2> 2638972 INFO  (coreZkRegister-7701-thread-1-processing-n:127.0.0.1:32962_ x:collection1 s:shard1 c:control_collection r:core_node1) [n:127.0.0.1:32962_ c:control_collection s:shard1 r:core_node1 x:collection1] o.a.s.c.ZkController numShards not found on descriptor - reading it from system property
   [junit4]   2> 2638978 INFO  (OverseerStateUpdate-96093729352187908-127.0.0.1:32962_-n_0000000000) [n:127.0.0.1:32962_    ] o.a.s.c.Overseer processMessage: queueSize: 1, message = {
   [junit4]   2>   "core":"collection1",
   [junit4]   2>   "core_node_name":"core_node1",
   [junit4]   2>   "roles":null,
   [junit4]   2>   "base_url":"http://127.0.0.1:32962",
   [junit4]   2>   "node_name":"127.0.0.1:32962_",
   [junit4]   2>   "numShards":"1",
   [junit4]   2>   "state":"active",
   [junit4]   2>   "shard":"shard1",
   [junit4]   2>   "collection":"control_collection",
   [junit4]   2>   "operation":"state"} current state version: 2
   [junit4]   2> 2638978 INFO  (OverseerStateUpdate-96093729352187908-127.0.0.1:32962_-n_0000000000) [n:127.0.0.1:32962_    ] o.a.s.c.o.ReplicaMutator Update state numShards=1 message={
   [junit4]   2>   "core":"collection1",
   [junit4]   2>   "core_node_name":"core_node1",
   [junit4]   2>   "roles":null,
   [junit4]   2>   "base_url":"http://127.0.0.1:32962",
   [junit4]   2>   "node_name":"127.0.0.1:32962_",
   [junit4]   2>   "numShards":"1",
   [junit4]   2>   "state":"active",
   [junit4]   2>   "shard":"shard1",
   [junit4]   2>   "collection":"control_collection",
   [junit4]   2>   "operation":"state"}
   [junit4]   2> 2639055 INFO  (TEST-TestCryptoKeys.test-seed#[8A141FED64EA135]) [    ] o.a.s.c.s.i.CloudSolrClient Final constructed zkHost string: 127.0.0.1:51435/solr
   [junit4]   2> 2639057 INFO  (TEST-TestCryptoKeys.test-seed#[8A141FED64EA135]) [    ] o.a.s.c.c.SolrZkClient Using default ZkCredentialsProvider
   [junit4]   2> 2639058 INFO  (TEST-TestCryptoKeys.test-seed#[8A141FED64EA135]) [    ] o.a.s.c.c.ConnectionManager Waiting for client to connect to ZooKeeper
   [junit4]   2> 2639061 INFO  (zkCallback-3061-thread-1) [    ] o.a.s.c.c.ConnectionManager Watcher org.apache.solr.common.cloud.ConnectionManager@8dc314c name:ZooKeeperConnection Watcher:127.0.0.1:51435/solr got event WatchedEvent state:SyncConnected type:None path:null path:null type:None
   [junit4]   2> 2639061 INFO  (TEST-TestCryptoKeys.test-seed#[8A141FED64EA135]) [    ] o.a.s.c.c.ConnectionManager Client is connected to ZooKeeper
   [junit4]   2> 2639062 INFO  (TEST-TestCryptoKeys.test-seed#[8A141FED64EA135]) [    ] o.a.s.c.c.SolrZkClient Using default ZkACLProvider
   [junit4]   2> 2639062 INFO  (TEST-TestCryptoKeys.test-seed#[8A141FED64EA135]) [    ] o.a.s.c.c.ZkStateReader Updating cluster state from ZooKeeper... 
   [junit4]   2> 2639064 INFO  (TEST-TestCryptoKeys.test-seed#[8A141FED64EA135]) [    ] o.a.s.c.c.ZkStateReader Loaded empty cluster properties
   [junit4]   2> 2639066 INFO  (TEST-TestCryptoKeys.test-seed#[8A141FED64EA135]) [    ] o.a.s.c.c.ZkStateReader Updated live nodes from ZooKeeper... (0) -> (1)
   [junit4]   2> 2639070 INFO  (TEST-TestCryptoKeys.test-seed#[8A141FED64EA135]) [    ] o.a.s.c.ChaosMonkey monkey: init - expire sessions:false cause connection loss:false
   [junit4]   2> 2639070 INFO  (TEST-TestCryptoKeys.test-seed#[8A141FED64EA135]) [    ] o.a.s.c.AbstractFullDistribZkTestBase Creating collection1 with stateFormat=2
   [junit4]   2> 2639070 INFO  (TEST-TestCryptoKeys.test-seed#[8A141FED64EA135]) [    ] o.a.s.c.c.SolrZkClient Using default ZkCredentialsProvider
   [junit4]   2> 2639071 INFO  (TEST-TestCryptoKeys.test-seed#[8A141FED64EA135]) [    ] o.a.s.c.c.ConnectionManager Waiting for client to connect to ZooKeeper
   [junit4]   2> 2639073 INFO  (zkCallback-3062-thread-1) [    ] o.a.s.c.c.ConnectionManager Watcher org.apache.solr.common.cloud.ConnectionManager@31b6823 name:ZooKeeperConnection Watcher:127.0.0.1:51435/solr got event WatchedEvent state:SyncConnected type:None path:null path:null type:None
   [junit4]   2> 2639073 INFO  (TEST-TestCryptoKeys.test-seed#[8A141FED64EA135]) [    ] o.a.s.c.c.ConnectionManager Client is connected to ZooKeeper
   [junit4]   2> 2639073 INFO  (TEST-TestCryptoKeys.test-seed#[8A141FED64EA135]) [    ] o.a.s.c.c.SolrZkClient Using default ZkACLProvider
   [junit4]   2> 2639078 INFO  (OverseerStateUpdate-96093729352187908-127.0.0.1:32962_-n_0000000000) [n:127.0.0.1:32962_    ] o.a.s.c.Overseer processMessage: queueSize: 1, message = {
   [junit4]   2>   "operation":"create",
   [junit4]   2>   "name":"collection1",
   [junit4]   2>   "numShards":"1",
   [junit4]   2>   "stateFormat":"2"} current state version: 2
   [junit4]   2> 2639078 INFO  (OverseerStateUpdate-96093729352187908-127.0.0.1:32962_-n_0000000000) [n:127.0.0.1:32962_    ] o.a.s.c.o.ClusterStateMutator building a new cName: collection1
   [junit4]   2> 2639080 INFO  (zkCallback-3057-thread-2-processing-n:127.0.0.1:32962_) [n:127.0.0.1:32962_    ] o.a.s.c.c.ZkStateReader A cluster state change: [WatchedEvent state:SyncConnected type:NodeDataChanged path:/clusterstate.json], has occurred - updating... (live nodes size: [1])
   [junit4]   2> 2639081 INFO  (zkCallback-3061-thread-1) [    ] o.a.s.c.c.ZkStateReader A cluster state change: [WatchedEvent state:SyncConnected type:NodeDataChanged path:/clusterstate.json], has occurred - updating... (live nodes size: [1])
   [junit4]   2> 2639194 INFO  (OverseerStateUpdate-96093729352187908-127.0.0.1:32962_-n_0000000000) [n:127.0.0.1:32962_    ] o.a.s.c.o.ZkStateWriter going to create_collection /collections/collection1/state.json
   [junit4]   2> 2639330 INFO  (TEST-TestCryptoKeys.test-seed#[8A141FED64EA135]) [    ] o.a.s.SolrTestCaseJ4 Writing core.properties file to /export/home/jenkins/workspace/Lucene-Solr-master-Solaris/solr/build/solr-core/test/J1/temp/solr.cloud.TestCryptoKeys_8A141FED64EA135-001/shard-1-001/cores/collection1
   [junit4]   2> 2639331 INFO  (TEST-TestCryptoKeys.test-seed#[8A141FED64EA135]) [    ] o.a.s.c.AbstractFullDistribZkTestBase create jetty 1 in directory /export/home/jenkins/workspace/Lucene-Solr-master-Solaris/solr/build/solr-core/test/J1/temp/solr.cloud.TestCryptoKeys_8A141FED64EA135-001/shard-1-001
   [junit4]   2> 2639332 INFO  (TEST-TestCryptoKeys.test-seed#[8A141FED64EA135]) [    ] o.e.j.s.Server jetty-9.3.8.v20160314
   [junit4]   2> 2639333 INFO  (TEST-TestCryptoKeys.test-seed#[8A141FED64EA135]) [    ] o.e.j.s.h.ContextHandler Started o.e.j.s.ServletContextHandler@5bd6728b{/,null,AVAILABLE}
   [junit4]   2> 2639334 INFO  (TEST-TestCryptoKeys.test-seed#[8A141FED64EA135]) [    ] o.e.j.s.ServerConnector Started ServerConnector@31e419ab{HTTP/1.1,[http/1.1]}{127.0.0.1:61181}
   [junit4]   2> 2639334 INFO  (TEST-TestCryptoKeys.test-seed#[8A141FED64EA135]) [    ] o.e.j.s.Server Started @2645537ms
   [junit4]   2> 2639334 INFO  (TEST-TestCryptoKeys.test-seed#[8A141FED64EA135]) [    ] o.a.s.c.s.e.JettySolrRunner Jetty properties: {solr.data.dir=/export/home/jenkins/workspace/Lucene-Solr-master-Solaris/solr/build/solr-core/test/J1/temp/solr.cloud.TestCryptoKeys_8A141FED64EA135-001/tempDir-001/jetty1, solrconfig=solrconfig.xml, hostContext=/, hostPort=61181, coreRootDirectory=/export/home/jenkins/workspace/Lucene-Solr-master-Solaris/solr/build/solr-core/test/J1/../../../../../../../../../../export/home/jenkins/workspace/Lucene-Solr-master-Solaris/solr/build/solr-core/test/J1/temp/solr.cloud.TestCryptoKeys_8A141FED64EA135-001/shard-1-001/cores}
   [junit4]   2> 2639335 INFO  (TEST-TestCryptoKeys.test-seed#[8A141FED64EA135]) [    ] o.a.s.s.SolrDispatchFilter SolrDispatchFilter.init(): sun.misc.Launcher$AppClassLoader@6d06d69c
   [junit4]   2> 2639335 INFO  (TEST-TestCryptoKeys.test-seed#[8A141FED64EA135]) [    ] o.a.s.c.SolrResourceLoader new SolrResourceLoader for directory: '/export/home/jenkins/workspace/Lucene-Solr-master-Solaris/solr/build/solr-core/test/J1/temp/solr.cloud.TestCryptoKeys_8A141FED64EA135-001/shard-1-001'
   [junit4]   2> 2639335 INFO  (TEST-TestCryptoKeys.test-seed#[8A141FED64EA135]) [    ] o.a.s.c.SolrResourceLoader JNDI not configured for solr (NoInitialContextEx)
   [junit4]   2> 2639335 INFO  (TEST-TestCryptoKeys.test-seed#[8A141FED64EA135]) [    ] o.a.s.c.SolrResourceLoader solr home defaulted to 'solr/' (could not find system property or JNDI)
   [junit4]   2> 2639337 INFO  (TEST-TestCryptoKeys.test-seed#[8A141FED64EA135]) [    ] o.a.s.c.c.SolrZkClient Using default ZkCredentialsProvider
   [junit4]   2> 2639338 INFO  (TEST-TestCryptoKeys.test-seed#[8A141FED64EA135]) [    ] o.a.s.c.c.ConnectionManager Waiting for client to connect to ZooKeeper
   [junit4]   2> 2639340 INFO  (zkCallback-3063-thread-1) [    ] o.a.s.c.c.ConnectionManager Watcher org.apache.solr.common.cloud.ConnectionManager@98f2cd2 name:ZooKeeperConnection Watcher:127.0.0.1:51435/solr got event WatchedEvent state:SyncConnected type:None path:null path:null type:None
   [junit4]   2> 2639340 INFO  (TEST-TestCryptoKeys.test-seed#[8A141FED64EA135]) [    ] o.a.s.c.c.ConnectionManager Client is connected to ZooKeeper
   [junit4]   2> 2639340 INFO  (TEST-TestCryptoKeys.test-seed#[8A141FED64EA135]) [    ] o.a.s.c.c.SolrZkClient Using default ZkACLProvider
   [junit4]   2> 2639344 INFO  (TEST-TestCryptoKeys.test-seed#[8A141FED64EA135]) [    ] o.a.s.s.SolrDispatchFilter Loading solr.xml from SolrHome (not found in ZooKeeper)
   [junit4]   2> 2639344 INFO  (TEST-TestCryptoKeys.test-seed#[8A141FED64EA135]) [    ] o.a.s.c.SolrXmlConfig Loading container configuration from /export/home/jenkins/workspace/Lucene-Solr-master-Solaris/solr/build/solr-core/test/J1/temp/solr.cloud.TestCryptoKeys_8A141FED64EA135-001/shard-1-001/solr.xml
   [junit4]   2> 2639353 INFO  (TEST-TestCryptoKeys.test-seed#[8A141FED64EA135]) [    ] o.a.s.c.CorePropertiesLocator Config-defined core root directory: /export/home/jenkins/workspace/Lucene-Solr-master-Solaris/solr/build/solr-core/test/J1/../../../../../../../../../../export/home/jenkins/workspace/Lucene-Solr-master-Solaris/solr/build/solr-core/test/J1/temp/solr.cloud.TestCryptoKeys_8A141FED64EA135-001/shard-1-001/cores
   [junit4]   2> 2639353 INFO  (TEST-TestCryptoKeys.test-seed#[8A141FED64EA135]) [    ] o.a.s.c.CoreContainer New CoreContainer 1896230891
   [junit4]   2> 2639353 INFO  (TEST-TestCryptoKeys.test-seed#[8A141FED64EA135]) [    ] o.a.s.c.CoreContainer Loading cores into CoreContainer [instanceDir=/export/home/jenkins/workspace/Lucene-Solr-master-Solaris/solr/build/solr-core/test/J1/temp/solr.cloud.TestCryptoKeys_8A141FED64EA135-001/shard-1-001]
   [junit4]   2> 2639354 WARN  (TEST-TestCryptoKeys.test-seed#[8A141FED64EA135]) [    ] o.a.s.c.CoreContainer Couldn't add files from /export/home/jenkins/workspace/Lucene-Solr-master-Solaris/solr/build/solr-core/test/J1/temp/solr.cloud.TestCryptoKeys_8A141FED64EA135-001/shard-1-001/lib to classpath: /export/home/jenkins/workspace/Lucene-Solr-master-Solaris/solr/build/solr-core/test/J1/temp/solr.cloud.TestCryptoKeys_8A141FED64EA135-001/shard-1-001/lib
   [junit4]   2> 2639354 INFO  (TEST-TestCryptoKeys.test-seed#[8A141FED64EA135]) [    ] o.a.s.h.c.HttpShardHandlerFactory created with socketTimeout : 90000,urlScheme : ,connTimeout : 15000,maxConnectionsPerHost : 20,maxConnections : 10000,corePoolSize : 0,maximumPoolSize : 2147483647,maxThreadIdleTime : 5,sizeOfQueue : -1,fairnessPolicy : false,
   [junit4]   2> 2639356 INFO  (TEST-TestCryptoKeys.test-seed#[8A141FED64EA135]) [    ] o.a.s.u.UpdateShardHandler Creating UpdateShardHandler HTTP client with params: 
   [junit4]   2> 2639357 INFO  (TEST-TestCryptoKeys.test-seed#[8A141FED64EA135]) [    ] o.a.s.l.LogWatcher SLF4J impl is org.slf4j.impl.Log4jLoggerFactory
   [junit4]   2> 2639357 INFO  (TEST-TestCryptoKeys.test-seed#[8A141FED64EA135]) [    ] o.a.s.l.LogWatcher Registering Log Listener [Log4j (org.slf4j.impl.Log4jLoggerFactory)]
   [junit4]   2> 2639358 INFO  (TEST-TestCryptoKeys.test-seed#[8A141FED64EA135]) [    ] o.a.s.c.ZkContainer Zookeeper client=127.0.0.1:51435/solr
   [junit4]   2> 2639358 INFO  (TEST-TestCryptoKeys.test-seed#[8A141FED64EA135]) [    ] o.a.s.c.ZkController zkHost includes chroot
   [junit4]   2> 2639358 INFO  (TEST-TestCryptoKeys.test-seed#[8A141FED64EA135]) [    ] o.a.s.c.c.SolrZkClient Using default ZkCredentialsProvider
   [junit4]   2> 2639359 INFO  (TEST-TestCryptoKeys.test-seed#[8A141FED64EA135]) [    ] o.a.s.c.c.ConnectionManager Waiting for client to connect to ZooKeeper
   [junit4]   2> 2639360 INFO  (zkCallback-3066-thread-1) [    ] o.a.s.c.c.ConnectionManager Watcher org.apache.solr.common.cloud.ConnectionManager@1851cbda name:ZooKeeperConnection Watcher:127.0.0.1:51435 got event WatchedEvent state:SyncConnected type:None path:null path:null type:None
   [junit4]   2> 2639361 INFO  (TEST-TestCryptoKeys.test-seed#[8A141FED64EA135]) [    ] o.a.s.c.c.ConnectionManager Client is connected to ZooKeeper
   [junit4]   2> 2639361 INFO  (TEST-TestCryptoKeys.test-seed#[8A141FED64EA135]) [    ] o.a.s.c.c.SolrZkClient Using default ZkACLProvider
   [junit4]   2> 2639363 INFO  (TEST-TestCryptoKeys.test-seed#[8A141FED64EA135]) [n:127.0.0.1:61181_    ] o.a.s.c.ZkController Added new OnReconnect listener org.apache.solr.cloud.ZkController$$Lambda$48/1352787704@48ad6287
   [junit4]   2> 2639364 INFO  (TEST-TestCryptoKeys.test-seed#[8A141FED64EA135]) [n:127.0.0.1:61181_    ] o.a.s.c.c.ConnectionManager Waiting for client to connect to ZooKeeper
   [junit4]   2> 2639366 INFO  (zkCallback-3067-thread-1-processing-n:127.0.0.1:61181_) [n:127.0.0.1:61181_    ] o.a.s.c.c.ConnectionManager Watcher org.apache.solr.common.cloud.ConnectionManager@f66f469 name:ZooKeeperConnection Watcher:127.0.0.1:51435/solr got event WatchedEvent state:SyncConnected type:None path:null path:null type:None
   [junit4]   2> 2639367 INFO  (TEST-TestCryptoKeys.test-seed#[8A141FED64EA135]) [n:127.0.0.1:61181_    ] o.a.s.c.c.ConnectionManager Client is connected to ZooKeeper
   [junit4]   2> 2639378 INFO  (TEST-TestCryptoKeys.test-seed#[8A141FED64EA135]) [n:127.0.0.1:61181_    ] o.a.s.c.c.ZkStateReader Updating cluster state from ZooKeeper... 
   [junit4]   2> 2639380 INFO  (TEST-TestCryptoKeys.test-seed#[8A141FED64EA135]) [n:127.0.0.1:61181_    ] o.a.s.c.c.ZkStateReader Loaded empty cluster properties
   [junit4]   2> 2639381 INFO  (TEST-TestCryptoKeys.test-seed#[8A141FED64EA135]) [n:127.0.0.1:61181_    ] o.a.s.c.c.ZkStateReader Updated live nodes from ZooKeeper... (0) -> (1)
   [junit4]   2> 2639387 INFO  (TEST-TestCryptoKeys.test-seed#[8A141FED64EA135]) [n:127.0.0.1:61181_    ] o.a.s.c.Overseer Overseer (id=null) closing
   [junit4]   2> 2639388 INFO  (TEST-TestCryptoKeys.test-seed#[8A141FED64EA135]) [n:127.0.0.1:61181_    ] o.a.s.c.LeaderElector Joined leadership election with path: /overseer_elect/election/96093729352187913-127.0.0.1:61181_-n_0000000001
   [junit4]   2> 2639389 INFO  (TEST-TestCryptoKeys.test-seed#[8A141FED64EA135]) [n:127.0.0.1:61181_    ] o.a.s.c.LeaderElector Watching path /overseer_elect/election/96093729352187908-127.0.0.1:32962_-n_0000000000 to know if I could be the leader
   [junit4]   2> 2639390 INFO  (TEST-TestCryptoKeys.test-seed#[8A141FED64EA135]) [n:127.0.0.1:61181_    ] o.a.s.c.ZkController Publish node=127.0.0.1:61181_ as DOWN
   [junit4]   2> 2639400 INFO  (OverseerStateUpdate-96093729352187908-127.0.0.1:32962_-n_0000000000) [n:127.0.0.1:32962_    ] o.a.s.c.Overseer processMessage: queueSize: 1, message = {
   [junit4]   2>   "operation":"downnode",
   [junit4]   2>   "node_name":"127.0.0.1:61181_"} current state version: 3
   [junit4]   2> 2639400 INFO  (OverseerStateUpdate-96093729352187908-127.0.0.1:32962_-n_0000000000) [n:127.0.0.1:32962_    ] o.a.s.c.o.NodeMutator DownNode state invoked for node: 127.0.0.1:61181_
   [junit4]   2> 2639402 INFO  (zkCallback-3057-thread-1-processing-n:127.0.0.1:32962_) [n:127.0.0.1:32962_    ] o.a.s.c.c.ZkStateReader A cluster state change: [WatchedEvent state:SyncConnected type:NodeDataChanged path:/clusterstate.json], has occurred - updating... (live nodes size: [1])
   [junit4]   2> 2639403 INFO  (zkCallback-3061-thread-1) [    ] o.a.s.c.c.ZkStateReader A cluster state change: [WatchedEvent state:SyncConnected type:NodeDataChanged path:/clusterstate.json], has occurred - updating... (live nodes size: [1])
   [junit4]   2> 2639405 INFO  (zkCallback-3067-thread-1-processing-n:127.0.0.1:61181_) [n:127.0.0.1:61181_    ] o.a.s.c.c.ZkStateReader A cluster state change: [WatchedEvent state:SyncConnected type:NodeDataChanged path:/clusterstate.json], has occurred - updating... (live nodes size: [1])
   [junit4]   2> 2639511 INFO  (OverseerStateUpdate-96093729352187908-127.0.0.1:32962_-n_0000000000) [n:127.0.0.1:32962_    ] o.a.s.c.o.ZkStateWriter going to update_collection /collections/collection1/state.json version: 0
   [junit4]   2> 2640395 INFO  (TEST-TestCryptoKeys.test-seed#[8A141FED64EA135]) [n:127.0.0.1:61181_    ] o.a.s.c.ZkController Register node as live in ZooKeeper:/live_nodes/127.0.0.1:61181_
   [junit4]   2> 2640396 INFO  (TEST-TestCryptoKeys.test-seed#[8A141FED64EA135]) [n:127.0.0.1:61181_    ] o.a.s.c.c.SolrZkClient makePath: /live_nodes/127.0.0.1:61181_
   [junit4]   2> 2640399 INFO  (zkCallback-3061-thread-1) [    ] o.a.s.c.c.ZkStateReader A live node change: [WatchedEvent state:SyncConnected type:NodeChildrenChanged path:/live_nodes], has occurred - updating... (live nodes size: [1])
   [junit4]   2> 2640400 INFO  (zkCallback-3061-thread-1) [    ] o.a.s.c.c.ZkStateReader Updated live nodes from ZooKeeper... (1) -> (2)
   [junit4]   2> 2640401 INFO  (zkCallback-3057-thread-1-processing-n:127.0.0.1:32962_) [n:127.0.0.1:32962_    ] o.a.s.c.c.ZkStateReader A live node change: [WatchedEvent state:SyncConnected type:NodeChildrenChanged path:/live_nodes], has occurred - updating... (live nodes size: [1])
   [junit4]   2> 2640403 INFO  (zkCallback-3057-thread-1-processing-n:127.0.0.1:32962_) [n:127.0.0.1:32962_    ] o.a.s.c.c.ZkStateReader Updated live nodes from ZooKeeper... (1) -> (2)
   [junit4]   2> 2640412 INFO  (zkCallback-3067-thread-1-processing-n:127.0.0.1:61181_) [n:127.0.0.1:61181_    ] o.a.s.c.c.ZkStateReader A live node change: [WatchedEvent state:SyncConnected type:NodeChildrenChanged path:/live_nodes], has occurred - updating... (live nodes size: [1])
   [junit4]   2> 2640415 INFO  (zkCallback-3067-thread-1-processing-n:127.0.0.1:61181_) [n:127.0.0.1:61181_    ] o.a.s.c.c.ZkStateReader Updated live nodes from ZooKeeper... (1) -> (2)
   [junit4]   2> 2640438 INFO  (TEST-TestCryptoKeys.test-seed#[8A141FED64EA135]) [n:127.0.0.1:61181_    ] o.a.s.c.CoreContainer Security conf doesn't exist. Skipping setup for authorization module.
   [junit4]   2> 2640438 INFO  (TEST-TestCryptoKeys.test-seed#[8A141FED64EA135]) [n:127.0.0.1:61181_    ] o.a.s.c.CoreContainer No authentication plugin used.
   [junit4]   2> 2640439 INFO  (TEST-TestCryptoKeys.test-seed#[8A141FED64EA135]) [n:127.0.0.1:61181_    ] o.a.s.c.CorePropertiesLocator Looking for core definitions underneath /export/home/jenkins/workspace/Lucene-Solr-master-Solaris/solr/build/solr-core/test/J1/../../../../../../../../../../export/home/jenkins/workspace/Lucene-Solr-master-Solaris/solr/build/solr-core/test/J1/temp/solr.cloud.TestCryptoKeys_8A141FED64EA135-001/shard-1-001/cores
   [junit4]   2> 2640441 INFO  (TEST-TestCryptoKeys.test-seed#[8A141FED64EA135]) [n:127.0.0.1:61181_    ] o.a.s.c.CoreDescriptor Created CoreDescriptor: {name=collection1, config=solrconfig.xml, transient=false, schema=schema.xml, loadOnStartup=true, configSetProperties=configsetprops.json, collection=collection1, coreNodeName=, dataDir=data/, shard=}
   [junit4]   2> 2640441 INFO  (TEST-TestCryptoKeys.test-seed#[8A141FED64EA135]) [n:127.0.0.1:61181_    ] o.a.s.c.CorePropertiesLocator Found core collection1 in /export/home/jenkins/workspace/Lucene-Solr-master-Solaris/solr/build/solr-core/test/J1/../../../../../../../../../../export/home/jenkins/workspace/Lucene-Solr-master-Solaris/solr/build/solr-core/test/J1/temp/solr.cloud.TestCryptoKeys_8A141FED64EA135-001/shard-1-001/cores/collection1
   [junit4]   2> 2640441 INFO  (TEST-TestCryptoKeys.test-seed#[8A141FED64EA135]) [n:127.0.0.1:61181_    ] o.a.s.c.CorePropertiesLocator Found 1 core definitions
   [junit4]   2> 2640443 INFO  (TEST-TestCryptoKeys.test-seed#[8A141FED64EA135]) [n:127.0.0.1:61181_    ] o.a.s.s.SolrDispatchFilter user.dir=/export/home/jenkins/workspace/Lucene-Solr-master-Solaris/solr/build/solr-core/test/J1
   [junit4]   2> 2640443 INFO  (TEST-TestCryptoKeys.test-seed#[8A141FED64EA135]) [n:127.0.0.1:61181_    ] o.a.s.s.SolrDispatchFilter SolrDispatchFilter.init() done
   [junit4]   2> 2640484 INFO  (coreLoadExecutor-7718-thread-1-processing-n:127.0.0.1:61181_) [n:127.0.0.1:61181_ c:collection1   x:collection1] o.a.s.c.ZkController publishing state=down
   [junit4]   2> 2640484 INFO  (coreLoadExecutor-7718-thread-1-processing-n:127.0.0.1:61181_) [n:127.0.0.1:61181_ c:collection1   x:collection1] o.a.s.c.ZkController numShards not found on descriptor - reading it from system property
   [junit4]   2> 2640495 INFO  (coreLoadExecutor-7718-thread-1-processing-n:127.0.0.1:61181_) [n:127.0.0.1:61181_ c:collection1   x:collection1] o.a.s.c.ZkController Registering watch for collection collection1
   [junit4]   2> 2640496 INFO  (coreLoadExecutor-7718-thread-1-processing-n:127.0.0.1:61181_) [n:127.0.0.1:61181_ c:collection1   x:collection1] o.a.s.c.c.ZkStateReader Add data for [collection1] ver [1]
   [junit4]   2> 2640496 INFO  (coreLoadExecutor-7718-thread-1-processing-n:127.0.0.1:61181_) [n:127.0.0.1:61181_ c:collection1   x:collection1] o.a.s.c.ZkController look for our core node name
   [junit4]   2> 2640497 INFO  (OverseerStateUpdate-96093729352187908-127.0.0.1:32962_-n_0000000000) [n:127.0.0.1:32962_    ] o.a.s.c.Overseer processMessage: queueSize: 1, message = {
   [junit4]   2>   "core":"collection1",
   [junit4]   2>   "roles":null,
   [junit4]   2>   "base_url":"http://127.0.0.1:61181",
   [junit4]   2>   "node_name":"127.0.0.1:61181_",
   [junit4]   2>   "numShards":"1",
   [junit4]   2>   "state":"down",
   [junit4]   2>   "shard":null,
   [junit4]   2>   "collection":"collection1",
   [junit4]   2>   "operation":"state"} current state version: 4
   [junit4]   2> 2640497 INFO  (OverseerStateUpdate-96093729352187908-127.0.0.1:32962_-n_0000000000) [n:127.0.0.1:32962_    ] o.a.s.c.o.ReplicaMutator Update state numShards=1 message={
   [junit4]   2>   "core":"collection1",
   [junit4]   2>   "roles":null,
   [junit4]   2>   "base_url":"http://127.0.0.1:61181",
   [junit4]   2>   "node_name":"127.0.0.1:61181_",
   [junit4]   2>   "numShards":"1",
   [junit4]   2>   "state":"down",
   [junit4]   2>   "shard":null,
   [junit4]   2>   "collection":"collection1",
   [junit4]   2>   "operation":"state"}
   [junit4]   2> 2640497 INFO  (OverseerStateUpdate-96093729352187908-127.0.0.1:32962_-n_0000000000) [n:127.0.0.1:32962_    ] o.a.s.c.o.ReplicaMutator Collection already exists with numShards=1
   [junit4]   2> 2640497 INFO  (OverseerStateUpdate-96093729352187908-127.0.0.1:32962_-n_0000000000) [n:127.0.0.1:32962_    ] o.a.s.c.o.ReplicaMutator Assigning new node to shard shard=shard1
   [junit4]   2> 2640625 INFO  (OverseerStateUpdate-96093729352187908-127.0.0.1:32962_-n_0000000000) [n:127.0.0.1:32962_    ] o.a.s.c.o.ZkStateWriter going to update_collection /collections/collection1/state.json version: 1
   [junit4]   2> 2640629 INFO  (zkCallback-3067-thread-1-processing-n:127.0.0.1:61181_) [n:127.0.0.1:61181_    ] o.a.s.c.c.ZkStateReader A cluster state change: [WatchedEvent state:SyncConnected type:NodeDataChanged path:/collections/collection1/state.json] for collection [collection1] has occurred - updating... (live nodes size: [2])
   [junit4]   2> 2640630 INFO  (zkCallback-3067-thread-1-processing-n:127.0.0.1:61181_) [n:127.0.0.1:61181_    ] o.a.s.c.c.ZkStateReader Updating data for [collection1] from [1] to [2]
   [junit4]   2> 2641502 INFO  (coreLoadExecutor-7718-thread-1-processing-n:127.0.0.1:61181_) [n:127.0.0.1:61181_ c:collection1   x:collection1] o.a.s.c.ZkController waiting to find shard id in clusterstate for collection1
   [junit4]   2> 2641502 INFO  (coreLoadExecutor-7718-thread-1-processing-n:127.0.0.1:61181_) [n:127.0.0.1:61181_ c:collection1   x:collection1] o.a.s.c.ZkController Check for collection zkNode:collection1
   [junit4]   2> 2641503 INFO  (coreLoadExecutor-7718-thread-1-processing-n:127.0.0.1:61181_) [n:127.0.0.1:61181_ c:collection1   x:collection1] o.a.s.c.ZkController Collection zkNode exists
   [junit4]   2> 2641503 INFO  (coreLoadExecutor-7718-thread-1-processing-n:127.0.0.1:61181_) [n:127.0.0.1:61181_ c:collection1   x:collection1] o.a.s.c.c.ZkStateReader Load collection config from: [/collections/collection1]
   [junit4]   2> 2641505 INFO  (coreLoadExecutor-7718-thread-1-processing-n:127.0.0.1:61181_) [n:127.0.0.1:61181_ c:collection1   x:collection1] o.a.s.c.c.ZkStateReader path=[/collections/collection1] [configName]=[conf1] specified config exists in ZooKeeper
   [junit4]   2> 2641505 INFO  (coreLoadExecutor-7718-thread-1-processing-n:127.0.0.1:61181_) [n:127.0.0.1:61181_ c:collection1   x:collection1] o.a.s.c.SolrResourceLoader new SolrResourceLoader for directory: '/export/home/jenkins/workspace/Lucene-Solr-master-Solaris/solr/build/solr-core/test/J1/temp/solr.cloud.TestCryptoKeys_8A141FED64EA135-001/shard-1-001/cores/collection1'
   [junit4]   2> 2641505 INFO  (coreLoadExecutor-7718-thread-1-processing-n:127.0.0.1:61181_) [n:127.0.0.1:61181_ c:collection1   x:collection1] o.a.s.c.SolrResourceLoader JNDI not configured for solr (NoInitialContextEx)
   [junit4]   2> 2641505 INFO  (coreLoadExecutor-7718-thread-1-processing-n:127.0.0.1:61181_) [n:127.0.0.1:61181_ c:collection1   x:collection1] o.a.s.c.SolrResourceLoader solr home defaulted to 'solr/' (could not find system property or JNDI)
   [junit4]   2> 2641508 INFO  (coreLoadExecutor-7718-thread-1-processing-n:127.0.0.1:61181_) [n:127.0.0.1:61181_ c:collection1   x:collection1] o.a.s.c.Config loaded config solrconfig.xml with version 0 
   [junit4]   2> 2641518 INFO  (coreLoadExecutor-7718-thread-1-processing-n:127.0.0.1:61181_) [n:127.0.0.1:61181_ c:collection1   x:collection1] o.a.s.c.SolrConfig current version of requestparams : -1
   [junit4]   2> 2641542 INFO  (coreLoadExecutor-7718-thread-1-processing-n:127.0.0.1:61181_) [n:127.0.0.1:61181_ c:collection1   x:collection1] o.a.s.c.SolrConfig Using Lucene MatchVersion: 7.0.0
   [junit4]   2> 2641549 INFO  (coreLoadExecutor-7718-thread-1-processing-n:127.0.0.1:61181_) [n:127.0.0.1:61181_ c:collection1   x:collection1] o.a.s.c.SolrConfig Loaded SolrConfig: solrconfig.xml
   [junit4]   2> 2641560 INFO  (coreLoadExecutor-7718-thread-1-processing-n:127.0.0.1:61181_) [n:127.0.0.1:61181_ c:collection1   x:collection1] o.a.s.s.IndexSchema [collection1] Schema name=test
   [junit4]   2> 2641686 INFO  (coreLoadExecutor-7718-thread-1-processing-n:127.0.0.1:61181_) [n:127.0.0.1:61181_ c:collection1   x:collection1] o.a.s.s.OpenExchangeRatesOrgProvider Initialized with rates=open-exchange-rates.json, refreshInterval=1440.
   [junit4]   2> 2641701 INFO  (coreLoadExecutor-7718-thread-1-processing-n:127.0.0.1:61181_) [n:127.0.0.1:61181_ c:collection1   x:collection1] o.a.s.s.IndexSchema default search field in schema is text
   [junit4]   2> 2641704 INFO  (coreLoadExecutor-7718-thread-1-processing-n:127.0.0.1:61181_) [n:127.0.0.1:61181_ c:collection1   x:collection1] o.a.s.s.IndexSchema unique key field: id
   [junit4]   2> 2641726 INFO  (coreLoadExecutor-7718-thread-1-processing-n:127.0.0.1:61181_) [n:127.0.0.1:61181_ c:collection1   x:collection1] o.a.s.s.FileExchangeRateProvider Reloading exchange rates from file currency.xml
   [junit4]   2> 2641730 INFO  (coreLoadExecutor-7718-thread-1-processing-n:127.0.0.1:61181_) [n:127.0.0.1:61181_ c:collection1   x:collection1] o.a.s.s.FileExchangeRateProvider Reloading exchange rates from file currency.xml
   [junit4]   2> 2641735 INFO  (coreLoadExecutor-7718-thread-1-processing-n:127.0.0.1:61181_) [n:127.0.0.1:61181_ c:collection1   x:collection1] o.a.s.s.OpenExchangeRatesOrgProvider Reloading exchange rates from open-exchange-rates.json
   [junit4]   2> 2641737 INFO  (coreLoadExecutor-7718-thread-1-processing-n:127.0.0.1:61181_) [n:127.0.0.1:61181_ c:collection1   x:collection1] o.a.s.s.OpenExchangeRatesOrgProvider Reloading exchange rates from open-exchange-rates.json
   [junit4]   2> 2641741 INFO  (coreLoadExecutor-7718-thread-1-processing-n:127.0.0.1:61181_) [n:127.0.0.1:61181_ c:collection1   x:collection1] o.a.s.c.ConfigSetProperties Did not find ConfigSet properties, assuming default properties: Can't find resource 'configsetprops.json' in classpath or '/configs/conf1', cwd=/export/home/jenkins/workspace/Lucene-Solr-master-Solaris/solr/build/solr-core/test/J1
   [junit4]   2> 2641741 INFO  (coreLoadExecutor-7718-thread-1-processing-n:127.0.0.1:61181_) [n:127.0.0.1:61181_ c:collection1   x:collection1] o.a.s.c.CoreContainer Creating SolrCore 'collection1' using configuration from collection collection1
   [junit4] 

[...truncated too long message...]

INFO  (TEST-TestCryptoKeys.test-seed#[8A141FED64EA135]) [    ] o.a.s.c.ZkTestServer connecting to 127.0.0.1:51435 51435
   [junit4]   2> 2689734 INFO  (Thread-9347) [    ] o.a.s.c.ZkTestServer connecting to 127.0.0.1:51435 51435
   [junit4]   2> 2689735 WARN  (Thread-9347) [    ] o.a.s.c.ZkTestServer Watch limit violations: 
   [junit4]   2> Maximum concurrent create/delete watches above limit:
   [junit4]   2> 
   [junit4]   2> 	7	/solr/aliases.json
   [junit4]   2> 	7	/solr/clusterprops.json
   [junit4]   2> 	5	/solr/security.json
   [junit4]   2> 	5	/solr/configs/conf1
   [junit4]   2> 
   [junit4]   2> Maximum concurrent data watches above limit:
   [junit4]   2> 
   [junit4]   2> 	7	/solr/clusterstate.json
   [junit4]   2> 	4	/solr/collections/collection1/state.json
   [junit4]   2> 	2	/solr/collections/.system/state.json
   [junit4]   2> 
   [junit4]   2> Maximum concurrent children watches above limit:
   [junit4]   2> 
   [junit4]   2> 	50	/solr/overseer/queue
   [junit4]   2> 	49	/solr/overseer/collection-queue-work
   [junit4]   2> 	18	/solr/overseer/queue-work
   [junit4]   2> 	7	/solr/live_nodes
   [junit4]   2> 	7	/solr/collections
   [junit4]   2> 
   [junit4]   2> NOTE: reproduce with: ant test  -Dtestcase=TestCryptoKeys -Dtests.method=test -Dtests.seed=8A141FED64EA135 -Dtests.slow=true -Dtests.locale=zh-CN -Dtests.timezone=Asia/Urumqi -Dtests.asserts=true -Dtests.file.encoding=UTF-8
   [junit4] FAILURE 52.6s J1 | TestCryptoKeys.test <<<
   [junit4]    > Throwable #1: java.lang.AssertionError: Could not find collection:.system
   [junit4]    > 	at __randomizedtesting.SeedInfo.seed([8A141FED64EA135:80F57E2478B2CCCD]:0)
   [junit4]    > 	at org.apache.solr.cloud.AbstractDistribZkTestBase.waitForRecoveriesToFinish(AbstractDistribZkTestBase.java:154)
   [junit4]    > 	at org.apache.solr.cloud.AbstractDistribZkTestBase.waitForRecoveriesToFinish(AbstractDistribZkTestBase.java:139)
   [junit4]    > 	at org.apache.solr.cloud.AbstractDistribZkTestBase.waitForRecoveriesToFinish(AbstractDistribZkTestBase.java:134)
   [junit4]    > 	at org.apache.solr.cloud.AbstractFullDistribZkTestBase.waitForRecoveriesToFinish(AbstractFullDistribZkTestBase.java:856)
   [junit4]    > 	at org.apache.solr.cloud.TestCryptoKeys.test(TestCryptoKeys.java:117)
   [junit4]    > 	at org.apache.solr.BaseDistributedSearchTestCase$ShardsRepeatRule$ShardsFixedStatement.callStatement(BaseDistributedSearchTestCase.java:985)
   [junit4]    > 	at org.apache.solr.BaseDistributedSearchTestCase$ShardsRepeatRule$ShardsStatement.evaluate(BaseDistributedSearchTestCase.java:960)
   [junit4]    > 	at java.lang.Thread.run(Thread.java:745)
   [junit4]   2> 2689762 INFO  (SUITE-TestCryptoKeys-seed#[8A141FED64EA135]-worker) [    ] o.a.s.SolrTestCaseJ4 ###deleteCore
   [junit4]   2> NOTE: leaving temporary files on disk at: /export/home/jenkins/workspace/Lucene-Solr-master-Solaris/solr/build/solr-core/test/J1/temp/solr.cloud.TestCryptoKeys_8A141FED64EA135-001
   [junit4]   2> NOTE: test params are: codec=Lucene62, sim=RandomSimilarity(queryNorm=false,coord=yes): {}, locale=zh-CN, timezone=Asia/Urumqi
   [junit4]   2> NOTE: SunOS 5.11 amd64/Oracle Corporation 1.8.0_92 (64-bit)/cpus=3,threads=1,free=244185880,total=536870912
   [junit4]   2> NOTE: All tests run in this JVM: [TestOrdValues, DefaultValueUpdateProcessorTest, HdfsDirectoryTest, TestIndexSearcher, NotRequiredUniqueKeyTest, BlockJoinFacetRandomTest, TestSolrIndexConfig, OpenCloseCoreStressTest, TestManagedResourceStorage, TestSimpleQParserPlugin, IndexSchemaRuntimeFieldTest, DistributedMLTComponentTest, TestOmitPositions, SpellCheckCollatorTest, ForceLeaderTest, TestDistributedMissingSort, OverseerTaskQueueTest, FieldMutatingUpdateProcessorTest, ZkStateWriterTest, SpellCheckComponentTest, TestConfigSetsAPIZkFailure, TestDocBasedVersionConstraints, TestSimpleTrackingShardHandler, TestCloudPivotFacet, TestRebalanceLeaders, TlogReplayBufferedWhileIndexingTest, TestStressRecovery, TestReversedWildcardFilterFactory, TestLMJelinekMercerSimilarityFactory, TestFieldSortValues, TestCloudSchemaless, TestLeaderInitiatedRecoveryThread, TestFuzzyAnalyzedSuggestions, CdcrVersionReplicationTest, ConnectionReuseTest, MultiTermTest, TestSchemaNameResource, CleanupOldIndexTest, TestAnalyzeInfixSuggestions, TestCollationField, FileUtilsTest, SuggestComponentContextFilterQueryTest, TestRandomFaceting, HdfsWriteToMultipleCollectionsTest, TestImplicitCoreProperties, VMParamsZkACLAndCredentialsProvidersTest, DistributedQueueTest, EchoParamsTest, SortByFunctionTest, MergeStrategyTest, SolrIndexSplitterTest, CacheHeaderTest, TestNumericTerms64, ZkNodePropsTest, TestFieldCacheVsDocValues, TestAtomicUpdateErrorCases, FacetPivotSmallTest, TestReloadDeadlock, DistributedQueryComponentOptimizationTest, CheckHdfsIndexTest, CollectionsAPISolrJTest, TestConfigSetImmutable, DistribDocExpirationUpdateProcessorTest, AddBlockUpdateTest, TestHdfsUpdateLog, ShardSplitTest, SortSpecParsingTest, TestAuthorizationFramework, TestComplexPhraseQParserPlugin, TestDistribIDF, TestFieldCollectionResource, OutputWriterTest, AsyncCallRequestStatusResponseTest, TestFoldingMultitermQuery, AnalyticsQueryTest, TestSolrCLIRunExample, BasicFunctionalityTest, CoreMergeIndexesAdminHandlerTest, DirectSolrConnectionTest, FieldAnalysisRequestHandlerTest, TestSolrCoreProperties, BJQParserTest, BitVectorTest, FullSolrCloudDistribCmdsTest, DistributedFacetPivotWhiteBoxTest, TestSchemaSimilarityResource, TestFieldCacheSort, SuggesterWFSTTest, TestMissingGroups, TestPivotHelperCode, CoreAdminCreateDiscoverTest, DeleteInactiveReplicaTest, TestJettySolrRunner, SearchHandlerTest, TestObjectReleaseTracker, HdfsTlogReplayBufferedWhileIndexingTest, ExitableDirectoryReaderTest, NumericFieldsTest, CurrencyFieldOpenExchangeTest, SolrCmdDistributorTest, ChaosMonkeySafeLeaderTest, TestRandomCollapseQParserPlugin, TestRequestForwarding, TestRecovery, TestBulkSchemaAPI, TestIndexingPerformance, TestNonDefinedSimilarityFactory, BlobRepositoryCloudTest, QueryResultKeyTest, TestFastOutputStream, TestCopyFieldCollectionResource, TestCSVResponseWriter, CollectionTooManyReplicasTest, TestQueryTypes, TestReloadAndDeleteDocs, TestAuthenticationFramework, TestRawTransformer, TestInitQParser, BasicDistributedZk2Test, BasicZkTest, SolrCoreCheckLockOnStartupTest, DistributedTermsComponentTest, TestRuleBasedAuthorizationPlugin, SolrCloudExampleTest, TestQuerySenderListener, TestExactStatsCache, LeaderElectionIntegrationTest, ShowFileRequestHandlerTest, TestJsonFacets, DateFieldTest, TestZkChroot, TestSortingResponseWriter, LukeRequestHandlerTest, TestCharFilters, TestSolr4Spatial2, TestPHPSerializedResponseWriter, TestRangeQuery, DocExpirationUpdateProcessorFactoryTest, BinaryUpdateRequestHandlerTest, TestSizeLimitedDistributedMap, TestDistributedGrouping, BadIndexSchemaTest, TestSolrConfigHandler, TermVectorComponentTest, ZkSolrClientTest, ResponseLogComponentTest, TestPerFieldSimilarity, TestUseDocValuesAsStored2, JavabinLoaderTest, BaseCdcrDistributedZkTest, HdfsSyncSliceTest, ShardRoutingTest, RecoveryZkTest, TestRandomDVFaceting, ShardRoutingCustomTest, TestDistributedSearch, ZkControllerTest, TestRealTimeGet, TestJoin, TestSolr4Spatial, StatsComponentTest, TestCoreDiscovery, SuggesterFSTTest, SolrRequestParserTest, DocValuesTest, DebugComponentTest, DisMaxRequestHandlerTest, TestWriterPerf, PrimitiveFieldTypeTest, TermsComponentTest, XmlUpdateRequestHandlerTest, TestValueSourceCache, TestSolrQueryParser, FastVectorHighlighterTest, RegexBoostProcessorTest, IndexSchemaTest, UpdateRequestProcessorFactoryTest, UniqFieldsUpdateProcessorFactoryTest, TestPartialUpdateDeduplication, CSVRequestHandlerTest, TestBinaryResponseWriter, SOLR749Test, TestQuerySenderNoQuery, TestMergePolicyConfig, TestBinaryField, MinimalSchemaTest, TestConfig, TestPostingsSolrHighlighter, TestXIncludeConfig, TestFastWriter, ResourceLoaderTest, OpenExchangeRatesOrgProviderTest, PluginInfoTest, TestSystemIdResolver, TestSuggestSpellingConverter, SpellingQueryConverterTest, RAMDirectoryFactoryTest, TestUtils, SliceStateTest, TestRTGBase, DistributedIntervalFacetingTest, CdcrReplicationHandlerTest, CloudExitableDirectoryReaderTest, CollectionReloadTest, ConfigSetsAPITest, ConnectionManagerTest, CreateCollectionCleanupTest, DeleteReplicaTest, DistribJoinFromCollectionTest, LeaderFailoverAfterPartitionTest, OverseerStatusTest, RecoveryAfterSoftCommitTest, RestartWhileUpdatingTest, RollingRestartTest, SharedFSAutoReplicaFailoverTest, SharedFSAutoReplicaFailoverUtilsTest, TestCloudBackupRestore, TestConfigSetsAPI, TestCryptoKeys]
   [junit4] Completed [475/614 (1!)] on J1 in 52.68s, 1 test, 1 failure <<< FAILURES!

[...truncated 471 lines...]
BUILD FAILED
/export/home/jenkins/workspace/Lucene-Solr-master-Solaris/build.xml:740: The following error occurred while executing this line:
/export/home/jenkins/workspace/Lucene-Solr-master-Solaris/build.xml:684: The following error occurred while executing this line:
/export/home/jenkins/workspace/Lucene-Solr-master-Solaris/build.xml:59: The following error occurred while executing this line:
/export/home/jenkins/workspace/Lucene-Solr-master-Solaris/solr/build.xml:233: The following error occurred while executing this line:
/export/home/jenkins/workspace/Lucene-Solr-master-Solaris/solr/common-build.xml:531: The following error occurred while executing this line:
/export/home/jenkins/workspace/Lucene-Solr-master-Solaris/lucene/common-build.xml:1427: The following error occurred while executing this line:
/export/home/jenkins/workspace/Lucene-Solr-master-Solaris/lucene/common-build.xml:984: There were test failures: 614 suites (10 ignored), 2584 tests, 1 failure, 88 ignored (73 assumptions) [seed: 8A141FED64EA135]

Total time: 80 minutes 52 seconds
Build step 'Invoke Ant' marked build as failure
Archiving artifacts
[WARNINGS] Skipping publisher since build result is FAILURE
Recording test results
Email was triggered for: Failure - Any
Sending email for trigger: Failure - Any



Mime
View raw message