lucene-dev mailing list archives

Site index · List index
Message view « Date » · « Thread »
Top « Date » · « Thread »
From Policeman Jenkins Server <jenk...@thetaphi.de>
Subject [JENKINS] Lucene-Solr-6.1-Linux (64bit/jdk1.8.0_92) - Build # 4 - Failure!
Date Thu, 09 Jun 2016 12:45:56 GMT
Build: http://jenkins.thetaphi.de/job/Lucene-Solr-6.1-Linux/4/
Java: 64bit/jdk1.8.0_92 -XX:+UseCompressedOops -XX:+UseParallelGC

1 tests failed.
FAILED:  junit.framework.TestSuite.org.apache.solr.handler.TestSolrConfigHandlerCloud

Error Message:
1 thread leaked from SUITE scope at org.apache.solr.handler.TestSolrConfigHandlerCloud:     1) Thread[id=2984, name=Thread-1035, state=TIMED_WAITING, group=TGRP-TestSolrConfigHandlerCloud]         at java.lang.Thread.sleep(Native Method)         at org.apache.solr.cloud.ZkSolrResourceLoader.openResource(ZkSolrResourceLoader.java:101)         at org.apache.solr.core.SolrResourceLoader.openSchema(SolrResourceLoader.java:333)         at org.apache.solr.schema.IndexSchemaFactory.create(IndexSchemaFactory.java:48)         at org.apache.solr.schema.IndexSchemaFactory.buildIndexSchema(IndexSchemaFactory.java:75)         at org.apache.solr.core.ConfigSetService.createIndexSchema(ConfigSetService.java:108)         at org.apache.solr.core.ConfigSetService.getConfig(ConfigSetService.java:79)         at org.apache.solr.core.CoreContainer.reload(CoreContainer.java:912)         at org.apache.solr.core.SolrCore.lambda$getConfListener$6(SolrCore.java:2510)         at org.apache.solr.core.SolrCore$$Lambda$94/1067715837.run(Unknown Source)         at org.apache.solr.cloud.ZkController$4.run(ZkController.java:2408)

Stack Trace:
com.carrotsearch.randomizedtesting.ThreadLeakError: 1 thread leaked from SUITE scope at org.apache.solr.handler.TestSolrConfigHandlerCloud: 
   1) Thread[id=2984, name=Thread-1035, state=TIMED_WAITING, group=TGRP-TestSolrConfigHandlerCloud]
        at java.lang.Thread.sleep(Native Method)
        at org.apache.solr.cloud.ZkSolrResourceLoader.openResource(ZkSolrResourceLoader.java:101)
        at org.apache.solr.core.SolrResourceLoader.openSchema(SolrResourceLoader.java:333)
        at org.apache.solr.schema.IndexSchemaFactory.create(IndexSchemaFactory.java:48)
        at org.apache.solr.schema.IndexSchemaFactory.buildIndexSchema(IndexSchemaFactory.java:75)
        at org.apache.solr.core.ConfigSetService.createIndexSchema(ConfigSetService.java:108)
        at org.apache.solr.core.ConfigSetService.getConfig(ConfigSetService.java:79)
        at org.apache.solr.core.CoreContainer.reload(CoreContainer.java:912)
        at org.apache.solr.core.SolrCore.lambda$getConfListener$6(SolrCore.java:2510)
        at org.apache.solr.core.SolrCore$$Lambda$94/1067715837.run(Unknown Source)
        at org.apache.solr.cloud.ZkController$4.run(ZkController.java:2408)
	at __randomizedtesting.SeedInfo.seed([CC8F2698627180C4]:0)




Build Log:
[...truncated 10890 lines...]
   [junit4] Suite: org.apache.solr.handler.TestSolrConfigHandlerCloud
   [junit4]   2> Creating dataDir: /home/jenkins/workspace/Lucene-Solr-6.1-Linux/solr/build/solr-core/test/J1/temp/solr.handler.TestSolrConfigHandlerCloud_CC8F2698627180C4-001/init-core-data-001
   [junit4]   2> 390385 INFO  (SUITE-TestSolrConfigHandlerCloud-seed#[CC8F2698627180C4]-worker) [    ] o.a.s.SolrTestCaseJ4 Randomized ssl (true) and clientAuth (false) via: @org.apache.solr.util.RandomizeSSL(reason=, ssl=NaN, value=NaN, clientAuth=NaN)
   [junit4]   2> 390385 INFO  (SUITE-TestSolrConfigHandlerCloud-seed#[CC8F2698627180C4]-worker) [    ] o.a.s.BaseDistributedSearchTestCase Setting hostContext system property: /
   [junit4]   2> 390386 INFO  (TEST-TestSolrConfigHandlerCloud.test-seed#[CC8F2698627180C4]) [    ] o.a.s.c.ZkTestServer STARTING ZK TEST SERVER
   [junit4]   2> 390387 INFO  (Thread-920) [    ] o.a.s.c.ZkTestServer client port:0.0.0.0/0.0.0.0:0
   [junit4]   2> 390387 INFO  (Thread-920) [    ] o.a.s.c.ZkTestServer Starting server
   [junit4]   2> 390487 INFO  (TEST-TestSolrConfigHandlerCloud.test-seed#[CC8F2698627180C4]) [    ] o.a.s.c.ZkTestServer start zk server on port:44583
   [junit4]   2> 390487 INFO  (TEST-TestSolrConfigHandlerCloud.test-seed#[CC8F2698627180C4]) [    ] o.a.s.c.c.SolrZkClient Using default ZkCredentialsProvider
   [junit4]   2> 390487 INFO  (TEST-TestSolrConfigHandlerCloud.test-seed#[CC8F2698627180C4]) [    ] o.a.s.c.c.ConnectionManager Waiting for client to connect to ZooKeeper
   [junit4]   2> 390489 INFO  (zkCallback-446-thread-1) [    ] o.a.s.c.c.ConnectionManager Watcher org.apache.solr.common.cloud.ConnectionManager@3ab31071 name:ZooKeeperConnection Watcher:127.0.0.1:44583 got event WatchedEvent state:SyncConnected type:None path:null path:null type:None
   [junit4]   2> 390489 INFO  (TEST-TestSolrConfigHandlerCloud.test-seed#[CC8F2698627180C4]) [    ] o.a.s.c.c.ConnectionManager Client is connected to ZooKeeper
   [junit4]   2> 390489 INFO  (TEST-TestSolrConfigHandlerCloud.test-seed#[CC8F2698627180C4]) [    ] o.a.s.c.c.SolrZkClient Using default ZkACLProvider
   [junit4]   2> 390489 INFO  (TEST-TestSolrConfigHandlerCloud.test-seed#[CC8F2698627180C4]) [    ] o.a.s.c.c.SolrZkClient makePath: /solr
   [junit4]   2> 390490 INFO  (TEST-TestSolrConfigHandlerCloud.test-seed#[CC8F2698627180C4]) [    ] o.a.s.c.c.SolrZkClient Using default ZkCredentialsProvider
   [junit4]   2> 390491 INFO  (TEST-TestSolrConfigHandlerCloud.test-seed#[CC8F2698627180C4]) [    ] o.a.s.c.c.ConnectionManager Waiting for client to connect to ZooKeeper
   [junit4]   2> 390491 INFO  (zkCallback-447-thread-1) [    ] o.a.s.c.c.ConnectionManager Watcher org.apache.solr.common.cloud.ConnectionManager@39aed37d name:ZooKeeperConnection Watcher:127.0.0.1:44583/solr got event WatchedEvent state:SyncConnected type:None path:null path:null type:None
   [junit4]   2> 390491 INFO  (TEST-TestSolrConfigHandlerCloud.test-seed#[CC8F2698627180C4]) [    ] o.a.s.c.c.ConnectionManager Client is connected to ZooKeeper
   [junit4]   2> 390492 INFO  (TEST-TestSolrConfigHandlerCloud.test-seed#[CC8F2698627180C4]) [    ] o.a.s.c.c.SolrZkClient Using default ZkACLProvider
   [junit4]   2> 390492 INFO  (TEST-TestSolrConfigHandlerCloud.test-seed#[CC8F2698627180C4]) [    ] o.a.s.c.c.SolrZkClient makePath: /collections/collection1
   [junit4]   2> 390492 INFO  (TEST-TestSolrConfigHandlerCloud.test-seed#[CC8F2698627180C4]) [    ] o.a.s.c.c.SolrZkClient makePath: /collections/collection1/shards
   [junit4]   2> 390493 INFO  (TEST-TestSolrConfigHandlerCloud.test-seed#[CC8F2698627180C4]) [    ] o.a.s.c.c.SolrZkClient makePath: /collections/control_collection
   [junit4]   2> 390493 INFO  (TEST-TestSolrConfigHandlerCloud.test-seed#[CC8F2698627180C4]) [    ] o.a.s.c.c.SolrZkClient makePath: /collections/control_collection/shards
   [junit4]   2> 390493 INFO  (TEST-TestSolrConfigHandlerCloud.test-seed#[CC8F2698627180C4]) [    ] o.a.s.c.AbstractZkTestCase put /home/jenkins/workspace/Lucene-Solr-6.1-Linux/solr/core/src/test-files/solr/collection1/conf/solrconfig-tlog.xml to /configs/conf1/solrconfig.xml
   [junit4]   2> 390493 INFO  (TEST-TestSolrConfigHandlerCloud.test-seed#[CC8F2698627180C4]) [    ] o.a.s.c.c.SolrZkClient makePath: /configs/conf1/solrconfig.xml
   [junit4]   2> 390495 INFO  (TEST-TestSolrConfigHandlerCloud.test-seed#[CC8F2698627180C4]) [    ] o.a.s.c.AbstractZkTestCase put /home/jenkins/workspace/Lucene-Solr-6.1-Linux/solr/core/src/test-files/solr/collection1/conf/schema.xml to /configs/conf1/schema.xml
   [junit4]   2> 390495 INFO  (TEST-TestSolrConfigHandlerCloud.test-seed#[CC8F2698627180C4]) [    ] o.a.s.c.c.SolrZkClient makePath: /configs/conf1/schema.xml
   [junit4]   2> 390496 INFO  (TEST-TestSolrConfigHandlerCloud.test-seed#[CC8F2698627180C4]) [    ] o.a.s.c.AbstractZkTestCase put /home/jenkins/workspace/Lucene-Solr-6.1-Linux/solr/core/src/test-files/solr/collection1/conf/solrconfig.snippet.randomindexconfig.xml to /configs/conf1/solrconfig.snippet.randomindexconfig.xml
   [junit4]   2> 390496 INFO  (TEST-TestSolrConfigHandlerCloud.test-seed#[CC8F2698627180C4]) [    ] o.a.s.c.c.SolrZkClient makePath: /configs/conf1/solrconfig.snippet.randomindexconfig.xml
   [junit4]   2> 390496 INFO  (TEST-TestSolrConfigHandlerCloud.test-seed#[CC8F2698627180C4]) [    ] o.a.s.c.AbstractZkTestCase put /home/jenkins/workspace/Lucene-Solr-6.1-Linux/solr/core/src/test-files/solr/collection1/conf/stopwords.txt to /configs/conf1/stopwords.txt
   [junit4]   2> 390496 INFO  (TEST-TestSolrConfigHandlerCloud.test-seed#[CC8F2698627180C4]) [    ] o.a.s.c.c.SolrZkClient makePath: /configs/conf1/stopwords.txt
   [junit4]   2> 390497 INFO  (TEST-TestSolrConfigHandlerCloud.test-seed#[CC8F2698627180C4]) [    ] o.a.s.c.AbstractZkTestCase put /home/jenkins/workspace/Lucene-Solr-6.1-Linux/solr/core/src/test-files/solr/collection1/conf/protwords.txt to /configs/conf1/protwords.txt
   [junit4]   2> 390497 INFO  (TEST-TestSolrConfigHandlerCloud.test-seed#[CC8F2698627180C4]) [    ] o.a.s.c.c.SolrZkClient makePath: /configs/conf1/protwords.txt
   [junit4]   2> 390497 INFO  (TEST-TestSolrConfigHandlerCloud.test-seed#[CC8F2698627180C4]) [    ] o.a.s.c.AbstractZkTestCase put /home/jenkins/workspace/Lucene-Solr-6.1-Linux/solr/core/src/test-files/solr/collection1/conf/currency.xml to /configs/conf1/currency.xml
   [junit4]   2> 390497 INFO  (TEST-TestSolrConfigHandlerCloud.test-seed#[CC8F2698627180C4]) [    ] o.a.s.c.c.SolrZkClient makePath: /configs/conf1/currency.xml
   [junit4]   2> 390498 INFO  (TEST-TestSolrConfigHandlerCloud.test-seed#[CC8F2698627180C4]) [    ] o.a.s.c.AbstractZkTestCase put /home/jenkins/workspace/Lucene-Solr-6.1-Linux/solr/core/src/test-files/solr/collection1/conf/enumsConfig.xml to /configs/conf1/enumsConfig.xml
   [junit4]   2> 390498 INFO  (TEST-TestSolrConfigHandlerCloud.test-seed#[CC8F2698627180C4]) [    ] o.a.s.c.c.SolrZkClient makePath: /configs/conf1/enumsConfig.xml
   [junit4]   2> 390498 INFO  (TEST-TestSolrConfigHandlerCloud.test-seed#[CC8F2698627180C4]) [    ] o.a.s.c.AbstractZkTestCase put /home/jenkins/workspace/Lucene-Solr-6.1-Linux/solr/core/src/test-files/solr/collection1/conf/open-exchange-rates.json to /configs/conf1/open-exchange-rates.json
   [junit4]   2> 390498 INFO  (TEST-TestSolrConfigHandlerCloud.test-seed#[CC8F2698627180C4]) [    ] o.a.s.c.c.SolrZkClient makePath: /configs/conf1/open-exchange-rates.json
   [junit4]   2> 390499 INFO  (TEST-TestSolrConfigHandlerCloud.test-seed#[CC8F2698627180C4]) [    ] o.a.s.c.AbstractZkTestCase put /home/jenkins/workspace/Lucene-Solr-6.1-Linux/solr/core/src/test-files/solr/collection1/conf/mapping-ISOLatin1Accent.txt to /configs/conf1/mapping-ISOLatin1Accent.txt
   [junit4]   2> 390499 INFO  (TEST-TestSolrConfigHandlerCloud.test-seed#[CC8F2698627180C4]) [    ] o.a.s.c.c.SolrZkClient makePath: /configs/conf1/mapping-ISOLatin1Accent.txt
   [junit4]   2> 390499 INFO  (TEST-TestSolrConfigHandlerCloud.test-seed#[CC8F2698627180C4]) [    ] o.a.s.c.AbstractZkTestCase put /home/jenkins/workspace/Lucene-Solr-6.1-Linux/solr/core/src/test-files/solr/collection1/conf/old_synonyms.txt to /configs/conf1/old_synonyms.txt
   [junit4]   2> 390499 INFO  (TEST-TestSolrConfigHandlerCloud.test-seed#[CC8F2698627180C4]) [    ] o.a.s.c.c.SolrZkClient makePath: /configs/conf1/old_synonyms.txt
   [junit4]   2> 390500 INFO  (TEST-TestSolrConfigHandlerCloud.test-seed#[CC8F2698627180C4]) [    ] o.a.s.c.AbstractZkTestCase put /home/jenkins/workspace/Lucene-Solr-6.1-Linux/solr/core/src/test-files/solr/collection1/conf/synonyms.txt to /configs/conf1/synonyms.txt
   [junit4]   2> 390500 INFO  (TEST-TestSolrConfigHandlerCloud.test-seed#[CC8F2698627180C4]) [    ] o.a.s.c.c.SolrZkClient makePath: /configs/conf1/synonyms.txt
   [junit4]   2> 390501 INFO  (TEST-TestSolrConfigHandlerCloud.test-seed#[CC8F2698627180C4]) [    ] o.a.s.c.c.SolrZkClient Using default ZkCredentialsProvider
   [junit4]   2> 390501 INFO  (TEST-TestSolrConfigHandlerCloud.test-seed#[CC8F2698627180C4]) [    ] o.a.s.c.c.ConnectionManager Waiting for client to connect to ZooKeeper
   [junit4]   2> 390502 INFO  (zkCallback-449-thread-1) [    ] o.a.s.c.c.ConnectionManager Watcher org.apache.solr.common.cloud.ConnectionManager@4d367748 name:ZooKeeperConnection Watcher:127.0.0.1:44583/solr got event WatchedEvent state:SyncConnected type:None path:null path:null type:None
   [junit4]   2> 390502 INFO  (TEST-TestSolrConfigHandlerCloud.test-seed#[CC8F2698627180C4]) [    ] o.a.s.c.c.ConnectionManager Client is connected to ZooKeeper
   [junit4]   2> 390502 INFO  (TEST-TestSolrConfigHandlerCloud.test-seed#[CC8F2698627180C4]) [    ] o.a.s.c.c.SolrZkClient Using default ZkACLProvider
   [junit4]   2> 390553 INFO  (TEST-TestSolrConfigHandlerCloud.test-seed#[CC8F2698627180C4]) [    ] o.a.s.SolrTestCaseJ4 Writing core.properties file to /home/jenkins/workspace/Lucene-Solr-6.1-Linux/solr/build/solr-core/test/J1/temp/solr.handler.TestSolrConfigHandlerCloud_CC8F2698627180C4-001/control-001/cores/collection1
   [junit4]   2> 390556 INFO  (TEST-TestSolrConfigHandlerCloud.test-seed#[CC8F2698627180C4]) [    ] o.e.j.s.Server jetty-9.3.8.v20160314
   [junit4]   2> 390557 INFO  (TEST-TestSolrConfigHandlerCloud.test-seed#[CC8F2698627180C4]) [    ] o.e.j.s.h.ContextHandler Started o.e.j.s.ServletContextHandler@3c059b86{/,null,AVAILABLE}
   [junit4]   2> 390561 INFO  (TEST-TestSolrConfigHandlerCloud.test-seed#[CC8F2698627180C4]) [    ] o.e.j.s.ServerConnector Started ServerConnector@243a287e{SSL,[ssl, http/1.1]}{127.0.0.1:44561}
   [junit4]   2> 390561 INFO  (TEST-TestSolrConfigHandlerCloud.test-seed#[CC8F2698627180C4]) [    ] o.e.j.s.Server Started @394229ms
   [junit4]   2> 390561 INFO  (TEST-TestSolrConfigHandlerCloud.test-seed#[CC8F2698627180C4]) [    ] o.a.s.c.s.e.JettySolrRunner Jetty properties: {solr.data.dir=/home/jenkins/workspace/Lucene-Solr-6.1-Linux/solr/build/solr-core/test/J1/temp/solr.handler.TestSolrConfigHandlerCloud_CC8F2698627180C4-001/tempDir-001/control/data, hostContext=/, hostPort=44561, coreRootDirectory=/home/jenkins/workspace/Lucene-Solr-6.1-Linux/solr/build/solr-core/test/J1/temp/solr.handler.TestSolrConfigHandlerCloud_CC8F2698627180C4-001/control-001/cores}
   [junit4]   2> 390561 INFO  (TEST-TestSolrConfigHandlerCloud.test-seed#[CC8F2698627180C4]) [    ] o.a.s.s.SolrDispatchFilter SolrDispatchFilter.init(): sun.misc.Launcher$AppClassLoader@73d16e93
   [junit4]   2> 390561 INFO  (TEST-TestSolrConfigHandlerCloud.test-seed#[CC8F2698627180C4]) [    ] o.a.s.c.SolrResourceLoader new SolrResourceLoader for directory: '/home/jenkins/workspace/Lucene-Solr-6.1-Linux/solr/build/solr-core/test/J1/temp/solr.handler.TestSolrConfigHandlerCloud_CC8F2698627180C4-001/control-001'
   [junit4]   2> 390561 INFO  (TEST-TestSolrConfigHandlerCloud.test-seed#[CC8F2698627180C4]) [    ] o.a.s.c.SolrResourceLoader JNDI not configured for solr (NoInitialContextEx)
   [junit4]   2> 390561 INFO  (TEST-TestSolrConfigHandlerCloud.test-seed#[CC8F2698627180C4]) [    ] o.a.s.c.SolrResourceLoader solr home defaulted to 'solr/' (could not find system property or JNDI)
   [junit4]   2> 390561 INFO  (TEST-TestSolrConfigHandlerCloud.test-seed#[CC8F2698627180C4]) [    ] o.a.s.c.c.SolrZkClient Using default ZkCredentialsProvider
   [junit4]   2> 390562 INFO  (TEST-TestSolrConfigHandlerCloud.test-seed#[CC8F2698627180C4]) [    ] o.a.s.c.c.ConnectionManager Waiting for client to connect to ZooKeeper
   [junit4]   2> 390562 INFO  (zkCallback-450-thread-1) [    ] o.a.s.c.c.ConnectionManager Watcher org.apache.solr.common.cloud.ConnectionManager@7c72cc7f name:ZooKeeperConnection Watcher:127.0.0.1:44583/solr got event WatchedEvent state:SyncConnected type:None path:null path:null type:None
   [junit4]   2> 390562 INFO  (TEST-TestSolrConfigHandlerCloud.test-seed#[CC8F2698627180C4]) [    ] o.a.s.c.c.ConnectionManager Client is connected to ZooKeeper
   [junit4]   2> 390563 INFO  (TEST-TestSolrConfigHandlerCloud.test-seed#[CC8F2698627180C4]) [    ] o.a.s.c.c.SolrZkClient Using default ZkACLProvider
   [junit4]   2> 390563 INFO  (TEST-TestSolrConfigHandlerCloud.test-seed#[CC8F2698627180C4]) [    ] o.a.s.s.SolrDispatchFilter Loading solr.xml from SolrHome (not found in ZooKeeper)
   [junit4]   2> 390563 INFO  (TEST-TestSolrConfigHandlerCloud.test-seed#[CC8F2698627180C4]) [    ] o.a.s.c.SolrXmlConfig Loading container configuration from /home/jenkins/workspace/Lucene-Solr-6.1-Linux/solr/build/solr-core/test/J1/temp/solr.handler.TestSolrConfigHandlerCloud_CC8F2698627180C4-001/control-001/solr.xml
   [junit4]   2> 390567 INFO  (TEST-TestSolrConfigHandlerCloud.test-seed#[CC8F2698627180C4]) [    ] o.a.s.c.CorePropertiesLocator Config-defined core root directory: /home/jenkins/workspace/Lucene-Solr-6.1-Linux/solr/build/solr-core/test/J1/temp/solr.handler.TestSolrConfigHandlerCloud_CC8F2698627180C4-001/control-001/cores
   [junit4]   2> 390567 INFO  (TEST-TestSolrConfigHandlerCloud.test-seed#[CC8F2698627180C4]) [    ] o.a.s.c.CoreContainer New CoreContainer 1837052547
   [junit4]   2> 390567 INFO  (TEST-TestSolrConfigHandlerCloud.test-seed#[CC8F2698627180C4]) [    ] o.a.s.c.CoreContainer Loading cores into CoreContainer [instanceDir=/home/jenkins/workspace/Lucene-Solr-6.1-Linux/solr/build/solr-core/test/J1/temp/solr.handler.TestSolrConfigHandlerCloud_CC8F2698627180C4-001/control-001]
   [junit4]   2> 390567 WARN  (TEST-TestSolrConfigHandlerCloud.test-seed#[CC8F2698627180C4]) [    ] o.a.s.c.CoreContainer Couldn't add files from /home/jenkins/workspace/Lucene-Solr-6.1-Linux/solr/build/solr-core/test/J1/temp/solr.handler.TestSolrConfigHandlerCloud_CC8F2698627180C4-001/control-001/lib to classpath: /home/jenkins/workspace/Lucene-Solr-6.1-Linux/solr/build/solr-core/test/J1/temp/solr.handler.TestSolrConfigHandlerCloud_CC8F2698627180C4-001/control-001/lib
   [junit4]   2> 390567 INFO  (TEST-TestSolrConfigHandlerCloud.test-seed#[CC8F2698627180C4]) [    ] o.a.s.h.c.HttpShardHandlerFactory created with socketTimeout : 90000,urlScheme : ,connTimeout : 15000,maxConnectionsPerHost : 20,maxConnections : 10000,corePoolSize : 0,maximumPoolSize : 2147483647,maxThreadIdleTime : 5,sizeOfQueue : -1,fairnessPolicy : false,useRetries : false,
   [junit4]   2> 390568 INFO  (TEST-TestSolrConfigHandlerCloud.test-seed#[CC8F2698627180C4]) [    ] o.a.s.u.UpdateShardHandler Creating UpdateShardHandler HTTP client with params: socketTimeout=340000&connTimeout=45000&retry=true
   [junit4]   2> 390568 INFO  (TEST-TestSolrConfigHandlerCloud.test-seed#[CC8F2698627180C4]) [    ] o.a.s.l.LogWatcher SLF4J impl is org.slf4j.impl.Log4jLoggerFactory
   [junit4]   2> 390568 INFO  (TEST-TestSolrConfigHandlerCloud.test-seed#[CC8F2698627180C4]) [    ] o.a.s.l.LogWatcher Registering Log Listener [Log4j (org.slf4j.impl.Log4jLoggerFactory)]
   [junit4]   2> 390568 INFO  (TEST-TestSolrConfigHandlerCloud.test-seed#[CC8F2698627180C4]) [    ] o.a.s.c.ZkContainer Zookeeper client=127.0.0.1:44583/solr
   [junit4]   2> 390568 INFO  (TEST-TestSolrConfigHandlerCloud.test-seed#[CC8F2698627180C4]) [    ] o.a.s.c.ZkController zkHost includes chroot
   [junit4]   2> 390569 INFO  (TEST-TestSolrConfigHandlerCloud.test-seed#[CC8F2698627180C4]) [    ] o.a.s.c.c.SolrZkClient Using default ZkCredentialsProvider
   [junit4]   2> 390569 INFO  (TEST-TestSolrConfigHandlerCloud.test-seed#[CC8F2698627180C4]) [    ] o.a.s.c.c.ConnectionManager Waiting for client to connect to ZooKeeper
   [junit4]   2> 390570 INFO  (zkCallback-453-thread-1) [    ] o.a.s.c.c.ConnectionManager Watcher org.apache.solr.common.cloud.ConnectionManager@4425ed8b name:ZooKeeperConnection Watcher:127.0.0.1:44583 got event WatchedEvent state:SyncConnected type:None path:null path:null type:None
   [junit4]   2> 390570 INFO  (TEST-TestSolrConfigHandlerCloud.test-seed#[CC8F2698627180C4]) [    ] o.a.s.c.c.ConnectionManager Client is connected to ZooKeeper
   [junit4]   2> 390570 INFO  (TEST-TestSolrConfigHandlerCloud.test-seed#[CC8F2698627180C4]) [    ] o.a.s.c.c.SolrZkClient Using default ZkACLProvider
   [junit4]   2> 390571 INFO  (TEST-TestSolrConfigHandlerCloud.test-seed#[CC8F2698627180C4]) [n:127.0.0.1:44561_    ] o.a.s.c.ZkController Added new OnReconnect listener org.apache.solr.cloud.ZkController$$Lambda$28/1497256721@c66c6b6
   [junit4]   2> 390571 INFO  (TEST-TestSolrConfigHandlerCloud.test-seed#[CC8F2698627180C4]) [n:127.0.0.1:44561_    ] o.a.s.c.c.ConnectionManager Waiting for client to connect to ZooKeeper
   [junit4]   2> 390574 INFO  (zkCallback-454-thread-1-processing-n:127.0.0.1:44561_) [n:127.0.0.1:44561_    ] o.a.s.c.c.ConnectionManager Watcher org.apache.solr.common.cloud.ConnectionManager@2d96cbde name:ZooKeeperConnection Watcher:127.0.0.1:44583/solr got event WatchedEvent state:SyncConnected type:None path:null path:null type:None
   [junit4]   2> 390574 INFO  (TEST-TestSolrConfigHandlerCloud.test-seed#[CC8F2698627180C4]) [n:127.0.0.1:44561_    ] o.a.s.c.c.ConnectionManager Client is connected to ZooKeeper
   [junit4]   2> 390575 INFO  (TEST-TestSolrConfigHandlerCloud.test-seed#[CC8F2698627180C4]) [n:127.0.0.1:44561_    ] o.a.s.c.c.SolrZkClient makePath: /overseer/queue
   [junit4]   2> 390576 INFO  (TEST-TestSolrConfigHandlerCloud.test-seed#[CC8F2698627180C4]) [n:127.0.0.1:44561_    ] o.a.s.c.c.SolrZkClient makePath: /overseer/collection-queue-work
   [junit4]   2> 390576 INFO  (TEST-TestSolrConfigHandlerCloud.test-seed#[CC8F2698627180C4]) [n:127.0.0.1:44561_    ] o.a.s.c.c.SolrZkClient makePath: /overseer/collection-map-running
   [junit4]   2> 390577 INFO  (TEST-TestSolrConfigHandlerCloud.test-seed#[CC8F2698627180C4]) [n:127.0.0.1:44561_    ] o.a.s.c.c.SolrZkClient makePath: /overseer/collection-map-completed
   [junit4]   2> 390577 INFO  (TEST-TestSolrConfigHandlerCloud.test-seed#[CC8F2698627180C4]) [n:127.0.0.1:44561_    ] o.a.s.c.c.SolrZkClient makePath: /overseer/collection-map-failure
   [junit4]   2> 390578 INFO  (TEST-TestSolrConfigHandlerCloud.test-seed#[CC8F2698627180C4]) [n:127.0.0.1:44561_    ] o.a.s.c.c.SolrZkClient makePath: /live_nodes
   [junit4]   2> 390579 INFO  (TEST-TestSolrConfigHandlerCloud.test-seed#[CC8F2698627180C4]) [n:127.0.0.1:44561_    ] o.a.s.c.c.SolrZkClient makePath: /aliases.json
   [junit4]   2> 390580 INFO  (TEST-TestSolrConfigHandlerCloud.test-seed#[CC8F2698627180C4]) [n:127.0.0.1:44561_    ] o.a.s.c.c.SolrZkClient makePath: /clusterstate.json
   [junit4]   2> 390580 INFO  (TEST-TestSolrConfigHandlerCloud.test-seed#[CC8F2698627180C4]) [n:127.0.0.1:44561_    ] o.a.s.c.c.SolrZkClient makePath: /security.json
   [junit4]   2> 390580 INFO  (TEST-TestSolrConfigHandlerCloud.test-seed#[CC8F2698627180C4]) [n:127.0.0.1:44561_    ] o.a.s.c.c.ZkStateReader Updating cluster state from ZooKeeper... 
   [junit4]   2> 390580 INFO  (TEST-TestSolrConfigHandlerCloud.test-seed#[CC8F2698627180C4]) [n:127.0.0.1:44561_    ] o.a.s.c.c.ZkStateReader Loaded cluster properties: {urlScheme=https}
   [junit4]   2> 390580 INFO  (TEST-TestSolrConfigHandlerCloud.test-seed#[CC8F2698627180C4]) [n:127.0.0.1:44561_    ] o.a.s.c.c.ZkStateReader Updated live nodes from ZooKeeper... (0) -> (0)
   [junit4]   2> 390581 INFO  (TEST-TestSolrConfigHandlerCloud.test-seed#[CC8F2698627180C4]) [n:127.0.0.1:44561_    ] o.a.s.c.c.SolrZkClient makePath: /overseer_elect
   [junit4]   2> 390581 INFO  (TEST-TestSolrConfigHandlerCloud.test-seed#[CC8F2698627180C4]) [n:127.0.0.1:44561_    ] o.a.s.c.c.SolrZkClient makePath: /overseer_elect/election
   [junit4]   2> 390582 INFO  (TEST-TestSolrConfigHandlerCloud.test-seed#[CC8F2698627180C4]) [n:127.0.0.1:44561_    ] o.a.s.c.Overseer Overseer (id=null) closing
   [junit4]   2> 390582 INFO  (TEST-TestSolrConfigHandlerCloud.test-seed#[CC8F2698627180C4]) [n:127.0.0.1:44561_    ] o.a.s.c.LeaderElector Joined leadership election with path: /overseer_elect/election/96041333171683333-127.0.0.1:44561_-n_0000000000
   [junit4]   2> 390582 INFO  (TEST-TestSolrConfigHandlerCloud.test-seed#[CC8F2698627180C4]) [n:127.0.0.1:44561_    ] o.a.s.c.OverseerElectionContext I am going to be the leader 127.0.0.1:44561_
   [junit4]   2> 390582 INFO  (TEST-TestSolrConfigHandlerCloud.test-seed#[CC8F2698627180C4]) [n:127.0.0.1:44561_    ] o.a.s.c.c.SolrZkClient makePath: /overseer_elect/leader
   [junit4]   2> 390583 INFO  (TEST-TestSolrConfigHandlerCloud.test-seed#[CC8F2698627180C4]) [n:127.0.0.1:44561_    ] o.a.s.c.Overseer Overseer (id=96041333171683333-127.0.0.1:44561_-n_0000000000) starting
   [junit4]   2> 390583 INFO  (TEST-TestSolrConfigHandlerCloud.test-seed#[CC8F2698627180C4]) [n:127.0.0.1:44561_    ] o.a.s.c.c.SolrZkClient makePath: /overseer/queue-work
   [junit4]   2> 390585 INFO  (TEST-TestSolrConfigHandlerCloud.test-seed#[CC8F2698627180C4]) [n:127.0.0.1:44561_    ] o.a.s.c.OverseerAutoReplicaFailoverThread Starting OverseerAutoReplicaFailoverThread autoReplicaFailoverWorkLoopDelay=10000 autoReplicaFailoverWaitAfterExpiration=30000 autoReplicaFailoverBadNodeExpiration=60000
   [junit4]   2> 390585 INFO  (OverseerCollectionConfigSetProcessor-96041333171683333-127.0.0.1:44561_-n_0000000000) [n:127.0.0.1:44561_    ] o.a.s.c.OverseerTaskProcessor Process current queue of overseer operations
   [junit4]   2> 390585 INFO  (OverseerStateUpdate-96041333171683333-127.0.0.1:44561_-n_0000000000) [n:127.0.0.1:44561_    ] o.a.s.c.Overseer Starting to work on the main queue
   [junit4]   2> 390585 INFO  (TEST-TestSolrConfigHandlerCloud.test-seed#[CC8F2698627180C4]) [n:127.0.0.1:44561_    ] o.a.s.c.ZkController Register node as live in ZooKeeper:/live_nodes/127.0.0.1:44561_
   [junit4]   2> 390586 INFO  (TEST-TestSolrConfigHandlerCloud.test-seed#[CC8F2698627180C4]) [n:127.0.0.1:44561_    ] o.a.s.c.c.SolrZkClient makePath: /live_nodes/127.0.0.1:44561_
   [junit4]   2> 390586 INFO  (OverseerStateUpdate-96041333171683333-127.0.0.1:44561_-n_0000000000) [n:127.0.0.1:44561_    ] o.a.s.c.c.ZkStateReader Updated live nodes from ZooKeeper... (0) -> (0)
   [junit4]   2> 390586 INFO  (zkCallback-454-thread-1-processing-n:127.0.0.1:44561_) [n:127.0.0.1:44561_    ] o.a.s.c.c.ZkStateReader A live node change: [WatchedEvent state:SyncConnected type:NodeChildrenChanged path:/live_nodes], has occurred - updating... (live nodes size: [0])
   [junit4]   2> 390586 INFO  (zkCallback-454-thread-1-processing-n:127.0.0.1:44561_) [n:127.0.0.1:44561_    ] o.a.s.c.c.ZkStateReader Updated live nodes from ZooKeeper... (0) -> (1)
   [junit4]   2> 390601 INFO  (TEST-TestSolrConfigHandlerCloud.test-seed#[CC8F2698627180C4]) [n:127.0.0.1:44561_    ] o.a.s.c.CoreContainer Security conf doesn't exist. Skipping setup for authorization module.
   [junit4]   2> 390601 INFO  (TEST-TestSolrConfigHandlerCloud.test-seed#[CC8F2698627180C4]) [n:127.0.0.1:44561_    ] o.a.s.c.CoreContainer No authentication plugin used.
   [junit4]   2> 390602 INFO  (TEST-TestSolrConfigHandlerCloud.test-seed#[CC8F2698627180C4]) [n:127.0.0.1:44561_    ] o.a.s.c.CorePropertiesLocator Looking for core definitions underneath /home/jenkins/workspace/Lucene-Solr-6.1-Linux/solr/build/solr-core/test/J1/temp/solr.handler.TestSolrConfigHandlerCloud_CC8F2698627180C4-001/control-001/cores
   [junit4]   2> 390603 INFO  (TEST-TestSolrConfigHandlerCloud.test-seed#[CC8F2698627180C4]) [n:127.0.0.1:44561_    ] o.a.s.c.CoreDescriptor Created CoreDescriptor: {name=collection1, config=solrconfig.xml, transient=false, schema=schema.xml, loadOnStartup=true, configSetProperties=configsetprops.json, collection=control_collection, coreNodeName=, dataDir=data/, shard=}
   [junit4]   2> 390603 INFO  (TEST-TestSolrConfigHandlerCloud.test-seed#[CC8F2698627180C4]) [n:127.0.0.1:44561_    ] o.a.s.c.CorePropertiesLocator Found core collection1 in /home/jenkins/workspace/Lucene-Solr-6.1-Linux/solr/build/solr-core/test/J1/temp/solr.handler.TestSolrConfigHandlerCloud_CC8F2698627180C4-001/control-001/cores/collection1
   [junit4]   2> 390603 INFO  (TEST-TestSolrConfigHandlerCloud.test-seed#[CC8F2698627180C4]) [n:127.0.0.1:44561_    ] o.a.s.c.CorePropertiesLocator Found 1 core definitions
   [junit4]   2> 390604 INFO  (coreLoadExecutor-1107-thread-1-processing-n:127.0.0.1:44561_) [n:127.0.0.1:44561_ c:control_collection   x:collection1] o.a.s.c.ZkController publishing state=down
   [junit4]   2> 390604 INFO  (TEST-TestSolrConfigHandlerCloud.test-seed#[CC8F2698627180C4]) [n:127.0.0.1:44561_    ] o.a.s.s.SolrDispatchFilter user.dir=/home/jenkins/workspace/Lucene-Solr-6.1-Linux/solr/build/solr-core/test/J1
   [junit4]   2> 390604 INFO  (coreLoadExecutor-1107-thread-1-processing-n:127.0.0.1:44561_) [n:127.0.0.1:44561_ c:control_collection   x:collection1] o.a.s.c.ZkController numShards not found on descriptor - reading it from system property
   [junit4]   2> 390604 INFO  (TEST-TestSolrConfigHandlerCloud.test-seed#[CC8F2698627180C4]) [n:127.0.0.1:44561_    ] o.a.s.s.SolrDispatchFilter SolrDispatchFilter.init() done
   [junit4]   2> 390604 INFO  (coreLoadExecutor-1107-thread-1-processing-n:127.0.0.1:44561_) [n:127.0.0.1:44561_ c:control_collection   x:collection1] o.a.s.c.ZkController Collection control_collection not visible yet, but flagging it so a watch is registered when it becomes visible
   [junit4]   2> 390604 INFO  (OverseerStateUpdate-96041333171683333-127.0.0.1:44561_-n_0000000000) [n:127.0.0.1:44561_    ] o.a.s.c.Overseer processMessage: queueSize: 1, message = {
   [junit4]   2>   "core":"collection1",
   [junit4]   2>   "roles":null,
   [junit4]   2>   "base_url":"https://127.0.0.1:44561",
   [junit4]   2>   "node_name":"127.0.0.1:44561_",
   [junit4]   2>   "numShards":"1",
   [junit4]   2>   "state":"down",
   [junit4]   2>   "shard":null,
   [junit4]   2>   "collection":"control_collection",
   [junit4]   2>   "operation":"state"} current state version: 0
   [junit4]   2> 390604 INFO  (coreLoadExecutor-1107-thread-1-processing-n:127.0.0.1:44561_) [n:127.0.0.1:44561_ c:control_collection   x:collection1] o.a.s.c.c.ZkStateReader Deleting data for [control_collection]
   [junit4]   2> 390604 INFO  (OverseerStateUpdate-96041333171683333-127.0.0.1:44561_-n_0000000000) [n:127.0.0.1:44561_    ] o.a.s.c.o.ReplicaMutator Update state numShards=1 message={
   [junit4]   2>   "core":"collection1",
   [junit4]   2>   "roles":null,
   [junit4]   2>   "base_url":"https://127.0.0.1:44561",
   [junit4]   2>   "node_name":"127.0.0.1:44561_",
   [junit4]   2>   "numShards":"1",
   [junit4]   2>   "state":"down",
   [junit4]   2>   "shard":null,
   [junit4]   2>   "collection":"control_collection",
   [junit4]   2>   "operation":"state"}
   [junit4]   2> 390604 INFO  (OverseerStateUpdate-96041333171683333-127.0.0.1:44561_-n_0000000000) [n:127.0.0.1:44561_    ] o.a.s.c.o.ClusterStateMutator building a new cName: control_collection
   [junit4]   2> 390605 INFO  (coreLoadExecutor-1107-thread-1-processing-n:127.0.0.1:44561_) [n:127.0.0.1:44561_ c:control_collection   x:collection1] o.a.s.c.ZkController look for our core node name
   [junit4]   2> 390605 INFO  (OverseerStateUpdate-96041333171683333-127.0.0.1:44561_-n_0000000000) [n:127.0.0.1:44561_    ] o.a.s.c.o.ReplicaMutator Assigning new node to shard shard=shard1
   [junit4]   2> 390605 INFO  (zkCallback-454-thread-1-processing-n:127.0.0.1:44561_) [n:127.0.0.1:44561_    ] o.a.s.c.c.ZkStateReader A cluster state change: [WatchedEvent state:SyncConnected type:NodeDataChanged path:/clusterstate.json], has occurred - updating... (live nodes size: [1])
   [junit4]   2> 391605 INFO  (coreLoadExecutor-1107-thread-1-processing-n:127.0.0.1:44561_) [n:127.0.0.1:44561_ c:control_collection   x:collection1] o.a.s.c.ZkController waiting to find shard id in clusterstate for collection1
   [junit4]   2> 391605 INFO  (coreLoadExecutor-1107-thread-1-processing-n:127.0.0.1:44561_) [n:127.0.0.1:44561_ c:control_collection   x:collection1] o.a.s.c.ZkController Check for collection zkNode:control_collection
   [junit4]   2> 391605 INFO  (coreLoadExecutor-1107-thread-1-processing-n:127.0.0.1:44561_) [n:127.0.0.1:44561_ c:control_collection   x:collection1] o.a.s.c.ZkController Collection zkNode exists
   [junit4]   2> 391605 INFO  (coreLoadExecutor-1107-thread-1-processing-n:127.0.0.1:44561_) [n:127.0.0.1:44561_ c:control_collection   x:collection1] o.a.s.c.c.ZkStateReader Load collection config from: [/collections/control_collection]
   [junit4]   2> 391605 INFO  (coreLoadExecutor-1107-thread-1-processing-n:127.0.0.1:44561_) [n:127.0.0.1:44561_ c:control_collection   x:collection1] o.a.s.c.c.ZkStateReader path=[/collections/control_collection] [configName]=[conf1] specified config exists in ZooKeeper
   [junit4]   2> 391605 INFO  (coreLoadExecutor-1107-thread-1-processing-n:127.0.0.1:44561_) [n:127.0.0.1:44561_ c:control_collection   x:collection1] o.a.s.c.SolrResourceLoader new SolrResourceLoader for directory: '/home/jenkins/workspace/Lucene-Solr-6.1-Linux/solr/build/solr-core/test/J1/temp/solr.handler.TestSolrConfigHandlerCloud_CC8F2698627180C4-001/control-001/cores/collection1'
   [junit4]   2> 391606 INFO  (coreLoadExecutor-1107-thread-1-processing-n:127.0.0.1:44561_) [n:127.0.0.1:44561_ c:control_collection   x:collection1] o.a.s.c.SolrResourceLoader JNDI not configured for solr (NoInitialContextEx)
   [junit4]   2> 391606 INFO  (coreLoadExecutor-1107-thread-1-processing-n:127.0.0.1:44561_) [n:127.0.0.1:44561_ c:control_collection   x:collection1] o.a.s.c.SolrResourceLoader solr home defaulted to 'solr/' (could not find system property or JNDI)
   [junit4]   2> 391607 INFO  (coreLoadExecutor-1107-thread-1-processing-n:127.0.0.1:44561_) [n:127.0.0.1:44561_ c:control_collection   x:collection1] o.a.s.c.Config loaded config solrconfig.xml with version 0 
   [junit4]   2> 391610 INFO  (coreLoadExecutor-1107-thread-1-processing-n:127.0.0.1:44561_) [n:127.0.0.1:44561_ c:control_collection   x:collection1] o.a.s.c.SolrConfig current version of requestparams : -1
   [junit4]   2> 391613 INFO  (coreLoadExecutor-1107-thread-1-processing-n:127.0.0.1:44561_) [n:127.0.0.1:44561_ c:control_collection   x:collection1] o.a.s.c.SolrConfig Using Lucene MatchVersion: 6.1.0
   [junit4]   2> 391618 INFO  (coreLoadExecutor-1107-thread-1-processing-n:127.0.0.1:44561_) [n:127.0.0.1:44561_ c:control_collection   x:collection1] o.a.s.c.SolrConfig Loaded SolrConfig: solrconfig.xml
   [junit4]   2> 391622 INFO  (coreLoadExecutor-1107-thread-1-processing-n:127.0.0.1:44561_) [n:127.0.0.1:44561_ c:control_collection   x:collection1] o.a.s.s.IndexSchema [collection1] Schema name=test
   [junit4]   2> 391680 INFO  (coreLoadExecutor-1107-thread-1-processing-n:127.0.0.1:44561_) [n:127.0.0.1:44561_ c:control_collection   x:collection1] o.a.s.s.OpenExchangeRatesOrgProvider Initialized with rates=open-exchange-rates.json, refreshInterval=1440.
   [junit4]   2> 391685 INFO  (coreLoadExecutor-1107-thread-1-processing-n:127.0.0.1:44561_) [n:127.0.0.1:44561_ c:control_collection   x:collection1] o.a.s.s.IndexSchema default search field in schema is text
   [junit4]   2> 391686 INFO  (coreLoadExecutor-1107-thread-1-processing-n:127.0.0.1:44561_) [n:127.0.0.1:44561_ c:control_collection   x:collection1] o.a.s.s.IndexSchema unique key field: id
   [junit4]   2> 391691 INFO  (coreLoadExecutor-1107-thread-1-processing-n:127.0.0.1:44561_) [n:127.0.0.1:44561_ c:control_collection   x:collection1] o.a.s.s.FileExchangeRateProvider Reloading exchange rates from file currency.xml
   [junit4]   2> 391693 INFO  (coreLoadExecutor-1107-thread-1-processing-n:127.0.0.1:44561_) [n:127.0.0.1:44561_ c:control_collection   x:collection1] o.a.s.s.FileExchangeRateProvider Reloading exchange rates from file currency.xml
   [junit4]   2> 391696 INFO  (coreLoadExecutor-1107-thread-1-processing-n:127.0.0.1:44561_) [n:127.0.0.1:44561_ c:control_collection   x:collection1] o.a.s.s.OpenExchangeRatesOrgProvider Reloading exchange rates from open-exchange-rates.json
   [junit4]   2> 391697 INFO  (coreLoadExecutor-1107-thread-1-processing-n:127.0.0.1:44561_) [n:127.0.0.1:44561_ c:control_collection   x:collection1] o.a.s.s.OpenExchangeRatesOrgProvider Reloading exchange rates from open-exchange-rates.json
   [junit4]   2> 391699 INFO  (coreLoadExecutor-1107-thread-1-processing-n:127.0.0.1:44561_) [n:127.0.0.1:44561_ c:control_collection   x:collection1] o.a.s.c.ConfigSetProperties Did not find ConfigSet properties, assuming default properties: Can't find resource 'configsetprops.json' in classpath or '/configs/conf1', cwd=/home/jenkins/workspace/Lucene-Solr-6.1-Linux/solr/build/solr-core/test/J1
   [junit4]   2> 391699 INFO  (coreLoadExecutor-1107-thread-1-processing-n:127.0.0.1:44561_) [n:127.0.0.1:44561_ c:control_collection   x:collection1] o.a.s.c.CoreContainer Creating SolrCore 'collection1' using configuration from collection control_collection
   [junit4]   2> 391699 INFO  (coreLoadExecutor-1107-thread-1-processing-n:127.0.0.1:44561_) [n:127.0.0.1:44561_ c:control_collection s:shard1 r:core_node1 x:collection1] o.a.s.c.SolrCore org.apache.solr.core.MockDirectoryFactory
   [junit4]   2> 391699 INFO  (coreLoadExecutor-1107-thread-1-processing-n:127.0.0.1:44561_) [n:127.0.0.1:44561_ c:control_collection s:shard1 r:core_node1 x:collection1] o.a.s.c.SolrCore [[collection1] ] Opening new SolrCore at [/home/jenkins/workspace/Lucene-Solr-6.1-Linux/solr/build/solr-core/test/J1/temp/solr.handler.TestSolrConfigHandlerCloud_CC8F2698627180C4-001/control-001/cores/collection1], dataDir=[/home/jenkins/workspace/Lucene-Solr-6.1-Linux/solr/build/solr-core/test/J1/temp/solr.handler.TestSolrConfigHandlerCloud_CC8F2698627180C4-001/control-001/cores/collection1/data/]
   [junit4]   2> 391699 INFO  (coreLoadExecutor-1107-thread-1-processing-n:127.0.0.1:44561_) [n:127.0.0.1:44561_ c:control_collection s:shard1 r:core_node1 x:collection1] o.a.s.c.JmxMonitoredMap JMX monitoring is enabled. Adding Solr mbeans to JMX Server: com.sun.jmx.mbeanserver.JmxMBeanServer@74836c1a
   [junit4]   2> 391700 INFO  (coreLoadExecutor-1107-thread-1-processing-n:127.0.0.1:44561_) [n:127.0.0.1:44561_ c:control_collection s:shard1 r:core_node1 x:collection1] o.a.s.c.CachingDirectoryFactory return new directory for /home/jenkins/workspace/Lucene-Solr-6.1-Linux/solr/build/solr-core/test/J1/temp/solr.handler.TestSolrConfigHandlerCloud_CC8F2698627180C4-001/control-001/cores/collection1/data
   [junit4]   2> 391700 INFO  (coreLoadExecutor-1107-thread-1-processing-n:127.0.0.1:44561_) [n:127.0.0.1:44561_ c:control_collection s:shard1 r:core_node1 x:collection1] o.a.s.c.SolrCore New index directory detected: old=null new=/home/jenkins/workspace/Lucene-Solr-6.1-Linux/solr/build/solr-core/test/J1/temp/solr.handler.TestSolrConfigHandlerCloud_CC8F2698627180C4-001/control-001/cores/collection1/data/index/
   [junit4]   2> 391700 WARN  (coreLoadExecutor-1107-thread-1-processing-n:127.0.0.1:44561_) [n:127.0.0.1:44561_ c:control_collection s:shard1 r:core_node1 x:collection1] o.a.s.c.SolrCore [collection1] Solr index directory '/home/jenkins/workspace/Lucene-Solr-6.1-Linux/solr/build/solr-core/test/J1/temp/solr.handler.TestSolrConfigHandlerCloud_CC8F2698627180C4-001/control-001/cores/collection1/data/index' doesn't exist. Creating new index...
   [junit4]   2> 391700 INFO  (coreLoadExecutor-1107-thread-1-processing-n:127.0.0.1:44561_) [n:127.0.0.1:44561_ c:control_collection s:shard1 r:core_node1 x:collection1] o.a.s.c.CachingDirectoryFactory return new directory for /home/jenkins/workspace/Lucene-Solr-6.1-Linux/solr/build/solr-core/test/J1/temp/solr.handler.TestSolrConfigHandlerCloud_CC8F2698627180C4-001/control-001/cores/collection1/data/index
   [junit4]   2> 391700 INFO  (coreLoadExecutor-1107-thread-1-processing-n:127.0.0.1:44561_) [n:127.0.0.1:44561_ c:control_collection s:shard1 r:core_node1 x:collection1] o.a.s.u.RandomMergePolicy RandomMergePolicy wrapping class org.apache.lucene.index.TieredMergePolicy: [TieredMergePolicy: maxMergeAtOnce=13, maxMergeAtOnceExplicit=36, maxMergedSegmentMB=28.8798828125, floorSegmentMB=1.080078125, forceMergeDeletesPctAllowed=7.135568428343175, segmentsPerTier=16.0, maxCFSSegmentSizeMB=8.796093022207999E12, noCFSRatio=1.0
   [junit4]   2> 391701 INFO  (coreLoadExecutor-1107-thread-1-processing-n:127.0.0.1:44561_) [n:127.0.0.1:44561_ c:control_collection s:shard1 r:core_node1 x:collection1] o.a.s.c.SolrDeletionPolicy SolrDeletionPolicy.onCommit: commits: num=1
   [junit4]   2> 	commit{dir=MockDirectoryWrapper(RAMDirectory@7cfd1071 lockFactory=org.apache.lucene.store.SingleInstanceLockFactory@5266979c),segFN=segments_1,generation=1}
   [junit4]   2> 391701 INFO  (coreLoadExecutor-1107-thread-1-processing-n:127.0.0.1:44561_) [n:127.0.0.1:44561_ c:control_collection s:shard1 r:core_node1 x:collection1] o.a.s.c.SolrDeletionPolicy newest commit generation = 1
   [junit4]   2> 391702 INFO  (OldIndexDirectoryCleanupThreadForCore-collection1) [n:127.0.0.1:44561_ c:control_collection s:shard1 r:core_node1 x:collection1] o.a.s.c.SolrCore Looking for old index directories to cleanup for core collection1 in /home/jenkins/workspace/Lucene-Solr-6.1-Linux/solr/build/solr-core/test/J1/temp/solr.handler.TestSolrConfigHandlerCloud_CC8F2698627180C4-001/control-001/cores/collection1/data/
   [junit4]   2> 391702 WARN  (OldIndexDirectoryCleanupThreadForCore-collection1) [n:127.0.0.1:44561_ c:control_collection s:shard1 r:core_node1 x:collection1] o.a.s.c.DirectoryFactory /home/jenkins/workspace/Lucene-Solr-6.1-Linux/solr/build/solr-core/test/J1/temp/solr.handler.TestSolrConfigHandlerCloud_CC8F2698627180C4-001/control-001/cores/collection1/data/ does not point to a valid data directory; skipping clean-up of old index directories.
   [junit4]   2> 391704 INFO  (coreLoadExecutor-1107-thread-1-processing-n:127.0.0.1:44561_) [n:127.0.0.1:44561_ c:control_collection s:shard1 r:core_node1 x:collection1] o.a.s.u.p.UpdateRequestProcessorChain creating updateRequestProcessorChain "nodistrib"
   [junit4]   2> 391704 INFO  (coreLoadExecutor-1107-thread-1-processing-n:127.0.0.1:44561_) [n:127.0.0.1:44561_ c:control_collection s:shard1 r:core_node1 x:collection1] o.a.s.u.p.UpdateRequestProcessorChain creating updateRequestProcessorChain "dedupe"
   [junit4]   2> 391704 INFO  (coreLoadExecutor-1107-thread-1-processing-n:127.0.0.1:44561_) [n:127.0.0.1:44561_ c:control_collection s:shard1 r:core_node1 x:collection1] o.a.s.u.p.UpdateRequestProcessorChain inserting DistributedUpdateProcessorFactory into updateRequestProcessorChain "dedupe"
   [junit4]   2> 391704 INFO  (coreLoadExecutor-1107-thread-1-processing-n:127.0.0.1:44561_) [n:127.0.0.1:44561_ c:control_collection s:shard1 r:core_node1 x:collection1] o.a.s.u.p.UpdateRequestProcessorChain creating updateRequestProcessorChain "stored_sig"
   [junit4]   2> 391704 INFO  (coreLoadExecutor-1107-thread-1-processing-n:127.0.0.1:44561_) [n:127.0.0.1:44561_ c:control_collection s:shard1 r:core_node1 x:collection1] o.a.s.u.p.UpdateRequestProcessorChain inserting DistributedUpdateProcessorFactory into updateRequestProcessorChain "stored_sig"
   [junit4]   2> 391704 INFO  (coreLoadExecutor-1107-thread-1-processing-n:127.0.0.1:44561_) [n:127.0.0.1:44561_ c:control_collection s:shard1 r:core_node1 x:collection1] o.a.s.u.p.UpdateRequestProcessorChain creating updateRequestProcessorChain "distrib-dup-test-chain-explicit"
   [junit4]   2> 391704 INFO  (coreLoadExecutor-1107-thread-1-processing-n:127.0.0.1:44561_) [n:127.0.0.1:44561_ c:control_collection s:shard1 r:core_node1 x:collection1] o.a.s.u.p.UpdateRequestProcessorChain creating updateRequestProcessorChain "distrib-dup-test-chain-implicit"
   [junit4]   2> 391704 INFO  (coreLoadExecutor-1107-thread-1-processing-n:127.0.0.1:44561_) [n:127.0.0.1:44561_ c:control_collection s:shard1 r:core_node1 x:collection1] o.a.s.u.p.UpdateRequestProcessorChain inserting DistributedUpdateProcessorFactory into updateRequestProcessorChain "distrib-dup-test-chain-implicit"
   [junit4]   2> 391704 INFO  (coreLoadExecutor-1107-thread-1-processing-n:127.0.0.1:44561_) [n:127.0.0.1:44561_ c:control_collection s:shard1 r:core_node1 x:collection1] o.a.s.c.SolrCore no updateRequestProcessorChain defined as default, creating implicit default
   [junit4]   2> 391705 WARN  (coreLoadExecutor-1107-thread-1-processing-n:127.0.0.1:44561_) [n:127.0.0.1:44561_ c:control_collection s:shard1 r:core_node1 x:collection1] o.a.s.c.RequestHandlers INVALID paramSet a in requestHandler {type = requestHandler,name = /dump,class = DumpRequestHandler,args = {defaults={a=A,b=B}}}
   [junit4]   2> 391706 INFO  (coreLoadExecutor-1107-thread-1-processing-n:127.0.0.1:44561_) [n:127.0.0.1:44561_ c:control_collection s:shard1 r:core_node1 x:collection1] o.a.s.h.l.XMLLoader xsltCacheLifetimeSeconds=60
   [junit4]   2> 391708 INFO  (coreLoadExecutor-1107-thread-1-processing-n:127.0.0.1:44561_) [n:127.0.0.1:44561_ c:control_collection s:shard1 r:core_node1 x:collection1] o.a.s.h.l.XMLLoader xsltCacheLifetimeSeconds=60
   [junit4]   2> 391709 INFO  (coreLoadExecutor-1107-thread-1-processing-n:127.0.0.1:44561_) [n:127.0.0.1:44561_ c:control_collection s:shard1 r:core_node1 x:collection1] o.a.s.h.l.XMLLoader xsltCacheLifetimeSeconds=60
   [junit4]   2> 391710 INFO  (coreLoadExecutor-1107-thread-1-processing-n:127.0.0.1:44561_) [n:127.0.0.1:44561_ c:control_collection s:shard1 r:core_node1 x:collection1] o.a.s.h.l.XMLLoader xsltCacheLifetimeSeconds=60
   [junit4]   2> 391712 INFO  (coreLoadExecutor-1107-thread-1-processing-n:127.0.0.1:44561_) [n:127.0.0.1:44561_ c:control_collection s:shard1 r:core_node1 x:collection1] o.a.s.c.RequestHandlers Registered paths: /admin/mbeans,standard,/update/json/docs,/admin/luke,/export,/get,/admin/properties,/update/json,/admin/threads,/dump,/update/csv,/sql,/graph,/admin/segments,/admin/system,/replication,/config,/stream,/schema,/admin/plugins,/admin/logging,/admin/ping,/update,/admin/file
   [junit4]   2> 391712 INFO  (coreLoadExecutor-1107-thread-1-processing-n:127.0.0.1:44561_) [n:127.0.0.1:44561_ c:control_collection s:shard1 r:core_node1 x:collection1] o.a.s.c.SolrCore Using default statsCache cache: org.apache.solr.search.stats.LocalStatsCache
   [junit4]   2> 391713 INFO  (coreLoadExecutor-1107-thread-1-processing-n:127.0.0.1:44561_) [n:127.0.0.1:44561_ c:control_collection s:shard1 r:core_node1 x:collection1] o.a.s.u.UpdateHandler Using UpdateLog implementation: org.apache.solr.update.UpdateLog
   [junit4]   2> 391713 INFO  (coreLoadExecutor-1107-thread-1-processing-n:127.0.0.1:44561_) [n:127.0.0.1:44561_ c:control_collection s:shard1 r:core_node1 x:collection1] o.a.s.u.UpdateLog Initializing UpdateLog: dataDir= defaultSyncLevel=FLUSH numRecordsToKeep=100 maxNumLogsToKeep=10 numVersionBuckets=65536
   [junit4]   2> 391714 INFO  (coreLoadExecutor-1107-thread-1-processing-n:127.0.0.1:44561_) [n:127.0.0.1:44561_ c:control_collection s:shard1 r:core_node1 x:collection1] o.a.s.u.CommitTracker Hard AutoCommit: disabled
   [junit4]   2> 391714 INFO  (coreLoadExecutor-1107-thread-1-processing-n:127.0.0.1:44561_) [n:127.0.0.1:44561_ c:control_collection s:shard1 r:core_node1 x:collection1] o.a.s.u.CommitTracker Soft AutoCommit: disabled
   [junit4]   2> 391714 INFO  (coreLoadExecutor-1107-thread-1-processing-n:127.0.0.1:44561_) [n:127.0.0.1:44561_ c:control_collection s:shard1 r:core_node1 x:collection1] o.a.s.u.RandomMergePolicy RandomMergePolicy wrapping class org.apache.lucene.index.LogDocMergePolicy: [LogDocMergePolicy: minMergeSize=1000, mergeFactor=11, maxMergeSize=9223372036854775807, maxMergeSizeForForcedMerge=9223372036854775807, calibrateSizeByDeletes=false, maxMergeDocs=2147483647, maxCFSSegmentSizeMB=8.796093022207999E12, noCFSRatio=0.8513628917124046]
   [junit4]   2> 391714 INFO  (coreLoadExecutor-1107-thread-1-processing-n:127.0.0.1:44561_) [n:127.0.0.1:44561_ c:control_collection s:shard1 r:core_node1 x:collection1] o.a.s.c.SolrDeletionPolicy SolrDeletionPolicy.onInit: commits: num=1
   [junit4]   2> 	commit{dir=MockDirectoryWrapper(RAMDirectory@7cfd1071 lockFactory=org.apache.lucene.store.SingleInstanceLockFactory@5266979c),segFN=segments_1,generation=1}
   [junit4]   2> 391714 INFO  (coreLoadExecutor-1107-thread-1-processing-n:127.0.0.1:44561_) [n:127.0.0.1:44561_ c:control_collection s:shard1 r:core_node1 x:collection1] o.a.s.c.SolrDeletionPolicy newest commit generation = 1
   [junit4]   2> 391714 INFO  (coreLoadExecutor-1107-thread-1-processing-n:127.0.0.1:44561_) [n:127.0.0.1:44561_ c:control_collection s:shard1 r:core_node1 x:collection1] o.a.s.s.SolrIndexSearcher Opening [Searcher@2818bb29[collection1] main]
   [junit4]   2> 391715 INFO  (coreLoadExecutor-1107-thread-1-processing-n:127.0.0.1:44561_) [n:127.0.0.1:44561_ c:control_collection s:shard1 r:core_node1 x:collection1] o.a.s.c.c.ZkStateReader Load collection config from: [/collections/control_collection]
   [junit4]   2> 391715 INFO  (coreLoadExecutor-1107-thread-1-processing-n:127.0.0.1:44561_) [n:127.0.0.1:44561_ c:control_collection s:shard1 r:core_node1 x:collection1] o.a.s.c.c.ZkStateReader path=[/collections/control_collection] [configName]=[conf1] specified config exists in ZooKeeper
   [junit4]   2> 391715 INFO  (coreLoadExecutor-1107-thread-1-processing-n:127.0.0.1:44561_) [n:127.0.0.1:44561_ c:control_collection s:shard1 r:core_node1 x:collection1] o.a.s.r.ManagedResourceStorage Setting up ZooKeeper-based storage for the RestManager with znodeBase: /configs/conf1
   [junit4]   2> 391715 INFO  (coreLoadExecutor-1107-thread-1-processing-n:127.0.0.1:44561_) [n:127.0.0.1:44561_ c:control_collection s:shard1 r:core_node1 x:collection1] o.a.s.r.ManagedResourceStorage Configured ZooKeeperStorageIO with znodeBase: /configs/conf1
   [junit4]   2> 391715 INFO  (coreLoadExecutor-1107-thread-1-processing-n:127.0.0.1:44561_) [n:127.0.0.1:44561_ c:control_collection s:shard1 r:core_node1 x:collection1] o.a.s.r.RestManager Initializing RestManager with initArgs: {}
   [junit4]   2> 391715 INFO  (coreLoadExecutor-1107-thread-1-processing-n:127.0.0.1:44561_) [n:127.0.0.1:44561_ c:control_collection s:shard1 r:core_node1 x:collection1] o.a.s.r.ManagedResourceStorage Reading _rest_managed.json using ZooKeeperStorageIO:path=/configs/conf1
   [junit4]   2> 391715 INFO  (coreLoadExecutor-1107-thread-1-processing-n:127.0.0.1:44561_) [n:127.0.0.1:44561_ c:control_collection s:shard1 r:core_node1 x:collection1] o.a.s.r.ManagedResourceStorage No data found for znode /configs/conf1/_rest_managed.json
   [junit4]   2> 391715 INFO  (coreLoadExecutor-1107-thread-1-processing-n:127.0.0.1:44561_) [n:127.0.0.1:44561_ c:control_collection s:shard1 r:core_node1 x:collection1] o.a.s.r.ManagedResourceStorage Loaded null at path _rest_managed.json using ZooKeeperStorageIO:path=/configs/conf1
   [junit4]   2> 391715 INFO  (coreLoadExecutor-1107-thread-1-processing-n:127.0.0.1:44561_) [n:127.0.0.1:44561_ c:control_collection s:shard1 r:core_node1 x:collection1] o.a.s.r.RestManager Initializing 0 registered ManagedResources
   [junit4]   2> 391716 INFO  (coreLoadExecutor-1107-thread-1-processing-n:127.0.0.1:44561_) [n:127.0.0.1:44561_ c:control_collection s:shard1 r:core_node1 x:collection1] o.a.s.h.ReplicationHandler Commits will be reserved for  10000
   [junit4]   2> 391716 INFO  (searcherExecutor-1108-thread-1-processing-n:127.0.0.1:44561_ x:collection1 s:shard1 c:control_collection r:core_node1) [n:127.0.0.1:44561_ c:control_collection s:shard1 r:core_node1 x:collection1] o.a.s.c.SolrCore [collection1] Registered new searcher Searcher@2818bb29[collection1] main{ExitableDirectoryReader(UninvertingDirectoryReader())}
   [junit4]   2> 391716 INFO  (coreLoadExecutor-1107-thread-1-processing-n:127.0.0.1:44561_) [n:127.0.0.1:44561_ c:control_collection s:shard1 r:core_node1 x:collection1] o.a.s.u.UpdateLog Looking up max value of version field to seed version buckets
   [junit4]   2> 391716 INFO  (coreLoadExecutor-1107-thread-1-processing-n:127.0.0.1:44561_) [n:127.0.0.1:44561_ c:control_collection s:shard1 r:core_node1 x:collection1] o.a.s.u.VersionInfo Refreshing highest value of _version_ for 65536 version buckets from index
   [junit4]   2> 391716 INFO  (coreLoadExecutor-1107-thread-1-processing-n:127.0.0.1:44561_) [n:127.0.0.1:44561_ c:control_collection s:shard1 r:core_node1 x:collection1] o.a.s.u.VersionInfo No terms found for _version_, cannot seed version bucket highest value from index
   [junit4]   2> 391716 INFO  (coreLoadExecutor-1107-thread-1-processing-n:127.0.0.1:44561_) [n:127.0.0.1:44561_ c:control_collection s:shard1 r:core_node1 x:collection1] o.a.s.u.UpdateLog Could not find max version in index or recent updates, using new clock 1536661332140490752
   [junit4]   2> 391719 INFO  (coreLoadExecutor-1107-thread-1-processing-n:127.0.0.1:44561_) [n:127.0.0.1:44561_ c:control_collection s:shard1 r:core_node1 x:collection1] o.a.s.u.UpdateLog Took 2.0ms to seed version buckets with highest version 1536661332140490752
   [junit4]   2> 391719 INFO  (coreLoadExecutor-1107-thread-1-processing-n:127.0.0.1:44561_) [n:127.0.0.1:44561_ c:control_collection s:shard1 r:core_node1 x:collection1] o.a.s.c.ZkController watch zkdir /configs/conf1
   [junit4]   2> 391720 INFO  (coreLoadExecutor-1107-thread-1-processing-n:127.0.0.1:44561_) [n:127.0.0.1:44561_ c:control_collection s:shard1 r:core_node1 x:collection1] o.a.s.c.CoreContainer registering core: collection1
   [junit4]   2> 391720 INFO  (coreZkRegister-1101-thread-1-processing-n:127.0.0.1:44561_ x:collection1 s:shard1 c:control_collection r:core_node1) [n:127.0.0.1:44561_ c:control_collection s:shard1 r:core_node1 x:collection1] o.a.s.c.ZkController Register replica - core:collection1 address:https://127.0.0.1:44561 collection:control_collection shard:shard1
   [junit4]   2> 391720 INFO  (coreZkRegister-1101-thread-1-processing-n:127.0.0.1:44561_ x:collection1 s:shard1 c:control_collection r:core_node1) [n:127.0.0.1:44561_ c:control_collection s:shard1 r:core_node1 x:collection1] o.a.s.c.c.SolrZkClient makePath: /collections/control_collection/leader_elect/shard1/election
   [junit4]   2> 391721 INFO  (coreZkRegister-1101-thread-1-processing-n:127.0.0.1:44561_ x:collection1 s:shard1 c:control_collection r:core_node1) [n:127.0.0.1:44561_ c:control_collection s:shard1 r:core_node1 x:collection1] o.a.s.c.LeaderElector Joined leadership election with path: /collections/control_collection/leader_elect/shard1/election/96041333171683333-core_node1-n_0000000000
   [junit4]   2> 391721 INFO  (coreZkRegister-1101-thread-1-processing-n:127.0.0.1:44561_ x:collection1 s:shard1 c:control_collection r:core_node1) [n:127.0.0.1:44561_ c:control_collection s:shard1 r:core_node1 x:collection1] o.a.s.c.ShardLeaderElectionContext Running the leader process for shard=shard1 and weAreReplacement=false and leaderVoteWait=10000
   [junit4]   2> 391722 INFO  (coreZkRegister-1101-thread-1-processing-n:127.0.0.1:44561_ x:collection1 s:shard1 c:control_collection r:core_node1) [n:127.0.0.1:44561_ c:control_collection s:shard1 r:core_node1 x:collection1] o.a.s.c.ShardLeaderElectionContext Enough replicas found to continue.
   [junit4]   2> 391722 INFO  (coreZkRegister-1101-thread-1-processing-n:127.0.0.1:44561_ x:collection1 s:shard1 c:control_collection r:core_node1) [n:127.0.0.1:44561_ c:control_collection s:shard1 r:core_node1 x:collection1] o.a.s.c.ShardLeaderElectionContext I may be the new leader - try and sync
   [junit4]   2> 391722 INFO  (coreZkRegister-1101-thread-1-processing-n:127.0.0.1:44561_ x:collection1 s:shard1 c:control_collection r:core_node1) [n:127.0.0.1:44561_ c:control_collection s:shard1 r:core_node1 x:collection1] o.a.s.c.SyncStrategy Sync replicas to https://127.0.0.1:44561/collection1/
   [junit4]   2> 391722 INFO  (coreZkRegister-1101-thread-1-processing-n:127.0.0.1:44561_ x:collection1 s:shard1 c:control_collection r:core_node1) [n:127.0.0.1:44561_ c:control_collection s:shard1 r:core_node1 x:collection1] o.a.s.c.SyncStrategy Sync Success - now sync replicas to me
   [junit4]   2> 391722 INFO  (OverseerStateUpdate-96041333171683333-127.0.0.1:44561_-n_0000000000) [n:127.0.0.1:44561_    ] o.a.s.c.Overseer processMessage: queueSize: 1, message = {
   [junit4]   2>   "operation":"leader",
   [junit4]   2>   "shard":"shard1",
   [junit4]   2>   "collection":"control_collection"} current state version: 1
   [junit4]   2> 391722 INFO  (coreZkRegister-1101-thread-1-processing-n:127.0.0.1:44561_ x:collection1 s:shard1 c:control_collection r:core_node1) [n:127.0.0.1:44561_ c:control_collection s:shard1 r:core_node1 x:collection1] o.a.s.c.SyncStrategy https://127.0.0.1:44561/collection1/ has no replicas
   [junit4]   2> 391723 INFO  (coreZkRegister-1101-thread-1-processing-n:127.0.0.1:44561_ x:collection1 s:shard1 c:control_collection r:core_node1) [n:127.0.0.1:44561_ c:control_collection s:shard1 r:core_node1 x:collection1] o.a.s.c.c.SolrZkClient makePath: /collections/control_collection/leaders/shard1
   [junit4]   2> 391723 INFO  (coreZkRegister-1101-thread-1-processing-n:127.0.0.1:44561_ x:collection1 s:shard1 c:control_collection r:core_node1) [n:127.0.0.1:44561_ c:control_collection s:shard1 r:core_node1 x:collection1] o.a.s.c.ShardLeaderElectionContextBase Creating leader registration node /collections/control_collection/leaders/shard1/leader after winning as /collections/control_collection/leader_elect/shard1/election/96041333171683333-core_node1-n_0000000000
   [junit4]   2> 391724 INFO  (coreZkRegister-1101-thread-1-processing-n:127.0.0.1:44561_ x:collection1 s:shard1 c:control_collection r:core_node1) [n:127.0.0.1:44561_ c:control_collection s:shard1 r:core_node1 x:collection1] o.a.s.c.ShardLeaderElectionContext I am the new leader: https://127.0.0.1:44561/collection1/ shard1
   [junit4]   2> 391724 INFO  (OverseerStateUpdate-96041333171683333-127.0.0.1:44561_-n_0000000000) [n:127.0.0.1:44561_    ] o.a.s.c.Overseer processMessage: queueSize: 1, message = {
   [junit4]   2>   "operation":"leader",
   [junit4]   2>   "shard":"shard1",
   [junit4]   2>   "collection":"control_collection",
   [junit4]   2>   "base_url":"https://127.0.0.1:44561",
   [junit4]   2>   "core":"collection1",
   [junit4]   2>   "state":"active"} current state version: 1
   [junit4]   2> 391825 INFO  (zkCallback-454-thread-1-processing-n:127.0.0.1:44561_) [n:127.0.0.1:44561_    ] o.a.s.c.c.ZkStateReader A cluster state change: [WatchedEvent state:SyncConnected type:NodeDataChanged path:/clusterstate.json], has occurred - updating... (live nodes size: [1])
   [junit4]   2> 391875 INFO  (coreZkRegister-1101-thread-1-processing-n:127.0.0.1:44561_ x:collection1 s:shard1 c:control_collection r:core_node1) [n:127.0.0.1:44561_ c:control_collection s:shard1 r:core_node1 x:collection1] o.a.s.c.ZkController We are https://127.0.0.1:44561/collection1/ and leader is https://127.0.0.1:44561/collection1/
   [junit4]   2> 391875 INFO  (coreZkRegister-1101-thread-1-processing-n:127.0.0.1:44561_ x:collection1 s:shard1 c:control_collection r:core_node1) [n:127.0.0.1:44561_ c:control_collection s:shard1 r:core_node1 x:collection1] o.a.s.c.ZkController No LogReplay needed for core=collection1 baseURL=https://127.0.0.1:44561
   [junit4]   2> 391875 INFO  (coreZkRegister-1101-thread-1-processing-n:127.0.0.1:44561_ x:collection1 s:shard1 c:control_collection r:core_node1) [n:127.0.0.1:44561_ c:control_collection s:shard1 r:core_node1 x:collection1] o.a.s.c.ZkController I am the leader, no recovery necessary
   [junit4]   2> 391875 INFO  (coreZkRegister-1101-thread-1-processing-n:127.0.0.1:44561_ x:collection1 s:shard1 c:control_collection r:core_node1) [n:127.0.0.1:44561_ c:control_collection s:shard1 r:core_node1 x:collection1] o.a.s.c.ZkController publishing state=active
   [junit4]   2> 391875 INFO  (coreZkRegister-1101-thread-1-processing-n:127.0.0.1:44561_ x:collection1 s:shard1 c:control_collection r:core_node1) [n:127.0.0.1:44561_ c:control_collection s:shard1 r:core_node1 x:collection1] o.a.s.c.ZkController numShards not found on descriptor - reading it from system property
   [junit4]   2> 391876 INFO  (OverseerStateUpdate-96041333171683333-127.0.0.1:44561_-n_0000000000) [n:127.0.0.1:44561_    ] o.a.s.c.Overseer processMessage: queueSize: 1, message = {
   [junit4]   2>   "core":"collection1",
   [junit4]   2>   "core_node_name":"core_node1",
   [junit4]   2>   "roles":null,
   [junit4]   2>   "base_url":"https://127.0.0.1:44561",
   [junit4]   2>   "node_name":"127.0.0.1:44561_",
   [junit4]   2>   "numShards":"1",
   [junit4]   2>   "state":"active",
   [junit4]   2>   "shard":"shard1",
   [junit4]   2>   "collection":"control_collection",
   [junit4]   2>   "operation":"state"} current state version: 2
   [junit4]   2> 391876 INFO  (OverseerStateUpdate-96041333171683333-127.0.0.1:44561_-n_0000000000) [n:127.0.0.1:44561_    ] o.a.s.c.o.ReplicaMutator Update state numShards=1 message={
   [junit4]   2>   "core":"collection1",
   [junit4]   2>   "core_node_name":"core_node1",
   [junit4]   2>   "roles":null,
   [junit4]   2>   "base_url":"https://127.0.0.1:44561",
   [junit4]   2>   "node_name":"127.0.0.1:44561_",
   [junit4]   2>   "numShards":"1",
   [junit4]   2>   "state":"active",
   [junit4]   2>   "shard":"shard1",
   [junit4]   2>   "collection":"control_collection",
   [junit4]   2>   "operation":"state"}
   [junit4]   2> 391977 INFO  (zkCallback-454-thread-1-processing-n:127.0.0.1:44561_) [n:127.0.0.1:44561_    ] o.a.s.c.c.ZkStateReader A cluster state change: [WatchedEvent state:SyncConnected type:NodeDataChanged path:/clusterstate.json], has occurred - updating... (live nodes size: [1])
   [junit4]   2> 392104 INFO  (TEST-TestSolrConfigHandlerCloud.test-seed#[CC8F2698627180C4]) [    ] o.a.s.c.s.i.CloudSolrClient Final constructed zkHost string: 127.0.0.1:44583/solr
   [junit4]   2> 392105 INFO  (TEST-TestSolrConfigHandlerCloud.test-seed#[CC8F2698627180C4]) [    ] o.a.s.c.c.SolrZkClient Using default ZkCredentialsProvider
   [junit4]   2> 392106 INFO  (TEST-TestSolrConfigHandlerCloud.test-seed#[CC8F2698627180C4]) [    ] o.a.s.c.c.ConnectionManager Waiting for client to connect to ZooKeeper
   [junit4]   2> 392106 INFO  (zkCallback-458-thread-1) [    ] o.a.s.c.c.ConnectionManager Watcher org.apache.solr.common.cloud.ConnectionManager@54af3044 name:ZooKeeperConnection Watcher:127.0.0.1:44583/solr got event WatchedEvent state:SyncConnected type:None path:null path:null type:None
   [junit4]   2> 392106 INFO  (TEST-TestSolrConfigHandlerCloud.test-seed#[CC8F2698627180C4]) [    ] o.a.s.c.c.ConnectionManager Client is connected to ZooKeeper
   [junit4]   2> 392106 INFO  (TEST-TestSolrConfigHandlerCloud.test-seed#[CC8F2698627180C4]) [    ] o.a.s.c.c.SolrZkClient Using default ZkACLProvider
   [junit4]   2> 392106 INFO  (TEST-TestSolrConfigHandlerCloud.test-seed#[CC8F2698627180C4]) [    ] o.a.s.c.c.ZkStateReader Updating cluster state from ZooKeeper... 
   [junit4]   2> 392107 INFO  (TEST-TestSolrConfigHandlerCloud.test-seed#[CC8F2698627180C4]) [    ] o.a.s.c.c.ZkStateReader Loaded cluster properties: {urlScheme=https}
   [junit4]   2> 392107 INFO  (TEST-TestSolrConfigHandlerCloud.test-seed#[CC8F2698627180C4]) [    ] o.a.s.c.c.ZkStateReader Updated live nodes from ZooKeeper... (0) -> (1)
   [junit4]   2> 392107 INFO  (TEST-TestSolrConfigHandlerCloud.test-seed#[CC8F2698627180C4]) [    ] o.a.s.c.ChaosMonkey monkey: init - expire sessions:false cause connection loss:false
   [junit4]   2> 392107 INFO  (TEST-TestSolrConfigHandlerCloud.test-seed#[CC8F2698627180C4]) [    ] o.a.s.c.AbstractFullDistribZkTestBase Creating collection1 with stateFormat=2
   [junit4]   2> 392108 INFO  (TEST-TestSolrConfigHandlerCloud.test-seed#[CC8F2698627180C4]) [    ] o.a.s.c.c.SolrZkClient Using default ZkCredentialsProvider
   [junit4]   2> 392108 INFO  (TEST-TestSolrConfigHandlerCloud.test-seed#[CC8F2698627180C4]) [    ] o.a.s.c.c.ConnectionManager Waiting for client to connect to ZooKeeper
   [junit4]   2> 392108 INFO  (zkCallback-459-thread-1) [    ] o.a.s.c.c.ConnectionManager Watcher org.apache.solr.common.cloud.ConnectionManager@70ea0d7f name:ZooKeeperConnection Watcher:127.0.0.1:44583/solr got event WatchedEvent state:SyncConnected type:None path:null path:null type:None
   [junit4]   2> 392108 INFO  (TEST-TestSolrConfigHandlerCloud.test-seed#[CC8F2698627180C4]) [    ] o.a.s.c.c.ConnectionManager Client is connected to ZooKeeper
   [junit4]   2> 392109 INFO  (TEST-TestSolrConfigHandlerCloud.test-seed#[CC8F2698627180C4]) [    ] o.a.s.c.c.SolrZkClient Using default ZkACLProvider
   [junit4]   2> 392110 INFO  (OverseerStateUpdate-96041333171683333-127.0.0.1:44561_-n_0000000000) [n:127.0.0.1:44561_    ] o.a.s.c.Overseer processMessage: queueSize: 1, message = {
   [junit4]   2>   "operation":"create",
   [junit4]   2>   "name":"collection1",
   [junit4]   2>   "numShards":"2",
   [junit4]   2>   "stateFormat":"2"} current state version: 3
   [junit4]   2> 392110 INFO  (OverseerStateUpdate-96041333171683333-127.0.0.1:44561_-n_0000000000) [n:127.0.0.1:44561_    ] o.a.s.c.o.ClusterStateMutator building a new cName: collection1
   [junit4]   2> 392160 INFO  (TEST-TestSolrConfigHandlerCloud.test-seed#[CC8F2698627180C4]) [    ] o.a.s.SolrTestCaseJ4 Writing core.properties file to /home/jenkins/workspace/Lucene-Solr-6.1-Linux/solr/build/solr-core/test/J1/temp/solr.handler.TestSolrConfigHandlerCloud_CC8F2698627180C4-001/shard-1-001/cores/collection1
   [junit4]   2> 392161 INFO  (TEST-TestSolrConfigHandlerCloud.test-seed#[CC8F2698627180C4]) [    ] o.a.s.c.AbstractFullDistribZkTestBase create jetty 1 in directory /home/jenkins/workspace/Lucene-Solr-6.1-Linux/solr/build/solr-core/test/J1/temp/solr.handler.TestSolrConfigHandlerCloud_CC8F2698627180C4-001/shard-1-001
   [junit4]   2> 392163 INFO  (TEST-TestSolrConfigHandlerCloud.test-seed#[CC8F2698627180C4]) [    ] o.e.j.s.Server jetty-9.3.8.v20160314
   [junit4]   2> 392167 INFO  (TEST-TestSolrConfigHandlerCloud.test-seed#[CC8F2698627180C4]) [    ] o.e.j.s.h.ContextHandler Started o.e.j.s.ServletContextHandler@3d6e506f{/,null,AVAILABLE}
   [junit4]   2> 392168 INFO  (TEST-TestSolrConfigHandlerCloud.test-seed#[CC8F2698627180C4]) [    ] o.e.j.s.ServerConnector Started ServerConnector@70e56b75{SSL,[ssl, http/1.1]}{127.0.0.1:45317}
   [junit4]   2> 392168 INFO  (TEST-TestSolrConfigHandlerCloud.test-seed#[CC8F2698627180C4]) [    ] o.e.j.s.Server Started @395837ms
   [junit4]   2> 392168 INFO  (TEST-TestSolrConfigHandlerCloud.test-seed#[CC8F2698627180C4]) [    ] o.a.s.c.s.e.JettySolrRunner Jetty properties: {solr.data.dir=/home/jenkins/workspace/Lucene-Solr-6.1-Linux/solr/build/solr-core/test/J1/temp/solr.handler.TestSolrConfigHandlerCloud_CC8F2698627180C4-001/tempDir-001/jetty1, solrconfig=solrconfig.xml, hostContext=/, hostPort=45317, coreRootDirectory=/home/jenkins/workspace/Lucene-Solr-6.1-Linux/solr/build/solr-core/test/J1/temp/solr.handler.TestSolrConfigHandlerCloud_CC8F2698627180C4-001/shard-1-001/cores}
   [junit4]   2> 392169 INFO  (TEST-TestSolrConfigHandlerCloud.test-seed#[CC8F2698627180C4]) [    ] o.a.s.s.SolrDispatchFilter SolrDispatchFilter.init(): sun.misc.Launcher$AppClassLoader@73d16e93
   [junit4]   2> 392169 INFO  (TEST-TestSolrConfigHandlerCloud.test-seed#[CC8F2698627180C4]) [    ] o.a.s.c.SolrResourceLoader new SolrResourceLoader for directory: '/home/jenkins/workspace/Lucene-Solr-6.1-Linux/solr/build/solr-core/test/J1/temp/solr.handler.TestSolrConfigHandlerCloud_CC8F2698627180C4-001/shard-1-001'
   [junit4]   2> 392169 INFO  (TEST-TestSolrConfigHandlerCloud.test-seed#[CC8F2698627180C4]) [    ] o.a.s.c.SolrResourceLoader JNDI not configured for solr (NoInitialContextEx)
   [junit4]   2> 392169 INFO  (TEST-TestSolrConfigHandlerCloud.test-seed#[CC8F2698627180C4]) [    ] o.a.s.c.SolrResourceLoader solr home defaulted to 'solr/' (could not find system property or JNDI)
   [junit4]   2> 392169 INFO  (TEST-TestSolrConfigHandlerCloud.test-seed#[CC8F2698627180C4]) [    ] o.a.s.c.c.SolrZkClient Using default ZkCredentialsProvider
   [junit4]   2> 392170 INFO  (TEST-TestSolrConfigHandlerCloud.test-seed#[CC8F2698627180C4]) [    ] o.a.s.c.c.ConnectionManager Waiting for client to connect to ZooKeeper
   [junit4]   2> 392170 INFO  (zkCallback-460-thread-1) [    ] o.a.s.c.c.ConnectionManager Watcher org.apache.solr.common.cloud.ConnectionManager@3bc12ef4 name:ZooKeeperConnection Watcher:127.0.0.1:44583/solr got event WatchedEvent state:SyncConnected type:None path:null path:null type:None
   [junit4]   2> 392170 INFO  (TEST-TestSolrConfigHandlerCloud.test-seed#[CC8F2698627180C4]) [    ] o.a.s.c.c.ConnectionManager Client is connected to ZooKeeper
   [junit4]   2> 392170 INFO  (TEST-TestSolrConfigHandlerCloud.test-seed#[CC8F2698627180C4]) [    ] o.a.s.c.c.SolrZkClient Using default ZkACLProvider
   [junit4]   2> 392171 INFO  (TEST-TestSolrConfigHandlerCloud.test-seed#[CC8F2698627180C4]) [    ] o.a.s.s.SolrDispatchFilter Loading solr.xml from SolrHome (not found in ZooKeeper)
   [junit4]   2> 392171 INFO  (TEST-TestSolrConfigHandlerCloud.test-seed#[CC8F2698627180C4]) [    ] o.a.s.c.SolrXmlConfig Loading container configuration from /home/jenkins/workspace/Lucene-Solr-6.1-Linux/solr/build/solr-core/test/J1/temp/solr.handler.TestSolrConfigHandlerCloud_CC8F2698627180C4-001/shard-1-001/solr.xml
   [junit4]   2> 392174 INFO  (TEST-TestSolrConfigHandlerCloud.test-seed#[CC8F2698627180C4]) [    ] o.a.s.c.CorePropertiesLocator Config-defined core root directory: /home/jenkins/workspace/Lucene-Solr-6.1-Linux/solr/build/solr-core/test/J1/temp/solr.handler.TestSolrConfigHandlerCloud_CC8F2698627180C4-001/shard-1-001/cores
   [junit4]   2> 392174 INFO  (TEST-TestSolrConfigHandlerCloud.test-seed#[CC8F2698627180C4]) [    ] o.a.s.c.CoreContainer New CoreContainer 800386848
   [junit4]   2> 392174 INFO  (TEST-TestSolrConfigHandlerCloud.test-seed#[CC8F2698627180C4]) [    ] o.a.s.c.CoreContainer Loading cores into CoreContainer [instanceDir=/home/jenkins/workspace/Lucene-Solr-6.1-Linux/solr/build/solr-core/test/J1/temp/solr.handler.TestSolrConfigHandlerCloud_CC8F2698627180C4-001/shard-1-001]
   [junit4]   2> 392174 WARN  (TEST-TestSolrConfigHandlerCloud.test-seed#[CC8F2698627180C4]) [    ] o.a.s.c.CoreContainer Couldn't add files from /home/jenkins/workspace/Lucene-Solr-6.1-Linux/solr/build/solr-core/test/J1/temp/solr.handler.TestSolrConfigHandlerCloud_CC8F2698627180C4-001/shard-1-001/lib to classpath: /home/jenkins/workspace/Lucene-Solr-6.1-Linux/solr/build/solr-core/test/J1/temp/solr.handler.TestSolrConfigHandlerCloud_CC8F2698627180C4-001/shard-1-001/lib
   [junit4]   2> 392175 INFO  (TEST-TestSolrConfigHandlerCloud.test-seed#[CC8F2698627180C4]) [    ] o.a.s.h.c.HttpShardHandlerFactory created with socketTimeout : 90000,urlScheme : ,connTimeout : 15000,maxConnectionsPerHost : 20,maxConnections : 10000,corePoolSize : 0,maximumPoolSize : 2147483647,maxThreadIdleTime : 5,sizeOfQueue : -1,fairnessPolicy : false,useRetries : false,
   [junit4]   2> 392176 INFO  (TEST-TestSolrConfigHandlerCloud.test-seed#[CC8F2698627180C4]) [    ] o.a.s.u.UpdateShardHandler Creating UpdateShardHandler HTTP client with params: socketTimeout=340000&connTimeout=45000&retry=true
   [junit4]   2> 392176 INFO  (TEST-TestSolrConfigHandlerCloud.test-seed#[CC8F2698627180C4]) [    ] o.a.s.l.LogWatcher SLF4J impl is org.slf4j.impl.Log4jLoggerFactory
   [junit4]   2> 392176 INFO  (TEST-TestSolrConfigHandlerCloud.test-seed#[CC8F2698627180C4]) [    ] o.a.s.l.LogWatcher Registering Log Listener [Log4j (org.slf4j.impl.Log4jLoggerFactory)]
   [junit4]   2> 392176 INFO  (TEST-TestSolrConfigHandlerCloud.test-seed#[CC8F2698627180C4]) [    ] o.a.s.c.ZkContainer Zookeeper client=127.0.0.1:44583/solr
   [junit4]   2> 392176 INFO  (TEST-TestSolrConfigHandlerCloud.test-seed#[CC8F2698627180C4]) [    ] o.a.s.c.ZkController zkHost includes chroot
   [junit4]   2> 392176 INFO  (TEST-TestSolrConfigHandlerCloud.test-seed#[CC8F2698627180C4]) [    ] o.a.s.c.c.SolrZkClient Using default ZkCredentialsProvider
   [junit4]   2> 392176 INFO  (TEST-TestSolrConfigHandlerCloud.test-seed#[CC8F2698627180C4]) [    ] o.a.s.c.c.ConnectionManager Waiting for client to connect to ZooKeeper
   [junit4]   2> 392177 INFO  (zkCallback-463-thread-1) [    ] o.a.s.c.c.ConnectionManager Watcher org.apache.solr.common.cloud.ConnectionManager@394fadc9 name:ZooKeeperConnection Watcher:127.0.0.1:44583 got event WatchedEvent state:SyncConnected type:None path:null path:null type:None
   [junit4]   2> 392178 INFO  (TEST-TestSolrConfigHandlerCloud.test-seed#[CC8F2698627180C4]) [    ] o.a.s.c.c.ConnectionManager Client is connected to ZooKeeper
   [junit4]   2> 392178 INFO  (TEST-TestSolrConfigHandlerCloud.test-seed#[CC8F2698627180C4]) [    ] o.a.s.c.c.SolrZkClient Using default ZkACLProvider
   [junit4]   2> 392178 INFO  (TEST-TestSolrConfigHandlerCloud.test-seed#[CC8F2698627180C4]) [n:127.0.0.1:45317_    ] o.a.s.c.ZkController Added new OnReconnect listener org.apache.solr.cloud.ZkController$$Lambda$28/1497256721@1c668f3a
   [junit4]   2> 392179 INFO  (TEST-TestSolrConfigHandlerCloud.test-seed#[CC8F2698627180C4]) [n:127.0.0.1:45317_    ] o.a.s.c.c.ConnectionManager Waiting for client to connect to ZooKeeper
   [junit4]   2> 392179 INFO  (zkCallback-464-thread-1-processing-n:127.0.0.1:45317_) [n:127.0.0.1:45317_    ] o.a.s.c.c.ConnectionManager Watcher org.apache.solr.common.cloud.ConnectionManager@166be265 name:ZooKeeperConnection Watcher:127.0.0.1:44583/solr got event WatchedEvent state:SyncConnected type:None path:null path:null type:None
   [junit4]   2> 392179 INFO  (TEST-TestSolrConfigHandlerCloud.test-seed#[CC8F2698627180C4]) [n:127.0.0.1:45317_    ] o.a.s.c.c.ConnectionManager Client is connected to ZooKeeper
   [junit4]   2> 392181 INFO  (TEST-TestSolrConfigHandlerCloud.test-seed#[CC8F2698627180C4]) [n:127.0.0.1:45317_    ] o.a.s.c.c.ZkStateReader Updating cluster state from ZooKeeper... 
   [junit4]   2> 392181 INFO  (TEST-TestSolrConfigHandlerCloud.test-seed#[CC8F2698627180C4]) [n:127.0.0.1:45317_    ] o.a.s.c.c.ZkStateReader Loaded cluster properties: {urlScheme=https}
   [junit4]   2> 392181 INFO  (TEST-TestSolrConfigHandlerCloud.test-seed#[CC8F2698627180C4]) [n:127.0.0.1:45317_    ] o.a.s.c.c.ZkStateReader Updated live nodes from ZooKeeper... (0) -> (1)
   [junit4]   2> 392182 INFO  (TEST-TestSolrConfigHandlerCloud.test-seed#[CC8F2698627180C4]) [n:127.0.0.1:45317_    ] o.a.s.c.Overseer Overseer (id=null) closing
   [junit4]   2> 392182 INFO  (TEST-TestSolrConfigHandlerCloud.test-seed#[CC8F2698627180C4]) [n:127.0.0.1:45317_    ] o.a.s.c.LeaderElector Joined leadership election with path: /overseer_elect/election/96041333171683338-127.0.0.1:45317_-n_0000000001
   [junit4]   2> 392183 INFO  (TEST-TestSolrConfigHandlerCloud.test-seed#[CC8F2698627180C4]) [n:127.0.0.1:45317_    ] o.a.s.c.LeaderElector Watching path /overseer_elect/election/96041333171683333-127.0.0.1:44561_-n_0000000000 to know if I could be the leader
   [junit4]   2> 392183 INFO  (TEST-TestSolrConfigHandlerCloud.test-seed#[CC8F2698627180C4]) [n:127.0.0.1:45317_    ] o.a.s.c.ZkController Publish node=127.0.0.1:45317_ as DOWN
   [junit4]   2> 392183 INFO  (OverseerStateUpdate-96041333171683333-127.0.0.1:44561_-n_0000000000) [n:127.0.0.1:44561_    ] o.a.s.c.Overseer processMessage: queueSize: 1, message = {
   [junit4]   2>   "operation":"downnode",
   [junit4]   2>   "node_name":"127.0.0.1:45317_"} current state version: 3
   [junit4]   2> 392183 INFO  (OverseerStateUpdate-96041333171683333-127.0.0.1:44561_-n_0000000000) [n:127.0.0.1:44561_    ] o.a.s.c.o.NodeMutator DownNode state invoked for node: 127.0.0.1:45317_
   [junit4]   2> 392183 INFO  (OverseerStateUpdate-96041333171683333-127.0.0.1:44561_-n_0000000000) [n:127.0.0.1:44561_    ] o.a.s.c.o.ZkStateWriter going to create_collection /collections/collection1/state.json
   [junit4]   2> 392184 INFO  (zkCallback-454-thread-1-processing-n:127.0.0.1:44561_) [n:127.0.0.1:44561_    ] o.a.s.c.c.ZkStateReader A cluster state change: [WatchedEvent state:SyncConnected type:NodeDataChanged path:/clusterstate.json], has occurred - updating... (live nodes size: [1])
   [junit4]   2> 392184 INFO  (zkCallback-458-thread-1) [    ] o.a.s.c.c.ZkStateReader A cluster state change: [WatchedEvent state:SyncConnected type:NodeDataChanged path:/clusterstate.json], has occurred - updating... (live nodes size: [1])
   [junit4]   2> 392184 INFO  (zkCallback-464-thread-1-processing-n:127.0.0.1:45317_) [n:127.0.0.1:45317_    ] o.a.s.c.c.ZkStateReader A cluster state change: [WatchedEvent state:SyncConnected type:NodeDataChanged path:/clusterstate.json], has occurred - updating... (live nodes size: [1])
   [junit4]   2> 392286 INFO  (OverseerStateUpdate-96041333171683333-127.0.0.1:44561_-n_0000000000) [n:127.0.0.1:44561_    ] o.a.s.c.o.ZkStateWriter going to update_collection /collections/collection1/state.json version: 2147483647
   [junit4]   2> 392287 WARN  (OverseerStateUpdate-96041333171683333-127.0.0.1:44561_-n_0000000000) [n:127.0.0.1:44561_    ] o.a.s.c.Overseer Bad version writing to ZK using compare-and-set, will force refresh cluster state
   [junit4]   2> org.apache.zookeeper.KeeperException$BadVersionException: KeeperErrorCode = BadVersion for /collections/collection1/state.json
   [junit4]   2> 	at org.apache.zookeeper.KeeperException.create(KeeperException.java:115)
   [junit4]   2> 	at org.apache.zookeeper.KeeperException.create(KeeperException.java:51)
   [junit4]   2> 	at org.apache.zookeeper.ZooKeeper.setData(ZooKeeper.java:1270)
   [junit4]   2> 	at org.apache.solr.common.cloud.SolrZkClient$8.execute(SolrZkClient.java:365)
   [junit4]   2> 	at org.apache.solr.common.cloud.SolrZkClient$8.execute(SolrZkClient.java:362)
   [junit4]   2> 	at org.apache.solr.common.cloud.ZkCmdExecutor.retryOperation(ZkCmdExecutor.java:60)
   [junit4]   2> 	at org.apache.solr.common.cloud.SolrZkClient.setData(SolrZkClient.java:362)
   [junit4]   2> 	at org.apache.solr.cloud.overseer.ZkStateWriter.writePendingUpdates(ZkStateWriter.java:232)
   [junit4]   2> 	at org.apache.solr.cloud.Overseer$ClusterStateUpdater.run(Overseer.java:240)
   [junit4]   2> 	at java.lang.Thread.run(Thread.java:745)
   [junit4]   2> 392287 INFO  (OverseerStateUpdate-96041333171683333-127.0.0.1:44561_-n_0000000000) [n:127.0.0.1:44561_    ] o.a.s.c.c.ZkStateReader Updated live nodes from ZooKeeper... (1) -> (1)
   [junit4]   2> 392287 INFO  (OverseerStateUpdate-96041333171683333-127.0.0.1:44561_-n_0000000000) [n:127.0.0.1:44561_    ] o.a.s.c.Overseer processMessage: workQueueSize: 1, message = {
   [junit4]   2>   "operation":"downnode",
   [junit4]   2>   "node_name":"127.0.0.1:45317_"}
   [junit4]   2> 392287 INFO  (OverseerStateUpdate-96041333171683333-127.0.0.1:44561_-n_0000000000) [n:127.0.0.1:44561_    ] o.a.s.c.o.NodeMutator DownNode state invoked for node: 127.0.0.1:45317_
   [junit4]   2> 392288 INFO  (zkCallback-454-thread-1-processing-n:127.0.0.1:44561_) [n:127.0.0.1:44561_    ] o.a.s.c.c.ZkStateReader A cluster state change: [WatchedEvent state:SyncConnected type:NodeDataChanged path:/clusterstate.json], has occurred - updating... (live nodes size: [1])
   [junit4]   2> 392288 INFO  (zkCallback-458-thread-1) [    ] o.a.s.c.c.ZkStateReader A cluster state change: [WatchedEvent state:SyncConnected type:NodeDataChanged path:/clusterstate.json], has occurred - updating... (live nodes size: [1])
   [junit4]   2> 392288 INFO  (zkCallback-464-thread-1-processing-n:127.0.0.1:45317_) [n:127.0.0.1:45317_    ] o.a.s.c.c.ZkStateReader A cluster state change: [WatchedEvent state:SyncConnected type:NodeDataChanged path:/clusterstate.json], has occurred - updating... (live nodes size: [1])
   [junit4]   2> 392288 INFO  (OverseerStateUpdate-96041333171683333-127.0.0.1:44561_-n_0000000000) [n:127.0.0.1:44561_    ] o.a.s.c.o.ZkStateWriter going to update_collection /collections/collection1/state.json version: 0
   [junit4]   2> 393183 INFO  (TEST-TestSolrConfigHandlerCloud.test-seed#[CC8F2698627180C4]) [n:127.0.0.1:45317_    ] o.a.s.c.ZkController Register node as live in ZooKeeper:/live_nodes/127.0.0.1:45317_
   [junit4]   2> 393184 INFO  (TEST-TestSolrConfigHandlerCloud.test-seed#[CC8F2698627180C4]) [n:127.0.0.1:45317_    ] o.a.s.c.c.SolrZkClient makePath: /live_nodes/127.0.0.1:45317_
   [junit4]   2> 393184 INFO  (zkCallback-458-thread-1) [    ] o.a.s.c.c.ZkStateReader A live node change: [WatchedEvent state:SyncConnected type:NodeChildrenChanged path:/live_nodes], has occurred - updating... (live nodes size: [1])
   [junit4]   2> 393184 INFO  (zkCallback-454-thread-1-processing-n:127.0.0.1:44561_) [n:127.0.0.1:44561_    ] o.a.s.c.c.ZkStateReader A live node change: [WatchedEvent state:SyncConnected type:NodeChildrenChanged path:/live_nodes], has occurred - updating... (live nodes size: [1])
   [junit4]   2> 393184 INFO  (zkCallback-464-thread-1-processing-n:127.0.0.1:45317_) [n:127.0.0.1:45317_    ] o.a.s.c.c.ZkStateReader A live node change: [WatchedEvent state:SyncConnected type:NodeChildrenChanged path:/live_nodes], has occurred - updating... (live nodes size: [1])
   [junit4]   2> 393184 INFO  (zkCallback-458-thread-1) [    ] o.a.s.c.c.ZkStateReader Updated live nodes from ZooKeeper... (1) -> (2)
   [junit4]   2> 393184 INFO  (zkCallback-454-thread-1-processing-n:127.0.0.1:44561_) [n:127.0.0.1:44561_    ] o.a.s.c.c.ZkStateReader Updated live nodes from ZooKeeper... (1) -> (2)
   [junit4]   2> 393184 INFO  (zkCallback-464-thread-1-processing-n:127.0.0.1:45317_) [n:127.0.0.1:45317_    ] o.a.s.c.c.ZkStateReader Updated live nodes from ZooKeeper... (1) -> (2)
   [junit4]   2> 393191 INFO  (TEST-TestSolrConfigHandlerCloud.test-seed#[CC8F2698627180C4]) [n:127.0.0.1:45317_    ] o.a.s.c.CoreContainer Security conf doesn't exist. Skipping setup for authorization module.
   [junit4]   2> 393191 INFO  (TEST-TestSolrConfigHandlerCloud.test-seed#[CC8F2698627180C4]) [n:127.0.0.1:45317_    ] o.a.s.c.CoreContainer No authentication plugin used.
   [junit4]   2> 393191 INFO  (TEST-TestSolrConfigHandlerCloud.test-seed#[CC8F2698627180C4]) [n:127.0.0.1:45317_    ] o.a.s.c.CorePropertiesLocator Looking for core definitions underneath /home/jenkins/workspace/Lucene-Solr-6.1-Linux/solr/build/solr-core/test/J1/temp/solr.handler.TestSolrConfigHandlerCloud_CC8F2698627180C4-001/shard-1-001/cores
   [junit4]   2> 393192 INFO  (TEST-TestSolrConfigHandlerCloud.test-seed#[CC8F2698627180C4]) [n:127.0.0.1:45317_    ] o.a.s.c.CoreDescriptor Created CoreDescriptor: {name=collection1, config=solrconfig.xml, transient=false, schema=schema.xml, loadOnStartup=true, configSetProperties=configsetprops.json, collection=collection1, coreNodeName=, dataDir=data/, shard=}
   [junit4]   2> 393192 INFO  (TEST-TestSolrConfigHandlerCloud.test-seed#[CC8F2698627180C4]) [n:127.0.0.1:45317_    ] o.a.s.c.CorePropertiesLocator Found core collection1 in /home/jenkins/workspace/Lucene-Solr-6.1-Linux/solr/build/solr-core/test/J1/temp/solr.handler.TestSolrConfigHandlerCloud_CC8F2698627180C4-001/shard-1-001/cores/collection1
   [junit4]   2> 393192 INFO  (TEST-TestSolrConfigHandlerCloud.test-seed#[CC8F2698627180C4]) [n:127.0.0.1:45317_    ] o.a.s.c.CorePropertiesLocator Found 1 core definitions
   [junit4]   2> 393192 INFO  (TEST-TestSolrConfigHandlerCloud.test-seed#[CC8F2698627180C4]) [n:127.0.0.1:45317_    ] o.a.s.s.SolrDispatchFilter user.dir=/home/jenkins/workspace/Lucene-Solr-6.1-Linux/solr/build/solr-core/test/J1
   [junit4]   2> 393192 INFO  (TEST-TestSolrConfigHandlerCloud.test-seed#[CC8F2698627180C4]) [n:127.0.0.1:45317_    ] o.a.s.s.SolrDispatchFilter SolrDispatchFilter.init() done
   [junit4]   2> 393192 INFO  (coreLoadExecutor-1118-thread-1-processing-n:127.0.0.1:45317_) [n:127.0.0.1:45317_ c:collection1   x:collection1] o.a.s.c.ZkController publishing state=down
   [junit4]   2> 393192 INFO  (coreLoadExecutor-1118-thread-1-processing-n:127.0.0.1:45317_) [n:127.0.0.1:45317_ c:collection1   x:collection1] o.a.s.c.ZkController numShards not found on descriptor - reading it from system property
   [junit4]   2> 393193 INFO  (coreLoadExecutor-1118-thread-1-processing-n:127.0.0.1:45317_) [n:127.0.0.1:45317_ c:collection1   x:collection1] o.a.s.c.ZkController Registering watch for collection collection1
   [junit4]   2> 393193 INFO  (OverseerStateUpdate-96041333171683333-127.0.0.1:44561_-n_0000000000) [n:127.0.0.1:44561_    ] o.a.s.c.Overseer processMessage: queueSize: 1, message = {
   [junit4]   2>   "core":"collection1",
   [junit4]   2>   "roles":null,
   [junit4]   2>   "base_url":"https://127.0.0.1:45317",
   [junit4]   2>   "node_name":"127.0.0.1:45317_",
   [junit4]   2>   "numShards":"2",
   [junit4]   2>   "state":"down",
   [junit4]   2>   "shard":null,
   [junit4]   2>   "collection":"collection1",
   [junit4]   2>   "operation":"state"} current state version: 5
   [junit4]   2> 393193 INFO  (coreLoadExecutor-1118-thread-1-processing-n:127.0.0.1:45317_) [n:127.0.0.1:45317_ c:collection1   x:collection1] o.a.s.c.c.ZkStateReader Add data for [collection1] ver [1]
   [junit4]   2> 393193 INFO  (OverseerStateUpdate-96041333171683333-127.0.0.1:44561_-n_0000000000) [n:127.0.0.1:44561_    ] o.a.s.c.o.ReplicaMutator Update state numShards=2 message={
   [junit4]   2>   "core":"collection1",
   [junit4]   2>   "roles":null,
   [junit4]   2>   "base_url":"https://127.0.0.1:45317",
   [junit4]   2>   "node_name":"127.0.0.1:45317_",
   [junit4]   2>   "numShards":"2",
   [junit4]   2>   "state":"down",
   [junit4]   2>   "shard":null,
   [junit4]   2>   "collection":"collection1",
   [junit4]   2>   "operation":"state"}
   [junit4]   2> 393193 INFO  (OverseerStateUpdate-96041333171683333-127.0.0.1:44561_-n_0000000000) [n:127.0.0.1:44561_    ] o.a.s.c.o.ReplicaMutator Collection already exists with numShards=2
   [junit4]   2> 393193 INFO  (OverseerStateUpdate-96041333171683333-127.0.0.1:44561_-n_0000000000) [n:127.0.0.1:44561_    ] o.a.s.c.o.ReplicaMutator Assigning new node to shard shard=shard2
   [junit4]   2> 393193 INFO  (coreLoadExecutor-1118-thread-1-processing-n:127.0.0.1:45317_) [n:127.0.0.1:45317_ c:collection1   x:collection1] o.a.s.c.ZkController look for our core node name
   [junit4]   2> 393294 INFO  (OverseerStateUpdate-96041333171683333-127.0.0.1:44561_-n_0000000000) [n:127.0.0.1:44561_    ] o.a.s.c.o.ZkStateWriter going to update_collection /collections/collection1/state.json version: 1
   [junit4]   2> 393295 INFO  (zkCallback-464-thread-1-processing-n:127.0.0.1:45317_) [n:127.0.0.1:45317_    ] o.a.s.c.c.ZkStateReader A cluster state change: [WatchedEvent state:SyncConnected type:NodeDataChanged path:/collections/collection1/state.json] for collection [collection1] has occurred - updating... (live nodes size: [2])
   [junit4]   2> 393295 INFO  (zkCallback-464-thread-1-processing-n:127.0.0.1:45317_) [n:127.0.0.1:45317_    ] o.a.s.c.c.ZkStateReader Updating data for [collection1] from [1] to [2]
   [junit4]   2> 394193 INFO  (coreLoadExecutor-1118-thread-1-processing-n:127.0.0.1:45317_) [n:127.0.0.1:45317_ c:collection1   x:collection1] o.a.s.c.ZkController waiting to find shard id in clusterstate for collection1
   [junit4]   2> 394193 INFO  (coreLoadExecutor-1118-thread-1-processing-n:127.0.0.1:45317_) [n:127.0.0.1:45317_ c:collection1   x:collection1] o.a.s.c.ZkController Check for collection zkNode:collection1
   [junit4]   2> 394194 INFO  (coreLoadExecutor-1118-thread-1-processing-n:127.0.0.1:45317_) [n:127.0.0.1:45317_ c:collection1   x:collection1] o.a.s.c.ZkController Collection zkNode exists
   [junit4]   2> 394194 INFO  (coreLoadExecutor-1118-thread-1-processing-n:127.0.0.1:45317_) [n:127.0.0.1:45317_ c:collection1   x:collection1] o.a.s.c.c.ZkStateReader Load collection config from: [/collections/collection1]
   [junit4]   2> 394194 INFO  (coreLoadExecutor-1118-thread-1-processing-n:127.0.0.1:45317_) [n:127.0.0.1:45317_ c:collection1   x:collection1] o.a.s.c.c.ZkStateReader path=[/collections/collection1] [configName]=[conf1] specified config exists in ZooKeeper
   [junit4]   2> 394194 INFO  (coreLoadExecutor-1118-thread-1-processing-n:127.0.0.1:45317_) [n:127.0.0.1:45317_ c:collection1   x:collection1] o.a.s.c.SolrResourceLoader new SolrResourceLoader for directory: '/home/jenkins/workspace/Lucene-Solr-6.1-Linux/solr/build/solr-core/test/J1/temp/solr.handler.TestSolrConfigHandlerCloud_CC8F2698627180C4-001/shard-1-001/cores/collection1'
   [junit4]   2> 394194 INFO  (coreLoadExecutor-1118-thread-1-processing-n:127.0.0.1:45317_) [n:127.0.0.1:45317_ c:collection1   x:collection1] o.a.s.c.SolrResourceLoader JNDI not configured for solr (NoInitialContextEx)
   [junit4]   2> 394194 INFO  (coreLoadExecutor-1118-thread-1-processing-n:127.0.0.1:45317_) [n:127.0.0.1:45317_ c:collection1   x:collection1] o.a.s.c.SolrResourceLoader solr home defaulted to 'solr/' (could not find system property or JNDI)
   [junit4]   2> 394195 INFO  (coreLoadExecutor-1118-thread-1-processing-n:127.0.0.1:45317_) [n:127.0.0.1:45317_ c:collection1   x:collection1] o.a.s.c.Config loaded config solrconfig.xml with version 0 
   [junit4]   2> 394199 INFO  (coreLoadExecutor-1118-thread-1-processing-n:127.0.0.1:45317_) [n:127.0.0.1:45317_ c:collection1   x:collection1] o.a.s.c.SolrConfig current version of requestparams : -1
   [junit4]   2> 394201 INFO  (coreLoadExecutor-1118-thread-1-processing-n:127.0.0.1:45317_) [n:127.0.0.1:45317_ c:collection1   x:collection1] o.a.s.c.SolrConfig Using Lucene MatchVersion: 6.1.0
   [junit4]   2> 394208 INFO  (coreLoadExecutor-1118-thread-1-processing-n:127.0.0.1:45317_) [n:127.0.0.1:45317_ c:collection1   x:collection1] o.a.s.c.SolrConfig Loaded SolrConfig: solrconfig.xml
   [junit4]   2> 394212 INFO  (coreLoadExecutor-1118-thread-1-processing-n:127.0.0.1:45317_) [n:127.0.0.1:45317_ c:collection1   x:collection1] o.a.s.s.IndexSchema [collection1] Schema name=test
   [junit4]   2> 394271 INFO  (coreLoadExecutor-1118-thread-1-processing-n:127.0.0.1:45317_) [n:127.0.0.1:45317_ c:collection1   x:collection1] o.a.s.s.OpenExchangeRatesOrgProvider Initialized with rates=open-exchange-rates.json, refreshInterval=1440.
   [junit4]   2> 394275 INFO  (coreLoadExecutor-1118-thread-1-processing-n:127.0.0.1:45317_) [n:127.0.0.1:45317_ c:collection1   x:collection1] o.a.s.s.IndexSchema default search field in schema is text
   [junit4]   2> 394276 INFO  (coreLoadExecutor-1118-thread-1-processing-n:127.0.0.1:45317_) [n:127.0.0.1:45317_ c:collection1   x:collection1] o.a.s.s.IndexSchema unique key field: id
   [junit4]   2> 394281 INFO  (coreLoadExecutor-1118-thread-1-processing-n:127.0.0.1:45317_) [n:127.0.0.1:45317_ c:collection1   x:collection1] o.a.s.s.FileE

[...truncated too long message...]

 2016 12:14:57 PM com.carrotsearch.randomizedtesting.ThreadLeakControl checkThreadLeaks
   [junit4]   2> SEVERE: 1 thread leaked from SUITE scope at org.apache.solr.handler.TestSolrConfigHandlerCloud: 
   [junit4]   2>    1) Thread[id=2984, name=Thread-1035, state=TIMED_WAITING, group=TGRP-TestSolrConfigHandlerCloud]
   [junit4]   2>         at java.lang.Thread.sleep(Native Method)
   [junit4]   2>         at org.apache.solr.cloud.ZkSolrResourceLoader.openResource(ZkSolrResourceLoader.java:101)
   [junit4]   2>         at org.apache.solr.core.SolrResourceLoader.openSchema(SolrResourceLoader.java:333)
   [junit4]   2>         at org.apache.solr.schema.IndexSchemaFactory.create(IndexSchemaFactory.java:48)
   [junit4]   2>         at org.apache.solr.schema.IndexSchemaFactory.buildIndexSchema(IndexSchemaFactory.java:75)
   [junit4]   2>         at org.apache.solr.core.ConfigSetService.createIndexSchema(ConfigSetService.java:108)
   [junit4]   2>         at org.apache.solr.core.ConfigSetService.getConfig(ConfigSetService.java:79)
   [junit4]   2>         at org.apache.solr.core.CoreContainer.reload(CoreContainer.java:912)
   [junit4]   2>         at org.apache.solr.core.SolrCore.lambda$getConfListener$6(SolrCore.java:2510)
   [junit4]   2>         at org.apache.solr.core.SolrCore$$Lambda$94/1067715837.run(Unknown Source)
   [junit4]   2>         at org.apache.solr.cloud.ZkController$4.run(ZkController.java:2408)
   [junit4]   2> Jun 09, 2016 12:14:57 PM com.carrotsearch.randomizedtesting.ThreadLeakControl tryToInterruptAll
   [junit4]   2> INFO: Starting to interrupt leaked threads:
   [junit4]   2>    1) Thread[id=2984, name=Thread-1035, state=TIMED_WAITING, group=TGRP-TestSolrConfigHandlerCloud]
   [junit4]   2> 444110 ERROR (Thread-1035) [n:127.0.0.1:43371_ c:collection1 s:shard2 r:core_node3 x:collection1] o.a.s.s.IndexSchemaFactory Error loading schema resource schema.xml
   [junit4]   2> java.io.IOException: Could not load resource=schema.xml
   [junit4]   2> 	at org.apache.solr.cloud.ZkSolrResourceLoader.openResource(ZkSolrResourceLoader.java:105)
   [junit4]   2> 	at org.apache.solr.core.SolrResourceLoader.openSchema(SolrResourceLoader.java:333)
   [junit4]   2> 	at org.apache.solr.schema.IndexSchemaFactory.create(IndexSchemaFactory.java:48)
   [junit4]   2> 	at org.apache.solr.schema.IndexSchemaFactory.buildIndexSchema(IndexSchemaFactory.java:75)
   [junit4]   2> 	at org.apache.solr.core.ConfigSetService.createIndexSchema(ConfigSetService.java:108)
   [junit4]   2> 	at org.apache.solr.core.ConfigSetService.getConfig(ConfigSetService.java:79)
   [junit4]   2> 	at org.apache.solr.core.CoreContainer.reload(CoreContainer.java:912)
   [junit4]   2> 	at org.apache.solr.core.SolrCore.lambda$getConfListener$6(SolrCore.java:2510)
   [junit4]   2> 	at org.apache.solr.cloud.ZkController$4.run(ZkController.java:2408)
   [junit4]   2> Caused by: java.lang.InterruptedException: sleep interrupted
   [junit4]   2> 	at java.lang.Thread.sleep(Native Method)
   [junit4]   2> 	at org.apache.solr.cloud.ZkSolrResourceLoader.openResource(ZkSolrResourceLoader.java:101)
   [junit4]   2> 	... 8 more
   [junit4]   2> 444111 WARN  (Thread-1035) [n:127.0.0.1:43371_ c:collection1 s:shard2 r:core_node3 x:collection1] o.a.s.c.SolrCores Tried to remove core collection1 from pendingCoreOps and it wasn't there. 
   [junit4]   2> 444111 WARN  (Thread-1035) [n:127.0.0.1:43371_ c:collection1 s:shard2 r:core_node3 x:collection1] o.a.s.c.ZkController listener throws error
   [junit4]   2> org.apache.solr.common.SolrException: Unable to reload core [collection1]
   [junit4]   2> 	at org.apache.solr.core.CoreContainer.reload(CoreContainer.java:920)
   [junit4]   2> 	at org.apache.solr.core.SolrCore.lambda$getConfListener$6(SolrCore.java:2510)
   [junit4]   2> 	at org.apache.solr.cloud.ZkController$4.run(ZkController.java:2408)
   [junit4]   2> Caused by: org.apache.solr.common.SolrException: Could not load conf for core collection1: Error loading schema resource schema.xml
   [junit4]   2> 	at org.apache.solr.core.ConfigSetService.getConfig(ConfigSetService.java:86)
   [junit4]   2> 	at org.apache.solr.core.CoreContainer.reload(CoreContainer.java:912)
   [junit4]   2> 	... 2 more
   [junit4]   2> Caused by: org.apache.solr.common.SolrException: Error loading schema resource schema.xml
   [junit4]   2> 	at org.apache.solr.schema.IndexSchemaFactory.create(IndexSchemaFactory.java:52)
   [junit4]   2> 	at org.apache.solr.schema.IndexSchemaFactory.buildIndexSchema(IndexSchemaFactory.java:75)
   [junit4]   2> 	at org.apache.solr.core.ConfigSetService.createIndexSchema(ConfigSetService.java:108)
   [junit4]   2> 	at org.apache.solr.core.ConfigSetService.getConfig(ConfigSetService.java:79)
   [junit4]   2> 	... 3 more
   [junit4]   2> Caused by: java.io.IOException: Could not load resource=schema.xml
   [junit4]   2> 	at org.apache.solr.cloud.ZkSolrResourceLoader.openResource(ZkSolrResourceLoader.java:105)
   [junit4]   2> 	at org.apache.solr.core.SolrResourceLoader.openSchema(SolrResourceLoader.java:333)
   [junit4]   2> 	at org.apache.solr.schema.IndexSchemaFactory.create(IndexSchemaFactory.java:48)
   [junit4]   2> 	... 6 more
   [junit4]   2> Caused by: java.lang.InterruptedException: sleep interrupted
   [junit4]   2> 	at java.lang.Thread.sleep(Native Method)
   [junit4]   2> 	at org.apache.solr.cloud.ZkSolrResourceLoader.openResource(ZkSolrResourceLoader.java:101)
   [junit4]   2> 	... 8 more
   [junit4]   2> Jun 09, 2016 12:14:57 PM com.carrotsearch.randomizedtesting.ThreadLeakControl tryToInterruptAll
   [junit4]   2> INFO: All leaked threads terminated.
   [junit4]   2> NOTE: test params are: codec=CheapBastard, sim=RandomSimilarity(queryNorm=true,coord=crazy): {}, locale=ko-KR, timezone=Asia/Dili
   [junit4]   2> NOTE: Linux 4.4.0-21-generic amd64/Oracle Corporation 1.8.0_92 (64-bit)/cpus=12,threads=1,free=50966648,total=534249472
   [junit4]   2> NOTE: All tests run in this JVM: [TestFieldCacheSortRandom, BlockJoinFacetRandomTest, ZkControllerTest, TestRestManager, FileUtilsTest, HighlighterTest, DistributedFacetPivotSmallAdvancedTest, TestInfoStreamLogging, TestLMJelinekMercerSimilarityFactory, BasicFunctionalityTest, WordBreakSolrSpellCheckerTest, SpellCheckComponentTest, TestQuerySenderListener, TestQueryUtils, TestSurroundQueryParser, HLLSerializationTest, TestSchemaResource, ConfigSetsAPITest, TestLegacyFieldCache, TestReqParamsAPI, TestTolerantUpdateProcessorCloud, LeaderInitiatedRecoveryOnShardRestartTest, TestDocumentBuilder, TestReplicaProperties, TestDistributedGrouping, DistributedMLTComponentTest, RecoveryAfterSoftCommitTest, ExitableDirectoryReaderTest, SolrIndexConfigTest, TestSearcherReuse, CdcrReplicationHandlerTest, TestMissingGroups, TestSubQueryTransformerDistrib, DeleteReplicaTest, ChaosMonkeyNothingIsSafeTest, TestSolrConfigHandlerCloud]
   [junit4]   2> NOTE: reproduce with: ant test  -Dtestcase=TestSolrConfigHandlerCloud -Dtests.seed=CC8F2698627180C4 -Dtests.multiplier=3 -Dtests.slow=true -Dtests.locale=ko-KR -Dtests.timezone=Asia/Dili -Dtests.asserts=true -Dtests.file.encoding=ISO-8859-1
   [junit4] ERROR   0.00s J1 | TestSolrConfigHandlerCloud (suite) <<<
   [junit4]    > Throwable #1: com.carrotsearch.randomizedtesting.ThreadLeakError: 1 thread leaked from SUITE scope at org.apache.solr.handler.TestSolrConfigHandlerCloud: 
   [junit4]    >    1) Thread[id=2984, name=Thread-1035, state=TIMED_WAITING, group=TGRP-TestSolrConfigHandlerCloud]
   [junit4]    >         at java.lang.Thread.sleep(Native Method)
   [junit4]    >         at org.apache.solr.cloud.ZkSolrResourceLoader.openResource(ZkSolrResourceLoader.java:101)
   [junit4]    >         at org.apache.solr.core.SolrResourceLoader.openSchema(SolrResourceLoader.java:333)
   [junit4]    >         at org.apache.solr.schema.IndexSchemaFactory.create(IndexSchemaFactory.java:48)
   [junit4]    >         at org.apache.solr.schema.IndexSchemaFactory.buildIndexSchema(IndexSchemaFactory.java:75)
   [junit4]    >         at org.apache.solr.core.ConfigSetService.createIndexSchema(ConfigSetService.java:108)
   [junit4]    >         at org.apache.solr.core.ConfigSetService.getConfig(ConfigSetService.java:79)
   [junit4]    >         at org.apache.solr.core.CoreContainer.reload(CoreContainer.java:912)
   [junit4]    >         at org.apache.solr.core.SolrCore.lambda$getConfListener$6(SolrCore.java:2510)
   [junit4]    >         at org.apache.solr.core.SolrCore$$Lambda$94/1067715837.run(Unknown Source)
   [junit4]    >         at org.apache.solr.cloud.ZkController$4.run(ZkController.java:2408)
   [junit4]    > 	at __randomizedtesting.SeedInfo.seed([CC8F2698627180C4]:0)
   [junit4] Completed [102/613 (1!)] on J1 in 53.74s, 1 test, 1 error <<< FAILURES!

[...truncated 1640 lines...]
BUILD FAILED
/home/jenkins/workspace/Lucene-Solr-6.1-Linux/build.xml:740: The following error occurred while executing this line:
/home/jenkins/workspace/Lucene-Solr-6.1-Linux/build.xml:684: The following error occurred while executing this line:
/home/jenkins/workspace/Lucene-Solr-6.1-Linux/build.xml:59: The following error occurred while executing this line:
/home/jenkins/workspace/Lucene-Solr-6.1-Linux/solr/build.xml:233: The following error occurred while executing this line:
/home/jenkins/workspace/Lucene-Solr-6.1-Linux/solr/common-build.xml:531: The following error occurred while executing this line:
/home/jenkins/workspace/Lucene-Solr-6.1-Linux/lucene/common-build.xml:1427: The following error occurred while executing this line:
/home/jenkins/workspace/Lucene-Solr-6.1-Linux/lucene/common-build.xml:984: There were test failures: 613 suites (10 ignored), 2567 tests, 1 suite-level error, 116 ignored (72 assumptions) [seed: CC8F2698627180C4]

Total time: 61 minutes 48 seconds
Build step 'Invoke Ant' marked build as failure
Archiving artifacts
[WARNINGS] Skipping publisher since build result is FAILURE
Recording test results
Email was triggered for: Failure - Any
Sending email for trigger: Failure - Any



Mime
View raw message